##TITLE=31Pdec_LY-DiX-O-PURP-mix
 CD3CN, 24 sc
 9.2.2021
##JCAMPDX= 6.0         $$ Bruker NMR JCAMP-DX V2.0
##DATA TYPE= NMR SPECTRUM
##DATA CLASS= NTUPLES
##ORIGIN= UXNMR, Bruker Analytische Messtechnik GmbH
##OWNER= root
$$ XWIN-NMR		Version 3.5
$$ Tue Feb  9 12:12:38 2021 Russian Standard Time (UT+4h)  she@DPX200
##.OBSERVE FREQUENCY= 81.013821
##.OBSERVE NUCLEUS= ^31P
##.ACQUISITION MODE= SIMULTANEOUS
##.ACQUISITION SCHEME= undefined
##.AVERAGES= 24
##.DIGITISER RES= 17
##SPECTROMETER/DATA SYSTEM= spect
##.PULSE SEQUENCE= zgpg30
##.SOLVENT NAME= CDCl3
##.SHIFT REFERENCE= (INTERNAL, CDCl3, 0, 182.463)
##AUDIT TRAIL= $$ (NUMBER, WHEN, WHO, WHERE, WHAT)
$$ ##TITLE= Audit trail, XWIN-NMR		Version 3.5
$$ ##JCAMPDX= 5.01
$$ ##ORIGIN= Bruker BioSpin GmbH
$$ ##OWNER= she
$$ F:/spectra/data/she/nmr/P31/1/pdata/1/auditp.txt
$$ ##AUDIT TRAIL=  $$ (NUMBER, WHEN, WHO, WHERE, WHAT)
(   1,<2021-02-09 12:11:00.54 +0400>,<she>,<DPX200>,
      <created by zg, POWCHK disabled, PULCHK disabled
       configuration hash MD5:
       00 E9 B6 7A A2 85 ED C7 34 08 36 98 17 FE 4E 26
       data hash MD5: 32K
       BB A9 B8 8D 39 1E 20 1F 69 F8 FF 38 C1 1A 00 C0>)
(   2,<2021-02-09 12:11:03.87 +0400>,<she>,<DPX200>,
      <Start of raw data processing
       efp BC_mod = 2 LB = 1 FT_mod = 6 PKNL = 1 PHC0 = -1695.856 PHC1 = 5.602172 SI = 64K 
       data hash MD5: 64K
       4C DD 00 7F E5 4F 08 44 57 09 08 C1 68 08 30 FE>)
(   3,<2021-02-09 12:11:39.98 +0400>,<she>,<DPX200>,
      <pk PHC0 = -12.5568 PHC1 = 0 
       data hash MD5: 64K
       0C A9 A3 4D 23 8F 23 10 18 20 0C 22 9C 01 CC 22>)
(   4,<2021-02-09 12:11:43.93 +0400>,<she>,<DPX200>,
      <abs ABSG = 5 
       data hash MD5: 64K
       F1 67 18 93 31 28 8D F8 FA F9 4E 9E F0 A4 07 E6>)
(   5,<2021-02-09 12:12:01.67 +0400>,<she>,<DPX200>,
      <pk PHC0 = 6.599999 PHC1 = 0 
       data hash MD5: 64K
       E4 14 9C 60 B4 45 27 19 88 B9 99 13 66 43 9A 98>)
$$ ##END=
$$ 
$$ hash MD5
$$ 2A D9 AA CD 54 A2 6D 49 76 CD 1B C2 0A CA 30 28
##$RELAX= 
##$RELAX= 
##$RELAX= 
##$RELAX= 
##$RELAX= 
##$RELAX= 
##$RELAX= 
##$RELAX= 
$$ Bruker specific parameters
$$ --------------------------
##$DU= <F:/spectra>
##$EXPNO= 1
##$NAME= <P31>
##$PROCNO= 1
##$TYPE= <nmr>
##$USER= <she>
##$AMP= (0..31)
100 100 100 100 100 100 100 100 100 100 100 100 100 100 100 100 100 100 
100 100 100 100 100 100 100 100 100 100 100 100 100 100 
##$AQSEQ= 0
##$AQ_mod= 1
##$AUNM= <au_zg>
##$AUTOPOS= <>
##$BF1= 81.014009
##$BF2= 200.13
##$BF3= 200.13
##$BF4= 200.13
##$BF5= 200.13
##$BF6= 200.13
##$BF7= 200.13
##$BF8= 200.13
##$BYTORDA= 1
##$CFDGTYP= 0
##$CFRGTYP= 5
##$CHEMSTR= <none>
##$CNST= (0..31)
1 1 145 1 1 1 1 1 1 1 1 1 1 1 1 1 1 1 1 1 1 1 1 1 1 1 1 1 1 1 1 1 
##$CPDPRG= <waltz16>
##$CPDPRG1= <>
##$CPDPRG2= <waltz16>
##$CPDPRG3= <>
##$CPDPRG4= <mlev>
##$CPDPRG5= <mlev>
##$CPDPRG6= <mlev>
##$CPDPRG7= <mlev>
##$CPDPRG8= <mlev>
##$CPDPRGB= <>
##$CPDPRGT= <>
##$D= (0..31)
0 1 0 0 0 0 0 0 0 0 0 0.03 2e-05 3e-06 0 0 0 0 0 0 0 0 0 0 0 0 0 0 0 0 
$$ [...]
##$SUBNAM3= <"">
##$SUBNAM4= <"">
##$SUBNAM5= <"">
##$SUBNAM6= <"">
##$SUBNAM7= <"">
##$SUBNAM8= <"">
##$SUBNAM9= <"">
##$SW= 369.568048894756
##$SWIBOX= (0..15)
0 1 3 0 0 0 0 0 0 0 0 0 0 0 0 0 
##$SW_h= 29940.119760479
##$TD= 32768
##$TD0= 1
##$TE= 0
##$TE2= 300
##$TE3= 300
##$TEG= 300
##$TL= (0..7)
0 120 53 12 22 120 120 120 
##$TP= (0..7)
150 150 150 150 150 150 150 150 
##$TP07= 0
##$TPNAME0= <>
##$TPNAME1= <>
##$TPNAME2= <>
##$TPNAME3= <>
##$TPNAME4= <>
##$TPNAME5= <>
##$TPNAME6= <>
##$TPNAME7= <>
##$TPOAL= (0..7)
0.5 0.5 0.5 0.5 0.5 0.5 0.5 0.5 
##$TPOFFS= (0..7)
0 0 0 0 0 0 0 0 
##$TUNHIN= 0
##$TUNHOUT= 0
##$TUNXOUT= 0
##$USERA1= <user>
##$USERA2= <user>
##$USERA3= <user>
##$USERA4= <user>
##$USERA5= <user>
##$V9= 5
##$VALIST= <valist>
##$VCLIST= <CCCCCCCCCCCCCCC>
##$VD= 0
##$VDLIST= <DDDDDDDDDDDDDDD>
##$VPLIST= <PPPPPPPPPPPPPPP>
##$VTLIST= <TTTTTTTTTTTTTTT>
##$WBST= 1024
##$WBSW= 4
##$XGAIN= (0..3)
0 0 0 0 
##$XL= 0
##$YL= 0
##$YMAX_a= 24832
##$YMIN_a= -43886
##$ZGOPTNS= <>
##$ZL1= 120
##$ZL2= 120
##$ZL3= 120
##$ZL4= 120
##$ABSF1= 182.463
##$ABSF2= -187.1042
##$ABSG= 5
##$ABSL= 3
##$ALPHA= 0
##$AQORDER= 0
##$ASSFAC= 0
##$ASSFACI= 0
##$ASSFACX= 0
##$ASSWID= 0
##$AUNMP= <proc_1d>
##$AZFE= 0.1
##$AZFW= 0.5
##$BCFW= 0
##$BC_mod= 2
##$BYTORDP= 0
##$COROFFS= 0
##$CY= -3
##$DATMOD= 1
##$DC= 0
##$DFILT= <>
##$DTYPP= 0
##$F1P= 0
##$F2P= 0
##$FCOR= 1
##$FTSIZE= 65536
##$FT_mod= 6
##$GAMMA= 0
##$GB= 0
##$INTBC= 1
##$INTSCL= 5.30512e-09
##$ISEN= 30
##$LB= 1
##$LEV0= 0
##$LPBIN= 0
##$MAXI= 10000
##$MC2= 0
##$MEAN= 0
##$ME_mod= 0
##$MI= 50
##$NCOEF= 0
##$NC_proc= -2
##$NLEV= 6
##$NOISF1= 182.463
##$NOISF2= 159.3651
##$NSP= 0
##$NTH_PI= 0
##$NZP= 0
##$OFFSET= 182.463
##$PC= 4
##$PHC0= -1701.813
##$PHC1= 5.602172
##$PH_mod= 1
##$PKNL= yes
##$PPARMOD= 0
##$PSCAL= 0
##$PSIGN= 0
##$REVERSE= no
##$SF= 81.014009
##$SI= 65536
##$SIGF1= 159.3651
##$SIGF2= -187.1042
##$SINO= 113.3802
##$SIOLD= 16384
##$SREGLST= <1H.CDCl3>
##$SSB= 0
##$STSI= 65536
##$STSR= 0
##$SW_p= 29940.119760479
##$SYMM= 0
##$S_DEV= 0
##$TDeff= 32768
##$TDoff= 0
##$TI= <>
##$TILT= no
##$TM1= 0
##$TM2= 0
##$TOPLEV= 0
##$USERP1= <user>
##$USERP2= <user>
##$USERP3= <user>
##$USERP4= <user>
##$USERP5= <user>
##$WDW= 1
##$XDIM= 65536
##$YMAX_p= 301035545
##$YMIN_p= -33359559
$$ End of Bruker specific parameters
$$ ---------------------------------
##NTUPLES= NMR SPECTRUM
##VAR_NAME=  FREQUENCY,     SPECTRUM/REAL,   SPECTRUM/IMAG
##SYMBOL=    X,             R,               I
##VAR_TYPE=  INDEPENDENT,   DEPENDENT,       DEPENDENT
##VAR_FORM=  AFFN,          ASDF,            ASDF
##VAR_DIM=   65536,         65536,           65536
##UNITS=     HZ,            ARBITRARY UNITS, ARBITRARY UNITS
##FACTOR=    0.456856943014862, 1,           1
##FIRST=     14782.0589164895, 0,            0
##LAST=      -15158.0608439895, 0,           0
##MIN=       -15158.0608439895, -33359559,   0
##MAX=       14782.0589164895, 301035545,    0
$$ Real data points
##PAGE= N=1
##DATA TABLE= (X++(R..R)), XYDATA
$$ [...]
##PAGE= N=2
##DATA TABLE= (X++(I..I)), XYDATA
35827C91391n6957L743N4892L3615j4334k0158j5154n4692q5876l1121N1209M6963
$$ 391391 334434 338177 393069 426684 412350 392192 377038 322346 236470 205349 256558 303521
35815C03521j6762k5269J0260j4666p2919k8592J04234J47257M4492n1900m3350
$$ 303521 286759 261490 271750 257084 184165 155573 259807 407064 451556 399656 356306
35804C56306j9561n0124n2595K0961O0867n488o8037k3189M5444K1552m6202n2130
$$ 356306 336745 286621 234026 254987 315854 310366 242329 219140 264584 286136 239934 187804
35792A87804j9064k2603l1988K0652R3254R7981M5989M608k1375m9683l7427L7886
$$ 187804 168740 146137 114149 134801 228055 326036 372025 376633 355258 305575 268148 306034
35780C06034Q2516L182j29124j57595n1466O9593J02305N8122O649p972K230j1242
$$ 306034 388550 391732 262608 105013 53547 123140 225445 283567 290216 282244 284474 273232
35768B73232o3807r0380k8954N7789M7666m7845q4283m124Q7103J07408J03372
$$ 273232 209425 119045 90091 147880 195546 147701 63418 59294 146397 253805 357177
35757C57177J04449M1832r0277j54292p1194M0431N2202J3901K0642L2149k0585
$$ 357177 461626 503458 413181 258889 187695 228126 280328 294229 314871 347020 326435
35746C26435p2364l6004K3379n289q0880q0016L029P5523J01588J01477O3399
$$ 326435 254071 218067 241446 236157 155277 75261 78290 153813 255401 356878 420277
35735D20277j2089n0655j3251J3986l6368p6858j3250P5504O7832J2942L3596
$$ 420277 408188 357533 344282 358268 321900 245042 231792 307296 375128 388070 421666
35724D21666R7757P8925j6129p0207o2610p1479j03528r3774m6803j9820n30M6306
$$ 421666 519423 598348 582219 512012 449402 377923 274395 180621 133818 113998 113468 159774
35712A59774O2926p617p3363k3094N4764p558j56846j67340J1690J78254J75571
$$ 159774 222700 215083 141720 118626 173390 165832 8986 -158354 -146664 31590 207161
35701B07161O7631k2350o4367o2765r449N0496M4953J524J4377O7456M2390p1245
$$ 207161 274792 252442 188075 125310 115861 166357 211310 212834 227211 294667 337057 265812
35689B65812j32674o3255M2416P3728M3852J6964R021J3093K7643K1558m1001
$$ 265812 133138 69883 112299 186027 229879 246843 255864 268957 296600 318158 277157
35678B77157j18610j24053n1008J6358K1299k0925p5464r2798n239J63301K37805
$$ 277157 158547 34494 -16514 -156 21143 218 -75246 -168044 -173283 -9982 227823
35667B27823R5564j15034j41007J4016J01404R200q9785l1967J00589J43120Q6420
$$ 227823 323387 208353 67346 81362 182766 191966 102181 70214 170803 313923 400343
35656D00343L0089R150j7664p1656j28748j51100j06719j727R7352J25888R6023
$$ 400343 430432 439582 421918 350262 221514 70414 -36305 -38032 59320 185208 281231
35645B81231N4237N456m4501l6307M2698P7604j4158j13609o1581P5490J02444
$$ 281231 335468 340924 296423 260116 302814 380418 366260 252651 191070 266560 369004
35634C69004R856l5854P780J8088k7770q918P3786N0633j14535k18570j26237
$$ 369004 378860 343006 350786 368874 341104 332186 405972 456605 342070 123500 -2737
35623b737L4264J01340J01925J14144R7406O420q0781q7443n9938n2787k7747
$$ -2737 31527 132867 234792 348936 446342 452762 371981 284538 224600 171813 144066
35612A44066K9203L5752l3393o5559O168Q0433O0760R304J2941L6148K4906J8922
$$ 144066 173269 209021 175628 110069 116237 196670 257430 266734 279675 315823 340729 359651
35600C59651M2165K1278o5024r7211n708Q8854O3519j2973j8044K0192P668l8479
$$ 359651 401816 423094 358070 260859 255151 344005 407524 394551 376507 396699 404367 365888
35588C65888m5407k0076m93K7468N3319N376r7443j04900K5747J15867M3078m5489
$$ 365888 320481 300405 299912 327380 380699 386075 288632 183732 209479 325346 368424 322935
35576C22935J2686J05722M7402q4807q3495K6126M5187m2624o4304J4630L7215
$$ 322935 335621 441343 488745 403938 320443 346569 391756 349132 284828 299458 336673
35565C36673m9232j00689l1587N6689O4423K4244j3232n5159p5541q839J10099
$$ 336673 287441 186752 155165 211854 276277 300521 287289 232130 156589 147750 257849
35554B57849J46049N8012l8216m7239m291L1212N7193N8378q717j03341j07115
$$ 257849 403898 461910 423694 376455 372164 403376 460569 518947 510230 406889 299774
35543B99774j1516L3005n6829j45937p3922R6426J65807Q3868k048J3058M5828
$$ 299774 288258 321263 264434 118497 44575 141001 306808 390676 388628 401686 447514
35532D47514j4878j07395q1097N4559J12375L344j08270m3093J05216R9517o9490
$$ 447514 432636 325241 244144 298703 411078 414422 306152 263059 368275 467792 398302
35521C98302j58376m3843R9557Q6304j3857l6382J4550L0834M759m836j4236n4265
$$ 398302 239926 196083 295640 381944 368087 331705 346255 377089 381848 377012 362776 308511
35509C08511n5002L7164J09482L6112q8385p2165O4671J20125L3201m1810k913
$$ 308511 253509 290673 400155 436267 347882 275717 340388 460513 493714 451904 448991
35498D48991O3573O2057K1285j1623n0657p9761l0412P6627J02409j2457j36144
$$ 448991 512564 574621 595906 584283 533626 453865 423453 500080 602489 590032 453888
35487D53888j22972j1179M8898p70p9518r0793k4929N0582P1965N0183M7835P1683
$$ 453888 330916 319737 368635 367865 288347 197554 172625 223207 295172 345355 393190 464873
35475D64873M3702o3637j32817n0904R5700J18630K580p6850k9358K4763k6330
$$ 464873 508575 444938 312121 261217 356917 475547 478127 401277 371919 396682 370352
35464C70352r4359l6521J07542J60031M9154j03305j41010m5491O6594P8264j2577
$$ 370352 275993 239472 347014 507045 556199 452894 311884 266393 332987 411251 398674
35453C98674j02056r9125k4543K7890J7073J0L9987J07553J10244J6842q3796
$$ 398674 296618 197493 172950 200840 217913 217923 257910 365463 475707 492549 408753
35442D08753q2392R93K8677n8852j33516n7262R1690J17609J2762k3070R0263
$$ 408753 326361 327354 356031 297179 163663 106401 198091 315700 328462 305392 395655
35431C95655J68140N2983j30462j73849r5262n7422q0808n2579L4544O6475J9374
$$ 395655 563795 616778 486316 312467 217205 159783 78975 26396 60940 127415 146789
35420A46789l648M1011Q0355P2572O1570O2117L0053k7041l7737P289L3291P815
$$ 146789 143141 184152 264507 337079 398649 460766 490819 463778 426041 433330 466621 474436
35408D74436k1101l0209n4436r5691j02336n8831l263M9715J08830J36069Q4464
$$ 474436 453335 423126 368690 272999 170663 111832 108569 158284 267114 403183 487647
35397D87647R80k1919O265m510n7697n7604K0567P9313N0555j4068l7981q931
$$ 487647 488627 466708 472973 468463 410766 353162 373729 453042 503597 489529 451548 442617
35385D42617M6238Q4966M4072q7730j97231j60340k4786M4398M7m4342j6688J8204
$$ 442617 488855 573821 617893 530163 332932 172592 147806 192204 192251 147909 131221 149425
35373A49425J165k2839l281L2865M7985M8475L5355j0656o9550r1290p2761m2408
$$ 149425 150590 127751 124470 157335 205320 253795 289150 278494 208944 117654 44893 2485
35361B485J2519R8830J34424N3287l7706J9626J66306J75919l425j59433j27462
$$ 2485 15004 113834 248258 301545 263839 283465 449771 625690 622265 462832 335370
35350C35370j544N1957K0568j9215n0713q8154j02764p1357k1093K7926P9782
$$ 335370 333826 385783 406351 387136 336423 248269 145505 74148 53055 80981 160763
35339A60763R8263L6871m7324m1420M0566O9174J4893j5967Q313j0044q6354q7986
$$ 160763 259026 295897 248573 207153 247719 316893 331786 315819 324132 314088 227734 139748
35327A39748L1082J22551P8236o134j5530R033J278L909L8445R579j11268j67861
$$ 139748 170830 293381 371617 365483 349953 358986 360264 364173 402618 412197 300929 133068
35315A33068n0563J00553J01948N551j8233L4276L5154k9680n0138N927N0188
$$ 133068 82505 183058 285006 290557 272324 306600 341754 312074 261936 267863 318051
35304C18051K4213l4158o4121l3831M9621J18567R2658j29m0841o262r792r0998
$$ 318051 342264 308106 243985 210154 259775 378342 471000 470871 430030 423768 413976 322978
35292C22978j25035m1314M0662K5566J3851R3289J35551Q292j62686j76499p5498
$$ 322978 197943 156629 197291 222857 236708 329997 465548 473840 311154 134655 59157
35281E9157l2988l3466N8825J87056J54395l0337j43709j00424m8054o9075m9401
$$ 59157 26169 -7297 51528 238584 392979 362642 218933 118509 70455 1380 -48021
35270d8021P3948J66299J11349p962n9137m4352k9932j6163K0656N2245M9027
$$ -48021 25927 192226 303575 295613 236476 192124 162192 146029 166685 218930 267957
35259B67957L1428J7050l753p413M7347J11006O9817o7905j37130m4292Q5461
$$ 267957 299385 316435 312682 305269 352616 463622 533439 465534 328404 284112 369573
35248C69573Q8156r639o1529l1768j5850n3616o1150J7126R6800O9410k8244n3116
$$ 369573 457729 448090 386561 354793 338943 285327 224177 241303 338103 407513 379269 326153
35236C26153M1156J28846Q0977n8265j39420j13253p1141q3723j03373o1591K3779
$$ 326153 367309 496155 577132 518867 379447 266194 195053 111330 7957 -53634 -29855
35225b9855R0191J12834R5958M1387k4439m4436K50N8349P8020N9555J8075m0735
$$ -29855 60336 173170 269128 310515 286076 241640 241890 300239 378259 437814 455889 415154
35213D15154q4474o8757j3713J4045J2924L8998O9689Q890j25975j70769n0502
$$ 415154 330680 261923 248210 262255 275179 314177 383866 392756 266781 96012 45510
35202D5510R1031R9937K1477j5345p31K034J468L5286O5209M6403K6843N5231
$$ 45510 136541 236478 257955 242610 241879 243913 245381 280667 345876 392279 419122 474353
35190D74353P0929R950o3606o1579k2518k4558l4812J0402N9428L3106j8451m454
$$ 474353 545282 555232 491626 430047 407529 382971 348159 358561 417989 451095 432644 428190
35178D28190L5325J1242l6114j0769M7368K9369l6034l1013L4923M8077L964M216
$$ 428190 463515 474757 438643 427874 475242 504611 468577 437564 472487 520564 524528 528744
35166E28744M9900K9623p3924j41987j09840m5919j6694p079P300K7065O8548
$$ 528744 578644 608267 534343 392356 282516 236597 219903 212824 220124 247189 315737
35155C15737J25833J18531L36j19376j04160M63M3957J3783J8410N5576O699j23070
$$ 315737 441570 560101 560437 441061 336901 337364 381321 395104 413514 469090 475789 352719
35143C52719j63561l5222J20495J37430K8598o6442n0691M8507J08824L5202r8907
$$ 352719 189158 153936 274431 411861 440459 374017 323326 371833 480657 515859 416952
35132D16952j05015M9701J48192L4985j20760p8392Q5023J03991m0717j18575
$$ 416952 311937 361638 509830 544815 424055 345663 430686 534677 493960 375385
35122C75385m9868M475k8406k7447L8741K5833q8123j04173O0450J92911J08036
$$ 375385 325517 329992 301586 274139 312880 338713 250590 146417 206867 399778 507814
35111E07814o7180j12004l4190J3150k464M130N3741P9017L6315n3333j26624
$$ 507814 440634 328630 294440 307590 305126 309256 362997 442014 478329 424996 298372
35100B98372r9990M4564J72143J19038o3663j41256k1181J17538R8227j5477o3970
$$ 298372 198382 242946 415089 534127 470464 329208 308027 425565 523792 508315 444345
35089D44345k9455p01p369j4487j0235o93K6261O2050N9643M226n6864q3952q0663
$$ 444345 414890 414189 406820 392333 382098 381405 407666 469716 529359 533585 476721 392769 312106
35076C12106n1579l326J6149k8242p7648n4893L978J1278j6179j530L3780J6762
$$ 312106 260527 257201 273350 245108 167460 112567 116545 127823 111644 110114 143894 160656
35064A60656j4923K2313P4785L3959m2787k0001N0801J2466q4910m7287R6021
$$ 160656 145733 168046 242831 276790 234003 214002 264803 277269 192359 145072 241093
35053B41093J13791j3176m7070P3394J16904j1668r1142O596P7908l6767j60344
$$ 241093 354884 341708 294638 368032 484936 473268 382126 388722 466630 429863 269519
35042B69519r8350L3377M6588p514p923p163o1557m8551R7060J85984O9252q3524
$$ 269519 171169 204546 251134 243620 235697 228534 166977 118426 215486 401470 470722 387198
35030C87198o2285L9167L3908j0881N7843J47343Q0835n5175n0171N7682O2270
$$ 387198 324913 364080 397988 387107 444950 592293 673128 617953 567782 625464 687734
35019F87734m8843j13239r6087q7120o7125M1135J49856J08110k3079n6901P900
$$ 687734 638891 525652 429565 342445 275320 316455 466311 574421 551342 494441 502341
35008E02341J5560n4704p7514k5755J0836J5598L4132K5780n6641j07580j8047
$$ 502341 517901 463197 385683 359928 370764 386362 420494 446274 389633 282053 264006
34997B64006R4027M9328p5871o6768O3054J07605K5129l3404k4998m8707q8811
$$ 264006 358033 407361 331490 264722 327776 435381 460510 427106 402108 353401 264590
34986B64590k2418J01948Q6935p4212j59459p2340K9451K4243p155J4209K5520
$$ 264590 242172 344120 431055 356843 197384 125044 154495 178738 171583 185792 211312
34975B11312k0292n3254k6643R187K9133O5804Q7810K4026o4633l1439J03768
$$ 211312 191020 137766 111123 120310 149443 215247 303057 327083 262450 231011 334779
34964C34779J49006L4990q2982p9352k3216j2740j9905R457M2884L2346q996n2052
$$ 334779 483785 518775 435793 356441 333225 320485 300580 310037 352921 385267 376271 324219
34952C24219p9200n3959K9821Q0393J6498q1237p3985J1613L4801j1634j148Q4761
$$ 324219 245019 191060 220881 301274 317772 236535 162550 174163 208964 197330 196182 280943
34940B80943J18665N0041k6066n0682p1168j02424q8970k9945J5429N0494J07912
$$ 280943 399608 449649 423583 372901 301733 199309 110339 80394 95823 146317 254229
34929B54229J16892l338j40314j02406O8230J36749M4394j9668M1113Q2915K647
$$ 254229 371121 367783 227469 125063 193293 330042 374436 354768 395881 478796 481443
34918D81443p7947l3535O0227P3921J7827k7296m4307n3110n6330o6543q8242
$$ 481443 403496 369961 430188 504109 521936 494640 450333 397223 340893 274350 186108
34907A86108o4249L6648J02864J7768j14742r0292O4988J23160K5354l7666L5679
$$ 186108 121859 158507 261371 279139 164397 74105 139093 262253 287607 249941 285620
34896B85620J03589N3820j5795l561K6597K832j7748J3704L1077j3357n8468n5098
$$ 285620 389209 443029 427234 423673 450270 453102 435354 449058 480135 466778 408310 353212
34884C53212l2620K876P7656J31120P1263l3476k7208N5979L0096j05453j43232
$$ 353212 320592 323468 401124 532244 603507 570031 542823 598802 628898 523445 380213
34873C80213l1671L4458l2626p4832j1034J2820o1612n1359J25098K43174J23163
$$ 380213 348542 383000 350374 275542 264508 277328 215716 164357 289455 532629 655792
34862F55792p2415j13802m1659n919J1794P7996J04447N525j01953p5891J7567
$$ 655792 583377 469575 427916 421997 433791 511787 616234 621759 519806 443915 461482
34851D61482M0130L618k0099n4124j11993j03745r190L4193k5428k9457R9187
$$ 461482 501612 505230 485131 431007 319014 215269 206079 240272 214844 185387 284574
34840B84574J69562L9320j11171o8074O2840O3060k4706j8654N7259M3921m6826
$$ 284574 454136 493456 382285 314211 377051 440111 415405 396751 454010 497931 451105
34829D51105o8211N0N6099N9970K2985p6260j92495j76647j1280R7877M7041K3755
$$ 451105 382894 382944 439043 499013 521998 445738 253243 76596 65316 163193 210234 233989
34817B33989J54045K27334O0028j35175r4593L1697l3176j65264o8162J43243
$$ 233989 388034 615368 675396 540221 445628 477325 444149 278885 210723 353966
34807C53966J08560j23746j52905P6808J82556J5940r9878M1250J84923Q3656
$$ 353966 462526 338780 185875 262683 445239 461179 361301 402551 587474 671130
34797F71130r9065j09228L18M9166L9894M7472K0669q0738j36790n7658M0559
$$ 671130 572065 462837 463155 512321 552215 599687 620356 539618 402828 345170 385729
34786C85729K8100k7950j3061K7082l114o5291p4190n0254m0028j211R0698J35956
$$ 385729 413829 385879 372818 399900 396786 331495 257305 207051 167023 165812 256510 392466
34774C92466N9651l5050j5599O4427N6751l7818p8679j2100N9244M2448k7031
$$ 392466 452117 417067 401468 465895 522646 484828 406149 394049 453293 495741 468710
34763D68710o4474n1261k6944j1068J8577P3863J18619J08584N2555n720n6596
$$ 468710 404236 352975 326031 314963 333540 407403 526022 634606 687161 681441 624845
34752F24845j15236j45982q6528K8860P6531K2605j9993J7815M4109j8076p2793
$$ 624845 509609 363627 277099 305959 382490 405095 385102 402917 447026 428950 356157
34741C56157j3682P2128L7549p3183r3755p41P5168O9943M3020K9954K77l9754
$$ 356157 342475 414603 452152 378969 285214 284473 359641 429584 472604 502558 502835 463081
34729D63081l9470L261M5306O5317M2013n9484j81539j69377m202R8129m493j25775
$$ 463081 423611 426872 472178 537495 579508 520024 338485 169108 164906 263035 258542 132767
34717A32767l3003J59955J67752j671p8576K3378J21730J16195J01211J03808
$$ 132767 99764 259719 427471 425800 347224 370602 492332 608527 709738 813546
34707H13546K4413j08805j26127k1920J4964n5617n0510Q0275J31487K838j16654
$$ 813546 837959 729154 603027 581107 596071 540454 489944 570219 701706 704544 587890
34696E87890q1367k5416q2008j28128k6542J01542Q2253j2124p673O9097O6345
$$ 587890 506523 481107 399099 270971 244429 345971 428224 416100 408427 477524 543869
34685E43869j9166o0409k3358J5826K5054K8783J4042l7104o7223j9111N2924
$$ 543869 524703 464294 440936 456762 481816 510599 524641 487537 420314 401203 454127
34674D54127N6488K96l8227l7598l2405l1125j6596N038J8621K8771L3257J4084
$$ 454127 510615 510911 472684 435086 402681 371556 354960 359998 378619 407390 440647 454731
34662D54731j6057j6819R230J6304j811p398k263k2703m8450k2832L2725M0168
$$ 454731 438674 421855 431085 447389 445578 438180 435917 413214 364764 341932 374657 414825
34650D14825L119k985K0216l426o7054p8479k7485L440O378N2157J13873Q0573
$$ 414825 417944 414959 435175 431749 364695 286216 258731 262171 268549 320706 434579 515152
34638E15152k5145n2054J5228K1394o7531q0028N2594J45896O1207o6244o4342
$$ 515152 490007 437953 453181 474575 407044 327016 379610 525506 586713 520469 456127
34627D56127P607J1745j7651K4609R5795Q3872P828l4066l4810m4977m6398j535
$$ 456127 463734 475479 457828 482437 578232 662104 669932 635866 601056 556079 509681 508146
34615E08146L9936J1599n3395q0188o0048j7698M4415R2479N2833o2931j31438
$$ 508146 548082 559681 506286 426098 366050 348352 392767 485246 538079 475148 343710
34604C43710r3518l9093l9407k9491M8664J21378J07953M7730N211k8688n4627
$$ 343710 250192 211099 171692 142201 190865 312243 420196 467926 473137 444449 389822
34593C89822k2142M5440L5612n4825p5077K8472J04812N8321J1352O1309Q6133
$$ 389822 367680 413120 448732 393907 318830 347302 452114 510435 521787 583096 669229
34582F69229k5253j46484j25124m0232k8147k4620P4348J53823N7798r8894q7057
$$ 669229 643976 497492 372368 332136 303989 279369 353717 507540 565338 466444 379387
34571C79387N4546Q6183l3829j07488m4730K2409L047j7757L4281R6994R6203
$$ 379387 433933 520116 486287 378799 334069 356478 359525 341768 376049 473043 569246
34560E69246M6161j8281q4700j14391o3961L2465R8073J16978J12631O6877k8853
$$ 569246 615407 597126 512426 398035 334074 366539 464612 581590 694221 761098 732245
34549G32245r3415n6302P070k3973j19091j42645o6330O230J3653M041K8650P5484
$$ 732245 638830 582528 589598 565625 446534 303889 237559 243789 257442 261483 290133 365617
34537C65617J07230Q8027q95j05702j16025j0980Q3011O1959j4066l8336j5136
$$ 365617 472847 560874 559979 454277 338252 327272 410283 472242 458176 419840 404704
34526D04704M935L7299Q8767Q2132r172o3569M170P6886J8133r3810j01192l1376
$$ 404704 409639 446938 535705 617837 608665 545096 549266 626152 644285 550475 449283 417907
34514D17907k1023o1165l5068M8377P2835K7902M997J2404j5314n4480k6579L1985
$$ 417907 396884 335719 300651 349028 421863 449765 454762 467166 451852 397372 370793 402778
34502D02778J8145m4404m1173K5112M1970j0520l6204M664N3856P5637Q1381N8970
$$ 402778 420923 376519 335346 360458 402428 391908 355704 360368 414224 489861 571242 630212
34490F30212L742k6907j0649l1363j18451j30856K0977J61991Q7281r5965j20745
$$ 630212 633954 607047 596398 565035 446584 315728 336705 498696 585977 490012 369267
34479C69267K2022R8495K4780m1990n827M4847M2677L0110J5395m1509q6795l2082
$$ 369267 391289 489784 514564 472574 466747 511594 554271 584381 599776 558267 471472 439390
34467D39390M7266J337j15169j01426N0631J38685Q6906K8471K1721l1725j30677
$$ 439390 486656 487993 372824 271398 322029 460714 547620 576091 597812 566087 435410
34456D35410j23217O940P8267K6936Q888Q3056Q1050o6784j59178n8657O2432
$$ 435410 312193 319133 397400 424336 433224 516280 597330 530546 371368 312711 375143
34445C75143K3175n3099K5010J60434J26838m1033j00185R955Q8652k622j47340
$$ 375143 398318 345219 370229 530663 657501 616468 516283 526238 614890 612268 464928
34434D64928j61874l4380R6001J21295O1702L939j2169k0155m7378o2796m0516
$$ 464928 303054 268674 364675 485970 547672 551611 539442 519287 471909 409113 368597
34423C68597j8119k6525j8944M4760J01589P8946K8339M3657R7907R4792L3650
$$ 368597 350478 323953 305009 349769 451358 530304 558643 602300 700207 794999 828649
34412H28649j7255n7190j10595j13207j6188O2219q631j25920r1103N6421J02147
$$ 828649 811394 754204 643609 530402 514214 576433 567802 441882 350779 407200 509347
34401E09347K4073Q931R3260R5595l5108j06175j8701O1358J541q1082n5216k538
$$ 509347 533420 542351 635611 731206 696098 589923 571222 632580 634121 553039 497823 495285
34389D95285m0413j03300p2463J8499N7161J9927m3794q8997o4737N1427J59307
$$ 495285 454872 351572 279109 297608 354769 374696 330902 241905 177168 228595 387902
34378C87902J21109k0734p7714n99O3084L5048Q648K8352O486n7796k4181J17380
$$ 387902 509011 488277 410563 409964 473048 508096 516744 545096 551582 493786 469605 586985
34366E86985J68753M5349o9899m2111p108r8378j83456q8641J01060J84928J40092
$$ 586985 755738 801087 731188 689077 681969 583591 400135 311494 412554 597482 737574
34355G37574P3649J5395n5422r3891o5277k9261k0285K3226R6495O8404q0393
$$ 737574 811223 826618 771196 677305 612028 582767 562482 585708 682203 750607 670214
34344F70214j50997k6780J08894N4256q5224p8806O1919J33870O4205l8624q9796
$$ 670214 519217 492437 601331 655587 570363 491557 553476 687346 751551 712927 623131
34333F23131r5252o5537j5452L147j7893q389M4277M5078k9291n6068J5622N0127
$$ 623131 527879 462342 446890 450037 432144 423755 468032 513110 483819 427751 443373 493500
34321D93500l1742q5169J1527J30345J14321M6206P0985J13090K3099j24955j46601
$$ 493500 461758 376589 388116 518461 632782 678988 749973 863063 886162 761207 614606
34310F14606o1641l9156r6685r9479j5644N2304O1851O1107N5788J8051j2585
$$ 614606 552965 513809 417124 317645 302001 354305 416156 477263 533051 551102 538517
34299E38517O719J6139l8330p2134j628P5032K0010j04675j32919n7986n041l287
$$ 538517 545236 561375 523045 450911 449283 524315 544325 439650 306731 248745 243704 240417
34287B40417J7512N3174M0881J1612M6341J11426J05226L8048R018L3754L9130
$$ 240417 257929 311103 351984 363596 409937 521363 626589 664637 673655 707409 746539
34276G46539o86m8195q3048r4225n3231J4128K0306l2803k3311P1830R3618l2258
$$ 746539 745853 697658 614610 520385 467154 481282 501588 468785 445474 517304 610922 578664
34264E78664j33267o5894L9365J7613l7006L2796J31773P8232n4275o3908K0123
$$ 578664 445397 379503 418868 436481 399475 432271 564044 642276 588001 524093 544216
34253E44216J6312n4057j2373J22378J42370R465q7145m9098J5425J6154j1322
$$ 544216 560528 506471 494098 616476 758846 768311 681166 632068 647493 663647 652325
34242F52325l7837p0831n4900N6105J50749R3159l1679l1224P4303R1141j1880
$$ 652325 614488 543657 488757 544862 695611 788770 757091 725867 800170 891311 879431
34231H79431o5549k966N0723J7309l3466n2505p5009r1303m4570K8522L2044j8775
$$ 879431 813882 810916 861639 878948 845482 792977 717968 626665 582095 610617 642661 623886
34219F23886l2733j9342m8778q0503k9237M9166M5925J0784N0170Q8185j1610
$$ 623886 591153 571811 523033 442530 413293 462459 508384 519168 569338 657523 645913
34208F45913j50624j10693P2522J50276N9066k2383j2973j8496o1149k6937P2507
$$ 645913 495289 384596 457118 607394 666460 644077 631104 612608 551459 524522 597029
34197E97029P7756k5201o7296k301K5750k9265m2174J1720q59q7111p6016O3009
$$ 597029 674785 649584 582288 579987 605737 576472 534298 546018 545159 458048 382032 445041
34185D45041J32819M1015n3810l7302j2727n7615o6588K3458Q7979L9667j2788
$$ 445041 577860 618875 565065 527763 515036 457421 390833 414291 502270 541937 529149
34174E29149L0440Q8774O2971n713m7224o9328o8962o511O7218L9439n9028p2775
$$ 529149 559589 648363 711334 705621 658397 589069 520107 513596 580814 620253 561225 488450
34162D88450J6306O6325M7018P9552J56465J06032p7871j59609l7062Q2492K5451
$$ 488450 504756 571081 618099 697651 854116 960148 882277 722668 685606 768098 793549
34151G93549q7714q4733p953K6347K2701P348o0565j38064p3810J18225J82966
$$ 793549 705835 621102 613149 639496 662197 669545 608980 470916 397106 515331 698297
34140F98297p851k20700j81075M9502K04092J67287K9038q9288j12005k5112O9044
$$ 698297 690446 469746 288671 338173 542265 709552 738590 649302 537297 512185 581229
34129E81229K9131j12940j60587m0680Q8777R1548K5394j8983n3310p6211k0813
$$ 581229 610360 497420 336833 296153 384930 476478 501872 482889 429579 353368 332555
34118C32555Q7682J13616L3138j9539Q108J7089j8162M04O1464L1338o3081l8903
$$ 332555 420237 533853 566991 547452 555560 572649 554487 554891 616355 647693 584612 545709
34106E45709Q2475O1163j13265j40752O6919J84868J7557j55562o2452J05979
$$ 545709 628184 689347 576082 435330 502249 687117 704674 549112 486660 592639
34096E92639O4435p2204m5421P1482N7878j7371M3829J44177M2060j86552k34300
$$ 592639 657074 584870 539449 610931 668809 651438 695267 839444 881504 694952 460652
34085D60652m9544J18301J26130P2150M2593P769l0709k2760R434J6631L7051
$$ 460652 411108 529409 655539 727689 770282 778051 747342 724582 734016 750647 787698
34074G87698R9213J05424p806j10457p5543k684l0618p1113J9292J33277O0920
$$ 787698 886911 992335 984529 874072 798529 795845 765227 694114 713406 846683 907603
34063I07603j46470k40297j45269r203O8929J14853J21262M9023l4834k5784L5015
$$ 907603 761133 520836 375567 366364 435293 550146 671408 720431 685597 659813 694828
34052F94828K6554m1941n8381j201N2445O1817L2689l3922q7506l4429Q6277Q8586
$$ 694828 721382 679441 621060 619859 672304 734121 766810 732888 645382 610953 697230 785816
34040G85816o3323j35896J9174K00423J70335K7506j180M8825K033r8233p9006
$$ 785816 722493 586597 605771 806194 976529 1004035 1002855 1051680 1053713 955480 876474
34029H76474K4833M1423j4535K169O0248R382j08800j09975N227N8794P376k3543
$$ 876474 901307 942730 928195 930364 990612 999994 891194 781219 786446 845240 852616 829073
34017H29073K360r12l2913r556M2566K4925k7561m424N5937K8062n6922o2661
$$ 829073 831433 830521 797608 788052 830618 855543 827982 823558 879495 907557 850635 787974
34005G87974k844j1559r1668j18107o1015M006O2738J35648J49891M8990m7631
$$ 787974 785130 773571 681903 563796 502781 506787 569525 705173 855064 904054 856423
33994H56423j3232N2757l936r6180m2152Q9755Q3151m8215r2523p607M5415J1965
$$ 856423 843191 895948 892012 795832 753680 843435 926586 878371 785848 778241 823656 835621
33982H35621l593J8329n882m8078q62Q7962P0294l2881o9708l4490m8950j02083
$$ 835621 832028 850357 844475 796397 795535 883497 953791 920910 851202 816712 767762 665679
33970F65679p4272J0591K2319j9654Q381P4075M4546m1390l2837M7358N6688J8333
$$ 665679 591407 601998 624317 604663 613044 687119 731665 690275 657438 704796 761484 779817
33958G79817O0190J28687P3448m1783m0024J7310o5655k11789j53668Q7500J99832
$$ 779817 840007 968694 1042142 1000359 960335 977645 911990 700201 546533 634033 833865
33947H33865Q2280l5906k2358r692o7023o8130J8654M1428m0923q0052k6375L513
$$ 833865 916145 880239 857881 848189 781166 713036 731690 773118 732195 652143 625768 629281
33935F29281j383P6612J87392J30856o5127j29678N948R4241L305q2751k4041
$$ 629281 627898 704510 891902 1022758 957631 827953 833901 928142 931447 848696 824655
33924H24655M4247j158m6182K8451J29866J22146K1768q3243j40935j10115J786
$$ 824655 868902 867744 821562 850013 979879 1102025 1123793 1040550 899615 789500 791286
33913G91286P1821J3022n8060j3519L7169l8570q4479Q2660K51637J06963j79249
$$ 791286 863107 876129 818069 804550 841719 803149 718670 801330 1052967 1159930 980681
33902I80681j70321Q7467J28460j16297k01064L5449J96166M8835r2056J8238
$$ 980681 810360 897827 1026287 909990 708926 744375 940541 989376 897320 915558
33892I15558J23993j2439j66283q7386N8121M5289n823O2429J01588k6957j30851
$$ 915558 1039551 1027112 860829 773443 831564 876853 871030 933459 1035047 1008090 877239
33881H77239k6667J11168P0669k8182k634M8115j5909p1877J4481J01088L4861
$$ 877239 850572 961740 1032409 1004227 1001593 1049708 1033799 961922 976403 1077491 1112352
33870A112352n4868j7183K8890n0586j20290l3496P9624O0097N606M1133O3161
$$ 1112352 1057484 1040301 1069191 1018605 898315 864819 944443 1004540 1010146 1051279 1114440
33859A114440k3100p6721N204N9554l2765r3009K5336J43714Q4185k715O1759
$$ 1114440 1091340 1014619 1019823 1079377 1046612 953603 978939 1122653 1206838 1204123 1265882
33848A265882J41475N8610o0946l5078L8850J0250j6106Q6918J72971P4659p7724
$$ 1265882 1407357 1465967 1405021 1369943 1408793 1419043 1402937 1489855 1662826 1737485 1659761
33837A659761q9071k6722l7335o7440k6145J2946M550N8431J64955J14107r8217
$$ 1659761 1570690 1543968 1506633 1439193 1413048 1425994 1430544 1488975 1653930 1768037 1669820
33826A669820j53621O2528K26836J32517K9652J09957J37582m5585j44655M3772
$$ 1669820 1516199 1578727 1805563 1938080 1967732 2077689 2215271 2169686 2025031 2068803
33816B068803K06077P9013n6810P0418J96777P0959q900K19735M19629K97782
$$ 2068803 2274880 2353893 2297083 2367501 2564278 2635237 2626337 2846072 3265701 3563483
33806C563483K13004M43780N26832J74538R8202P70505J050456m36647k862442
$$ 3563483 3776487 4220267 4747099 4921637 5019839 5790344 6840800 6404153 3541711
33797C541711l800294k387129l46753N03948L13936J46083K07673J03915p1512
$$ 3541711 -258583 -2645712 -2992465 -2488517 -2174581 -2028498 -1820825 -1716910 -1788422
33788a788422N0093L15473L13886J07269L8165J01669P0988j2462K9151J15567
$$ -1788422 -1738329 -1422856 -1108970 -1001701 -963536 -861867 -790879 -803341 -774190 -658623
33778f58623P4158p609L8381J33970J24667O6609O4829M7942m0579o3343N3666
$$ -658623 -584465 -592074 -553693 -419723 -295056 -228447 -163618 -115676 -156255 -219598 -165932
33767a65932J29564L3475o8391j0174P9503K9957o1285k7288O5331N8432k5138
$$ -165932 -36368 -2893 -71284 -81458 -1955 28002 -33283 -60571 4760 63192 38054
33756C8054o5483m8198j0989N5144J15371P4023m1237o8723K4717Q5725N2709
$$ 38054 -27429 -75627 -86616 -31472 83899 157922 116685 47962 72679 158404 211113
33745B11113M3287Q8496N8948n2643p0547L7362P6909j5170n0353M8665R7842
$$ 211113 254400 342896 401844 349201 278654 316016 392925 377755 327402 376067 473909
33734D73909J1723k9634N5147O6762r1580j93694q3206M5144R693l4825P8614
$$ 473909 485632 455998 511145 577907 486327 292633 209427 254571 264264 229439 308053
33723C08053J83944P8914r0695p6604N3059P0187r619l852Q5134J01596L2720
$$ 308053 491997 570911 480216 403612 456671 526858 517239 513387 598521 700117 732837
33712G32837K126K6069P234p0155j24846j17705o7565J2150Q3274P3034j1023
$$ 732837 734963 761032 768266 698111 573265 455560 387995 400145 483419 556453 545430
33701E45430n6042j3077K7793N94l8954m6146o0605p9129k5413Q2941J14672L9271
$$ 545430 489388 476311 504104 504698 465744 419598 358993 279864 254451 337392 452064 491335
33689D91335k3909k4726l8761n2560N5014K32054K27104k2564k31050j56251O9770
$$ 491335 467426 442700 403939 351379 406393 638447 865551 842987 611937 455686 525456
33678E25456J72710J02568p19m2781k0996L2528M3611m1903j31867q2622N3523
$$ 525456 698166 800734 800015 757234 736238 768766 812377 770474 638607 555985 609508
33667F09508Q1082j5458m9688K7841N0183l9721p8762M262N8006K435l1071K8915
$$ 609508 690590 675132 625444 653285 703468 663747 584985 589247 647253 649688 618617 647532
33655F47532O1663P528k7436k1838r1939j94519j12839J36898K40711Q0655o9900
$$ 647532 709195 716723 689287 667449 575510 380991 268152 405050 645761 726416 656516
33644F56516j9541N0323k0849o9895M0105J25719K9593o6203K1534J27023L9701
$$ 656516 636975 687298 666449 596554 636659 762378 791971 725768 747302 874325 914026
33633I14026j14950j16702k5306m297l013Q0499J38006N0891n3564k7385K3231
$$ 914026 799076 682374 657068 652771 649758 730257 868263 919154 865590 838205 861436
33622H61436l9724j05418l4340N6836J4384n9196j4461N4055J3954k1633Q1925
$$ 861436 821712 716294 681954 738790 753174 693978 679517 733572 747526 725893 807818
33611H07818J78560P7991r9188j15571k225M8422J8560Q951J880m8640m9179N2620
$$ 807818 986378 1064369 965181 849610 847385 895807 914367 923318 925198 876558 827379 879999
33599H79999R5000l5755j64298j09941L01j6214n6433M4153J61510R9665l2584
$$ 879999 974999 939244 774946 665005 665306 649092 592659 636812 798322 897987 865403
33588H65403j4100Q6506N7303n4861m6878N4741N6914m5450r6425p2188n8119
$$ 865403 851303 937809 995112 940251 893373 948114 1005028 959578 863153 790965 732846
33577G32846l3997M7212Q7714J5421k4311P9201J37372l8548k53920j99873M3004
$$ 732846 698849 746061 833775 849196 824885 904086 1041458 1002910 748990 549117 592121
33566E92121J40934L2861n2018k1043K394j7934J4696Q8322Q3014m33m8559l1197
$$ 592121 733055 765916 713898 692855 695249 677315 692011 780333 863347 862914 814355 783158
33554G83158R140P6836J46106J00134n7903j10419M1404J62850N5897r4592m6611
$$ 783158 792298 869134 1015240 1115374 1057471 947052 988456 1151306 1207203 1112611 1066000
33543A066000P1154J4535j15115o7084Q0687O1878r2370j27771l1831j5568r3671
$$ 1066000 1137154 1151689 1036574 969490 1050177 1112055 1019685 891914 860083 844515 750844
33532G50844p3402O7941J46324R4268J9297k6050o6097n8868K2706O4221m267
$$ 750844 677442 745383 891707 985975 1005272 979222 913125 854257 876963 941184 936917
33521I36917m0301N6077J12755j8843j58854r7279L3065J9674l2640N9769J61767
$$ 936917 896616 952693 1065448 1046605 887751 790472 823537 843211 810571 870340 1032107
33510A032107O5478q9662o3719L5446j6164j04972j6844J01773J2612j10451K2026
$$ 1032107 1097585 1007923 944204 979650 963486 858514 841670 943443 956055 845604 867630
33499H67630K26093J25711j57212j97025m220N0896n6987k2443J39872J10820
$$ 867630 1093723 1219434 1062222 865197 860977 911873 854886 832443 972315 1083135
33489A083135q7057j01175P9234R4273j02226j52716L6513J43183M2198j1833
$$ 1083135 996078 894903 974137 1068410 966184 813468 849981 993164 1035362 1023529
33479A023529P2245O0139j00282j48523j8934L5748n3855n6041P0257P9119n7145
$$ 1023529 1095774 1155913 1055631 907108 888174 923922 870067 814026 884283 963402 906257
33468I06257o3108J02447J41204k6204j07517K1919J26810Q7277P1973J18025
$$ 906257 843149 945596 1086800 1060596 953079 974998 1101808 1189085 1261058 1379083
33458A379083L8758j37171j43819L892p24j57897j24487J17226J69702m9274j26514
$$ 1379083 1417841 1280670 1136851 1140743 1140019 982122 857635 974861 1144563 1095289 968775
33447I68775R0458K04384J82j67487l8401J02404r84j09716J1386J41775N4160
$$ 968775 1059233 1263617 1263799 1096312 1057911 1160315 1159331 1049615 1061001 1202776 1256936
33436A256936m9681M6404J48055L4258j22406r5568m568k3576m0347O0492J12316
$$ 1256936 1207255 1253659 1401714 1435972 1313566 1217998 1213430 1189854 1149507 1209999 1322315
33425A322315j5440j39288r6511l2748q2334r9736K0930R9543Q319p9167k5264
$$ 1322315 1306875 1167587 1071076 1038328 955994 856258 877188 976731 985050 905883 880619
33414H80619K6473k6919l8886N2952O2323n8189o5740J12562J89916K9020r6093
$$ 880619 907092 880173 841287 894239 956562 898373 832633 945195 1135111 1164131 1068038
33403A068038l398Q0322j6134q0984L9945J21315j143j00220N326J06906K8051
$$ 1068038 1064640 1144962 1128828 1047844 1087789 1209104 1207961 1107741 1113067 1219973 1248024
33392A248024l4417P4519J37075r236j32792m4626M5042m4856j08193K0915J15753
$$ 1248024 1213607 1288126 1425201 1415965 1283173 1238547 1283589 1238733 1130540 1151455 1267208
33381A267208K736p7599N8567J48377k5458j87666n3909J51599J13081l0983j2557
$$ 1267208 1269944 1192345 1250912 1399289 1373831 1186165 1132256 1283855 1396936 1365953 1353396
33370A353396O3193r594j06125m3413M6609J2636M811J27264J54480l1553j40673
$$ 1353396 1416589 1406995 1300870 1257457 1304066 1316702 1321513 1448777 1603257 1571704 1431031
33359A431031J447Q5148j08074k48508m8119J82716R1099q1472J9481J96847J12800
$$ 1431031 1432478 1517626 1409552 1161044 1112925 1295641 1386740 1305268 1324749 1521596 1634396
33348A634396o0647j2185R0168l0396j63749k2574J39152k2131k44895j11616
$$ 1634396 1573749 1561564 1651732 1621336 1457587 1435013 1574165 1552034 1307139 1195523
33338A195523J62935J17540j08127p0918J18023K5812k36778j90424J22566K12853
$$ 1195523 1358458 1475998 1367871 1296953 1414976 1440788 1204010 1013586 1136152 1349005
33328A349005J8120n5324Q1003R3409r2803j75866o4262J7391J4506Q1261J59769
$$ 1349005 1367125 1311801 1392804 1486213 1393410 1217544 1153282 1170673 1185179 1266440 1426209
33317A426209N6430j10289o3209J04784P8446r6914j13755J8743L6902m0427J4381
$$ 1426209 1482639 1372350 1309141 1413925 1492371 1395457 1281702 1300445 1337347 1296920 1311301
33306A311301J31623O2833j00476p5616O0386K3198j07133m2286J21089O3440
$$ 1311301 1442924 1505757 1405281 1329665 1390051 1413249 1306116 1263830 1384919 1448359
33296A448359j27251j01503Q9676J04283k7582P574J52406P5971j49018j39309
$$ 1448359 1321108 1219605 1309281 1413564 1385982 1393556 1545962 1621933 1472915 1333606
33286A333606P7583J09286o5773q7212P4659P9642r2454r4015J02510J36795m9660
$$ 1333606 1411189 1520475 1454702 1367490 1442149 1521791 1429337 1335322 1437832 1574627 1524967
33275A524967j05855N6794J12331n2252j50951n2691L2972J9275O3993J58467
$$ 1524967 1419112 1475906 1588237 1535985 1385034 1332343 1365315 1384590 1448583 1607050
33265A607050J07204m1270m6156M3962k2649j72448j16544O6738M9003j09181
$$ 1607050 1714254 1672984 1626828 1670790 1648141 1475693 1359149 1425887 1474890 1365709
33255A365709o3115J30302J00051j06839q6566J40035J43048r3869j22324J28278
$$ 1365709 1302594 1432896 1532947 1426108 1339542 1479577 1622625 1528756 1406432 1534710
33245A534710K18345K3167o4353R0847J30909o3752j30481O3492J53854k9202
$$ 1534710 1753055 1776222 1711869 1802716 1933625 1869873 1739392 1802884 1956738 1927536
33235A927536j52764k0907Q8588j6938j16635m3627M4494N3454J01219J46179
$$ 1927536 1774772 1753865 1842453 1825515 1708880 1665253 1709747 1763201 1864420 2010599
33225B010599m175k21314j59812R7228J09338j41229k04199K0581J24247l0020
$$ 2010599 2006424 1785110 1625298 1722526 1831864 1690635 1486436 1507017 1631264 1601244
33215A601244q9074O6977J05846o2338q4469J31965K13921L6351n1246P4835Q1449
$$ 1601244 1512170 1579147 1684993 1622655 1538186 1670151 1884072 1920423 1869177 1944012 2025461
33204B025461j33897k20424n8394K7188n9875j2788J87074J56373j10965j38625
$$ 2025461 1891564 1671140 1612746 1639934 1580059 1567271 1754345 1910718 1799753 1661128
33194A661128J36670J91142j10450k29532M8672K17444J5361j01532J16098K02086
$$ 1661128 1797798 1988940 1878490 1648958 1697630 1915074 1930435 1828903 1945001 2147087
33184B147087j08804l11277l8508K58157J32144r9380k5229J26870L5988q2109
$$ 2147087 2038283 1727006 1688498 1946655 2078799 1979419 1954190 2081060 2117048 2034939
33174B034939J4545O8837j20165k18857J2564K12188P4141r0442J8082J16689
$$ 2034939 2049484 2118321 1998156 1779299 1791863 2004051 2078192 1987750 2005832 2122521
33164B122521n8217j96657k3408J46015J9012j07157M6881J76763Q150j34716
$$ 2122521 2064304 1867647 1844239 1990254 2009266 1902109 1948990 2125753 2133903 1999187
33154A999187L8329J90199k35k02822o3104J25719J1012j36076K7139K33191J24293
$$ 1999187 2037516 2227715 2227480 2024658 1961554 2087273 2098285 1962209 1989348 2222539 2346832
33143B346832p6367m5659J6244j32514k09336M4188K81453J52657m6438M1118
$$ 2346832 2270465 2224806 2241050 2108536 1899200 1943388 2224841 2377498 2331060 2372178
33133B372178J49980n1762k68792j21314J31227Q1998r9358q0455n546r5241j24119
$$ 2372178 2522158 2470396 2201604 2080290 2211517 2293515 2194157 2113702 2108156 2012915 1888796
33122A888796Q6642J97847j8346j60998P0994K65125O1091j44036L7482K10523
$$ 1888796 1975438 2173285 2154939 1993941 2064935 2330060 2391151 2247115 2284597 2495120
33112B495120l6578k91266p9756K10855O3297j77912J4423L10927J53056j71323
$$ 2495120 2458542 2167276 2087520 2298375 2361672 2183760 2198183 2509110 2662166 2490843
33102B490843r8352J22006m3839l14816j14287K80400K14508j31123j14086J55361
$$ 2490843 2392491 2514497 2470658 2155842 2041555 2321955 2536463 2405340 2291254 2446615
33092B446615R4731j82424j07246K03490J63408j43533j30906J60086J62618j27554
$$ 2446615 2541346 2358922 2251676 2455166 2618574 2475041 2344135 2504221 2666839 2539285
33082B539285j93576l506J4516j17330l898K52458J96151q3490j03839R6563Q3508
$$ 2539285 2345709 2342203 2356719 2239389 2235491 2487949 2684100 2600610 2496771 2593334 2676842
33071B676842r2519l1391J72165J06664j15772p6377J04126K4077j40976L6881
$$ 2676842 2584323 2552932 2725097 2831761 2715989 2639612 2743738 2767815 2626839 2663720
33061B663720L16226J60041k19960j97514J25276J43583r9047n3633K20696J73681
$$ 2663720 2979946 3139987 2920027 2722513 2847789 2991372 2892325 2838692 3059388 3233069
33051C233069j38737j54476R8714P3552k12365k16202P0656J36252l9801l913
$$ 3233069 3094332 2939856 3038570 3112122 2899757 2683555 2754211 2890463 2850662 2846749
33041B846749K09826J43647j32875j33064P9448K9145j90915r5219J84123J15484
$$ 2846749 3056575 3200222 3067347 2934283 3013731 3042876 2851961 2756742 2940865 3056349
33031C056349j59363o0977K73308K03212j82878k15254R2047J11411j57929j30042
$$ 3056349 2896986 2836009 3109317 3312529 3129651 2914397 3006444 3117855 2959926 2829884
33021B829884J62008J31183j49801n3743L20148K55458j96937k53757J44764K38277
$$ 2829884 2991892 3123075 2973274 2919531 3239679 3495137 3298200 3044443 3189207 3427484
33011C427484j11666k09724J10769K19945m6358j25311J02044J19344r9874j8241
$$ 3427484 3315818 3106094 3216863 3436808 3390450 3265139 3367183 3486527 3386653 3368412
33001C368412K93891J86118k60364k64246J87609K62619j67933k95625R7067K76482
$$ 3368412 3662303 3848421 3588057 3323811 3511420 3774039 3606106 3310481 3407548 3684030
32991C684030j2513j38944J04648J45629j25919j08977K35010K19913j90496k35449
$$ 3684030 3671517 3532573 3637221 3782850 3656931 3547954 3782964 4002877 3812381 3576932
32981C576932J60807K02477k12199k42868K54740L87112r3687l19706L9887K12404
$$ 3576932 3737739 3940216 3728017 3485149 3739889 4127001 4033314 3713608 3753495 3965899
32971C965899j08739j90266K14404L23309j16016k74130J51657L23260j07042
$$ 3965899 3857160 3666894 3881298 4204607 4088591 3814461 3966118 4289378 4182336
32962D182336l02027J38777L98524J4485k70345K2064K47918K097j14509J78910
$$ 4182336 3880309 4019086 4417610 4432095 4161750 4183814 4431732 4433829 4319320 4498230
32952D498230K08776k32889l17463K30238M77798j3717l59575j6491K61226l9389
$$ 4498230 4707006 4474117 4156654 4386892 4864690 4850973 4491398 4474907 4736133 4696744
32942D696744k35582J04105K85895o4453k05826K05546L52343j31803l68131P5244
$$ 4696744 4461162 4565267 4851162 4786709 4580883 4786429 5138772 5006969 4638838 4714082
32932D714082L24471p0616k33505K67760M82002p6903m04082R2951M41317o879
$$ 4714082 5038553 4967937 4734432 5002192 5484194 5407291 5003209 5096160 5537477 5530598
32922E530598l27414J26366M36619l8238l49756J66126N15410l4017m67945M5169
$$ 5530598 5203184 5329550 5766169 5727931 5378175 5544301 6059711 6025694 5557749 5602918
32912E602918N35337J07834l33323J20001N96386J66102l31341N9973N40869J16164
$$ 5602918 6138255 6246089 5912766 6032767 6629153 6795255 6463914 6523887 7064756 7180920
32902G180920n15266l83287n0246k78949m25871J31643N17970J0239m22973P2060
$$ 7180920 6665654 6282367 6232121 5953172 5527301 5658944 6176914 6187153 5764180 5836240
32892E836240N49968J09526l23480J50863N78534N7300l84060K07847P13859M3331
$$ 5836240 6386208 6495734 6172254 6323117 6901651 6958951 6574891 6782738 7496597 7539928
32882G539928o67299j58796N42846J27497m72662L2367P28951L17595l16904R8914
$$ 7539928 6872629 6713833 7256679 7384176 6911514 6943881 7672832 7990427 7673523 7772437
32872G772437O59373J11467n52628j2332O91907J49100n80567J1656Q60271L25200
$$ 7772437 8431810 8543277 7990649 7978317 8670224 8819324 8238757 8250413 9110684 9435884
32862I435884o01090j98072O53204K57994n26614l0030Q43306L72530n14558k7081
$$ 9435884 8834794 8636722 9289926 9547920 9021306 8991276 9834582 10207112 9692554 9665473
32852I665473R05876M25577n43039o9121R37444M76606n68045j44306Q86102M44859
$$ 9665473 10571349 10996926 10453887 10384766 11322210 11798816 11230771 11086465 11972567 12417426
32842A2417426n76170l3178J137425O66028n19047l5002J199688O78078o77934
$$ 12417426 11841256 11808078 12945503 13611531 13092484 13057482 14257170 14935248 14257314
32833A4257314j45086J472691J215606n06656q82263n1434k95426j043235n5164
$$ 14257314 14112228 15584919 16800525 16293869 15411606 15360172 15064746 14021511 13966347
32824A3966347J562099J042865n18608j4844J608173J112867n73737n2652J736668
$$ 13966347 15528446 16571311 16052703 16037859 17646032 18758899 18185162 18132510 19869178
32815A9869178J189923p36117j67858J973991J533221o47303j36550K316854K002114
$$ 19869178 21059101 20322984 20155126 22129117 23662338 23015035 22878485 25195339 27197453
32806B7197453m54966r5970K546890K275186l78838J46753L324478L099639q6911
$$ 27197453 26742487 26646517 29193407 31468593 31089755 31236508 34560986 37660625 37573714
32797C7573714L68087M135457L927652j74090j64198M228404M390174K6638Q82397
$$ 37573714 37941801 42077258 46004910 45830820 45666622 49895026 54285200 54311838 55194235
32788E5194235P405226Q225561K490503L802526J3706628J5157407N187548O917560
$$ 55194235 62599461 70825022 73315525 77118051 90824679 105982086 111169634 118087194
32780A18087194K7239128K8946633k1152348r2424755j17210262p4073993j0377450
$$ 118087194 145326322 174272955 153120607 60695852 -56514410 -130588403 -140965853
32773a40965853K0097534J1047466r968245j8832099o834105K0477385M2277233
$$ -140965853 -120868319 -109820853 -119789098 -138621197 -145455302 -124977917 -82700684
32766h2700684L7478217J1604678o598974k840828O431195L840381l444783j681968
$$ -82700684 -45222467 -33617789 -40216763 -43057591 -36626396 -32786015 -36230798 -37912766
32758c7912766M617805L618274j780030j211449L440437L010257j233974j042250
$$ -37912766 -33294961 -29676687 -31456717 -32668166 -29227729 -26217472 -27451446 -28493696
32750b8493696K755307K637623r13576j001976K161066K229331p73513r51885
$$ -28493696 -25738389 -23100766 -24014342 -25016318 -22855252 -20625921 -21399434 -22351319
32742b2351319J835414K083062n13927q39520J515929J782309n17107r09052J137883
$$ -22351319 -20515905 -18432843 -18946770 -19786290 -18270361 -16488052 -17005159 -17914211 -16776328
32733a6776328J425228n91248r16569J030333J432447l61180p47868R44286J297069
$$ -16776328 -15351100 -15942348 -16858917 -15828584 -14396137 -14757317 -15505185 -14560899 -13263830
32724a3263830l60393p46742Q32897J232729k70031o73184P47898J107699l16138
$$ -13263830 -13624223 -14370965 -13538068 -12305339 -12575370 -13248554 -12500656 -11392957 -11709095
32715a1709095p21856O38862J050285k78013p31153N28699J017653j22814n62542
$$ -11709095 -12430951 -11792089 -10741804 -11019817 -11750970 -11222271 -10204618 -10327432 -10889974
32706a0889974N01885Q30841l05904o72068M64975Q80577j97909n87573N18006
$$ -10889974 -10388089 -9557248 -9863152 -10535220 -10070245 -9189668 -9387577 -9975150 -9457144
32697i457144R67573j14465o47227L16132Q20050q8509n61051L21558P61989j47826
$$ -9457144 -8489571 -8604036 -9251263 -8935131 -8115081 -8203590 -8764641 -8443083 -7681094 -7828920
32687g828920o39455K29785P58915k1497n06812K54704P28326j9911n24133J18526
$$ -7828920 -8468375 -8238590 -7479675 -7501172 -8007984 -7753280 -7024954 -7044865 -7568998 -7450472
32677g450472N12863j59150m89893K89794P03748p1693n53431J56226O27352p4284
$$ -7450472 -6937609 -7096759 -7586652 -7296858 -6593110 -6664803 -7218234 -7062008 -6434656 -6508940
32667f508940n76144P4741N61209p4367n56307Q2283O03450K0854m77487J10826
$$ -6508940 -7085084 -7010343 -6449134 -6523501 -7079808 -6997525 -6394075 -6373221 -6850708 -6739882
32657f739882O57172J47697l71470Q3295N31681N6932l66414J32330N40478l1396
$$ -6739882 -6082710 -5935013 -6306483 -6223188 -5691507 -5634575 -6000989 -5868659 -5328181 -5359577
32647e359577n48757m7580M97769Q6059m03836l884M58212N2782m15903l9400
$$ -5359577 -5908334 -5955914 -5458145 -5372086 -5775922 -5779806 -5321594 -5268812 -5684715 -5724115
32637e724115M08656N7621l26537R0104N15730J10902l23030P1069M97181Q2650
$$ -5724115 -5315459 -5257838 -5584375 -5494271 -4978541 -4867639 -5190669 -5119600 -4622419 -4539769
32627d539769l81744K543M61760O8934m32735r3785L81432L2210m67469j29009
$$ -4539769 -4921513 -4918970 -4457210 -4388276 -4821011 -4914796 -4533364 -4501154 -4968623 -5097632
32617e097632M31079K06889k77520o4872L70020J32956k98844n1012M10003K18255
$$ -5097632 -4666553 -4459664 -4737184 -4802056 -4432036 -4299080 -4597924 -4648936 -4238933 -4020678
32607d020678k01657l9688K83508K4963l36776o8679K91164k3859m31408q4736
$$ -4020678 -4222335 -4262023 -3978515 -3953552 -4290328 -4359007 -4067843 -4091702 -4523110 -4607846
32597d607846M48392K38103k38160n4906L64565J24108l51387j39374L71154K36772
$$ -4607846 -4159454 -3921351 -4159511 -4214417 -3849852 -3725744 -4077131 -4216505 -3845351 -3608579
32587c608579k19618q2999L48022J67101l46585k60749K28595K23943j56839j17463
$$ -3608579 -3828197 -3911196 -3563174 -3396073 -3742658 -4003407 -3774812 -3550869 -3707708 -3825171
32577c825171K18154J26583k19680j09205K62914J87734j31543K921L59875K12096
$$ -3825171 -3607017 -3480434 -3700114 -3809319 -3546405 -3358671 -3490214 -3487293 -3127418 -2915322
32567b915322k18811j73749J90685J60034j33189m8928K26799O9241k73372j29885
$$ -2915322 -3134133 -3307882 -3117197 -2957163 -3090352 -3139280 -2912481 -2843240 -3116612 -3246497
32557c246497K43672J32546k41880j71513J31650j8801l68522j92850K34134J12511
$$ -3246497 -3002825 -2870279 -3112159 -3283672 -3152022 -3170823 -3539345 -3732195 -3498061 -3385550
32547c385550l25866k28537K54397K72809r8363o2640L17961K71719j47829j79659
$$ -3385550 -3711416 -3939953 -3685556 -3412747 -3511110 -3573750 -3255789 -2984070 -3131899 -3311558
32537c311558J47399J12578k37534j91148J86732J71349j67687r0676L18540K60588
$$ -3311558 -3164159 -3051581 -3289115 -3480263 -3293531 -3122182 -3289869 -3380545 -3062005 -2801417
32527b801417k22288k80894J45114K44558j01846j48866K15809K57994j48011
$$ -2801417 -3023705 -3304599 -3159485 -2914927 -3016773 -3165639 -2949830 -2691836 -2839847
32518b839847k64615Q9448K24190p0918j73982J04728J74694j30981k21629Q4761
$$ -2839847 -3104462 -3015014 -2790824 -2861742 -3035724 -2930996 -2756302 -2887283 -3108912 -3024151
32508c024151K24761L760p6040J33289J47587j24016j59950J25571J84261q7252
$$ -3024151 -2799390 -2795630 -2871670 -2738381 -2590794 -2714810 -2874760 -2749189 -2564928 -2652180
32498b652180j35581J57217K33617n5170j76514L8987J16252p7166r4390J25446
$$ -2652180 -2787761 -2630544 -2396927 -2452097 -2628611 -2589624 -2473372 -2550538 -2644928 -2519482
32488b519482R1606k24563k52282Q5958J93421o9405j37294J38970K03580j01448
$$ -2519482 -2427876 -2652439 -2904721 -2818763 -2625342 -2694747 -2832041 -2693071 -2489491 -2590939
32478b590939k17450M6781J67003m5555r0076J95138K83215r271j52678P0471
$$ -2590939 -2808389 -2761608 -2594605 -2640160 -2730236 -2535098 -2251883 -2261154 -2413832 -2343361
32468b343361J64018q8627k08557K1495J39804p3766j90354j0882O6386r9255
$$ -2343361 -2179343 -2267970 -2476527 -2455032 -2315228 -2388994 -2579348 -2590230 -2523844 -2623099
32458b623099r2833J71070K04522r2243j84466P0728J45553r7582j13116K14081
$$ -2623099 -2715932 -2544862 -2340340 -2432583 -2617049 -2546321 -2400768 -2498350 -2611466 -2397385
32448b397385K57153j45477k93772Q8571L06397j9681k50146N3462L10138M2413
$$ -2397385 -2140232 -2285709 -2579481 -2490910 -2184513 -2204194 -2454340 -2400878 -2090740 -2048327
32438b048327k30278j0033K44478L7493k10489N68K78827R5510k18316j15697
$$ -2048327 -2278605 -2288638 -2044160 -2006667 -2217156 -2216588 -1937761 -1842251 -2060567 -2176264
32428b176264J69585J30128q4017o1680O0245l9707j71287k8450J65310Q4548
$$ -2176264 -2006679 -1876551 -1960568 -2022248 -1962003 -2001710 -2172997 -2201447 -2036137 -1951589
32418a951589o3068L2855J58683j086k36896j99911j3663M0970M6296J52654J83798
$$ -1951589 -2014657 -1981802 -1823119 -1824205 -2061101 -2261012 -2274675 -2233705 -2187409 -2034755 -1850957
32407a850957J0692j08565N035R9428j645m7916R6745J23202j12140k37561m3769
$$ -1850957 -1840265 -1948830 -1943795 -1844367 -1846012 -1893928 -1797183 -1673981 -1786121 -2023682 -2067451
32396b067451J06162k9310j19879M5385J09814j18980k09406Q2166K73329K1964
$$ -2067451 -1961289 -1990599 -2110478 -2065093 -1955279 -2074259 -2283665 -2201499 -1928170 -1906206
32386a906206k08128K072K44180O5364j75610j3268K27162O4359k10370r4046
$$ -1906206 -2114334 -2112262 -1868082 -1802718 -1978328 -1991596 -1764434 -1700075 -1910445 -2004491
32376b004491J78731J11180j15880m1850J71138Q6234j47403j12378N8901q581
$$ -2004491 -1825760 -1714580 -1830460 -1872310 -1701172 -1614938 -1762341 -1874719 -1815818 -1824399
32366a824399j54581j0605K26928J41111j02706p6798R4928J9218j73051j00276
$$ -1824399 -1978980 -1989585 -1762657 -1621546 -1724252 -1801050 -1706122 -1686904 -1859955 -1960231
32356a960231Q9693L786j98742q9980J87312J63688q5703j06343Q5611J01516
$$ -1960231 -1870538 -1866752 -2065494 -2155474 -1968162 -1804474 -1890177 -1996520 -1910909 -1809393
32346a809393l6217J6337J91856J29300r4303r0304R1785O8335j25231j09380
$$ -1809393 -1845610 -1829273 -1637417 -1508117 -1602420 -1692724 -1600939 -1532604 -1657835 -1767215
32336a767215R3534J02515r2139j34571Q114L2462p1148k8062J25231R5952o0291
$$ -1767215 -1673681 -1571166 -1663305 -1797876 -1789762 -1757300 -1828448 -1856510 -1731279 -1635327 -1695618
32325a695618k3193J50736J04904j36722j96912k9419M2209m7362m5511O3076
$$ -1695618 -1718811 -1568075 -1463171 -1599893 -1796805 -1826224 -1784015 -1831377 -1876888 -1813812
32315a813812L8347q6475m2103J22518J00000p8578q5029Q4813J14972j7391k3291
$$ -1813812 -1775465 -1861940 -1904043 -1781525 -1681525 -1760103 -1845132 -1760319 -1645347 -1662738 -1686029
32304a686029J02842O6748j23502j34728O0667J13560o4203j49706J549J37872
$$ -1686029 -1583187 -1516439 -1639941 -1774669 -1714002 -1600442 -1664645 -1814351 -1812802 -1674930
32294a674930R7102L3290M9318L6323l0647k9993K1984j0070p8105k9760O3213
$$ -1674930 -1577828 -1544538 -1495220 -1458897 -1489544 -1519537 -1497553 -1507623 -1585728 -1615488 -1552275
32283a552275L5487j2687R5914K00328M7543j83656j32056R1940P2773j74719
$$ -1552275 -1516788 -1529475 -1433561 -1233233 -1185690 -1369346 -1501402 -1409462 -1336689 -1511408
32273a511408k37404l3462R6413L1343Q721Q7298N0904r4966q4598Q6147J28345
$$ -1511408 -1748812 -1782274 -1685861 -1654518 -1645797 -1558499 -1507595 -1602561 -1687159 -1601012 -1472667
32262a472667J793l2913O0479M9523n5868j157J63877J07065j51406k08831K2339
$$ -1472667 -1470874 -1503787 -1443308 -1393785 -1449653 -1450810 -1286933 -1179868 -1331274 -1540105 -1517766
32251a517766J67397N7917k9976M9375O9341n6157o8907J12223J81260j2394j84579
$$ -1517766 -1350369 -1292452 -1322428 -1273053 -1203712 -1259869 -1328776 -1216553 -1035293 -1047687 -1232266
32240a232266j14551J2132r018o8155k0122N2933N3323L5340K3608l9754r0234
$$ -1232266 -1346817 -1334685 -1343703 -1411858 -1431980 -1379047 -1325724 -1290384 -1266776 -1306530 -1396764
32229a396764L78J29140P6186q4941q4468M9330L5886j22834j38698J2296M7997
$$ -1396764 -1396386 -1267246 -1191060 -1276001 -1360469 -1311139 -1275253 -1398087 -1536785 -1524489 -1476492
32218a476492o5821m9301J29096J63377j2599r5890J3624M9288p4492r3687O1074
$$ -1476492 -1542313 -1591614 -1462518 -1299141 -1311740 -1407630 -1394006 -1344718 -1419210 -1512897 -1451823
32207a451823R5165q0051j40830O2413K23040J23005k5106k4896j8467j15266
$$ -1451823 -1356658 -1436709 -1577539 -1515126 -1292086 -1169081 -1194187 -1219083 -1237550 -1352816
32197a352816j47225l8879Q686o9431m1137J49681K00410k0351k04701j19372
$$ -1352816 -1500041 -1538920 -1530234 -1599665 -1640802 -1491121 -1290711 -1311062 -1515763 -1635135
32187a635135M2139O9847O9689J32617J02208o0505j00309P4147J69507J6250
$$ -1635135 -1592996 -1523149 -1453460 -1320843 -1218635 -1279140 -1379449 -1305302 -1135795 -1119545
32177a119545j19595k0414R9881P889j39168j15175q455J8993K9006Q9729Q4245
$$ -1119545 -1239140 -1259554 -1159673 -1151784 -1290952 -1406127 -1414582 -1395589 -1366583 -1276854 -1192609
32166a192609j5902k1479J04369J12612p0589j50383J8962J42932K192j57668
$$ -1192609 -1208511 -1229990 -1125621 -1013009 -1083598 -1233981 -1215019 -1072087 -1069895 -1227563
32156a227563p7247P0895L8426n8230j3219P7429M8221q887K7406M2844n0286
$$ -1227563 -1304810 -1233915 -1195489 -1253719 -1266938 -1189509 -1141288 -1150175 -1122769 -1079925 -1130211
32145a130211q5562L4783J02033k5240j32955l4194Q8438L2984n4891J3030J10090
$$ -1130211 -1215773 -1180990 -1078957 -1104197 -1237152 -1271346 -1182908 -1149924 -1204815 -1191785 -1081695
32134a081695O8616Q413O8330J05815j4873j25234n8478L5055j6016q5664k8516
$$ -1081695 -1013079 -1004666 -936336 -830521 -845394 -970628 -1029106 -994051 -1010067 -1095731 -1124247
32123a124247K6647l7791o2672O2901J34157K193j18560l8033N6838k2617r1302
$$ -1124247 -1097600 -1135391 -1198063 -1135162 -1001005 -998812 -1117372 -1155405 -1098567 -1121184 -1212486
32112a212486M0951J72154P4597p1588k0302Q0608p837j52028j13534O7k0897
$$ -1212486 -1171535 -999381 -924784 -996372 -1016674 -936066 -943903 -1095931 -1209465 -1209398 -1230295
32101a230295o4701N2977J79067R1654p1241o9268Q235k1892m6116P3240J29673
$$ -1230295 -1294996 -1242019 -1062952 -971298 -1042539 -1111807 -1103572 -1125464 -1171580 -1098340 -968667
32090i68667o0757k19771l7300K37805J80215q7807j30806M6852Q2889n6486p7399
$$ -968667 -1029424 -1249195 -1286495 -1048690 -868475 -956282 -1087088 -1040236 -957347 -1013833 -1091232
32079a091232M1403L4879r8090q2533R6077J54397K8016m4619K2766O2174K2805
$$ -1091232 -1049829 -1014950 -1113040 -1195573 -1099496 -945099 -917083 -961702 -938936 -876762 -853957
32068h53957L3160P8701P694j34817j49160m8506k5716q0357m1481P0034O9512
$$ -853957 -820797 -742096 -734402 -869219 -1018379 -1066885 -1092601 -1172958 -1214439 -1144405 -1074893
32057a074893k9852m4264K3190Q852o5408l2910O7198M2978p5997p6250N0746
$$ -1074893 -1104745 -1149009 -1125819 -1116967 -1182375 -1215285 -1148087 -1105109 -1181106 -1257356 -1206610
32046a206610J06524M9203K0077L6538o294o2755k11J04022O2602o9923p9532
$$ -1206610 -1100086 -1050883 -1030806 -994268 -1000562 -1063317 -1063528 -959506 -896904 -966827 -1046359
32035a046359K3778M5757k0227r487O9731N6668l1423k6492O5021Q4471K3719
$$ -1046359 -1022581 -976824 -997051 -1006538 -936807 -880139 -911562 -938054 -873033 -788562 -764843
32024g64843k413j6187r8962j48685m0445Q5261L6932o3589m159Q9888k1520j97017
$$ -764843 -767256 -783443 -882405 -1031090 -1071535 -986274 -949342 -1012931 -1017090 -927202 -948722 -1145739
32012a145739j25271Q8932P7975j24252j29006J11270K19590N7675p3028L992
$$ -1145739 -1271010 -1182078 -1104103 -1228355 -1357361 -1246091 -1026501 -968826 -1041854 -1037862
32002a037862Q3498K2684k2659M0789O4185j4078l7817M1585O6475j196r151N4083
$$ -1037862 -954364 -931680 -954339 -913550 -849365 -863443 -901260 -859675 -793200 -794396 -803547 -749464
31990g49464K2658q8320p0695O7333Q0283n5107p8194O6385J08247n6183j72829
$$ -749464 -726806 -815126 -885821 -818488 -738205 -793312 -871506 -805121 -696874 -753057 -925886
31979i25886q2192L8074M3309M9626J23391J14295k3287r1725p768L6481o1758
$$ -925886 -1008078 -970004 -926695 -877069 -753678 -639383 -662670 -754395 -762163 -725682 -787440
31968g87440j22949k9700N8438J2217n0712k8734k1814q7206r3587J7845R5807
$$ -787440 -910389 -940089 -881651 -869434 -920146 -948880 -970694 -1057900 -1151487 -1133642 -1037835
31957a037835N1065N373L9004N3792O028O342P6375P7323j8625o1384j1673o150
$$ -1037835 -986770 -981397 -942393 -888601 -882573 -876231 -799856 -722533 -741158 -802542 -814215 -820365
31945h20365o1347k8639P8718N2917j21370j95948q0383J9322n432j329R0186
$$ -820365 -881712 -910351 -831633 -778716 -900086 -1096034 -1176417 -1157095 -1162527 -1163856 -1073670
31934a073670R1147m4265r4101K6955R6569J516m5602Q5851J81831O4965r3478
$$ -1073670 -982523 -1026788 -1120889 -1093934 -997365 -995849 -1041451 -955600 -773769 -708804 -802282
31923h02282q9555j4942k7821o9100l6121R783J0499M3627J18834R7348l4769
$$ -802282 -891837 -906779 -934600 -1003700 -1039821 -1030038 -1019539 -975912 -857078 -759730 -794499
31912g94499q6372O428O1057o076l4982L9545N0200m9394n6747Q3208J29967j5042
$$ -794499 -880871 -874443 -813386 -819462 -854444 -814899 -764699 -814093 -870840 -787632 -657665 -672707
31900f72707j09931j9181M2324n4164q5961P5601J68374N242j58156p0169P5108
$$ -672707 -782638 -801819 -759495 -813659 -899620 -824019 -655645 -650403 -808559 -878728 -803620
31889h03620J8001r4303j9488J09123M6996r4772p2096L1059j7068j45829j16281
$$ -803620 -785619 -879922 -899410 -790287 -743291 -838063 -910159 -879100 -896168 -1041997 -1158278
31878a158278M7994J33824J05852P0596J9294q0819r4815P1739K28429J61070
$$ -1158278 -1110284 -976460 -870608 -800012 -780718 -861537 -956352 -884613 -656184 -495114
31868d95114k2835r4581p2254r5325j17441l4946M9614K212o6826q97R6626N3856
$$ -495114 -517949 -612530 -684784 -780109 -897550 -932496 -882882 -880670 -947496 -948393 -851767 -797911
31856g97911m3107k0179N7088L3140k7906P621N1037l3582j26241m7654R5019
$$ -797911 -841018 -861197 -804109 -770969 -798875 -791254 -740217 -773799 -900040 -947694 -852675
31845h52675Q5316k4254l4642L8181M4769R126L5891M6542p1622j85797j07992
$$ -852675 -767359 -791613 -826255 -788074 -743305 -734179 -698288 -651746 -723368 -909165 -1017157
31834a017157O3090J06961N5552Q1214J44694Q8981l4562o4072l8108q6721j32133
$$ -1017157 -954067 -847106 -791554 -710340 -565646 -476665 -511227 -575299 -613407 -700128 -832261
31823h32261k8845J14312R0032l5961m5232M3131L8803n7693r1580o4417q5737
$$ -832261 -861106 -746794 -656762 -692723 -737955 -694824 -656021 -713714 -805294 -869711 -955448
31812i55448j05583j1546J05195R2066L0051P2510J24549K0718j20244q3473L7948
$$ -955448 -1061031 -1072577 -967382 -875316 -845265 -772755 -648206 -627488 -747732 -831205 -793257
31801g93257J4218q0658j6960J21725O7860j16328j22662M9483R5480m3580r9301
$$ -793257 -779039 -859697 -876657 -754932 -687072 -803400 -926062 -876579 -781099 -824679 -923980
31790i23980J9748R1961K0456j4401O5991R3491o046p4111k4934K1324o410l1806
$$ -923980 -904232 -812271 -791815 -806216 -740225 -646734 -652780 -726891 -751825 -730501 -736911 -768717
31778g68717m2043j08530j65221o8109J00591J05865l5994n9476J01546K06071
$$ -768717 -810760 -919290 -1084511 -1152620 -1052029 -946164 -982158 -1041634 -940088 -734017
31768g34017J15051j5872l8024p330L577J8564J4040p9640j82971j29155M5790
$$ -734017 -618966 -634838 -672862 -680192 -676615 -658051 -644011 -723651 -906622 -1035777 -989987
31757i89987J32512Q3668N0083P6114M7655m1387o2603j2802j8315p3688n9828
$$ -989987 -857475 -773807 -723724 -647610 -599955 -641342 -703945 -716747 -735062 -808750 -868578
31746h68578r325n1780j21027m5938R6161P7902m8519j5810J63221J91253J9085
$$ -868578 -877903 -929683 -1050710 -1096648 -1000487 -922585 -971104 -986914 -823693 -632440 -613355
31735f13355n8361P0741J46327J1873j29309j02438l5992o4822q9406j5406N6730
$$ -613355 -671716 -600975 -454648 -442775 -572084 -674522 -710514 -775336 -864742 -880148 -823418
31724h23418M4247K2359K8486j2094p4005k4436R9007J03305n765j2650J04030
$$ -823418 -779171 -756812 -728326 -740420 -814425 -838861 -739854 -636549 -642314 -654964 -550934
31713e50934J17314k0280p7951K1209O2287m2119r3774j4582m287j24400j36159
$$ -550934 -433620 -453900 -531851 -510642 -448355 -490474 -584248 -598830 -603117 -727517 -863676
31702h63676M7140J52415J8516j17730n5202L3617l0297r2858R958J24177P8282
$$ -863676 -816536 -664121 -645605 -763335 -818537 -784920 -815217 -908075 -898117 -773940 -695658
31691f95658O820P2044J46717P2086l4794j9431K0616m1218j03497o4641m0773
$$ -695658 -688838 -616794 -470077 -397991 -432785 -452216 -431600 -472818 -576315 -640956 -681729
31680f81729r8554o2246J34839K17196N798k13430j21494J10733J26565l0107
$$ -681729 -780283 -842529 -707690 -490494 -484696 -698126 -819620 -708887 -582322 -612429
31670f12429n7816N5164O1095p6215j40908m7201O9001J03841O5482l7131j57150
$$ -612429 -670245 -615081 -553986 -630201 -771109 -818310 -749309 -645468 -579986 -617117 -774267
31659g74267j58306j1428R0603K0359n9128J4516J00313K0950q4910q097J26452
$$ -774267 -932573 -944001 -853398 -833039 -892167 -877651 -777338 -756388 -841298 -849395 -722943
31648g22943O9185r5733r3514N1395P2067n5705q6369M2698J08808N21j11958
$$ -722943 -653758 -749491 -843005 -791610 -719543 -775248 -861617 -818919 -710111 -709590 -821548
31637h21548p9594K0949O5903N4000L1088J1391J2554M1870N3108K5248K6018
$$ -821548 -901142 -880193 -814290 -760290 -729202 -717811 -705257 -663387 -610279 -585031 -559013
31626e59013Q1551Q5495j9292r7063l1870N5846J1254p8547m9289L2335l087r9534
$$ -559013 -477462 -391967 -411259 -508322 -540192 -484346 -473092 -551639 -600928 -568593 -571680 -671214
31614f71214o9503N6502P4122l7430r1922k2939L6619J4476r901K214r538m2417
$$ -671214 -740717 -684215 -610093 -647523 -739445 -762384 -725765 -711289 -721190 -718976 -728514 -770931
31602g70931j4279O2540P6097P989l6312q940K1838Q156j8830l2141l4780j5214
$$ -770931 -785210 -722670 -646573 -638584 -674896 -683836 -661998 -653842 -672672 -704813 -739593 -754807
31590g54807K2544K3409k8891n2938p92M3003O709l2592J1946P8710Q0467O0626
$$ -754807 -732263 -708854 -737745 -790683 -791475 -748472 -741763 -774355 -762409 -683699 -603232 -542606
31578e42606P3658M5621p3776j58789r6123J0931K4060J0371Q3925J55248Q6362
$$ -542606 -468948 -423327 -497103 -655892 -752015 -741084 -717024 -706653 -622728 -467480 -381118
31567c81118l5911m4447O646m2489j44488j32409l5273j4547n0942J1544J53058
$$ -381118 -417029 -461476 -454830 -497319 -641807 -774216 -809489 -824036 -874978 -863434 -710376
31556g10376J98237J23947P1591O9681J1821r5496j20666m7321N830K899J2441
$$ -710376 -512139 -388192 -316601 -246920 -235099 -330595 -451261 -498582 -492752 -489853 -477412
31545d77412L0963k128m5563k2529O866m2266p3366L4294J45460L9943j93824
$$ -477412 -446449 -448577 -494140 -516669 -509803 -552069 -625435 -591141 -445681 -405738 -599562
31534e99562k53810r0895M2248J8681q026P3219J50644J14806J8718o0167j09444
$$ -599562 -853372 -944267 -902019 -883338 -891364 -818145 -667501 -552695 -533977 -594144 -703588
31523g03588r1769L1583J64633J63254N9542J20r396o8920j33831o8783O8052
$$ -703588 -795357 -763774 -599141 -435887 -376345 -376225 -385621 -454541 -588372 -657155 -589103
31512e89103P7876l9292q2130J370M8638m313l2528J0959J6870l8681m0574K6199
$$ -589103 -511227 -550519 -632649 -631279 -582641 -586954 -619482 -608523 -591653 -630334 -670908 -644709
31500f44709M3020N121L6985J21283R0452o1370j39032p6283k4414n2331m6290
$$ -644709 -601689 -596568 -559583 -438300 -347848 -409218 -548250 -624533 -648947 -701278 -747568
31489g47568K3425L0318l5224j7616R2057J00183l2467r1054J1452O9285m1329
$$ -747568 -724143 -693825 -729049 -746665 -654608 -554425 -586892 -677946 -666494 -597209 -638538
31478f38538j28060j7978J44560J50569M9555P253K9361K4729j1385m3251q4063
$$ -638538 -766598 -784576 -640016 -489447 -439892 -432639 -403278 -378549 -389934 -433185 -517248
31467e17248j13762n7963N1248O5666l6660r0286j3903O5655N7752N1361R9370
$$ -517248 -631010 -688973 -637725 -572059 -608719 -699005 -712908 -647253 -589501 -538140 -438770
31456d38770Q8735l6131j33488r0615M908M7378O7696Q7845L4015p8989r4463
$$ -438770 -350035 -386166 -519654 -610269 -605361 -557983 -490287 -402442 -368427 -447416 -541879
31445e41879K3090R1692J2708o2306j0787N2265R763m6972k3705j4284r3617j34183
$$ -541879 -518789 -427097 -414389 -476695 -487482 -435217 -425454 -472426 -496131 -510415 -604032 -738215
31433g38215l1484Q7148Q1287L1363N0459N6719m6515j43163q8509L2804N7374
$$ -738215 -769699 -682551 -601264 -569901 -519442 -462723 -509238 -652401 -740910 -708106 -650732
31422f50732J4881L4371J01574J11681N5126k2776j27772k26654j95645k0127
$$ -650732 -635851 -601480 -499906 -388225 -333099 -355875 -483647 -710301 -905946 -926073
31412i26073J08601O2598k0193K4875J23525J26814O4988L0587k1283j35928j85338
$$ -926073 -817472 -754874 -775067 -750192 -626667 -499853 -434865 -404278 -425561 -561489 -746827
31401g46827o3671R0825J00683L3436M8143J03416O8831o278J466L2082l9865
$$ -746827 -810498 -719673 -618990 -585554 -537411 -433995 -365164 -371442 -369976 -337894 -377759
31390c77759j30019o4332R8716J38501J7805r4655j09403q5492m8235L0415R1307
$$ -377759 -507778 -572110 -473394 -334893 -317088 -411743 -521146 -606638 -654873 -624458 -533151
31379e33151M5252m4508l5455N8564R3181L1110k9428m0995m6479n3126k8546
$$ -533151 -487899 -532407 -567862 -509298 -416117 -385007 -414435 -455430 -501909 -555035 -583581
31368e83581J047p376j2536L5128P4708L0112m6434o5481n0334n4037l1207N0443
$$ -583581 -582534 -589910 -602446 -567318 -492610 -462498 -508932 -574413 -624747 -678784 -709991 -659548
31356f59548R0322K3001k6327M3184Q2383o8488k46366j73090Q5718J94103N3059
$$ -659548 -569226 -546225 -572552 -529368 -446985 -515473 -761839 -934929 -849211 -655108 -602049
31345f02049q7540n1117L7714K7057k6155j3699L2142K9763q547k6121j6951l346
$$ -602049 -689589 -740706 -702992 -675935 -702090 -715789 -683647 -653884 -662431 -688552 -705503 -708849
31333g08849Q347J6219K4830N4197R2366Q1679J6334k1701m782l0028j35135j72337
$$ -708849 -700502 -684283 -659453 -605256 -512890 -431211 -414877 -436578 -441360 -471388 -606523 -778860
31321g78860k6873J58024J68779L6031m8372m3592n7746r4835n1436N4112Q4159
$$ -778860 -805733 -647709 -478930 -442899 -491271 -534863 -592609 -687444 -738880 -684768 -600609
31310f00609J8882j9112J3826L4044J4892K8895Q5647J02350N8966K8146L6922
$$ -600609 -581727 -600839 -587013 -552969 -538077 -509182 -423535 -321185 -262219 -234073 -197151
31299a97151L8798K1535R273k2125r7154j46452j02405l5276l9862n5590K2112
$$ -197151 -158353 -136818 -127545 -149670 -246824 -393276 -495681 -530957 -570819 -626409 -604297
31288f04297J24333J08757J5924J904O1246N2094l3078o5192l3015n3121j22859
$$ -604297 -479964 -371207 -355283 -353379 -292133 -240039 -273117 -338309 -371324 -424445 -547304
31277e47304j10331j0845K8710k5500m1012K7888O5584K5202N908L8918K0691
$$ -547304 -657635 -668480 -639770 -665270 -706282 -678394 -612810 -587608 -581700 -542782 -522091
31266e22091o4733p6762L2812J07034L4452o7595m7582N0387Q3286K7832j9455
$$ -522091 -586824 -663586 -630774 -523740 -489288 -556883 -604465 -554078 -470792 -442960 -462415
31255d62415K771N4960N6646k3894j18949j20547k8085K8049k1674o8215o445
$$ -462415 -459644 -404684 -348038 -371932 -490881 -611428 -639513 -611464 -633138 -701353 -707798
31244g07798P9375O4312K535J1708M5877k77o0822j6512M6852k7925j50108r9081
$$ -707798 -628423 -564111 -561576 -549868 -503991 -504268 -565090 -581602 -534750 -562675 -712783 -811864
31232h11864Q1696J33265J5669m0141N5557J19255M0858n1002n9168o3721j02764
$$ -811864 -730168 -596903 -581234 -621375 -565818 -446563 -405705 -456707 -515875 -579596 -682360
31221f82360q1183P188K9216k9387j9701P9247J04929K6887J6262J04186R3624
$$ -682360 -763543 -756355 -727139 -756526 -776227 -696980 -592051 -565164 -548902 -444716 -351092
31210c51092o1074j21321K2809J36520L9627r3902o8476K282l7168o6083O0879
$$ -351092 -412166 -533487 -510678 -374158 -334531 -428433 -496909 -494627 -531795 -597878 -536999
31199e36999J84624R2124r4792j13303O268L0789o1547q6044o319K7685k4786
$$ -536999 -352375 -260251 -355043 -468346 -462078 -431289 -492836 -578880 -585199 -557514 -582300
31188e82300m1182J6560M4232P071l005M6844O9578K0939k9162k6546j0562k4821
$$ -582300 -623482 -606922 -562690 -555619 -558624 -511780 -442202 -421263 -450425 -476971 -487533 -512354
31176e12354m5127l0968J0351L0983p672p8034q1027M1096J86662J89520M9092
$$ -512354 -557481 -588449 -578098 -547115 -554787 -632821 -713848 -672752 -486090 -296570 -247478
31165b47478n9041l7956J0626j5953n8117k7184L5287M7055K2689J1615k190l8333
$$ -247478 -306519 -344475 -333849 -349802 -407919 -435103 -399816 -352761 -330072 -318457 -320647 -358980
31153c58980n2878k3596p684l5282m8232j7629p544m7524o4636j9253J9343Q077
$$ -358980 -411858 -435454 -443138 -478420 -526652 -544281 -551825 -599349 -663985 -683238 -663895 -655818
31141f55818L722K7498R261n0166k9285R8505J70570P8717n4476p3700j1140K4376
$$ -655818 -652096 -624598 -615337 -665503 -694788 -596283 -425713 -346996 -401472 -475172 -486312 -461936
31129d61936K6735K4140j9764r7770r9373M189O8238O211n2787J0044R3417O7320
$$ -461936 -435201 -411061 -430825 -528595 -627968 -623779 -555541 -549330 -602117 -592073 -498656 -431336
31117d31336M923K6502O6912J2470o3943k5598P9591J06793N6011K3770M404n9936
$$ -431336 -426413 -399911 -332999 -320529 -384472 -410070 -330479 -223686 -167675 -143905 -139501 -199437
31105a99437j14375p3788K540L746l6903j5236M8639N9246J7139j7424n0272r2387
$$ -199437 -313812 -387600 -385060 -381314 -418217 -433453 -384814 -325568 -308429 -325853 -376125 -468512
31093d68512p2530L4876J07115N8451j060L4603N8336n0404j66011j06379M0079
$$ -468512 -541042 -506166 -399051 -340600 -341660 -307057 -248721 -299125 -465136 -571515 -531436
31082e31436M9416o3775q7097K6379J08857P5150K1179K1120L8845M5949M8399
$$ -531436 -482020 -545795 -632892 -606513 -497656 -422506 -401327 -380207 -341362 -295413 -247014
31071b47014J1281q1227j34918p5641R00j7902n4886R409Q9419L4442p7921n6797
$$ -247014 -235733 -316960 -451878 -527519 -526619 -544521 -599407 -589998 -500579 -466137 -544058 -600855
31059f00855O2412P7911k1565n2195K6265N9388J38k0201L8919N3633j4991m6981
$$ -600855 -538443 -460532 -482097 -534292 -508027 -448639 -448501 -468702 -429783 -376150 -391141 -438122
31047d38122k867j733q2689j05922J3891J57238J75278P2807n0639j19112j00527
$$ -438122 -440989 -442722 -525411 -631333 -617442 -460204 -284926 -212119 -262758 -381870 -482397
31036d82397k2630J8533k7906p1958j8825O2520N8986K1298O0858J18930O6018
$$ -482397 -505027 -486494 -514400 -586358 -605183 -542663 -483677 -462379 -401521 -282591 -216573
31025b16573l5380k1651O7563N1701n2900n3937N7197P5450n0308j25758n7821
$$ -216573 -251953 -273604 -206041 -154340 -207240 -261177 -203980 -128530 -178838 -304596 -362417
31014c62417J311m5037p1531R457P1814L771r7056r6901k0613M3590P6692P3357
$$ -362417 -361106 -406143 -477674 -468217 -396403 -392632 -489688 -586589 -607202 -563612 -486920 -413563
31002d13563P529p2780o9548l392O809l9381k3272N2056M9198l3598l2777P2432
$$ -413563 -406034 -478814 -548362 -551754 -544945 -584326 -607598 -555542 -506344 -539942 -572719 -500287
30990e00287Q9919m4639j26049k0024J05795O2742o6430r9967l4617K9709P7096
$$ -500287 -410368 -455007 -581056 -601080 -495285 -432543 -498973 -598940 -633557 -603848 -526752
30979e26752J14542P6462m1456r4192L803J14916Q2099l3147p8043n1098m5288
$$ -526752 -412210 -335748 -377204 -471396 -467593 -352677 -270578 -303725 -381768 -432866 -478154
30968d78154n1563J318P7193O9923j8601o9516r112J04206J50180O7977p1965
$$ -478154 -529717 -528399 -451206 -381283 -399884 -469400 -478512 -374306 -224126 -156149 -228114
30957b28114j24119m6116K3519l6919j24491o3586R1273J24269J0225n3820J0770
$$ -228114 -352233 -398349 -374830 -411749 -536240 -599826 -508553 -384284 -374059 -427879 -417109
30946d17109O0188K3343K5064J13929J34915Q907j06593q5744l1821n0042n3798
$$ -417109 -356921 -333578 -308514 -194585 -59670 -50763 -157356 -243100 -274921 -324963 -378761
30935c78761K5512N8524m9447j46570p3566N9695O1571k7153l5612M0459O8785
$$ -378761 -353249 -294725 -344172 -490742 -564308 -504613 -443042 -470195 -505807 -465348 -396563
30924c96563K1079j7862j7656j2339l991R857j2442o6543o1879K3960P0700L519
$$ -396563 -375484 -393346 -411002 -423341 -427332 -417475 -429917 -496460 -558339 -534379 -463679 -460160
30912d60160p7236o5984p849K6954O3676R9499M0596j00141j35353P585J28080
$$ -460160 -537396 -603380 -611229 -584275 -520599 -421100 -380504 -480645 -615998 -608413 -480333
30901d80333O3898m2824l468R1425N3428o6088q7456j7747J1633R918O6836J22793
$$ -480333 -416435 -459259 -462727 -371302 -317874 -383962 -471418 -489165 -477532 -467614 -400778 -277985
30889b77985N9964n1797m9683M3782P2818J9480n855R358j5260o9086p6841n7405
$$ -277985 -218021 -269818 -319501 -275719 -202901 -183421 -189276 -179918 -195178 -264264 -341105 -398510
30877c98510o6429n0846M7828J32075R3422K1519N0105J00564K3941j02402r2104
$$ -398510 -464939 -515785 -467957 -335882 -242460 -220941 -170836 -70272 -46331 -148733 -240837
30866b40837J7219L4928l8687l6226M4818L6966p5163j20907n0334P47j9095m987
$$ -240837 -223618 -188690 -227377 -263603 -218785 -181819 -256982 -377889 -428223 -427476 -446571 -451558
30854d51558O8999R3041M2017J7321L1769j4799j09865j11372K827R3596J02007
$$ -451558 -382559 -289518 -247501 -230180 -198411 -213210 -323075 -434447 -431620 -338024 -236017
30843b36017J03809R7121j3093j74933j94786n1405M8433P792k3396N0654R3098
$$ -236017 -132208 -35087 -48180 -223113 -417899 -469304 -420871 -413079 -436475 -385821 -292723
30832b92723k883j06033o9180L0865M5102j0560l0764p496M061M940J6438J3404
$$ -292723 -295606 -401639 -470819 -439954 -394852 -405412 -436176 -443672 -439611 -434671 -418233 -404829
30820d04829j3244j7413Q052L23n0940o5404j3875K5786J2191Q640M7339O2316
$$ -404829 -418073 -435486 -427434 -427111 -478051 -543455 -557330 -531544 -519353 -510713 -463374 -401058
30808d01058K3313k689Q648j6215q8601r6442J531P0238L553r6076p3856M4781
$$ -401058 -377745 -380434 -371786 -388001 -476602 -573044 -571513 -501275 -497722 -593798 -667654 -622873
30796f22873J09059N8876k8431n9728j0349P3679J06951M6941l2927k5379M7592
$$ -622873 -513814 -454938 -483369 -543097 -553446 -479767 -372816 -325875 -358802 -384181 -336589
30785c36589N7431l2191j14798j14823p3519k4184O5429J65074J51235n543j52898
$$ -336589 -279158 -311349 -426147 -540970 -614489 -638673 -573244 -408170 -256935 -262478 -415376
30774d15376j49673l7147O0110R1611O5217q083p4844n5753K8218O0210J2994
$$ -415376 -565049 -602196 -542086 -450475 -385258 -393341 -468185 -523938 -495720 -435510 -422516
30763d22516r791K3047m58j09142j39338O862J65350J46736K2931j9616J1155
$$ -422516 -432307 -409260 -409718 -518860 -658198 -651336 -485986 -339250 -316319 -335935 -324780
30752c24780k3373j04097p6462O1180J25612L5984o5734m3439M5280P1535K3197
$$ -324780 -348153 -452250 -528712 -467532 -341920 -305936 -371670 -415109 -369829 -298294 -275097
30741b75097k0232k0299j688J3304K3159K0827p36k3944k1950n88j329m8693j04523
$$ -275097 -295329 -315628 -317316 -304012 -280853 -260026 -260762 -284706 -306656 -307244 -308573 -357266 -461789
30728d61789r9165j8958O1519O0726j4562q6580j00095n9360Q599P6700J13862
$$ -461789 -560954 -579912 -518393 -457667 -472229 -558809 -658904 -718264 -709665 -632965 -519103
30717e19103J06772P8085M5231j1158q9639j23487o8794M575M939l3378q243O7947
$$ -519103 -412331 -334246 -289015 -300173 -389812 -513299 -582093 -577518 -572579 -605957 -614200 -546253
30705e46253P9979P081l5529J2669O1905K9557k5159p835N7639P3133J1567o0011
$$ -546253 -466274 -459193 -494722 -482053 -420148 -390591 -415750 -423585 -365946 -292813 -281246 -341257
30693c41257p6295l6473J7086M8990N9777O9194P2327M1560j4609m5161l7265
$$ -341257 -417552 -454025 -436939 -387949 -328172 -258978 -186651 -145091 -159700 -204861 -242126
30682b42126l6404m6964n481Q3704J01751M993o2233J6746J24262R2720j8227
$$ -242126 -278530 -325494 -330975 -247271 -145520 -140527 -202760 -186014 -61752 30968 12741
30671A2741m2188o971o4365j82463j81283n0596M2920N8694J05977J57441N4911
$$ 12741 -29447 -36418 -100783 -283246 -464529 -515125 -472205 -413511 -307534 -150093 -95182
30660i5182j49952j89349j0508J09352J2764r2945j8472Q7853L5894o1069j0533
$$ -95182 -245134 -434483 -444991 -335639 -322875 -415820 -434292 -346439 -310545 -371614 -382147
30649c82147J04469Q3892l6196p4077k8645l9894j02255p8368L9920J13653Q5159
$$ -382147 -277678 -193786 -229982 -304059 -332704 -372598 -474853 -553221 -513301 -399648 -314489
30638c14489L3641J2145q878m2481o2820o9867p3378m3704L3949J05868J26013
$$ -314489 -280848 -268703 -277581 -320062 -382882 -452749 -526127 -569831 -535882 -430014 -304001
30627c04001J15542Q1058k0744j55882j78464l3444J27565J50445P5809J2600
$$ -304001 -188459 -107401 -128145 -284027 -462491 -495935 -368370 -217925 -142116 -129516
30617a29516m5124j27542j51584n0682O5542N8873j8448k2357M5604O7503J0051
$$ -129516 -174640 -302182 -453766 -504448 -438906 -380033 -398481 -420838 -375234 -307731 -297680
30606b97680n8452r4688r1507k9097O7540J04085N6044K7106O7003P3599k587
$$ -297680 -356132 -450820 -542327 -571424 -503884 -399799 -343755 -316649 -249646 -176047 -178634
30595a78634l0092O6205J23089j235j58616j40029j7151R405l4457J3603J13082
$$ -178634 -208726 -142521 -19432 -20667 -179283 -319312 -336463 -327058 -361515 -347912 -234830
30584b34830Q6271l9305o7420J5023K5112p9404j41117r8351o2274o6986j1306
$$ -234830 -148559 -187864 -255284 -240261 -215149 -294553 -435670 -534021 -596295 -663281 -674587
30573f74587J01538J24267L2364j0134O8595J24908N0100n6858p0948k6214j4973
$$ -674587 -573049 -448782 -416418 -426552 -357957 -233049 -182949 -239807 -310755 -336969 -351942
30562c51942l6530l7453k971M9622Q7489N9744l1972q3390k0609O1461L3636n1504
$$ -351942 -388472 -425925 -428896 -379274 -291785 -232041 -264013 -347403 -368012 -306551 -272915 -324419
30550c24419n1405J3967P933o2073n8664K1254L3475m8015q5756k9706J3445J444
$$ -324419 -375824 -361857 -353924 -415997 -474661 -453407 -419932 -467947 -553703 -583409 -569964 -568520
30538e68520K1957Q6808Q3804k044l3100M3067J02589O4169M173j6234m4636q8339
$$ -568520 -546563 -459755 -375951 -377995 -411095 -368028 -265439 -201270 -197097 -213331 -257967 -346306
30526c46306o5198K4150O2635K1094P397N5874P0615L2349L9606Q3907K8439j11535
$$ -346306 -411504 -387354 -324719 -303625 -296228 -240354 -169739 -137390 -97784 -13877 14562 -96973
30514i6973j31870J1261R0787j3560j07797l2644N6415j5219j16885n2277Q5356
$$ -96973 -228843 -217582 -126795 -140355 -248152 -280796 -224381 -239600 -356485 -408762 -323406
30503c23406Q8699J036K347N7154p409j47122j42100K2769J12516J1226j17679
$$ -323406 -234707 -233671 -231324 -174170 -181579 -328701 -470801 -448032 -335516 -324290 -441969
30492d41969j06486o237N4377O6143Q9530J17769R2587Q665o5114o0101J4667
$$ -441969 -548455 -554692 -500315 -434172 -344642 -226873 -134286 -125621 -190735 -250836 -236169
30481b36169O9761L1033o0241r5030n2331k2527m6582m3115L7230R7485L8189
$$ -236169 -166408 -135375 -195616 -290646 -342977 -365504 -412086 -455201 -417971 -320486 -282297
30470b82297p4380j03167l7369K7495N7327R9232J53110J42225K8200j19799j88884
$$ -282297 -356677 -459844 -497213 -469718 -412391 -313159 -160049 -17824 10376 -109423 -298307
30459b98307j23560K4089J25285R2079j7497o4870j5181K4432k1068q2526o6496
$$ -298307 -421867 -397778 -272493 -180414 -197911 -262781 -277962 -253530 -274598 -357124 -423620
30448d23620O198N7476O9824O8648N1913J2804k0512k8431k9860k5557J6076P2428
$$ -423620 -417422 -359946 -290122 -221474 -169561 -156757 -177269 -205700 -235560 -261117 -245041 -172613
30436a72613N6012m7935j22574p2925L9799R2128N6171o024l8652j9485M2498
$$ -172613 -116601 -164536 -287110 -360035 -320236 -228108 -171937 -177961 -216613 -236098 -193600
30425a93600Q3255K9189q9234j52170j15658o0603m0545r063M6331M4671k9618
$$ -193600 -110345 -81156 -170390 -322560 -438218 -498821 -539366 -548429 -502098 -457427 -487045
30414d87045n4652L3761J13200O6243k9121m2370l982j6695n4881k5849M3004
$$ -487045 -541697 -507936 -394736 -328493 -357614 -399984 -403966 -420661 -475542 -501391 -458387
30403d58387N1951J2221J4813N1278K8056n4648q8928l0180M4376O2266L7803
$$ -458387 -406436 -394215 -379402 -328124 -300068 -354716 -443644 -473824 -429448 -367182 -329379
30392c29379J2832j876j0279j1981n957J3063M2365M6658p59m6417j3339N6954
$$ -329379 -316547 -318423 -328702 -340683 -346640 -333577 -291212 -244554 -245313 -291730 -305069 -248115
30380b48115L7342p7101j36690p1424N66j3137k7440L2251O0895l5328j25834
$$ -248115 -210773 -287874 -424564 -495988 -495422 -508559 -535999 -503748 -442853 -478181 -604015
30369f04015m0278J38955J87528P6620j5960M04L0939n171n7154n4824m474N4011
$$ -604015 -644293 -505338 -317810 -241190 -257150 -256746 -225807 -230978 -288132 -342956 -347430 -293419
30357b93419Q9615P5255J7135k8640l0792k6911l5138o011O2526P1309j6585p8044
$$ -293419 -203804 -128549 -111414 -140054 -170846 -197757 -232895 -238906 -176380 -105071 -121656 -199700
30345a99700k2379M3393m955q6714n6945L9599N6877o62k3647j4880m3175n4274
$$ -199700 -222079 -178686 -183641 -270355 -327300 -287701 -230824 -231486 -255133 -270013 -313188 -367462
30333c67462L9155J41865R9296j4344j239R9568N7998j29740j89730j3018J53456
$$ -367462 -328307 -186442 -87146 -101490 -102729 -3161 54837 -74903 -264633 -277651 -124195
30322a24195R3193o5521r4186p596L5695J7197L2547P4858M0316p7952j53239
$$ -124195 -31002 -96523 -190709 -198305 -162610 -145413 -112866 -38008 2308 -75644 -228883
30311b28883r5334L3171R2752K1868r5677j22146l0665O0502N3069L421J5930
$$ -228883 -324217 -291046 -198294 -176426 -272103 -394249 -424914 -364412 -311343 -307922 -291992
30300b91992O9687O7280P192k7013k0548l1649o0128n2496k6833m7854q3758l9630
$$ -291992 -222305 -155025 -147833 -174846 -195394 -227043 -287171 -339667 -366500 -414354 -498112 -537742
30288e37742O3407J00129M8123K2516P0346Q7521n19j09474j19214k9427O5178
$$ -537742 -474335 -374206 -326083 -303567 -233221 -145700 -146219 -255693 -374907 -404334 -339156
30277c39156Q5721K5815m6160m4936J8725L0766m7244q1791K5492J36881O8796
$$ -339156 -253435 -227620 -273780 -318716 -299991 -269225 -316469 -398260 -372768 -235887 -167091
30266a67091r7914j24199J3959J05506N1845k0676k6466m4418j06480r9191K2588
$$ -167091 -265005 -389204 -375245 -269739 -217894 -238570 -265036 -309454 -415934 -515125 -492537
30255d92537J24416R9875J7470l0643o0210q8066n6760M3153J20525J26665J08324
$$ -492537 -368121 -268246 -250776 -281419 -341629 -429695 -486455 -443302 -322777 -196112 -87788
30244h7788O9705m6625j87601j93854n3993M1182q875o5739n126P9912O5372N989
$$ -87788 -18083 -64708 -252309 -446163 -500156 -458974 -467849 -533588 -538714 -458802 -393430 -387441
30232c87441O224L4716J8793q450K034J31n5187q8240l4184L5914L6616P472J8996
$$ -387441 -381217 -346501 -327708 -336158 -334124 -333993 -389180 -477420 -511604 -475690 -439074 -431602 -412606
30219d12606M5003L4099O467j2638m8881q9443n8429M2435J00134P0438M7595
$$ -412606 -367603 -333504 -327037 -339675 -388556 -477999 -536428 -493993 -393859 -323421 -275826
30208b75826Q2433R2115L1594j6445j0099k7320q7683q9165j6495J016n7477l4748
$$ -275826 -193393 -101278 -69684 -86129 -96228 -123548 -211231 -300396 -316891 -315875 -373352 -408100
30196d08100R5377J19448m5083j52580k5448J25708N1540j14893j02928L8036
$$ -408100 -312723 -193275 -238358 -390938 -416386 -290678 -239138 -354031 -456959 -418923
30186d18923O9971n831n446O9844O8132M962J7563P0376K3657p0249n6824K195
$$ -418923 -348952 -354783 -360229 -290385 -222253 -217291 -199728 -129352 -105695 -175944 -232768 -230573
30174b30573o5304j76791r8040J18024J76047L2840m0935N2427Q1527p1427j84193
$$ -230573 -295877 -472668 -570708 -452684 -276637 -243797 -284732 -232305 -150778 -222205 -406398
30163d06398q0179Q1798J00390M0409M0981M9428l4202j31467j14818k2950L1453
$$ -406398 -486577 -404779 -304389 -263980 -222999 -173571 -207773 -339240 -454058 -477008 -445555
30152d45555M4511N7580L8073k5639l3702O7424J50161Q5047m6597q1062k8335
$$ -445555 -401044 -343464 -305391 -331030 -364732 -297308 -147147 -62100 -108697 -189759 -218094
30141b18094k7505r9195j17441k4878P1963N8963l1334p2310n954Q9887R8661
$$ -218094 -245599 -344794 -462235 -487113 -415150 -356187 -387521 -459831 -465785 -375898 -277237
30130b77237R464p1669o5266j3601J3987L6039Q6679R7882p821j44815j44695
$$ -277237 -267773 -339442 -404708 -418309 -404322 -368283 -281604 -183722 -191543 -336358 -481053
30119d81053q576P9299J4503r9247j21898m0211Q0278J73632J66142K9446j15130
$$ -481053 -489629 -410330 -395827 -495074 -616972 -657183 -576905 -403273 -237131 -207685 -322815
30108c22815r0281Q4129J80375P4216q5443j09207k0822M1794N0618O6048P8151
$$ -322815 -413096 -328967 -148592 -74376 -159819 -269026 -289848 -248054 -197436 -131388 -53237
30097e3237K0967r0220j56706j22935k9015M8344N7737N437l6691L693R7892J33657
$$ -53237 -32270 -122490 -279196 -402131 -431146 -382802 -325065 -319628 -356319 -352626 -254734 -121077
30085a21077O0282m9047j07245j09704q6455l9854K1564N8192N5492M3884L1580
$$ -121077 -60795 -109842 -217087 -326791 -413246 -453100 -431536 -373344 -317852 -273968 -242388
30074b42388j0060o5936o7549k115N4402N5263M7192P0446Q2681L8804k9491o7873
$$ -242388 -252448 -318384 -385933 -388048 -333646 -278383 -231191 -160745 -78064 -39260 -68751 -136624
30062a36624o7741m2558n371M657m4301r6935o3323K8176M8561k9639q0736k6529
$$ -136624 -204365 -246923 -252294 -247637 -291938 -388873 -452196 -424020 -375459 -405098 -485834 -512363
30050e12363N0581O3562N0195O0605N1844k848k7303K2515N7792J0489l3502J0785
$$ -512363 -461782 -398220 -348025 -287420 -235576 -238424 -265727 -243212 -185420 -174931 -208433 -197648
30038a97648N8394j706r6924q3452R102L3998k1550l4324K5531N2632O876j8081
$$ -197648 -139254 -140960 -237884 -321336 -312234 -278236 -299786 -334110 -308579 -255947 -249071 -267152
30026b67152L1823P7233M4436j7897k8030M817Q651m5749j08310r7843J4534J46936
$$ -267152 -235329 -158096 -113660 -131557 -159587 -154770 -146119 -191868 -300178 -398021 -383487 -236551
30014b36551J63426L4012j05859j18973l6563K0896L4488P2571J19101P1176p2599
$$ -236551 -73125 -39113 -144972 -263945 -300508 -279612 -245124 -172553 -53452 17724 -54875
30003e4875j64524j05782J8625P0235L2823j6346l8259m8217m2534K881O6983
$$ -54875 -219399 -325181 -306556 -236321 -203498 -219844 -258103 -306320 -348854 -345973 -278990
29992b78990Q3911K4825n8310q9421n1368L564K0868M048l453J7352M2554M9497
$$ -278990 -195079 -170254 -228564 -317985 -369353 -365789 -344921 -340873 -344326 -326974 -284420 -234923
29980b34923M2796K5613j4124o5261q1207m0656J3225L2960L4544N9508R5359
$$ -234923 -192127 -166514 -180638 -245899 -327106 -367762 -354537 -321577 -287033 -227525 -132166
29969a32166Q7793K2478n2459q5229o7582k5866P983K0052K5498M3911N5800J6322
$$ -132166 -44373 -21895 -74354 -159583 -227165 -253031 -245048 -224996 -199498 -155587 -99787 -83465
29957h3465o9440j26791j00491k6581K1250J9316j1343n3847q6302o4697J8982
$$ -83465 -152905 -279696 -380187 -406768 -385518 -366202 -377545 -431392 -517694 -582391 -563409
29946e63409Q9444O7707j8522o9093m3084Q298L0798K2947N823q82K4814P4073
$$ -563409 -473965 -406258 -424780 -493873 -536957 -528659 -497861 -474914 -469091 -469973 -445159 -371086
29934c71086Q0129j450r0999n7663Q7218J69609P4808r7340j67656r5255K1680
$$ -371086 -290957 -292407 -383406 -441069 -353851 -184242 -109434 -206774 -374430 -469685 -448005
29923d48005R9626J20549P0875m6226j42650j13578L541N7384P495j3671O3993
$$ -448005 -348379 -227830 -156955 -203181 -345831 -459409 -455868 -398484 -390989 -404660 -340667
29912c40667J00505k5613j66675r2223J35971K18418N8248j03021o8902L5632
$$ -340667 -240162 -265775 -432450 -524673 -388702 -170284 -112036 -215057 -283959 -248327
29902b48327J9852n3964k1474O9127M5202p4034j06315k0721K4340l1201n9519
$$ -248327 -228475 -282439 -303913 -234786 -189584 -263618 -369933 -390654 -366314 -397515 -457034
29891d57034P094N6024P083m1559J2571J07280J32670R5401N8731K1203l9434
$$ -457034 -449940 -393916 -386833 -428392 -415821 -308541 -175871 -80470 -21739 -536 -39970
29880c9970q2171n8850M062M9223N6472K0782o3848j52956j62649p7563K4180
$$ -39970 -122141 -180991 -176929 -127706 -71234 -50452 -114300 -267256 -429905 -507468 -483288
29869d83288P9463Q8932M9630m3522j14036o3292N6330Q4210P171r118R1014J37271
$$ -483288 -403825 -314893 -265263 -308785 -422821 -486113 -429783 -345573 -338402 -347520 -256506 -119235
29857a19235J7119j24968j22929m2917k4891l3415L0238J02160O3698k3422j1806
$$ -119235 -102116 -227084 -350013 -392930 -417821 -451236 -420998 -318838 -255140 -278562 -290368
29846b90368P1400P3770j9971p7956m3582J6907O1529R4419P3662k9861j15776
$$ -290368 -218968 -145198 -165169 -243125 -286707 -269800 -208271 -113852 -40190 -70051 -185827
29835a85827p1796K7167K0498p0656p5864L9951J28082R9739K5047k9490p7562
$$ -185827 -257623 -230456 -209958 -280614 -356478 -316527 -188445 -88706 -63659 -93149 -170711
29824a70711j01669m3189O0757R1684L2307j3753j10J7979K2211M7288N4605k9454
$$ -170711 -272380 -315569 -254812 -163128 -130821 -144574 -144684 -126705 -104494 -57206 -2601 -32055
29812c2055j41024j37543m1940j9745r1985j01338m672N1734J8811M0069J50865
$$ -32055 -173079 -310622 -352562 -372307 -464292 -565630 -570302 -518568 -499757 -459688 -308823
29801c08823J56212k7462j67146o4374J12014R7298m4911n4929Q7057J55719O1139
$$ -308823 -152611 -180073 -347219 -411593 -299579 -202281 -247192 -302121 -215064 -59345 1794
29790A794m5121n2244l6926q0885j32881j17333m4150L9575J02997J10587M4183
$$ 1794 -43327 -95571 -132497 -213382 -346263 -463596 -507746 -468171 -365174 -254587 -210404
29779b10404l8475n4913j1764J4904K027q672o213j7235k7347R64L7211J6179
$$ -210404 -248879 -303792 -315556 -300652 -298625 -307297 -313510 -330745 -358092 -357128 -319917 -303738
29767c03738l8119l2228M2994Q7963M4475l2515p6176p8575l5380O7241J67536
$$ -303738 -341857 -374085 -331091 -243128 -198653 -231168 -307344 -385919 -421299 -354058 -186522
29756a86522J44816r387j35665j05219J1020O5235M5892M8048Q3218O2450l4277
$$ -186522 -41706 -51093 -186758 -291977 -280957 -215722 -169830 -121782 -38564 23886 -10391
29745a0391j08502r7905o3753o5523n1342L9622J43451J49110O7164Q540J2158
$$ -10391 -118893 -216798 -280551 -346074 -397416 -357794 -214343 -65233 1931 10471 22629
29734B2629R191l4265n7426k5490k669m2747r4378q7375m1718j7300j8964k3577
$$ 22629 31820 -2445 -59871 -85361 -88030 -130777 -225155 -312530 -354248 -371548 -390512 -414089
29722d14089l4640l3632M4209J87274K42748J05971q9345j24751l60Q5817M4100
$$ -414089 -448729 -482361 -438152 -250878 -8130 97841 8496 -116255 -116615 -30798 13302
29711A3302j2837n018j4021r7516j48884o2985Q1566J31958O9370l936k1543J823
$$ 13302 465 -4553 -18574 -116090 -264974 -327959 -246393 -114435 -45065 -49001 -70544 -68721
29699f8721L1287L3685j7035q9153j00398l6319M518m6707j11849p7005L8997
$$ -68721 -37434 -3749 -20784 -109937 -210335 -246654 -242136 -288843 -400692 -477697 -438700
$$ [...]
##END NTUPLES=NMR SPECTRUM
##END=
