##TITLE=31Pdec_LY-DiX-5
 CD3CN, 24 sc
 10.2.2021
##JCAMPDX= 6.0         $$ Bruker NMR JCAMP-DX V2.0
##DATA TYPE= NMR SPECTRUM
##DATA CLASS= NTUPLES
##ORIGIN= UXNMR, Bruker Analytische Messtechnik GmbH
##OWNER= root
$$ XWIN-NMR		Version 3.5
$$ Wed Feb 10 10:59:24 2021 Russian Standard Time (UT+4h)  she@DPX200
##.OBSERVE FREQUENCY= 81.013821
##.OBSERVE NUCLEUS= ^31P
##.ACQUISITION MODE= SIMULTANEOUS
##.ACQUISITION SCHEME= undefined
##.AVERAGES= 24
##.DIGITISER RES= 17
##SPECTROMETER/DATA SYSTEM= spect
##.PULSE SEQUENCE= zgpg30
##.SOLVENT NAME= CDCl3
##.SHIFT REFERENCE= (INTERNAL, CDCl3, 0, 182.463)
##AUDIT TRAIL= $$ (NUMBER, WHEN, WHO, WHERE, WHAT)
$$ ##TITLE= Audit trail, XWIN-NMR		Version 3.5
$$ ##JCAMPDX= 5.01
$$ ##ORIGIN= Bruker BioSpin GmbH
$$ ##OWNER= she
$$ F:/spectra/data/she/nmr/P31/1/pdata/1/auditp.txt
$$ ##AUDIT TRAIL=  $$ (NUMBER, WHEN, WHO, WHERE, WHAT)
(   1,<2021-02-10 10:57:41.21 +0400>,<she>,<DPX200>,
      <created by zg, POWCHK disabled, PULCHK disabled
       configuration hash MD5:
       00 E9 B6 7A A2 85 ED C7 34 08 36 98 17 FE 4E 26
       data hash MD5: 32K
       A7 04 57 FE FB 63 A5 BA 3A 94 ED 5E 21 17 30 8C>)
(   2,<2021-02-10 10:57:50.62 +0400>,<she>,<DPX200>,
      <Start of raw data processing
       efp BC_mod = 2 LB = 1 FT_mod = 6 PKNL = 1 PHC0 = -1701.813 PHC1 = 5.602172 SI = 64K 
       data hash MD5: 64K
       65 82 BF BA B3 9C 79 F9 17 21 ED 17 A9 DC D6 11>)
(   3,<2021-02-10 10:58:18.54 +0400>,<she>,<DPX200>,
      <pk PHC0 = -13.01504 PHC1 = 0 
       data hash MD5: 64K
       C1 7F 75 89 3F C7 F6 18 6B EE 3D 45 1A F0 5F F6>)
(   4,<2021-02-10 10:58:22.42 +0400>,<she>,<DPX200>,
      <abs ABSG = 5 
       data hash MD5: 64K
       69 E7 6C B0 54 2B 92 1C 55 B4 85 F7 8E 95 C6 23>)
$$ ##END=
$$ 
$$ hash MD5
$$ 86 5E EE E5 28 5B B4 4A 28 63 D9 19 05 17 8A D2
##$RELAX= 
##$RELAX= 
##$RELAX= 
##$RELAX= 
##$RELAX= 
##$RELAX= 
##$RELAX= 
##$RELAX= 
$$ Bruker specific parameters
$$ --------------------------
##$DU= <F:/spectra>
##$EXPNO= 1
##$NAME= <P31>
##$PROCNO= 1
##$TYPE= <nmr>
##$USER= <she>
##$AMP= (0..31)
100 100 100 100 100 100 100 100 100 100 100 100 100 100 100 100 100 100 
100 100 100 100 100 100 100 100 100 100 100 100 100 100 
##$AQSEQ= 0
##$AQ_mod= 1
##$AUNM= <au_zg>
##$AUTOPOS= <>
##$BF1= 81.014009
##$BF2= 200.13
##$BF3= 200.13
##$BF4= 200.13
##$BF5= 200.13
##$BF6= 200.13
##$BF7= 200.13
##$BF8= 200.13
##$BYTORDA= 1
##$CFDGTYP= 0
##$CFRGTYP= 5
##$CHEMSTR= <none>
##$CNST= (0..31)
1 1 145 1 1 1 1 1 1 1 1 1 1 1 1 1 1 1 1 1 1 1 1 1 1 1 1 1 1 1 1 1 
##$CPDPRG= <waltz16>
##$CPDPRG1= <>
##$CPDPRG2= <waltz16>
##$CPDPRG3= <>
##$CPDPRG4= <mlev>
##$CPDPRG5= <mlev>
##$CPDPRG6= <mlev>
##$CPDPRG7= <mlev>
##$CPDPRG8= <mlev>
##$CPDPRGB= <>
##$CPDPRGT= <>
##$D= (0..31)
0 1 0 0 0 0 0 0 0 0 0 0.03 2e-05 3e-06 0 0 0 0 0 0 0 0 0 0 0 0 0 0 0 0 
0 0 
##$DATE= 1612940260
##$DBL= (0..7)
120 120 120 11 120 120 24 19 
##$DBP= (0..7)
150 150 150 150 150 150 150 150 
##$DBP07= 0
##$DBPNAM0= <>
##$DBPNAM1= <>
##$DBPNAM2= <>
$$ [...]
##$SUBNAM3= <"">
##$SUBNAM4= <"">
##$SUBNAM5= <"">
##$SUBNAM6= <"">
##$SUBNAM7= <"">
##$SUBNAM8= <"">
##$SUBNAM9= <"">
##$SW= 369.568048894756
##$SWIBOX= (0..15)
0 1 3 0 0 0 0 0 0 0 0 0 0 0 0 0 
##$SW_h= 29940.119760479
##$TD= 32768
##$TD0= 1
##$TE= 0
##$TE2= 300
##$TE3= 300
##$TEG= 300
##$TL= (0..7)
0 120 53 12 22 120 120 120 
##$TP= (0..7)
150 150 150 150 150 150 150 150 
##$TP07= 0
##$TPNAME0= <>
##$TPNAME1= <>
##$TPNAME2= <>
##$TPNAME3= <>
##$TPNAME4= <>
##$TPNAME5= <>
##$TPNAME6= <>
##$TPNAME7= <>
##$TPOAL= (0..7)
0.5 0.5 0.5 0.5 0.5 0.5 0.5 0.5 
##$TPOFFS= (0..7)
0 0 0 0 0 0 0 0 
##$TUNHIN= 0
##$TUNHOUT= 0
##$TUNXOUT= 0
##$USERA1= <user>
##$USERA2= <user>
##$USERA3= <user>
##$USERA4= <user>
##$USERA5= <user>
##$V9= 5
##$VALIST= <valist>
##$VCLIST= <CCCCCCCCCCCCCCC>
##$VD= 0
##$VDLIST= <DDDDDDDDDDDDDDD>
##$VPLIST= <PPPPPPPPPPPPPPP>
##$VTLIST= <TTTTTTTTTTTTTTT>
##$WBST= 1024
##$WBSW= 4
##$XGAIN= (0..3)
0 0 0 0 
##$XL= 0
##$YL= 0
##$YMAX_a= 27538
##$YMIN_a= -51475
##$ZGOPTNS= <>
##$ZL1= 120
##$ZL2= 120
##$ZL3= 120
##$ZL4= 120
##$ABSF1= 182.463
##$ABSF2= -187.1042
##$ABSG= 5
##$ABSL= 3
##$ALPHA= 0
##$AQORDER= 0
##$ASSFAC= 0
##$ASSFACI= 0
##$ASSFACX= 0
##$ASSWID= 0
##$AUNMP= <proc_1d>
##$AZFE= 0.1
##$AZFW= 0.5
##$BCFW= 0
##$BC_mod= 2
##$BYTORDP= 0
##$COROFFS= 0
##$CY= -3
##$DATMOD= 1
##$DC= 0
##$DFILT= <>
##$DTYPP= 0
##$F1P= 0
##$F2P= 0
##$FCOR= 1
##$FTSIZE= 65536
##$FT_mod= 6
##$GAMMA= 0
##$GB= 0
##$INTBC= 1
##$INTSCL= 5.30512e-09
##$ISEN= 30
##$LB= 1
##$LEV0= 0
##$LPBIN= 0
##$MAXI= 10000
##$MC2= 0
##$MEAN= 0
##$ME_mod= 0
##$MI= 50
##$NCOEF= 0
##$NC_proc= -2
##$NLEV= 6
##$NOISF1= 182.463
##$NOISF2= 159.3651
##$NSP= 0
##$NTH_PI= 0
##$NZP= 0
##$OFFSET= 182.463
##$PC= 4
##$PHC0= -1714.828
##$PHC1= 5.602172
##$PH_mod= 1
##$PKNL= yes
##$PPARMOD= 0
##$PSCAL= 0
##$PSIGN= 0
##$REVERSE= no
##$SF= 81.014009
##$SI= 65536
##$SIGF1= 159.3651
##$SIGF2= -187.1042
##$SINO= 113.3802
##$SIOLD= 16384
##$SREGLST= <1H.CDCl3>
##$SSB= 0
##$STSI= 65536
##$STSR= 0
##$SW_p= 29940.119760479
##$SYMM= 0
##$S_DEV= 0
##$TDeff= 32768
##$TDoff= 0
##$TI= <>
##$TILT= no
##$TM1= 0
##$TM2= 0
##$TOPLEV= 0
##$USERP1= <user>
##$USERP2= <user>
##$USERP3= <user>
##$USERP4= <user>
##$USERP5= <user>
##$WDW= 1
##$XDIM= 65536
##$YMAX_p= 306659865
##$YMIN_p= -19942959
$$ End of Bruker specific parameters
$$ ---------------------------------
##NTUPLES= NMR SPECTRUM
##VAR_NAME=  FREQUENCY,     SPECTRUM/REAL,   SPECTRUM/IMAG
##SYMBOL=    X,             R,               I
##VAR_TYPE=  INDEPENDENT,   DEPENDENT,       DEPENDENT
##VAR_FORM=  AFFN,          ASDF,            ASDF
##VAR_DIM=   65536,         65536,           65536
##UNITS=     HZ,            ARBITRARY UNITS, ARBITRARY UNITS
##FACTOR=    0.456856943014862, 1,           1
##FIRST=     14782.0589164895, 0,            0
##LAST=      -15158.0608439895, 0,           0
##MIN=       -15158.0608439895, -19942959,   0
##MAX=       14782.0589164895, 306659865,    0
$$ Real data points
##PAGE= N=1
##DATA TABLE= (X++(R..R)), XYDATA
$$ [...]
##PAGE= N=2
##DATA TABLE= (X++(I..I)), XYDATA
$$ plain form
35817 368046 385571 372399 355581 354784 362671 354434 321381 282696 256557 241621 237836 257653
35805 257653 299898 336702 340915 308110 250855 196016 177988 198398 206782 165469 111114 96037
35793 96037 103083 97594 122334 226125 328722 305697 204040 200283 315647 366740 272930
35782 272930 207884 310405 431391 363232 184366 146783 294896 429991 435206 412103 459092
35771 459092 507970 458723 335489 221306 135633 57289 2893 12732 94057 218397 344162
35760 344162 421407 413410 339484 273905 287458 394047 538195 624614 599017 521930 506271
35749 506271 548838 509744 330973 177169 228421 400747 442172 290540 156397 213930
35739 213930 375907 457610 429955 395537 400222 393434 343891 292688 286551 319894 353516 359806
$$ packed form
35817C68046J7525j3172j6818p97P887q237l3053l8685k6139j4936l785J9817
35805B57653M2245L6804M213l2805n7255n4839j8028K0410Q384m1313n4355j5077
35793I6037P046n489K4740J03791J02597k3025j01657l757J15364N1093r3810
35782B72930o5046J02521J20986o8159j78866l7583J48113J35095N215k3103M6989
35771D59092M8878m9247j23234j14183q5673p8344n4396R839Q1325J24340J25765
35760C44162P7245p997p3926o5579J3553J06589J44148Q6419k5597p7087j5659
35749E06271M2567l9094j78771j53804N1252J72326M1425j51632j34143N7533
35739B13930J61977Q1703k7655l4418M685o788m9543n1203o137L3343L3622O290
$$ plain form
35727 359806 345473 340013 355385 362862 333252 288357 273066 288592 308014 346555 437249 527560
35715 527560 494324 309765 118445 83593 204446 345493 405231 390740 354527 329532 323843
35704 323843 324505 299379 231671 155379 126786 159754 214269 249291 265083 290745 343897 403791
35692 403791 421060 365243 266842 192891 173904 182832 199239 252727 363245 469468 477126
35681 477126 378114 268728 235131 265110 296421 310528 335787 379668 407153 389679 339990
35670 339990 290063 263976 281583 354098 451884 504024 464548 366770 281530 233926 199358
35659 199358 175065 202423 296523 395419 421424 378266 347339 383187 445779 457952 410077
35648 410077 369906 382698 403928 369949 308608 315584 416602 520802 540757 497351 458969
$$ packed form
35727C59806j4333n460J5372P477k9610m4895j5291J5526J9422L8541R0694R0311
35715E27560l3236j84559j91320l4852J20853J41047N9738j4491l6213k4995n689
35704C23843O62k5126o7708p6292k8593L2968N4515L5022J5792K5662N3152N9894
35692D03791J7269n5817r8401p3951j8987Q928J6407N3488J10518J06223P658
35681D77126r9012j09386l3597K9979L1311J4107K5259M3881K7485j7474m9689
35670C39990m9927k6087J7607P2515R7786N2140l9476r7778q5240m7604l4568
35659A99358k4293K7358R4100R8896K6005m3158l0927L5848O2592J2173m7875
35648D10077m0171J2792K1230l3979o1341O976J01018J04200J9955m3406l8382
$$ plain form
35637 458969 432368 378922 299713 233486 194473 176646 194341 252601 304991 312577 314936 364205
35625 364205 424702 431364 407834 410538 394353 283028 153134 167320 307174 368756 283060
35614 283060 238589 375909 550696 562249 466156 464057 580506 652796 596183 492814 427770
35603 427770 398106 394470 437510 510531 558162 566150 562951 550235 513708 486890 517749 585420
35591 585420 628861 636042 626442 579480 472208 358024 312190 324122 334468 346222 400447
35580 400447 473085 498083 465853 405725 315734 214532 203097 339463 500276 518710 425813
35569 425813 394586 469966 529546 505983 467136 460671 454345 454011 506575 557038 484291 321066
35557 321066 252341 336503 413263 360747 257621 202116 159486 100537 107426 206298 265393
$$ packed form
35637D58969k6601n3446p9209o6227l9013j7827J7695N8260N2390P586K359M9269
35625C64205O0497O662k3530K704j6185j11325j29894J4186J39854O1582q5696
35614B83060m4471J37320J74787J1553r6093k099J16449P2290n6613j03369o5044
35603D27770k9664l636M3040P3021M7631P988l199j2716l6527k6818L0859O7671
35591E85420M3441P181r600m6962j07272j14184m5834J1932J0346J1754N4225
35580D00447P2638K4998l2230o0128q9991j01202j1435J36366J60813J8434r2897
35569D25813l1227P5380N9580k3563l8847o465o326l34N2564N0463p2747j63225
35557C21066o8725Q4162P6760n2516j03126n5505m2630n8949O889R8872N9095
$$ plain form
35546 265393 211236 184168 304983 437696 391974 243598 221780 348007 424898 365415 306666
35535 306666 362070 448730 431279 307295 181163 137669 187353 275985 323647 301477 269284
35524 269284 292506 348356 374275 369993 369728 350738 271779 179948 167529 227136 263181 257535
35512 257535 305122 446968 577104 582762 498001 441106 452136 474952 476051 495335 560707
35501 560707 615624 581908 472572 387251 384859 410195 382656 316661 292626 327951 351865
35490 351865 317514 271885 289420 385846 517953 624673 657204 617326 573227 584309 610379
35479 610379 561177 433861 319957 273983 271347 303660 396949 505479 515751 411971 316459
35468 316459 301609 290727 228850 213965 334573 491415 526597 447590 378406 356248 327890
$$ packed form
35546B65393n4157k7068J20815J32713m5722j48376k1818J26227P6891n9483n8749
35535C06666N5404Q6660j7451j23984j26132m3494M9684Q8632M7662k2170l2193
35524B69284K3222N5850K5919m282k65j8990p8959r1831j2419N9607L6045n646
35512B57535M7587J41846J30136N658q4761n6895J1030K2816J099J9284O5372
35501E60707N4917l3716j09336q5321k392K5336k7539o5995k4035L5325K3914
35490C51865l4351m5629J7535R6426J32107J06720L2531l9878m4099J1082K6070
35479F10379m9202j27316j13904m5974k636L2313R3289J08530J0272j03780r5512
35468C16459j4850j0882o1877j4885J20608J56842L5182p9007o9184k2158k8358
$$ plain form
35457 327890 299211 330658 400614 415105 357965 317269 357078 455232 561880 634415 629424
35446 629424 543219 442924 385519 340860 267078 204736 203324 217843 192531 187940 291826
35435 291826 448994 521443 487595 442536 428008 407464 387819 412763 446261 416219 365741
35424 365741 400236 488459 491689 401563 362032 422976 466213 435551 445485 565814 672537
35413 672537 632481 493813 373482 284039 198111 167956 239640 334887 353347 326650 350392
35402 350392 426156 489969 536702 587343 580456 439932 240460 173172 320777 560238 717019
35391 717019 745017 723366 728760 754789 747626 694348 647021 640962 624635 532997 412067 378221
35379 378221 442258 477340 401534 289573 240821 234476 202399 162178 172589 215548 230982
$$ packed form
35457C27890k8679L1447O9956J4491n7140m0696L9809R8154J06648P2535m991
35446F29424q6205j00295n7405m4659p3782o2342j412J4519k5312m591J03886
35435B91826J57168P2449l3848m5059j4528k0544j9645K4944L3498l0042n0478
35424C65741L4495Q8223L230r0126l9531O0944M3237l0662R934J20329J06723
35413F72537m0056j38668j20331q9443q5928l0155P1684R5247J8460k6697K3742
35402C50392P5764O3813M6733N0641o887j40524j99472o7288J47605K39461J56781
35391G17019K7998k1651N394K6029p163n3278m7327o059j6327r1638j20930l3846
35379C78221O4037L5082p5806j11961m8752o345l2077m0221J0411M2959J5434
$$ plain form
35368 230982 231306 277453 365154 433234 469900 514511 557046 531005 425285 327476 324557 406319
35356 406319 489217 507562 470209 439395 446018 428539 303436 110853 13214 94634 238033
35345 238033 287214 263166 300298 410693 460366 388343 305651 323323 397012 418328 375808
35334 375808 339424 340058 347981 340160 315691 263063 178808 110475 120508 206228 306982 391115
35322 391115 479636 573215 618468 584130 524887 518100 561246 584802 556802 519657 517374 539310
35310 539310 557619 574695 599600 611283 583807 525697 461018 397600 352234 374489 484007
35299 484007 600706 611326 513873 425484 421038 431899 355814 216764 142836 198344 305583
35288 305583 350340 316637 282242 306267 365287 403251 404948 393260 378140 351241 329319 357191
$$ packed form
35368B30982L24M6147Q7701O8080L6666M4611M2535k6041j05720r7809k919Q1762
35356D06319Q2898J8345l7353l0814O623j7479j25103j92583r7639Q1420J43399
35345B38033M9181k4048L7132J10395M9673p2023q2692J7672P3689K1316m2520
35334C75808l6384O34P923p821k4469n2628q4255o8333J0033Q5720J00754Q4133
35322C91115Q8521R3579M5253l4338n9243o787M3146K3556k8000l7145k283K1936
35310E39310J8309J7076K4905J1683k7476n8110o4679o3418m5366K2255J09518
35299D84007J16699J0620r7453q8389m446J0861p6085j39050p3928N5508J07239
35288C05583M4757l3703l4395K4025N9020L7964J697j1688j5120k6899k1922K7872
$$ plain form
35276 357191 445907 538514 565021 515699 440365 389505 371512 353738 295166 193895 105980
35265 105980 95255 166047 272479 378346 459426 470439 395173 322257 357864 443632 395781
35254 395781 181237 10685 58597 228078 327306 349113 397482 443240 378327 263410 283120
35243 283120 447337 558791 517725 449841 463195 475151 386491 266863 246219 337976 470891
35232 470891 592458 655095 610108 505543 480401 564284 590632 422078 169700 65027
35222 65027 178888 378982 514651 542516 509835 499605 559648 631181 604254 490079 447062
35211 447062 563132 709333 708263 564519 419881 353189 341858 363123 410392 442534 422163
35200 422163 378646 351941 319138 261365 246601 342793 491706 570591 545675 475566 403962
$$ packed form
35276C57191Q8716R2607K6507m9322p5334n0860j7993j7774n8572j01271q7915
35265A05980j0725P0792J06432J05867Q1080J1013p5266p2916L5607Q5768m7851
35254C95781k14544j70552M7912J69481R9228K1807M8369M5758o4913j14917J9710
35243B83120J64217J11454m1066o7884J3354J1956q8660j19628k0644R1757J32915
35232D70891J21567O2637m4987j04565k5142Q3883K6348j68554k52378j04673
35222F5027J13861K00094J35669K7865l2681j0230O0043P1533k6927j14175m3017
35211D47062J16070J46201j070j43744j44638o6692j1331K1265M7269L2142k0371
35200D22163m3517k6705l2803n7773j4764R6192J48913P8885k4916p0109p1604
$$ plain form
35189 403962 339085 295227 264495 194978 85068 39172 130954 277489 360248 399233 475975
35178 475975 554107 534995 443131 387928 372435 315288 244523 276792 390073 412943 291293
35167 291293 185993 227978 336614 380400 379259 423529 492354 487372 398016 319460 321672 381478
35155 381478 439853 469016 478916 489510 502533 496993 460257 411939 374706 340144 297538 274214
35143 274214 303600 374245 454223 535300 601951 600475 512919 424168 428831 500118 541364 536813
35131 536813 544751 562623 521677 418666 335879 314355 315005 322116 373273 456497 484955 418847
35119 418847 326266 284593 298105 341620 407467 481723 544952 611014 692035 730456 665594
35108 665594 565069 565022 661390 696761 597398 485756 487483 551236 552088 476597 410720 414418
$$ packed form
35189D03962o4877m3858l0732o9517j09910m5896R1782J46535Q2759L8985P6742
35178D75975P8132j9112r1864n5203j5493n7147p0765L2269J13281K2870j21650
35167B91293j05300M1985J08636M3786j141M4270O8825m982q9356p8556K212N9806
35155C81478N8375K9163R900J0594J3023n540l6736m8318l7233l4562m2606k3324
35143B74214K9386P0645P9978Q1077O6651j476q7556q8751M663P1287M1246m551
35131E36813P938J7872m0946j03011q2787k1524O50P111N1157Q3224K8458o6108
35119D18847r2581m1673J3512M3515O5847P4256O3229O6062Q1021L8421o4862
35108F65594j00525m7R6368L5371r9363j11642J727O3753Q52p5491o5877L698
$$ plain form
35096 414418 484021 574184 601556 508024 374673 371208 519364 617992 506034 297138 221905
35085 221905 316055 415788 416700 376833 365107 357210 322709 303439 346305 427667 494565 534385
35073 534385 563567 581558 573786 544765 521992 529314 564304 596916 587939 516022 395142 273453
35061 273453 214255 255508 364928 448710 436592 355895 295830 306236 360821 409322 428204
35050 428204 425280 431007 479993 566262 626619 606047 528711 467483 459260 487480 523407 542144
35038 542144 529065 516890 574266 700819 784419 732793 592892 463831 366655 301940 341341
35027 341341 504041 616556 495421 237280 116521 201543 300617 309299 354383 509135
35017 509135 615084 533325 371491 294938 279256 226842 188074 271705 429174 510730 478907
$$ packed form
35096D14418O9603R0163K7372r3532j33351l465J48156R8628j11958k08896p5233
35085B21905R4150R9733R12l9867j1726p897l4501j9270M2866Q1362O6898L9820
35073E34385K9182J7991p772k9021k2773P322L4990L2612q977p1917j20880j21689
35061B73453n9198M1253J09420Q3782j2118q0697o0065J0406N4585M8501J8882
35050D28204k924N727M8986Q6269O0357k0572p7336o1228q223K8220L5927J8737
35038E42144j3079j2175N7376J26553Q3600n1626j39901j29061r7176o4715L9401
35027C41341J62700J12515j21135k58141j20759Q5022R9074Q682M5084J54752
35017E09135J05949q1759j61834p6553j5682n2414l8768Q3631J57469Q1556l1823
$$ plain form
35006 478907 418303 387368 387346 417754 447001 399672 285079 249331 373619 517603 510843 406702
34994 406702 375530 425491 425678 360582 356054 452590 534591 509382 409605 299312 213176 204052
34982 204052 316422 482548 558188 491736 370532 294035 291157 353606 445944 485998 421042
34971 421042 322205 301640 346195 346078 280877 251501 318426 430470 533327 632066 718609
34960 718609 745408 704490 640765 564554 443269 298632 216644 236514 312596 395271 459356
34949 459356 455456 350052 230248 246719 414869 579471 612977 543296 449443 348946 249744
34938 249744 209822 268429 387721 515427 634956 716594 710434 639184 604857 638752 633009
34927 633009 497915 309267 211839 234513 286798 296113 270955 261012 320772 478017 674503
$$ packed form
35006D78907o0604l0935k2L0408K9247m7329j14593l5748J24288J43984o760j04141
34994D06702l1172M9961J87o5096m528R6536Q2001k5209r9777j10293q6136r124
34982B04052J12370J66126P5640o6452j21204p6497k878O2449R2338M0054o4956
34971D21042r8837k0565M4555j17o5201k9376O6925J12044J02857R8739Q6543
34960G18609K6799m0918o3725p6211j21285j44637q1988J9870P6082Q2675O4085
34949D59356l900j05404j19804J6471J68150J64602L3506o9681r3853j00497r9202
34938B49744l9922N8607J19292J27706J19529Q1638o160p1250l4327L3895n743
34927F33009j35094j88648r7428K2674N2285R315k5158r943N9760J57245J96486
$$ plain form
34916 674503 774048 700004 539507 444893 454127 479131 457155 432100 468588 549996 602426
34905 602426 590991 555109 551057 583456 606059 580672 513875 432134 350317 287534 285700 368722
34893 368722 491957 574463 583439 553621 526327 509071 499686 509436 542025 570830 555082 480188
34881 480188 387499 359200 443141 583173 663755 642910 593688 588015 602840 589121 564967
34870 564967 565695 560767 513541 477261 523024 599280 580209 452205 342540 348980 437543 523793
34858 523793 559812 521777 411857 309375 329071 476276 611866 611421 508504 440114 492748
34847 492748 632617 749060 744871 621527 491848 475260 574702 687865 726510 679150 578205
34836 578205 473536 428759 469973 535452 540650 490499 462084 485545 518256 532378 546743
$$ packed form
34916F74503R9545p4044j60497r4614R234K5004k1976k5055L6488Q1408N2430
34905F02426j1435l5882m052L2399K2603k5387o6797q1741q1817o2783j834Q3022
34893C68722J23235Q2506Q976k9818k7294j7256r385R750L2589K8805j5748p4894
34881D80188r2689k8299Q3941J40032Q0582k0845m9222n673J4825j3719k4154
34870E64967P28m928m7226l6280M5763P6256j9071j28004j09665O440Q8563Q6250
34858E23793L6019l8035j09920j02482J9696J47205J35590m45j02917o8390N2634
34847D92748J39869J16443m189j23344j29679j6588R9442J13163L8645m7360j00945
34836E78205j04669m4777M1214O5479N198n0151k8415K3461L2711J4122J4365
$$ plain form
34825 546743 567937 575631 569874 563039 532609 458656 392936 400387 445839 440757 392602 393356 460360
34812 460360 513371 523953 557662 634558 673279 624331 549036 510471 482444 423241 358768
34801 358768 343219 400230 521499 648755 660370 484715 235911 117169 173128 264638
34791 264638 300591 336756 406982 431032 371478 327843 374732 437463 428773 388463 385648 393726
34779 393726 362703 312709 266490 200069 147039 221631 428984 581400 532831 383298 317785
34768 317785 353549 392321 416585 465676 494956 430855 321786 287278 352898 455186 554106
34757 554106 620554 586286 447234 348093 411620 543816 566953 487762 457784 512111 542038
34746 542038 514552 523742 602576 659947 647282 636644 684087 744401 768274 768999 749450 670948
$$ packed form
34825E46743K1194P694n757o835l0430p3953o5720P451M5452n082m8155P54O7004
34812D60360N3011J0582L3709P6896L8721m8948p5295l8565k8027n9203o4473
34801C58768j5549N7011J21269J27256J1615j75655k48804j18742N5959R1510
34791B64638L5953L6165P0226K4050n9554m3635M6889O2731q690m0310k815Q078
34779C93726l1023m9994m6219o6421n3030P4592K07353J52416m8569j49533o5513
34768C17785L5764L8772K4264M9091K9280o4101j09069l4508O5620J02288R8920
34757E54106O6448l4268j39052r9141O3527J32196K3137p9191k9978N4327K9927
34746E42038k7486R190P8834N7371j2665j0638M7443O0314K3873P25j9549p8502
$$ plain form
34734 670948 543204 455082 471298 566122 678189 759249 766218 694200 625898 655241 747715
34723 747715 768056 663127 525151 450937 428622 397159 340918 288355 273148 319169 415781
34712 415781 501681 521621 492157 460972 427732 374264 340256 377274 449893 483183 492870 557101
34700 557101 662709 700604 632882 550337 529870 538372 523292 507832 539129 606037 658662
34689 658662 667514 634225 581459 546244 547525 562126 570497 603669 688907 775567 785713 717516
34677 717516 629669 555591 511599 542444 649316 712660 622387 467647 449514 598044 726329
34666 726329 695049 576527 507659 519124 577067 666313 747576 738570 629128 531518 531980 568033
34654 568033 538228 463869 444094 496161 539808 527065 504504 530644 579974 559392 420038
$$ packed form
34734F70948j27744q8122J6216R4824J12067Q1060O969p2018o8302K9343R2474
34723G47715K0341j04929j37976p4214k2315l1463n6241n2563j5207M6021R6612
34712D15781Q5900J9940k9464l1185l3240n3468l4008L7018P2619L3290R687O4231
34700E57101J05608L7895o7722q2545k0467Q502j5080j5460L1297O6908N2625
34689F58662Q852l3289n2766l5215J281J4601Q371L3172Q5238Q6660J0146o8197
34677G17516q7847p4078m3992L0845J06872O3344r0273j54740j8133J48530J28285
34666G26329l1280j18522o8868J1465N7943Q9246Q1263r006j09442r7610M62L6053
34654E68033k9805p4359j9775N2067M3647j2743k2561K6140M9330k0582j39354
$$ plain form
34643 420038 240447 166076 246449 372986 419292 393484 385853 420279 457097 502603 591315
34632 591315 675752 666985 589178 559842 600423 607963 549301 536000 641563 774975 815355
34621 815355 762005 674549 572157 475636 446383 489581 509009 452039 410977 476456 574222
34610 574222 573552 500666 508888 653001 810475 840590 742011 635024 634488 744708 852564
34599 852564 837000 700793 561917 505295 503879 509086 535514 597402 636025 594804 520651
34588 520651 507659 566991 625310 632812 606338 577830 560256 560959 580889 600552 599418 584221
34576 584221 574742 574037 572531 564621 542887 494887 425374 370898 381121 483917 648550 771948
34564 771948 749413 605334 504521 562469 691493 727787 661717 613103 611563 568304 474715
$$ packed form
34643D20038j79591p4371Q0373J26537M6306k5808p631L4426L6818M5506Q8712
34632E91315Q4437q767p7807k9336M0581P540n8662j3301J05563J33412M0380
34621H15355n3350q7456j02392r6521k9253M3198J9428n6970m1062O5479R7766
34610E74222o70p2886Q222J44113J57474L0115r8579j06987n36J10220J07856
34599H52564j5564j36207j38876n6622j416N207K6428O1888L8623m1221p4153
34588E20651j2992N9332N8319P502k6474k8508j7574P03J9930J9663j134j5197
34576E84221r479p05j506p910k1734m8000o9513n4476J0223J02796J64633J23398
34564G71948k2535j44079j00813N7948J29024L6294o6070m8614j540m3259r3589
$$ plain form
34553 474715 448096 523321 568296 498243 427256 493100 650765 759845 777431 744182 669073
34542 669073 558567 491726 535876 632823 681837 691380 738018 815221 838124 776840 683130
34531 683130 597903 519055 448518 396941 355630 322120 325658 374301 419746 431943 455230 525377
34519 525377 590453 589509 551702 538866 550922 569482 621788 702552 711041 593268 480853 534676
34507 534676 684587 689043 462294 196465 122282 262718 465218 586296 598023 571007
34497 571007 584409 626381 600112 467771 338064 333636 420976 475221 472815 492314 545086
34486 545086 551427 498930 482618 545147 602367 584858 541862 535508 532159 484952 443565 479875
34474 479875 553154 554762 474970 431811 513087 657712 737372 720287 697682 743826 802822
$$ packed form
34553D74715k6619P5225M4975p0053p0987O5844J57665J09080J7586l3249p5109
34542F69073j10506o6841M4150R6947M9014R543M6638P7203K2903o1284r3710
34531F83130q5227p8848p0537n1577m1311l3510L538M8643M5445J2197K3287P0147
34519E25377O5076r44l7807j2836J2056J8560N2306Q0764Q489j17773j12415N3823
34507E34676J49911M456k26749k65829p4183J40436K02500J21078J1727k7016
34497E71007J3402M1972k6269j32341j29707m428Q7340N4245k406J9499N2772
34486E45086O341n2497j6312O2529N7220j7509m2996o354l349m7207m1387L6310
34474D79875P3279J608p9792m3159Q1276J44625P9660j7085k2605M6144N8996
$$ plain form
34463 802822 760315 604209 450669 404033 454555 537574 622750 693238 697726 601025 456564
34452 456564 363504 365156 434962 533841 627309 674717 664365 642600 655508 684396 691662 698542
34440 698542 748592 814842 815947 719663 573465 444236 381289 415597 525207 612732 589561
34429 589561 485133 413442 433195 501685 566909 637625 739572 848395 895933 833379 688815
34418 688815 567554 568921 682151 793610 817342 779080 747591 737471 721184 685694 629233
34407 629233 550119 483666 492764 570928 620196 586471 545552 580248 648073 666386 658218 695910
34395 695910 752162 738280 664964 635215 678389 707788 658033 566534 495556 450258 398961
34384 398961 326413 259084 263674 390864 586355 712920 714095 689564 738939 809794 798050
$$ packed form
34463H02822m2507j56106j53540m6636N0522Q3019Q5176P0488M488r6701j44461
34452D56564r3060J652O9806R8879R3468M7408j0352k1765J2908K8888P266O880
34440F98542N0050O6250J105r6284j46198j29229o2947L4308J09610Q7525k3171
34429E89561j04428p1691J9753O8490O5224P0716J01947J08823M7538o2554j44564
34418F88815j21261J367J13230J11459K3732l8262l1489j0120j6287l5490n6461
34407F29233p9114o6453R098P8164M9268l3725m0919L4696O7825J8313q168L7692
34395F95910N6252j3882p3316k9749M3174K9399m9755r1499p0978m5298n1297
34384C98961p2548o7329M590J27190J95491J26565J175k4531M9375P0855j1744
$$ plain form
34373 798050 724301 686647 690914 658170 569896 485572 440278 431246 471067 547495 577702 520727
34361 520727 482299 573174 714013 731683 608878 479754 412844 368516 346537 392580 463101
34350 463101 464479 431216 485702 613332 668071 623698 620600 715068 775167 698627 564117
34339 564117 485723 465231 463695 484773 520049 534097 550640 627666 721054 721268 647331 631912
34327 631912 686354 678975 592790 583484 701584 784756 740625 712904 816814 916561 846449
34316 846449 677769 574494 535006 476194 443597 526294 655726 689412 629997 589199 599946
34305 599946 624586 677198 772939 823735 752889 655179 675472 778314 804937 717928 623873
34294 623873 584246 565497 555914 577821 597902 570031 552328 638537 784402 844494 777994
$$ packed form
34373G98050p3749l7654M267l2744q8274q4324m5294r032L9821P6428L0207n6975
34361E20727l8428R0875J40839J7670j22805j29124o6910m4328k1979M6043P0521
34350D63101J378l3263N4486J27630N4739m4373l098R4468O0099p6540j34510
34339E64117p8394k0492j536K1078L5276J4048J6543P7026R3388K14p3937j5419
34327F31912N4442p379q6185r306J18100Q3172m4131k7721J03910R9747p0112
34316H46449j68680j03275l9488n8812l2597Q2697J29432L3686n9415m0798J0747
34305E99946K4640N2612R5741N0796p0846r7710K0293J02842K6623q7009r4055
34294F23873l9627j8749r583K1907K0081k7871j7703Q6209J45865O0092o6500
$$ plain form
34283 777994 682356 624929 577691 526679 514799 555358 613424 684551 787501 877121 876921 805889
34271 805889 761560 766333 744199 670164 628492 681268 771881 806777 768168 711850 703549 772170
34259 772170 877454 923640 858028 746892 695726 713083 724909 704430 699065 729596 749913
34248 749913 722512 664867 608355 569594 565332 597437 625113 610829 586431 609941 666995 690025
34236 690025 674100 692824 781354 873873 888068 823328 747517 718402 737079 758631 740159
34225 740159 687229 643099 625633 605660 565704 539937 564160 623079 680964 726963 755250
34214 755250 740423 671870 579761 499939 451276 458502 532007 608138 595719 512412 475197 513985
34202 513985 517270 434933 401299 539437 756254 874168 878822 883256 915165 906567 856535 840245
$$ packed form
34283G77994r5638n7427m7238n1012j1880M0559N8066P1127J02950Q9620k00p1032
34271H05889m4329M773k2134p4035m1672N2776R0613L4896l8609n6318q301O8621
34259G72170J05284M6186o5612j11136n1166J7357J1826k0479n365L0531K0317
34248G49913k7401n7645n6512l8761m262L2105K7676j4284k4398K3510N7054K3030
34236F90025j5925J8724Q8530R2519J4195o4740p5811k9115J8677K1552j8472
34225G40159n2930m4130j7466j9973l9956k5767K4223N8919N7885M5999K8287
34214G55250j4827o8553r2109p9822m8663P226P3505P6131j2419q3307l7215L8788
34202E13985L285q2337l3634J38138K16817J17914M654M434L1909q598n0032j6290
$$ plain form
34190 840245 867310 876572 867460 899402 958453 956643 877132 800740 772434 750926 706207 663248
34178 663248 631709 590002 559212 604115 736002 880154 947660 888617 704492 485159 394888
34167 394888 513882 710382 775721 676117 568217 579638 687790 810000 891620 891255 792556
34156 792556 659474 590334 597913 611831 597275 582007 572467 546506 533006 593911 714666
34145 714666 810766 855688 905891 985863 1045363 1049330 1020673 977526 913457 851706 832926 837268
34133 837268 801325 720490 655013 635713 647849 699240 805000 905133 901666 792727 682300
34122 682300 648861 682388 740551 779378 747307 647701 584078 634706 712640 678278 562253
34111 562253 525783 613509 711718 757682 814958 910189 968740 966211 983400 1046366 1061900 982030
$$ packed form
34190H40245K7065R262r112L1942N9051j810p9511p6392k8306k1508m4719m2959
34178F63248l1539m1707l0790M4903J31887J44152O7506n9043j84125k19333r0271
34167C94888J18994J96500O5339r9604j07900J1421J08152J22210Q1620l65r8699
34156G92556j33082o9140P579J3918j4556j5268r540k5961j3500O0905J20755
34145G14666R6100M4922N0203P9972N9500L967k8657m3147o4069o1751j8780M342
34133H37268l5943q0835o5477j9300J2136N1391J05760J00133l467j08939j10427
34122F82300l3439L3527N8163L8827l2071r9606o3623N0628P7934l4362j16025
34111E62253l6470Q7726R8209M5964N7276R5231N8551k529J7189O2966J5534p9870
$$ plain form
34099 982030 888849 840599 776122 660411 588598 639331 739879 785996 798709 855140 946188
34088 946188 1006397 1019003 1001771 951301 883485 868203 943652 1047971 1103526 1115193 1123759
34077 1123759 1121455 1080368 1013801 949066 886296 835108 839979 916575 1010079 1063940 1084612 1097951
34065 1097951 1092409 1051525 1001603 984651 1010406 1056798 1089023 1071356 995952 900794 828907
34054 828907 790504 796836 872926 972467 958607 781041 605281 625087 798743 930415 964242
34043 964242 1002995 1060022 1020147 873188 765758 763967 768809 730158 733513 791924 770734 636236
34031 636236 571891 701547 881713 929813 892347 911285 973053 984037 976843 1038577 1114365
34020 1114365 1076534 943301 859336 885451 946056 960419 911957 820901 746860 771805 888228
$$ packed form
34099I82030r3181m8250o4477j15711p1813N0733J00548M6117J2713N6431R1048
34088I46188O0209J2606j7232n0470o7816j5282P5449J04319N5555J1667Q566
34077A123759k304m1087o6567o4735o2770n1188M871P6596R3504N3861K0672J3339
34065A097951n542m0884m9922j6952K5755M6392L2225j7667p5404r5158p1887
34054H28907l8403O332P6090R9541j3860j77566j75760J9806J73656J31672L3827
34043I64242L8753N7027l9875j46959j07430j791M842l8651L355N8411k1190j34498
34031F36236o4345J29656J80166M8100l7466J8938O1768J0984p194O1734P5788
34020A114365l7831j33233q3965K6115O0605J4363m8462r1056p4041K4945J16423
$$ plain form
34009 888228 964205 913297 828485 845976 952843 1044268 1095767 1145806 1165898 1090884 953665
33998 953665 868329 889060 975335 1072999 1146481 1158623 1098034 1007265 933284 888504 893222 978827
33986 978827 1098354 1126495 1018762 882178 819320 804557 792516 826780 928649 991626 926005
33975 926005 822863 832186 942671 1018525 1003123 957413 937388 950872 1000769 1068614 1091492
33964 1091492 1041621 980087 955222 920726 843877 809072 898815 1043026 1108487 1083267 1057453
33953 1057453 1068897 1078042 1058270 1017337 964030 923210 933292 974258 972193 924410 919511 980114
33941 980114 1012835 980644 974346 1028090 1036299 964703 951058 1047035 1065928 891298 744359
33930 744359 884960 1194000 1337515 1244202 1129565 1113136 1111353 1089624 1129803 1219691 1227240
$$ packed form
34009H88228P5977n0908q4812J7491J06867R1425N1499N0039K0092p5014j37219
33998I53665q5336K0731Q6275R7664P3482J2142o0589r0769p3981m4780M718Q5605
33986I78827J19527K8141j07733j36584o2858j4763j2041L4264J01869O2977o5621
33975I26005j03142R323J10485P5854j5402m5710k0025J3484M9897O7845K2878
33964A091492m9871o1534k4865l4496p6849l4805Q9743J44211O5461k5220k5814
33953A057453J1444R145j9772m0933n3307m0820J0082M0966k065m7783m899O0603
33941I80114L2721l2191o298N3744Q209p1596j3645R5977J8893j74630j46939
33930G44359J40601L09040J43515r3313j14637j6429j783k1729M0179Q9888P549
$$ plain form
33919 1227240 1130020 1058733 1075307 1101481 1096047 1112817 1152347 1139739 1083648 1084292 1152515 1189837
33907 1189837 1178282 1218504 1336707 1415816 1374753 1280114 1229302 1238764 1283044 1335429 1343226
33896 1343226 1262924 1138994 1066050 1078713 1152161 1267894 1386016 1415845 1330861 1246529 1259226
33885 1259226 1290530 1236225 1171294 1222217 1322031 1304340 1179306 1099499 1102051 1106284 1120235
33874 1120235 1212180 1310485 1279624 1178504 1192432 1314804 1355761 1276498 1248301 1345940 1442667
33863 1442667 1459515 1468154 1488229 1430206 1311191 1290434 1409540 1517775 1529369 1536588 1597344
33852 1597344 1635493 1628889 1671128 1763779 1771733 1671443 1617787 1674188 1708299 1655851 1649760 1767062
33840 1767062 1879069 1886624 1882697 1941585 1966226 1898386 1868204 1966502 2065864 2043818 1998662
$$ packed form
33919A227240r7220p1287J6574K6174n434J6770L9530j2608n6091O44O8223L7322
33907A189837j1555M0222J18203P9109m1063r4639n0812R462M4280N2385P797
33896A343226q0302j23930p2944J2663P3448J15733J18122K9829q4984q4332J2697
33885A259226L1304n4305o4931N0923R9814j7691j25034p9807K552M233J3951
33874A120235R1945R8305l0861j01120J3928J22372M0957p9263k8197R7639R6727
33863A442667J6848Q639K0075n8023j19015k0757J19106J08235J1594P219O0756
33852A597344L8149o604M2239R2651P954j00290n3656N6401L4111n2448o091J17302
33840A767062J12007P555l927N8888K4641o7840l0182R8298R9362k2046m5156
$$ plain form
33829 1998662 2060076 2158130 2173581 2162862 2235237 2342166 2389439 2440735 2602481 2794884 2843091
33818 2843091 2747019 2680042 2743877 2877307 3001330 3127785 3304166 3529769 3758037 3964162
33808 3964162 4191770 4493990 4821358 5059847 5206573 5309584 5097837 3956780 1656667
33799 1656667 -1026903 -2879431 -3457666 -3337978 -3162927 -2966288 -2591896 -2214576 -2059136
33790 -2059136 -1981550 -1742581 -1444976 -1325657 -1322975 -1218636 -1048168 -1012037 -1091394 -1084173 -946514
33779 -946514 -804999 -697158 -568093 -459493 -446490 -443294 -308988 -93955 33560 41062
33769 41062 6909 -72260 -225031 -331981 -242892 -20721 138329 177951 183861 181411 134863
33758 134863 90765 122850 181822 177419 146941 170800 204631 180108 179795 306988 465952 485803
$$ packed form
33829A998662O1414R8054J5451j0719P2375J06929M7273N1296J61746J92403M8207
33818B843091r6072o6977O3835J33430J24023J26455J76381K25603K28268K06125
33808C964162K27608L02220L27368K38489J46726J03011k11747j141057k300113
33799A656667k683570j852528n78235J19688J75051J96639L74392L77320J55440
33790b059136P7586K38969K97605J19319K682J04339J70468L6131p9357P221J37659
33779i46514J41515J07841J29065J08600J3003L196J34306K15033J27515P502
33769D1062l4153p9169j52771j06950Q9089K22171J59050L9622N910k450m6548
33758A34863m4098L2085N8972m403l0478K3859L3831k4523l13J27193J58964J9851
$$ plain form
33746 485803 391345 338688 349425 323339 256424 236950 277299 341189 465415 656880 758781
33735 758781 642818 451788 415438 504463 519011 445847 445561 526676 524492 404697 316751
33724 316751 325554 340440 335565 397791 516314 552205 469711 398602 419391 466472 480913 490203
33712 490203 508072 512125 534484 623631 720559 727216 680397 696547 771800 806555 791385 786750
33700 786750 763978 668667 596100 675935 812643 784932 597183 483217 544441 632817 635155
33689 635155 633156 707488 790046 797534 751972 705645 680987 711768 808086 879928 841085 768024
33677 768024 792375 874326 877445 828640 872070 980822 968581 810270 700142 737161 786098
33666 786098 726084 627905 597651 621821 650679 688505 736841 770998 802837 850216 855029 769300
$$ packed form
33746D85803r4458n2657J0737k6086o6915j9474M0349O3890J24226J91465J01901
33735G58781j15963j91030l6350Q9025J4548p3164k86Q1115k184j19795q7946
33724C16751Q803J4886m875O2226J18523L5891q2494p1109K0789M7081J4441R290
33712D90203J7869M053K2359Q9147R6928O657m6819J6150P5253L4755j5170m635
33700G86750k2772r5311p2567P9835J36708k7711j87749j13966O1224Q8376K338
33689F35155j999P4332Q2558P488m5562m6327k4658L0781R6318P1842l8843p3061
33677G68024K4351Q1951L119m8805M3430J08752j2241j58311j10128L7019M8937
33666G86098o0014r8179l0254K4170K8858L7826M8336L4157L1839M7379M813q5729
$$ plain form
33654 769300 689230 738773 859368 898959 862873 868303 898648 842451 744998 764953 890616
33643 890616 954844 928015 935723 988933 973942 919014 979504 1129969 1166903 1061526 1011516
33632 1011516 1083498 1106056 997694 906523 929367 972184 983765 1050446 1163364 1171331 1064438
33621 1064438 1024469 1096834 1107237 1009074 996440 1134078 1193290 1029211 825361 775229 797770
33610 797770 763168 735876 790497 833739 810087 847767 1006572 1118197 1070823 1010780 1063347
33599 1063347 1103077 1016017 938563 998513 1060390 984810 914571 1028082 1209592 1246029 1175356
33588 1175356 1161237 1182761 1128106 1053398 1070428 1100327 1008892 878973 887575 1006174 1071131
33577 1071131 1065651 1093574 1151318 1154570 1125114 1142835 1177933 1158112 1124414 1142663 1151358 1073805
$$ packed form
33654G69300q0070M9543J20595L9591l6086N430L0345n6197r7453J9955J25663
33643H90616O4228k6829P708N3210j4991n4928O0490J50465L6934j05377n0010
33632A011516P1982K2558j08362r1171K2844M2817J1581O6681J12918P967j06893
33621A064438l9969P2365J0403r8163j2634J37638N9212j64079k03850n0132K2541
33610G97770l4602k7292N4621M3242k3652L7680J58805J11625m7374o0043N2567
33599A063347L9730q7060p7454N9950O1877p5580p0239J13511J81510L6437p0673
33588A175356j4119K1524n4655p4708J7030K9899r1435j29919Q602J18599O4957
33577A071131n480K7923N7744L252k9456J7721L5098j9821l3698J8249Q695p7553
$$ plain form
33565 1073805 981882 974625 1004964 1001052 1028905 1139723 1191668 1048106 840688 804833 942816
33554 942816 1068443 1101775 1104889 1103109 1081648 1092849 1172512 1220531 1147474 1056883 1097991 1224934
33542 1224934 1285989 1259774 1220879 1174029 1110129 1114083 1216733 1257887 1114320 948621 995045
33531 995045 1199186 1315518 1274581 1202570 1154023 1087248 1050836 1132115 1246313 1219758 1068719
33520 1068719 974767 1000189 1039272 1034314 1033488 1045210 1026174 1001116 1020536 1027456 937546 814005
33508 814005 791764 872024 958956 1039224 1145137 1206208 1135762 1013363 986053 1036002 1037269
33497 1037269 992809 1018474 1131997 1245066 1325565 1394181 1413349 1352733 1300755 1336548 1369626
33486 1369626 1290670 1189573 1218049 1325282 1351720 1302842 1296777 1316077 1259387 1180764 1222816
$$ packed form
33565A073805r1923p257L0339l912K7853J10818N1945j43562k07418l5855J37983
33554I42816J25627L3332L114j780k1461J1201P9663M8019p3057r0591M1108J26943
33542A224934O1055k6215l8895m6850o3900L954J02650M1154j43567j65699M6424
33531I95045K04141J16332m0937p2011m8547o6775l6412Q1279J14198k6555j51039
33520A068719r3952K5422L9083m958q26J1722j9036k5058J9420O920q9910j23541
33508H14005k2241Q0260Q6932Q0268J05913O1071p0446j22399k7310M9949J267
33497A037269m4460K5665J13523J13069Q0499O8616J9168o0616n1978L5793L3078
33486A369626p8956j01097K8476J07233K6438m8878o065J9300n6690p8623M2052
$$ plain form
33475 1222816 1346694 1372422 1267630 1172395 1159389 1179486 1213788 1273848 1289407 1196550 1089126
33464 1089126 1089141 1138706 1123602 1107397 1209412 1347441 1360477 1298399 1315242 1359159 1266111
33453 1266111 1094151 1050628 1130192 1141722 1069713 1090034 1230404 1325509 1320049 1320574 1336060
33442 1336060 1260231 1128243 1106793 1211333 1301389 1352026 1451246 1547502 1504609 1393151 1405936
33431 1405936 1494747 1435697 1255437 1217587 1354412 1404037 1283073 1224357 1332896 1395436
33421 1395436 1288186 1207939 1304710 1411542 1351627 1227622 1188827 1164329 1050594 952275
33411 952275 1017340 1191951 1320627 1359300 1354554 1340771 1359313 1448788 1547945 1547728 1471547 1437573
33399 1437573 1437115 1361116 1252722 1284609 1455671 1568656 1549125 1521111 1526633 1459379 1333832
$$ packed form
33475A222816J23878K5728j04792r5235j3006K0097L4302O0060J5559r2857j07424
33464A089126J5M9565j5104j6205J02015J38029J3036o2078J6843M3917r3048
33453A266111j71960m3523P9564J1530p2009K0321J40370R5105n460N25J5486
33442A336060p5829j31988k1450J04540R0056N0637R9220R6256m2893j11458J2785
33431A405936Q8811n9050j80260l7850J36825M9625j20964n8716J08539O2540
33421A395436j07250q0247R6771J06832n9915j24005l8795k4498j13735r8319
33411I52275O5065J74611J28676L8673m746j3783J8542Q9475R9157k17p6181l3974
33399A437573m58p5999j08394L1887J71062J12985j9531k8014N522o7254j25547
$$ plain form
33388 1333832 1316856 1412667 1421861 1305960 1278507 1419824 1519420 1445062 1362733 1422556 1509551
33377 1509551 1486429 1429121 1444132 1481753 1489500 1531689 1618978 1640822 1585459 1591213 1673645 1662737
33365 1662737 1522779 1455669 1561461 1683481 1722252 1798758 1953485 1998499 1854035 1731516
33355 1731516 1781812 1848435 1775601 1680142 1701363 1749794 1723693 1718096 1804994 1858401 1801380
33344 1801380 1765225 1806038 1751203 1544037 1434262 1571743 1713281 1621400 1467722 1519239
33334 1519239 1680241 1690772 1569710 1516275 1540415 1518904 1481025 1536598 1635653 1662929 1654387
33323 1654387 1690072 1709930 1654170 1630299 1724239 1813181 1779250 1725257 1761085 1777306 1666996
33312 1666996 1569542 1643394 1790241 1853286 1889648 1990676 2038697 1916381 1763055 1748117
$$ packed form
33388A333832j6976R5811R194j15901k7453J41317R9596p4358q2329N9823Q6995
33377A509551k3122n7308J5011L7621P747M2189Q7289K1844n5363N754Q2432j0908
33365A662737j39958o7110J05792J22020L8771P6506J54727M5014j44464j22519
33355A731516N0296O6623p2834r5459K1221M8431k6101n597Q6898N3407n7021
33344A801380l6155M0813n4835k07166j09775J37481J41538r1881j53678N1517
33334A519239J61002J0531j21062n3435K4140k1511l7879N5573R9055K7276q542
33323A654387L5685J9858n5760k3871R3940Q8942l3931n3993L5828J6221j10310
33312A666996r7454P3852J46847O3045L6362J01028M8021j22316j53326j4938
$$ plain form
33302 1748117 1781676 1723012 1672175 1762701 1865008 1804892 1691650 1717095 1806547 1786405 1726040
33291 1726040 1787317 1893539 1875710 1801511 1836143 1916388 1881257 1789005 1789618 1820612 1743708
33280 1743708 1644460 1681156 1776091 1769886 1733527 1808028 1893115 1829961 1730840 1774513 1838513
33269 1838513 1715417 1541911 1603371 1834364 1934798 1889257 1941905 2113428 2170173 2060390
33259 2060390 1986055 2029828 2061818 2024805 1995526 1974759 1912045 1896488 2028168 2169383 2131184
33248 2131184 2017067 2050029 2159304 2105507 1926369 1863503 1912559 1857459 1714283 1721856 1891707
33237 1891707 1973669 1895088 1852985 1934911 2009024 2025500 2080260 2147937 2089687 1954394 1940775
33226 1940775 2038766 2041125 1930365 1912819 2033820 2093245 1994842 1874180 1835942 1845553 1899912
$$ packed form
33302A748117L3559n8664n0837R0526J02307o0116j13242K5445Q9452k0142o0365
33291A726040O1277J06222j7829p4199L4632Q0245l5131r2252O13L0994p6904
33280A743708r9248L6696R4935o205l6359P4501Q5087o3154r9121M3673O4000
33269A838513j23096j73506O1460K30993J00434m5541N2648J71523N6745j09783
33259B060390p4335M3773L1990l7013k9279k0767o2714j5557J31680J41215l8199
33248B131184j14117L2962J09275n3797j79138o2866M9056n5100j43176P573J69851
33237A891707Q1962p8581m2103Q1926P4113J6476N4760O7677n8250j35293j3619
33226A940775R7991K359j10760j7546J21001N9425r8403j20662l8238R611N4359
$$ plain form
33215 1899912 2027948 2123821 2059137 1939505 1966851 2095398 2126593 2074308 2097174 2143747 2043455
33204 2043455 1892486 1945217 2154519 2233238 2155641 2171705 2318920 2355707 2214838 2099184
33194 2099184 2079850 2014582 1914864 1973617 2164898 2232839 2147738 2153982 2289132 2290076 2085667
33183 2085667 1957673 2074081 2255033 2340505 2414287 2523442 2537055 2427958 2363842 2397819
33173 2397819 2388642 2316959 2341832 2462057 2475816 2359692 2325097 2415887 2426554 2312203 2294610
33162 2294610 2450441 2569333 2537595 2501937 2545482 2559301 2530688 2596174 2722577 2704821 2553915
33151 2553915 2504171 2576055 2544480 2400783 2399505 2566038 2623583 2512383 2507189 2696791 2823988
33140 2823988 2775552 2748993 2796939 2709360 2501151 2492585 2723070 2816588 2635753 2527210 2681402
$$ packed form
33215A899912J28036R5873o4684j19632K7346J28547L1195n2285K2866M6573j00292
33204B043455j50969N2731K09302P8719p7597J6064J47215L6787j40869j15654
33194B099184j9334o5268r9718N8753J91281O7941q5101O244J35150R44k04409
33183B085667j27994J16408J80952Q5472P3782J09155J3613j09097o4116L3977
33173B397819r177p1683K4873J20225J3759j16124l4595R0790J0667j14351j7593
33162B294610J55831J18892l1738l5658M3545J3819k8613O5486J26403j7756j50906
33151B553915m9744P1884l1575j43697j278J66533N7545j11200n194J89602J27197
33140B823988m8436k6559M7946q7579k08209q566K30485R3518j80835j08543J54192
$$ plain form
33129 2681402 2802171 2692095 2617837 2769843 2885672 2768882 2685036 2858377 3036841 2952446
33119 2952446 2786482 2783950 2809627 2677587 2538881 2559788 2582798 2473971 2436285 2613020
33109 2613020 2754078 2647440 2509501 2571803 2659242 2572534 2511934 2696361 2911946 2877892
33099 2877892 2744755 2795502 2944161 2957814 2903556 2956770 3016913 2916308 2779988 2805823
33089 2805823 2912072 2939464 2959066 3059942 3095980 2958508 2824471 2834129 2826858 2694000 2649978
33078 2649978 2829684 2980528 2907410 2850587 3036460 3225472 3128216 2922021 2916676 3034100
33068 3034100 3061480 3104989 3337444 3583899 3602592 3506396 3489246 3429092 3187827 2997944
33058 2997944 3098351 3274409 3215688 3054383 3093733 3270620 3343152 3354416 3461818 3554797
$$ packed form
33129B681402J20769j10076p4258J52006J15829j16790q3846J73341J78464q4395
33119B952446j65964k532K5677j32040j38706K0907K3010j08827l7686J76735
33109B613020J41058j06638j37939O2302Q7439q6708o0600J84427K15585l4054
33099B877892j33137N0747J48659J3653n4258N3214O0143j00605j36320K5835
33089B805823J06249K7392J9602J00876L6038j37472j34037R658p271j32858m4022
33078B649978J79706J50844p3118n6823J85873J89012r7256k06195n345J17424
33068C034100K7380M3509K32455K46455J8693r6196j7150o0154k41265j89883
33058B997944J00407J76058n8721j61305L9350J76887P2532J1264J07402R2979
$$ plain form
33048 3554797 3475329 3370469 3417587 3470153 3372722 3317210 3470411 3583619 3421599 3239772
33038 3239772 3359190 3601984 3642631 3586734 3685413 3800768 3694778 3547629 3646531 3843264
33028 3843264 3851613 3795006 3925831 4094713 4041062 3919561 3994465 4108249 4002548 3858383
33018 3858383 3954224 4101617 3998301 3821702 3876780 3981594 3821447 3586296 3616136 3741741
33008 3741741 3643310 3533195 3776116 4141103 4165552 3981881 4036877 4252670 4229101 4044040
32998 4044040 4084461 4288233 4305000 4208629 4311323 4486559 4419780 4294143 4459530 4673620
32988 4673620 4484035 4119486 4148909 4480238 4580816 4482309 4636048 4937035 4858521 4460967
32978 4460967 4315431 4480650 4487751 4299045 4349256 4646825 4750005 4637536 4709088 4932011
$$ packed form
33048C554797p9468j04860M7118N2566r7431n5512J53201J13208j62020j81827
33038C239772J19418K42794M0647n5897R8679J15355j05990j47149R8902J96733
33028C843264Q349n6607J30825J68882n3651j21501P4904J13784j05701j44165
33018C858383R5841J47393j03316j76599N5078J04814j60147k35151K9840J25605
33008C741741r8431j10115K42921L64987K4449j83671N4996K15793k3569j85061
32998D044040M0421K03772J6767r6371J02694J75236o6779j25637J65387K14090
32988D673620j89585l64549K9423L31329J00578r8507J53739L00987p8514l97554
32978D460967j45536J65219P101j88706N0211K97569J03180j12469P1552K22923
$$ plain form
32968 4932011 4889491 4662133 4742690 5080138 5139861 4914210 4921445 5189166 5220528 5012188
32958 5012188 5101428 5512242 5653714 5392557 5248714 5385861 5377992 5133397 5089980 5325493
32948 5325493 5412704 5308020 5436733 5759273 5733127 5358135 5265315 5594045 5782475 5652617
32938 5652617 5677251 5964343 6020299 5765648 5750786 6098761 6256704 6062107 6027864 6301590
32928 6301590 6386686 6176648 6207801 6589349 6749433 6545475 6540954 6871974 6960873 6688404
32918 6688404 6692683 7126645 7297030 6963311 6807230 7139098 7331640 7067591 6964878 7376428
32908 7376428 7719502 7618361 7597820 7994721 8251420 7945696 7509013 7315024 7070186 6682349
32898 6682349 6682156 7191436 7515746 7329948 7213652 7481461 7607982 7361676 7331651 7742857
$$ packed form
32968D932011m2520k27358Q0557L37448N9723k25651P235K67721L1362k08340
32958E012188Q9240M10814J41472k61157j43843J37147p869k44595m3417K35513
32948E325493Q7211j04684J28713L22540k6146l74992r2820L28730J88430j29858
32938E652617K4634K87092N5956k54651j4862L47975J57943j94597l4243K73726
32928F301590Q5096k10038L1153L81548J60084k03958m521L31020Q8899k72469
32918F688404M279M33962J70385l33719j56081L31868J92542k64049j02713M11550
32908G376428L43074j01141k0541L96901K56699l05724m36683j93989k44838l87837
32898F682349j93N09280L24310j85798j16296K67809J26521k46306l0025M11206
$$ plain form
32888 7742857 7949165 7705682 7703571 8212091 8480699 8172546 8067910 8597823 9012921 8808884
32878 8808884 8643741 8997538 9256395 9009694 8925756 9426939 9818021 9648442 9599090 10090698
32868 10090698 10395709 10090332 9965245 10494173 10857749 10533101 10351684 10877710 11278513
32859 11278513 10974816 10834625 11479076 12004480 11718102 11524665 12173295 12756537 12458663
32850 12458663 12174529 12800450 13514073 13400670 13200360 13743100 14249783 13950517 13776824
32841 13776824 14610415 15468720 15327227 15101875 15848726 16679278 16556741 16461644 17524566
32832 17524566 18642878 18297374 17198702 16807989 16799344 16340632 16242726 17364241 18520035
32823 18520035 18481186 18357357 19460898 20675815 20649475 20595166 21981711 23502630 23500922
$$ packed form
32888G742857K06308k43483k111N08520K68608l08153j04636N29913M15098k04037
32878H808884j65143L53797K58857k46701q3938N01183L91082j69579m9352M91608
32868A0090698L05011l05377j25087N28928L63576l24648j81417N26026M00803
32859A1278513l03697j40191O44451N25404k86378j93437O48630N83242k97874
32850A2458663k84134O25921P13623j13403k00310N42740N06683k99266j73693
32841A3776824Q33591Q58305j41493k25352P46851Q30552j22537r5097J062922
32832A7524566J118312l45504j098672l90713q645m58712r7906J121515J155794
32823A8520035l8849j23829J103541J214917k6340n4309J386545J520919j708
$$ plain form
32814 23500922 23291588 24684193 26374156 26455168 26311757 28057192 30306442 30744881 30696556
32805 30696556 32589428 35099788 35717469 35910856 38445884 41787973 42895063 43356719
32797 43356719 46518957 50703483 52117479 52366305 55587815 60239574 62075751 63231821
32789 63231821 68908178 76897700 81231440 84627650 94513234 107601012 114099136 117910899
32781 117910899 131989860 146088306 121507275 36704715 -75030452 -153690354 -172681296
32774 -172681296 -155097399 -136654261 -131372276 -132195445 -126365230 -105286687 -72031115
32767 -72031115 -43447857 -35403930 -44075244 -51264804 -48458350 -44014578 -45295892 -47309637
32759 -47309637 -44180488 -39796513 -39510663 -40481878 -38074738 -34632828 -34351216 -35267523 -33496159
$$ packed form
32814B3500922k09334J392605J689963Q1012j43411J745435K249250M38439m8325
32805C0696556J892872K510360O17681J93387K535028L342089J107090M61656
32797D3356719L162238M184526J413996K48826L221510M651759J836177J156070
32789F3231821N676357P989522M333740L396210R885584J3087778O498124L811763
32781A17910899J4078961J4098446k4581031q4802560j11735167p8659902j8990942
32774a72681296J7583897J8443138N281985q23169N830215K1078543L3255572
32767g2031115K8583258Q043927q671314p189560K806454M443772j281314k013745
32759d7309637L129149M383975K85850r71215K407140L441910K81612r16307J771364
$$ plain form
32750 -33496159 -30621117 -30180817 -30851105 -29414603 -27047658 -26728471 -27378928 -26177899 -24102024
32741 -24102024 -23867125 -24630013 -23768171 -21936946 -21572511 -22123585 -21342651 -19772997 -19575767
32732 -19575767 -20242600 -19655184 -18225008 -17976554 -18557979 -18019657 -16661081 -16391792 -17019679
32723 -17019679 -16727982 -15613531 -15354880 -15887879 -15653140 -14709832 -14514559 -14983019 -14721132
32714 -14721132 -13838140 -13696825 -14174134 -13906089 -12982388 -12748161 -13166689 -12951025 -12115694
32705 -12115694 -11902491 -12330999 -12230250 -11565041 -11405395 -11724983 -11499311 -10847663 -10840199 -11314568
32695 -11314568 -11105301 -10323439 -10189717 -10683221 -10579429 -9815894 -9609335 -10135412 -10249590
32686 -10249590 -9683937 -9442366 -9783847 -9808981 -9321218 -9186322 -9546555 -9510284 -8922323 -8681742
$$ packed form
32750c3496159K875042M40300o70288J436502K366945L19187o50457J201029K075875
32741b4102024K34899p62888Q61842J831225L64435n51074P80934J569654J97230
32732a9575767o66833N87416J430176K48454n81425N38322J358576K69289o27887
32723a7019679K91697J114451K58651n32999K34739R43308J95273m68460K61887
32714a4721132Q82992J41315m77309K68045R23701K34227m18528K15664Q35331
32705a2115694K13203m28508J00749O65209J59646l19588K25672O51648P464m74369
32695a1314568K09267P81862J33722m93504J03792P63535K06559n26077j14178
32686a0249590N65653K41571l41481k5134M87763J34896l60233L6271N87961K40581
$$ plain form
32676 -8681742 -8996646 -9027120 -8557818 -8358668 -8587082 -8470915 -7895273 -7706510 -8104164 -8270006
32666 -8270006 -7921467 -7735206 -7917848 -7839917 -7403196 -7307227 -7637593 -7633029 -7175134 -7069320
32656 -7069320 -7504710 -7665829 -7251888 -6981554 -7181902 -7238218 -6877656 -6687104 -6911042 -6987950
32646 -6987950 -6709034 -6624055 -6894524 -6941600 -6616500 -6525228 -6813572 -6830058 -6386465 -6158830
32636 -6158830 -6424928 -6574000 -6290181 -6077645 -6193697 -6187623 -5908941 -5857625 -6134218 -6157768
32626 -6157768 -5812340 -5737627 -6090574 -6185824 -5790571 -5591571 -5899677 -6068747 -5729456 -5450571
32616 -5450571 -5609256 -5718494 -5464347 -5328282 -5571752 -5652074 -5266676 -4964247 -5105947 -5219796
32606 -5219796 -4997122 -4921517 -5267284 -5471116 -5175799 -4931104 -5160166 -5371643 -5121758 -4847567
$$ packed form
32676h681742l14904l0474M69302J99150k28414J16167N75642J88763l97654j65842
32666h270006L48539J86261j82642P7931M36721R5969l30366M564M57895J05814
32656g069320m35390j61119M13941K70334k00348n6316L60562J90552k23938p6908
32646f987950K78916Q4979k70469m7076L25100R1272k88344j6486M43593K27635
32636f158830k66098j49072K83819K12536j16052O074K78682N1316k76593k3550
32626f157768L45428P4713l52947r5250L95253J99000l08106j69070L39291K78885
32616e450571j58685j09238K54147J36065k43470q0322L85398L02429j41700j13849
32606e219796K22674P5605l45767k03832K95317K44695k29062k11477K49885K74191
$$ plain form
32596 -4847567 -4992422 -5167102 -4945945 -4686068 -4793840 -4941456 -4757526 -4566332 -4717370
32587 -4717370 -4886967 -4745064 -4617761 -4807360 -4954812 -4749133 -4563296 -4715622 -4820227
32578 -4820227 -4555583 -4346908 -4569549 -4800391 -4607335 -4369503 -4532907 -4743790 -4540968
32569 -4540968 -4256408 -4379154 -4625203 -4499373 -4230315 -4285912 -4464668 -4327040 -4072851 -4145693
32559 -4145693 -4376112 -4331532 -4134231 -4149551 -4235693 -4068765 -3849000 -3930769 -4104721 -3988379
32549 -3988379 -3778351 -3871887 -4082726 -3984104 -3715503 -3700120 -3848223 -3779852 -3580301 -3614462
32539 -3614462 -3821528 -3877654 -3833124 -3935556 -4058075 -3942536 -3765031 -3830827 -3967525 -3851215
32529 -3851215 -3658539 -3741683 -3928032 -3819483 -3538340 -3489998 -3609704 -3534066 -3321243 -3313139
$$ packed form
32596d847567j44855j74680K21157K59877j07772j47616J83930J91194j51038
32587d717370j69597J41903J27303j89599j47452K05679J85837j52326j04605
32578d820227K64644K08675k22641k30842J93056K37832j63404k10883K02822
32569d540968K84560j22746k46049J25830K69058n5597j78756J37628K54189p2842
32559d145693k30419M4580J97301j5320q6142J66928K19765q1769j73952J16342
32549c988379K10028r3536k10839R8622K68601J5383j48103O8371J99551l4161
32539c614462k07066n6126M4530j02432j22519J15539J77505o5796j36698J16310
32529c851215J92676q3144j86349J08549K81143M8342j19706P5638K12823Q104
$$ plain form
32519 -3313139 -3451617 -3405520 -3232624 -3264612 -3464988 -3526266 -3473652 -3562154 -3708645 -3631512
32509 -3631512 -3426152 -3408549 -3516292 -3449126 -3269165 -3273861 -3402683 -3357200 -3190285 -3197683 -3340274
32498 -3340274 -3341038 -3236023 -3268776 -3366525 -3284117 -3133919 -3204633 -3392105 -3384334 -3264119 -3334115
32487 -3334115 -3493948 -3418278 -3222804 -3299134 -3581447 -3638110 -3433121 -3339085 -3424869 -3387193
32477 -3387193 -3195414 -3160259 -3316671 -3347049 -3182945 -3114284 -3234434 -3311318 -3262455 -3243723
32467 -3243723 -3233554 -3041808 -2756919 -2675413 -2772797 -2753993 -2625194 -2677697 -2896737 -2946521
32457 -2946521 -2781914 -2719624 -2841037 -2871992 -2735964 -2690841 -2816110 -2875187 -2790482 -2763616
32447 -2763616 -2826528 -2759524 -2555341 -2486644 -2609286 -2664000 -2568356 -2542016 -2647088 -2671006 -2571114
$$ packed form
32519c313139j38478M6097J72896l1988k00376o1278N2614q8502j46491P7133
32509c631512K05360J7603j07743O7166J79961m696j28822M5483J66915p398j42591
32498c340274p64J05015l2753r7749Q2408J50198p0714j87472P771J20215o9996
32487c334115j59833P5670J95474p6330k82313n6663K04989R4036q5784L7676
32477c387193J91779L5155j56412l0378J64104O8661j20150p6884M8863J8732
32467c243723J0169J91746K84889Q1506r7384J8804J28799n2503k19040m9784
32457b946521J64607O2290j21413l0955J36028M5123j25269n9077Q4705K6866
32447b763616o2912O7004K04183O8697j22642n4714R5644K6340j05072k3918R9892
$$ plain form
32436 -2571114 -2573402 -2716415 -2751282 -2614824 -2558147 -2679088 -2754596 -2662783 -2561705 -2537110 -2475174
32425 -2475174 -2381173 -2418380 -2544881 -2524724 -2374656 -2370277 -2537634 -2596168 -2493685 -2515208 -2731545
32414 -2731545 -2819756 -2604865 -2339015 -2260926 -2286101 -2301525 -2366035 -2451887 -2380683 -2182791 -2142324
32403 -2142324 -2331993 -2481068 -2445961 -2416550 -2502593 -2519340 -2365441 -2233145 -2254737 -2292689
32393 -2292689 -2250048 -2239126 -2284718 -2219250 -2036311 -1991250 -2180177 -2362435 -2363541 -2314843 -2339725
32382 -2339725 -2347641 -2296922 -2320767 -2435907 -2457386 -2341887 -2278589 -2317423 -2270285 -2107774 -2067875
32371 -2067875 -2221900 -2320948 -2236677 -2168245 -2241725 -2294920 -2241397 -2253826 -2388125 -2416492 -2244950
32360 -2244950 -2112396 -2156281 -2165953 -2002393 -1881511 -1982297 -2132471 -2146944 -2135868 -2211848
$$ packed form
32436b571114k288j43013l4867J36458N6677j20941p5508R1813J01078K4595O1936
32425b475174R4001l7207j26501K0157J50068M379j67357n8534J02483k1523k16337
32414b731545q8211K14891K65850P8089k5175j5424o4510q5852P1204J97892M0467
32403b142324j89669j49075L5107K9411q6043j6747J53899J32296k1592l7952
32393b292689M2641J0922m5592O5468J82939M5061j88927j82258j106M8698k4882
32382b339725p916N0719k3845j15140k1479J15499O3298l8834M7138J62511L9899
32371b067875j54025r9048Q4271O8432p3480n3195N3523j2429j34299k8367J71542
32360b244950J32554m3885r672J63560J20882j00786j50174j4473J1076p5980
$$ plain form
32350 -2211848 -2224933 -2063581 -1909637 -1925813 -1979346 -1923479 -1862278 -1900548 -1931476 -1905700 -1996683
32339 -1996683 -2250950 -2389862 -2227550 -1990717 -1954982 -2045576 -2062229 -2023428 -2021162 -1993942 -1899287
32328 -1899287 -1865942 -1948422 -1986092 -1908292 -1891423 -2010030 -2053708 -1919791 -1852027 -2026089 -2223812
32317 -2223812 -2201650 -2073269 -2039617 -2041020 -1968780 -1929103 -2007148 -2056287 -1997267 -2019703 -2207317
32306 -2207317 -2298463 -2128534 -1963637 -2047964 -2165006 -2036411 -1827309 -1826251 -1918863 -1838891
32296 -1838891 -1691521 -1752070 -1942293 -1974441 -1861163 -1835045 -1890331 -1838769 -1721549 -1751017
32286 -1751017 -1909995 -1982520 -1922994 -1858996 -1800039 -1664726 -1523899 -1516175 -1597853 -1643947 -1688422
32275 -1688422 -1802494 -1876546 -1803493 -1727566 -1819316 -1962156 -1963706 -1906644 -1964528 -2043685 -1965400
$$ packed form
32350b211848j3085J61352J53944j6176n3533N5867O1201l8270l0928K5776r0983
32339a996683k54267j38912J62312K36833L5735r0594j6653L8801K266K7220R4655
32328a899287L3345q2480l7670P7800J6869j18607m3678J33917O7764j74062j97723
32317b223812K2162J28381L3652j403P2240L9677p8045m9139N9020k2436j87614
32306b207317r1146J69929J64897q4327j17042J28595K09102J058r2612P9972
32296a838891J47370o0549j90223l2148J13278K6118n5286N1562J17220k9468
32286a751017j58978p2525N9526O3998N8957J35313J40827P724q1678m6094m4475
32275a688422j14072p4052P3053P5927r1750j42840j550N7062n7884p9157P8285
$$ plain form
32264 -1965400 -1846350 -1914906 -2074411 -2042219 -1836164 -1737939 -1824825 -1899399 -1858418 -1806129 -1815574
32253 -1815574 -1853620 -1908832 -1956640 -1880766 -1664692 -1534529 -1653585 -1826829 -1795509 -1657395
32243 -1657395 -1667409 -1784076 -1781490 -1680451 -1686919 -1801380 -1861219 -1880342 -1976349 -2050889 -1928415
32232 -1928415 -1739329 -1771047 -1987731 -2086991 -1998290 -1936402 -1976287 -1959241 -1831993 -1721942
32222 -1721942 -1659984 -1559112 -1468123 -1520623 -1641120 -1626594 -1501730 -1465183 -1515731 -1482836 -1399359
32211 -1399359 -1465315 -1642516 -1672178 -1526274 -1463955 -1584830 -1688126 -1648780 -1593819 -1622204
32201 -1622204 -1662124 -1683894 -1759712 -1844634 -1783055 -1591857 -1464476 -1455205 -1435809 -1383229 -1406913
32190 -1406913 -1466459 -1386972 -1203755 -1166033 -1327458 -1449942 -1403470 -1358993 -1475953 -1669573
$$ packed form
32264a965400J19050o8556j59505L2192K06055R8225q6886p4574M0981N2289r445
32253a815574l8046n5212m7808P5874K16074J30163j19056j73244L1320J38114
32243a657395j0014j16667K586J01039o468j14461n9839j9123r6007p4540J22474
32232a928415J89086l1718k16684r9260Q8701O1888l9885J7046J27248J10051
32222a721942O1958J00872R0989n2500j20497J4526J24864L6547n0548L2895Q3477
32211a399359o5956j77201k9662J45904O2319j20875j03296L9346N4961k8385
32201a622204l9920k1770p5818q4922O1579J91198J27381R271J9396N2580k3684
32190a406913n9546P9487J83217L7722j61425j22484M6472M4477j16960j93620
$$ plain form
32180 -1669573 -1798763 -1848717 -1835269 -1741910 -1619595 -1554885 -1513095 -1410085 -1319386 -1374998 -1506020
32169 -1506020 -1535741 -1502620 -1581037 -1718628 -1689086 -1497489 -1385288 -1419570 -1427381 -1360253 -1363693
32158 -1363693 -1447553 -1453261 -1397914 -1477701 -1667199 -1699669 -1529862 -1428053 -1507908 -1552050 -1440932
32147 -1440932 -1368264 -1462090 -1554440 -1514947 -1479228 -1552647 -1598015 -1512528 -1429193 -1455832 -1480722
32136 -1480722 -1409538 -1339996 -1348475 -1356202 -1337421 -1393781 -1505762 -1499329 -1375368 -1361648 -1514615
32125 -1514615 -1601241 -1512342 -1437299 -1465724 -1393995 -1141054 -985625 -1129030 -1357688 -1418054
32115 -1418054 -1412989 -1527455 -1650355 -1594110 -1450652 -1408425 -1414034 -1317222 -1179066 -1153353 -1211946
32104 -1211946 -1243002 -1280211 -1402860 -1545433 -1614022 -1654436 -1726301 -1763493 -1718108 -1669286 -1648332
$$ packed form
32180a669573j29190m9954J3448R3359J22315O4710M1790J03010R0699n5612j31022
32169a506020k9721L3121p8417j37591K9542J91597J12201l4282p811O7128l440
32158a363693q3860n708N5347p9787j89498l2470J69807J01809p9855m4142J11118
32147a440932P2668r3826r2350L9493L5719p3419m5368Q5487Q3335k6639k4890
32136a480722P1184O9542q479p727J8781n6360j11981O433J23961J3720j52967
32125a514615q6626Q8899P5043k8425P1729K52941J55429j43405k28658o0366
32115a418054N065j14466j22900N6245J43458M2227n609R6812J38156K5713n8593
32104a211946l1056l7209j22649j42573o8589m0414p1865l7192M5385M8822K0954
$$ plain form
32093 -1648332 -1564067 -1438962 -1465201 -1660622 -1749254 -1585823 -1408004 -1428033 -1471189 -1311859
32083 -1311859 -1094576 -1084166 -1219415 -1260426 -1201092 -1198370 -1240104 -1208933 -1155198 -1202586 -1290087
32072 -1290087 -1288174 -1262161 -1349734 -1485129 -1508150 -1442634 -1416166 -1414016 -1359420 -1321292 -1391236
32061 -1391236 -1467678 -1411586 -1305830 -1313789 -1391331 -1384379 -1305085 -1273150 -1291943 -1309450 -1375460
32050 -1375460 -1508512 -1550172 -1398371 -1236855 -1270164 -1384258 -1357018 -1255704 -1304934 -1478195
32040 -1478195 -1550943 -1475677 -1388378 -1315845 -1187686 -1075130 -1109533 -1214894 -1217626 -1165816 -1236425
32029 -1236425 -1378474 -1369102 -1199349 -1088122 -1113732 -1133678 -1086379 -1085076 -1174736 -1249204 -1249093
32018 -1249093 -1227054 -1203287 -1155882 -1138584 -1205694 -1257919 -1176562 -1057632 -1081300 -1209039 -1262036
$$ packed form
32093a648332Q4265J25105k6239j95421q8632J63431J77819k0029m3156J59330
32083a311859K17283J0410j35249m1011N9334K722m1734L1171N3735m7388q7501
32072a290087J913K6013q7573j35395k3021O5516K6468K150N4596L8128o9944
32061a391236p6442N6092J05756p959p7542O952P9294L1935j8793j7507o6010
32050a375460j33052m1660J51801J61516l3309j14094K7240J01314m9230j73261
32040a478195p2748P5266Q7299P2533J28159J12556l4403j05361k732N1810p0609
32029a236425j42049R372J69753J11227k5610j9946M7299J303q9660p4468J11
32018a249093K2039K3767M7405J7298o7110n2225Q1357J18930k3668j27739n2997
$$ plain form
32007 -1262036 -1240225 -1287454 -1385531 -1376995 -1273012 -1245863 -1314647 -1321919 -1232920 -1181976 -1205138
31996 -1205138 -1195602 -1142910 -1151305 -1201913 -1160595 -1040324 -991821 -1021587 -996803 -943281 -1034391
31985 -1034391 -1242967 -1318803 -1190885 -1089371 -1161888 -1255250 -1211219 -1119691 -1125250 -1201248 -1266971
31974 -1266971 -1342470 -1445622 -1494109 -1434662 -1337850 -1275069 -1233359 -1214886 -1271188 -1375418 -1409906
31963 -1409906 -1340945 -1265414 -1242308 -1226905 -1202866 -1215890 -1242128 -1192487 -1086755 -1056565 -1136234
31952 -1136234 -1212064 -1211145 -1181243 -1164056 -1153486 -1185709 -1293052 -1371345 -1288945 -1122656 -1070932
31941 -1070932 -1137872 -1142748 -1047625 -1007865 -1065153 -1071347 -981074 -941165 -1003848 -1027843 -968810 -987847
31929 -987847 -1136548 -1207233 -1066369 -891590 -888048 -985659 -1017128 -1005602 -1064928 -1167671 -1216202
$$ packed form
32007a262036K1811m7229r8077Q536J03983K7149o8784p272Q8999N0944k3162
31996a205138R536N2692q395n0608M1318J20271M8503k9766K4784N3522r1110
31985a034391k08576p5836J27918J01514p2517r3362M4031R1528n559p5998o5723
31974a266971p5499j03152m8487N9447R6812O2781M1710J8473n6302j04230l4488
31963a409906O8961P5531K3106J5403K4039j3024k6238M9641J05732L0190p9669
31952a136234p5830R19K9902J7187J0570l2223j07343p8293Q2400J66289N1724
31941a070932o6940m876R5123L9760n7288o194R0273L9909o2683k3995N9033j9037
31929i87847j48701p0685J40864J74779L542r7611l1469J1526n9326j02743m8531
$$ plain form
31918 -1216202 -1223684 -1242087 -1217049 -1084075 -919774 -847817 -872626 -928356 -1004895 -1110203 -1195782
31907 -1195782 -1226431 -1240367 -1254491 -1211196 -1103838 -1041169 -1090807 -1165716 -1160512 -1096769 -1044436
31896 -1044436 -1006880 -975251 -991653 -1064812 -1116969 -1096133 -1049474 -1020942 -982155 -927659 -921517
31885 -921517 -980759 -1031409 -1047234 -1103892 -1220929 -1284488 -1218153 -1107751 -1061502 -1058254 -1027508
31874 -1027508 -975653 -940975 -914134 -882900 -873646 -889533 -893724 -893954 -943601 -1030311 -1081160 -1100604
31862 -1100604 -1163579 -1245651 -1221479 -1075065 -944095 -902595 -873942 -820811 -831717 -929661 -979442
31851 -979442 -900382 -811944 -848927 -968659 -1050838 -1064691 -1042110 -1002801 -982151 -1013293 -1031007
31840 -1031007 -937133 -798370 -796539 -931002 -981915 -850886 -716352 -737452 -822402 -831414 -802886
$$ packed form
31918a216202p482j8403K5038J32974J64301P1957k4809n5730p6539j05308q5579
31907a195782l0649j3936j4124M3295J07358O2669m9638p4909N204O3743N2333
31896a044436L7556L1629j6402p3159n2157K0836M6659K8532L8787N4496O142
31885i21517n9242n0650j5825n6658j17037o3559O6335J10402M6249L248L0746
31874a027508N1855L4678K6841L1234R254j5887m191k30m9647q6710n0849j9444
31862a100604o2975q2072K4172J46414J30970M1500K8653N3131j0906r7944m9781
31851i79442P9060Q8438l6983j19732q2179j3853K2581L9309K0650l1142j7714
31840a031007R3874J38763J831j34463n0913J31029J34534k1100q4950r012K8528
$$ plain form
31829 -802886 -816364 -819744 -769160 -774313 -921136 -1089204 -1121386 -1055051 -1023493 -1040669 -1038394 -1016885
31817 -1016885 -1015761 -1018840 -998808 -972101 -935412 -857944 -788935 -827057 -936541 -974492 -948442
31806 -948442 -1022716 -1199492 -1255673 -1110318 -981365 -1025296 -1096115 -1048430 -1006802 -1108311 -1230175
31795 -1230175 -1222749 -1182047 -1228626 -1235819 -1062484 -861282 -860454 -1004324 -1093682 -1119738 -1170208
31784 -1170208 -1166784 -1007603 -835725 -856054 -1000272 -1067764 -1075118 -1158821 -1252128 -1187923 -1030265
31773 -1030265 -979645 -1027171 -1017075 -968910 -1011483 -1075940 -998582 -867265 -910715 -1084348 -1127144
31762 -1127144 -1008941 -952421 -1006787 -975198 -806851 -696597 -722453 -726374 -644192 -626515 -724010
31751 -724010 -763947 -671416 -631482 -783551 -993999 -1075873 -1032341 -961128 -899411 -861563 -863199
$$ packed form
31829h02886j3478l380N0584n153j46823j68068l2182O6335L1558j7176K275K1509
31817a016885J124l079K0032K6707L6689P7468O9009l8122j09484l7951K6050
31806i48442p4274j76776n6181J45355J28953m3931p0819M7685M1628j01509j21864
31795a230175P426M0702m6579p193J73335K01202Q28j43870q9358k6056n0470
31784a170208L424J59181J71878k0329j44218o7492p354q3703r3307O4205J57658
31773a030265N0620m7526J0096M8165m2573o4457P7358J31317m3450j73633m2796
31762a127144J18203N6520n4366L1589J68347J10254k5856l921Q2182J7677r7495
31751g24010l9937R2531L9934j52069k10448q1874M3532P1213O1717L7848j636
$$ plain form
31740 -863199 -842427 -727668 -613327 -665736 -833874 -889720 -787151 -717896 -759807 -758097 -647845
31729 -647845 -599954 -704786 -781511 -679203 -536259 -550238 -683433 -785794 -844364 -923502
31719 -923502 -993190 -994509 -971307 -985996 -995986 -939804 -856856 -813392 -797835 -780225 -781865 -807477
31707 -807477 -809273 -788630 -822945 -922487 -977972 -924297 -841634 -818705 -823265 -779842 -680193 -561671
31695 -561671 -466502 -449338 -521232 -583989 -552617 -528775 -673123 -907603 -969118 -800422 -650097
31684 -650097 -702033 -839107 -889047 -878987 -894916 -886425 -784954 -660681 -599444 -560237 -502527
31673 -502527 -514147 -653619 -793784 -790315 -701802 -681153 -736273 -754035 -694231 -621177 -595358
31662 -595358 -642250 -767153 -907214 -941748 -840828 -729797 -728259 -809257 -886994 -940080 -971012
$$ packed form
31740h63199K0772J14759J14341n2409j68138n5846J02569O9255m1911J710J10252
31729f47845M7891j04832p6725J02308J42944j3979j33195j02361n8570p9138
31719i23502o9688j319K3202j4689r990N6182Q2948M3464J5557J7610j640k5612
31707h07477j796K0643l4315r9542n5485N3675Q2663K2929m560M3423R9649J18522
31695e61671R5169J7164p1894o2757L1372K3842j44348k34480o1515J68696J50325
31684f50097n1936j37074m9940J0060j5929Q491J01471J24273O1237L9207N7710
31673e02527j1620j39472j40165L469Q8513K0649n5120j7762N9804P3054K5819
31662e95358m6892j24903j40061l4534J00920J11031J538q0998p7737n3086l0932
$$ plain form
31651 -971012 -955629 -917000 -935872 -1005490 -1001557 -884392 -790625 -817574 -862126 -803154 -703997
31640 -703997 -683656 -712568 -700902 -681632 -730903 -792394 -759916 -674737 -669451 -754595 -818635 -815325
31628 -815325 -806876 -831284 -851221 -835840 -800027 -768032 -764569 -813973 -890964 -919899 -878261 -835733
31616 -835733 -833246 -810059 -727057 -667978 -716863 -813639 -838747 -778356 -707037 -667590 -663575 -711162
31604 -711162 -803353 -874694 -882994 -868417 -861991 -815522 -706087 -624700 -658992 -757783 -811482 -803614
31592 -803614 -789948 -791798 -800245 -821713 -835021 -775222 -645320 -564323 -610778 -698251 -706713 -661246
31580 -661246 -672687 -765477 -869231 -928489 -931375 -882620 -821593 -804074 -809305 -755529 -663999 -679589
31568 -679589 -838970 -957073 -872403 -683169 -591622 -617621 -629069 -578250 -543245 -582912 -692816
$$ packed form
31651i71012J5383L8629j8872o9618L933J17165R3767k6949m4552N8972R9157
31640g03997K0341k8912J1666J9270m9271o1491L2478Q5179N286q5144o4040L310
31628h15325Q449k4408j9937J5381L5813L1995L463m9404p6991k8935M1638M2528
31616h35733K487K3187Q3002N9079m8885r6776k5108O0391P1319L9447M015m7587
31604g11162r2191p1341q300J4577O426M6469J09435Q1387l4292r8791n3699P868
31592h03614J3666j850q447k1468j3308N9799J29902Q0997m6455q7473q462M5467
31580f61246j1441r2790j03754n9258k886M8755O1027J7519n231N3776R1530j5590
31568f79589j59381j18103Q4670J89234R1547k5999j1448N0819L5005l9667j09904
$$ plain form
31557 -692816 -861441 -1042013 -1114038 -998128 -778322 -615628 -585479 -671688 -832512 -979002
31547 -979002 -988234 -853289 -730811 -734492 -788433 -794559 -807597 -894764 -957998 -881090 -743383
31536 -743383 -692757 -701737 -651346 -571012 -579479 -653578 -675245 -659491 -716543 -822309 -845022 -779867
31524 -779867 -744330 -753613 -714356 -638648 -647444 -744817 -797133 -765635 -760447 -825398 -863878 -832390
31512 -832390 -824581 -891549 -938452 -880100 -770624 -705894 -701188 -722871 -754313 -789233 -826054 -875649
31500 -875649 -912257 -853858 -682861 -530887 -520952 -582803 -570444 -502950 -511932 -597568 -640695
31489 -640695 -636255 -698787 -828572 -887248 -835408 -787076 -786380 -736688 -610786 -530087 -556575 -592518
31477 -592518 -573495 -582353 -671368 -738047 -694366 -618290 -617538 -659818 -653493 -602657 -578720 -610943
$$ packed form
31557f92816j68625j80572p2025J15910K19806J62694L0149q6209j60824j46490
31547i79002r232J34945J22478l681n3941o126j3038q7167o3234P6908J37707
31536g43383N0626q980N0391Q0334q467p4099k1667J5754n7052j05766k2713O5155
31524g79867L5537r283L9257P5708q796r7373n2316L1498N188o4951l8480L1488
31512h32390P809o6968m6903N8352J09476O4730M706k1683l1442l4920l6821m9595
31500h75649l6608N8399J70997J51974R935o1851J2359O7494q982q5636m3127
31489f40695M440o2532j29785n8676N1840M8332O96M9692J25902Q0699k6488l5943
31477e92518J9023q858q9015o6679M3681P6076P52m2280O325N0836K3937l2223
$$ plain form
31465 -610943 -683176 -771065 -828524 -812736 -759895 -748935 -766722 -720211 -609424 -556397 -615126
31454 -615126 -686800 -686479 -663847 -683974 -712994 -711230 -729160 -810552 -885699 -858948 -745585 -647071
31442 -647071 -634984 -706202 -802536 -843514 -793392 -709813 -669350 -661168 -638734 -641216 -731560 -835537
31430 -835537 -810857 -689570 -670478 -822265 -971730 -963637 -865888 -816474 -812966 -773827 -697331
31419 -697331 -641576 -622965 -624940 -643000 -661449 -658127 -668198 -747379 -843918 -832706 -719631 -670759
31407 -670759 -771682 -895962 -894051 -783314 -664009 -574047 -523497 -553439 -654418 -726469 -715710
31396 -715710 -696562 -736134 -780731 -761504 -707249 -666843 -625999 -583894 -598924 -672139 -705247
31385 -705247 -666367 -669170 -781918 -889591 -870367 -785982 -759654 -777959 -761665 -732576 -751782
$$ packed form
31465f10943p2233q7889n7459J5788N2841J0960j7787M6511J10787N3027n8729
31454f15126p1674L21K2632k0127k9020J764j7930q1392p5147K6751J13363R8514
31442f47071J2087p1218r6334m0978N0122Q3579M0463Q182K2434k482r0344j03977
31430h35537K4680J21287J9092j51787j49465Q093R7749M9414L508L9139P6496
31419f97331N5755J8611j975j8060j8449L322j0071p9181r6539J1212J13075M8872
31407f70759j00923j24280J911J10737J19305Q9962N0550k9942j00979p2051J0759
31396g15710J9148l9572m4597J9227N4255M0406M0844M2105j5030p3215l3108
31385g05247L8880k803j12748j07673J9224Q4385K6328j8305J6294K9089j9206
$$ plain form
31374 -751782 -772847 -715631 -625508 -608465 -655764 -674223 -650131 -648235 -679061 -692917 -683416 -685468
31362 -685468 -690341 -662735 -625617 -642210 -725889 -826695 -881623 -843964 -721256 -616432 -643584
31351 -643584 -761215 -799761 -709502 -645337 -721371 -829116 -820740 -733792 -684948 -663647 -601420
31340 -601420 -545119 -577312 -638495 -614560 -551944 -603647 -783397 -936975 -953077 -868284 -771040
31329 -771040 -716859 -722833 -747405 -704591 -579669 -471502 -439780 -408356 -326904 -303552 -422500
31318 -422500 -551227 -525527 -427299 -453546 -581877 -615875 -527594 -490523 -560179 -582417 -479473
31307 -479473 -392688 -445778 -560620 -614392 -618851 -636910 -657188 -657327 -679995 -745127 -775559 -699414
31295 -699414 -557858 -443825 -398429 -418578 -493964 -582134 -612753 -570663 -524215 -532332 -572155
$$ packed form
31374g51782k1065N7216R0123J7043m7299j8459K4092J896l0826j3856R501k052
31362f85468m873K7606L7118j6593q3679j00806n4928L7659J22708J04824k7152
31351f43584j17631l8546R0259O4165p6034j07745Q376Q6948M8844K1301O2227
31340f01420N6301l2193o1183K3935O2616n1703j79750j53578j6102Q4793R7244
31329g71040N4181n974k4572M2814J24922J08167L1722L1424Q1452K3352j18948
31318d22500j28727K5700R8228k6247j28331l3998Q8281L7071o9656k2238J02944
31307d79473Q6785n3090j14842n3772m459j8059k0278j39k2668o5132l0432P6145
31295f99414J41556J14033M5396k0149p5386q8170l0619M2090M6448q117l9823
$$ plain form
31284 -572155 -589766 -576347 -566557 -594680 -663710 -733223 -753017 -738224 -768839 -865801 -928645 -875550
31272 -875550 -782514 -775905 -837913 -844442 -761678 -672446 -629676 -618414 -645852 -726029 -784225 -729369
31260 -729369 -626817 -640941 -782844 -872383 -791265 -624408 -499681 -434064 -404510 -432005 -508757
31249 -508757 -555437 -538740 -539645 -625819 -736618 -767217 -698845 -588094 -494247 -463902 -516230
31238 -516230 -600416 -637215 -631734 -662259 -733784 -749203 -667175 -574341 -540062 -514024 -450875 -429208
31226 -429208 -534703 -699801 -779320 -747081 -710543 -744760 -803084 -800018 -717585 -611586 -547825
31215 -547825 -547639 -584793 -626023 -659942 -677921 -658729 -606865 -574426 -594787 -624385 -608718 -570265
31203 -570265 -556734 -542164 -478951 -418173 -456371 -568312 -620615 -568677 -515852 -542408 -591863
$$ packed form
31284e72155j7611J3419R790k8123o9030o9513j9794J4793l0615r6962o2844N3095
31272h75550R3036O609o2008o529Q2764Q9232M2770J1262k7438q0177n8196N4856
31260g29369J02552j4124j41903q9539Q1118J66857J24727O5617K9554k7495p6752
31249e08757m6680J6697r05q6174j10799l0599O8372J10751R3847L0345n2328
31238e16230q4186l6799N481l0525p1525j5419Q2028R2834L4279K6038O3149K1667
31226d29208j05495j65098p9519L2239L6538l4217n8324L066Q2433J05999O3761
31215e47825J86l7154m1230l3919j7979J9192N1864L2439k0361k9598J5667L8453
31203e70265J3531J4570O3213O0778l8198j11941n2303N1938N2825k6556m9455
$$ plain form
31192 -591863 -577328 -502571 -425075 -381413 -394310 -476781 -587025 -645923 -630232 -588871 -560268
31181 -560268 -548790 -578078 -668575 -759594 -763098 -701459 -674152 -683859 -637013 -535721 -507984 -596695
31169 -596695 -675153 -642694 -557736 -499614 -447035 -385123 -383283 -453531 -473122 -381257 -324300 -451307
31157 -451307 -669036 -766513 -709204 -642859 -651629 -674937 -651207 -603807 -572528 -559428 -552033 -537324
31145 -537324 -509715 -511629 -611602 -781602 -873307 -805467 -697237 -701831 -776130 -753786 -605840
31134 -605840 -480234 -487627 -581937 -669548 -721022 -742918 -731821 -697675 -674170 -679063 -700662 -723573
31122 -723573 -730157 -692772 -609628 -526782 -479558 -446013 -411073 -428082 -536974 -659915 -677425
31111 -677425 -596046 -543907 -593119 -674637 -692891 -652701 -634564 -684700 -760026 -770048 -673131
$$ packed form
31192e91863J4535P4757P7496M3662j2897q2471j10244n8898J5691M1361K8603
31181e60268J1478k9288r0497r1019l504O1639K7307r707M6846J01292K7737q8711
31169e96695p8458L2459Q4958N8122N2579O1912J840p0248j9591R1865N6957j27007
31157d51307k17729r7477N7309O6345q770k3308K3730M7400L1279J3100P395J4709
31145e37324K7609j914r9973j70000r1705O7840J08230m594p4299K2344J47946
31134f05840J25606p393r4310q7611n1474k1896J1097L4146K3505m893k1599k2911
31122g23573o584L7385Q3144Q2846M7224L3545L4940j7009j08892j22941j7510
31111f77425Q1379N2139m9212q1518j8254M0190J8137n0136p5326j0022R6917
$$ plain form
31100 -673131 -541115 -502429 -595257 -709773 -712104 -589786 -431662 -308883 -240379 -237931 -297798
31089 -297798 -354283 -324987 -222513 -161434 -226270 -370328 -472007 -472201 -434283 -466800 -593727
31078 -593727 -718601 -734689 -650800 -568381 -549398 -565394 -570872 -551897 -493593 -384936 -280725
31067 -280725 -270031 -345619 -395685 -370519 -354901 -410263 -456981 -413922 -355611 -399404 -505977
31056 -505977 -538398 -484280 -472558 -571497 -701741 -769325 -772547 -746575 -698692 -638996 -600539
31045 -600539 -589691 -573357 -543397 -537875 -570049 -591474 -564274 -526736 -539892 -592378 -607978 -550721
31033 -550721 -483079 -492930 -581446 -664751 -688806 -686824 -691634 -657783 -549169 -457538 -518768 -712625
31021 -712625 -857778 -829548 -682280 -530200 -419250 -362958 -389397 -475007 -523162 -490821 -463092
$$ packed form
31100f73131J32016L8686r2828j14516k331J22318J58124J22779O8504K448n9867
31089b97798n6485K9296J02474O1079o4836j44058j01679j94L7918l2517j26927
31078e93727j24874j6088Q3889Q2419J8983j5996n478J8975N8304J08657J04211
31067b80725J0694p5588n0066K5166J5618n5362m6718M3059N8311m3793j06573
31056e05977l2421N4118J1722r8939j30244o7584l222K5972M7883N9696L8457
31045f00539J0848J6334K9960N522l2174k1425K7200L7538j3156n2486j5600N7257
31033e50721O7642r851q8516q3305k4055J982m810L3851J08614R1631o1230j93857
31021g12625j45153K8230J47268J52080J10950N6292k6439q5610m8155L2341K7729
$$ plain form
31010 -463092 -526400 -636614 -687087 -643460 -542549 -424712 -337691 -341095 -434107 -535526 -592355
30999 -592355 -639766 -703424 -732185 -691450 -629117 -580171 -508254 -416208 -397044 -481897 -558323
30988 -558323 -546187 -525954 -566825 -567898 -436276 -297953 -331248 -479536 -538633 -469966 -417321
30977 -417321 -447197 -477899 -457563 -426616 -404086 -379482 -408247 -546132 -698978 -713335 -614705
30966 -614705 -578995 -661154 -731236 -700038 -633865 -609618 -612472 -616708 -633541 -652366 -652288 -665533
30954 -665533 -702389 -654214 -441857 -218400 -209144 -366522 -425168 -310962 -229713 -297144 -361304
30943 -361304 -303388 -250665 -329735 -434271 -426791 -386978 -457538 -585226 -616204 -545996 -490558
30932 -490558 -488916 -501788 -537946 -621564 -683339 -631054 -499056 -408866 -408743 -447291 -468258 -446120
$$ packed form
31010d63092o3308j10214n0473M3627J00911J17837Q7021l404r3012j01419n6829
30999e92355m7411o3658k8761M0735O2333M8946P1917R2046J9164q4853p6426
30988e58323J2136K0233m0871j073J31622J38323l3295j48288n9097O8667N2645
30977d17321k9876l0702K0336L0947K2530K4604k8765j37885j52846j4357R8630
30966f14705L5710q2159p0082L1198O6173K4247k854m236j6833j8825P8j3245
30954f65533l6856M8175K12357K23457R256j57378n8646J14206Q1249o7431o4160
30943c61304N7916N2723p9070j04536P480L9813p0560j27688l0978P0208N5438
30932d90558J642j2872l6158q3618o1775N2285J31998R0190J23l8548k0967K2138
$$ plain form
30920 -446120 -372681 -288301 -278593 -367704 -466642 -489425 -456826 -427511 -406944 -391539 -416749 -484858
30908 -484858 -527865 -515761 -512748 -553417 -568073 -518825 -497046 -574245 -660593 -639385 -552598 -518354
30896 -518354 -541446 -545799 -530658 -550771 -588965 -587756 -572296 -609888 -674606 -677323 -609513 -541780
30884 -541780 -501435 -464645 -448235 -490669 -549779 -531805 -429133 -338246 -335708 -409756 -507062
30873 -507062 -575859 -573418 -497667 -404883 -353871 -361040 -437322 -595413 -766873 -806363 -669227
30862 -669227 -502977 -461975 -514278 -544187 -551261 -597126 -632001 -555415 -413712 -358363 -416713
30851 -416713 -472483 -475927 -501124 -569066 -583482 -502694 -434880 -485028 -606504 -670192 -608052
30840 -608052 -449193 -286542 -233447 -335863 -504486 -603955 -612117 -607952 -614568 -573893 -486776
$$ packed form
30920d46120P3439Q4380R708q9111r8938k2783L2599K9315K0567J5405k5210o8109
30908d84858m3007J2104L013m0669j4656M9248K1779p7199q6348K1208Q6787L4244
30896e18354k3092m353J5141k0113l8194J209J5460l7592o4718k717O7810O7733
30884e41780M0345L6790J6410m2434n9110J7974J02672R0887K538p4048r7306
30873e07062o8797K441P5751R2784N1012p169p6282j58091j71460l9490J37136
30862f69227J66250M1002n2303k9909p074m5865l4875P6586J41703N5349n8350
30851d16713n5770l444k5197o7942j4416Q0788O7814n0148j21476o3688O2140
30840f08052J58859J62651N3095j02416j68623r9469q162M165o616M0675Q7117
$$ plain form
30829 -486776 -443823 -475835 -497257 -453607 -409061 -420464 -435084 -398562 -368577 -421248 -516232
30818 -516232 -557451 -537898 -524980 -534617 -515888 -450171 -385339 -370384 -416846 -520345 -658635
30807 -658635 -766016 -771948 -684660 -589920 -546350 -527146 -495877 -490172 -562655 -658908 -647550 -505752
30795 -505752 -389282 -437778 -570482 -590669 -467959 -375450 -423060 -502994 -477408 -388665 -363076
30784 -363076 -401335 -408083 -374736 -384695 -453188 -496233 -468301 -421449 -413081 -445077 -500877 -557874
30772 -557874 -564983 -498975 -440927 -497632 -642127 -734288 -709981 -640729 -584163 -494137 -331370
30761 -331370 -161867 -75416 -78050 -127999 -217621 -355606 -509310 -620604 -659525 -638200 -599970
30750 -599970 -602199 -664905 -730025 -723391 -656762 -600955 -559801 -466369 -327824 -267100 -357631 -501194
$$ packed form
30829d86776M2953l2012k1422M3650M4546j1403j4620L6522K9985n2671r4984
30818e16232m1219J9553J2918r637J8729O5717O4832J4955m6462j03499j38290
30807f58635j07381n932Q7288R4740M3570J9204L1269N705p2483r6253J1358J41798
30795e05752J16470m8496j32704k0187J22710R2509m7610p9934K5586Q8743K5589
30784c63076l8259o748L3347r959o8493m3045K7932M6852Q368l1996n5800n6997
30772e57874p109O6008N8048n6705j44495r2161K4307O9252N6566R0026J62767
30761c31370J69503Q6451k634m9949q9622j37985j53704j11294l8921K1325L8230
30750e99970k229o2706o5120O634O6629N5807M1154R3432J38545O0724r0531j43563
$$ plain form
30738 -501194 -548886 -483143 -398666 -348540 -299552 -223406 -149150 -113892 -119526 -158137 -241077 -375266
30726 -375266 -525525 -626131 -639826 -596735 -558513 -547615 -539252 -522557 -518405 -514200 -445260 -297314
30714 -297314 -172716 -176798 -277914 -366204 -414090 -471579 -527152 -507323 -427896 -411129 -503959
30703 -503959 -596048 -585884 -526339 -519350 -547324 -512638 -401039 -308047 -312985 -397714 -490264 -539415
30691 -539415 -544682 -545735 -581475 -640597 -661529 -595571 -460200 -324818 -257969 -283973 -365951
30680 -365951 -432502 -441373 -405679 -343110 -244669 -137798 -119404 -235502 -369812 -370152 -269734
30669 -269734 -248222 -360837 -454708 -408852 -316097 -328186 -426386 -467324 -398323 -312872 -311354
30658 -311354 -391428 -473262 -480384 -402023 -305107 -267161 -285787 -291676 -254584 -214672 -199302 -189088
$$ packed form
30738e01194m7692O5743Q4477N0126M8988P6146P4256L5258n634l8611q2940j34189
30726c75266j50259j00606j3695M3091L8222J0898Q363J6695M152M205O8940J47946
30714b97314J24598m082j01116q8290m7886n7489n5573J9829P9427J6767r2830
30703e03959r2089J0164N9545O989k7974L4686J11599R2992m938q4729r2550m9151
30691e39415n267j053l5740n9122k0932O5958J35371J35382O6849k6004q1978
30680c65951o6551q871L5694O2569R8441J06871J8394j16098j34310l40J00418
30669b69734K1512j12615r3871M5856R2755j2089r8200m0938O9001Q5451J518
30658c11354q0074q1834p122P8361R6916L7946j8626n889L7092L9912J5370J0214
$$ plain form
30646 -189088 -188977 -240561 -325063 -351915 -298243 -261108 -304918 -361139 -365182 -386095 -502986 -640326
30634 -640326 -663434 -577767 -493753 -438448 -352139 -252202 -244890 -355596 -478995 -531627 -545017
30623 -545017 -572551 -603563 -612428 -608396 -593278 -541660 -463290 -419410 -437059 -465266 -453466 -418606
30611 -418606 -398310 -391654 -386646 -395442 -415712 -402431 -334803 -281347 -335800 -491976 -631549 -648119
30599 -648119 -554648 -455895 -434576 -482013 -532281 -539589 -508040 -463507 -429486 -429308 -470267 -509222
30587 -509222 -478711 -383027 -329007 -406585 -561135 -646878 -602248 -509152 -467520 -474170 -460650
30576 -460650 -404781 -353671 -352547 -396457 -457194 -523578 -593500 -642306 -631558 -561484 -492754 -487388
30564 -487388 -532630 -554144 -510282 -441415 -409789 -419388 -421668 -383650 -325800 -300859 -347417 -447622
$$ packed form
30646a89088J11n1584q4502k6852N3672L7135m3810n6221m043k0913j16891j37340
30634f40326k3108Q5667Q4014N5305Q6309R9937P312j10706j23399n2632j3390
30623e45017k7534l1012q865M032J5118N1618P8370M3880j7649k8207J1800L4860
30611d18606K0296O656N008q796k0270J3281O7628N3456n4453j56176j39573j6570
30599f48119R3471R8753K1319m7437n0268p308L1549M4533L4021J78m0959l8955
30587e09222L0511R5684N4020p7578j54550q5743M4630R3096M1632o650J3520
30576d60650N5869N1110J124m3910o0737o6384o9922m8806J0748P0074O8730N366
30564d87388m5242k1514M3862O8867L1626r599k280L8018N7850K4941m6558j00205
$$ plain form
30552 -447622 -520310 -486109 -364254 -275478 -310682 -417001 -460486 -393129 -304011 -292715 -343321
30541 -343321 -363788 -323941 -300283 -370329 -499457 -570694 -521313 -413319 -353973 -375495 -421323
30530 -421323 -432550 -409287 -385844 -379024 -377921 -371438 -371165 -400948 -459024 -500799 -484845 -433193
30518 -433193 -405442 -407195 -382143 -318352 -288507 -330419 -362439 -305025 -226036 -252088 -371346
30507 -371346 -450744 -437597 -411705 -426258 -433066 -403162 -391573 -421425 -419752 -344992 -277388 -295005
30495 -295005 -346043 -343110 -317591 -371120 -506899 -609303 -590857 -493167 -432838 -477173 -571965
30484 -571965 -592293 -491404 -380413 -396017 -507270 -556947 -497010 -448340 -486314 -516381 -453395
30473 -453395 -390548 -457128 -599478 -645336 -535834 -371907 -268903 -273433 -385436 -550923
$$ packed form
30552d47622p2688L4201J21855Q8776l5204j06319m3485O7357Q9118J1296n0606
30541c43321k0467L9847K3658p0046j29128p1237M9381J07994N9346k1522m5828
30530d21323j1227K3263K3443O820J103O483K73k9783n8076m1775J5954N1652
30518d33193K7751j753K5052O3791K9845m1912l2020N7414P8989k6052j19258
30507c71346p9398J3147K5892j4553o808K9904J1589k9852J673P4760O7604j7617
30495b95005n1038K933K5519n3529j35779j02404J8446R7690O0329m4335r4792
30484e71965k0328J00889J10991j5604j11253m9677N9937M8670l7974l0067O2986
30473d53395O2847o6580j42350m5858J09502J63927J03004m530j12003j65487
$$ plain form
30463 -550923 -655355 -623104 -510440 -427725 -403424 -397316 -397603 -415354 -426542 -410318 -404864 -443145
30451 -443145 -486943 -511049 -580121 -729018 -839855 -780963 -616329 -521421 -523853 -494074 -385563
30440 -385563 -312190 -357824 -458858 -522299 -536701 -519485 -464296 -391070 -358534 -383615 -421175
30429 -421175 -447259 -487146 -546003 -590486 -610404 -620772 -601261 -520658 -421712 -387397 -419002
30418 -419002 -441738 -430129 -425335 -430958 -409225 -388018 -444176 -554356 -587098 -485917 -352106
30407 -352106 -303016 -345089 -419972 -475648 -461013 -355142 -235524 -213286 -272925 -289267 -228035
30396 -228035 -194924 -244097 -286797 -262094 -255027 -345794 -463969 -503318 -478599 -454663 -411355
30385 -411355 -303337 -186291 -159806 -225853 -306761 -365399 -412876 -434005 -402070 -346924 -326015
$$ packed form
30463e50923j04432L2251J12664Q2715K4301O108k87j7751j1188J6224N454l8281
30451d43145m3798k4106o9072j48897j10837N8892J64634R4908k432K9779J08511
30440c85563P3373m5634j01034o3441j4402J7216N5189P3226L2536k5081l7560
30429d21175k6084l9887n8857m4483j9918j0368J9511Q0603R8946L4315l1605
30418d19002k2736J1609M794n623K1733K1207n6158j10180l2742J01181J33811
30407c52106M9090m2073p4883n5676J4635J05871J19618K2238n9639j6342O1232
30396b28035L3111m9173m2700K4703P067r0767j18175l9349K4719K3936M3308
30385d11355J08018J17046K6485o6047q0908n8638m7477k1129L1935N5146K0909
$$ plain form
30374 -326015 -343762 -367506 -399456 -459893 -513569 -486958 -370043 -254839 -252896 -382413 -538529
30363 -538529 -589493 -522760 -466918 -523582 -619797 -611118 -495330 -402976 -387568 -371608 -323047
30352 -323047 -327385 -421156 -498418 -471791 -403596 -381647 -377532 -331700 -277224 -269940 -285906 -294025
30340 -294025 -338247 -433281 -470465 -360702 -198221 -144202 -203229 -251370 -240636 -233167 -254280
30329 -254280 -247641 -184113 -113531 -97741 -157175 -268194 -359492 -352332 -261316 -196381 -206952 -212097
30317 -212097 -163122 -160656 -285781 -423375 -417136 -318091 -295945 -362885 -386075 -343159 -350194 -425881
30305 -425881 -437246 -327013 -210380 -182081 -192813 -190420 -228426 -342587 -452066 -483130 -481952
30294 -481952 -506519 -503675 -401855 -256728 -198631 -269704 -389585 -456890 -433648 -359617 -319254
$$ packed form
30374c26015j7747k3744l1950o0437n3676K6611J16915J15204J943j29517j56116
30363e38529n0964O6733N5842n6664r6215Q679J15788R2354J5408J5960M8561
30352c23047m338r3771p7262K6627O8195K1949M115M5832N4476P284j5966q119
30340b94025m4222r5034l7184J09763J62481N4019n9027m8141J0734P469k1113
30329b54280O639O3528P0582J5790n9434j11019r1298P160R1016O4935j0571n145
30317b12097M8975K466j25125j37594O239R9045K2146o6940k3190M2916p035p5687
30305d25881j1365J10233J16633K8299j0732K393l8006j14161j09479l1064J178
30294d81952k4567K844J01820J45127N8097p1073j19881o7305K3242P4031M0363
$$ plain form
30283 -319254 -360362 -426094 -415861 -323338 -244622 -235496 -249366 -248171 -276910 -369680 -466391 -493613
30271 -493613 -462259 -419488 -367339 -298199 -252269 -265057 -304550 -329841 -366156 -450360 -544918
30260 -544918 -582451 -563220 -537090 -520590 -502233 -494015 -497688 -455426 -331527 -220670 -259835
30249 -259835 -425279 -533200 -478232 -362014 -320810 -324459 -250835 -101282 -16926 -83246 -227107
30238 -227107 -339372 -410517 -485801 -550430 -543496 -468003 -410519 -435033 -506065 -540319 -503425
30227 -503425 -431272 -372959 -336561 -293686 -230162 -179353 -184504 -229638 -249081 -226938 -236997 -335357
30215 -335357 -461075 -518688 -523760 -567138 -649077 -667017 -585538 -497052 -467897 -441954 -368669
30204 -368669 -315820 -353651 -415989 -397236 -326287 -316587 -379328 -415116 -380393 -339579 -341110 -352560
$$ packed form
30283c19254m1108o5732J0233R2523P8716R126j3870J195k8739r2770r6711k7222
30271d93613L1354M2771N2149O9140M5930j2788l9493k5291l6315q4204r4558
30260e44918l7533J9231K6130J6500J8357Q218l673M2262J23899J10857l9165
30249b59835j65444j07921N4968J16218M1204l649P3624J49553Q4356o6320j43861
30238b27107j12265p1145p5284o4629O934P5493N7484k4514p1032l4254L6894
30227e03425P2153N8313L6398M2875O3524N0809n151m5134j9443K2143j0059r8360
30215c35357j25718n7613n072m3378q1939j7940Q1479Q8486K9155K5943P3285
30204c68669N2849l7831o2338J8753P0949R700o2741l5788L4723M0814j531j1450
$$ plain form
30192 -352560 -347024 -358013 -406226 -447331 -442842 -430941 -476263 -574849 -647058 -620350 -505800 -393837
30180 -393837 -368631 -421274 -463378 -432450 -356780 -308039 -326795 -403601 -484225 -485407 -376311
30169 -376311 -261055 -285064 -421768 -469535 -333879 -185119 -214015 -345372 -362280 -238250
30159 -238250 -150240 -187436 -244123 -223573 -172555 -161480 -176808 -194774 -240129 -306960 -323991
30148 -323991 -261734 -189400 -173610 -199519 -235020 -290378 -367134 -423737 -438287 -438802 -435073 -390020
30136 -390020 -293789 -198215 -145072 -124741 -128130 -164361 -202125 -175289 -82817 -11991 -30991 -122423
30124 -122423 -235814 -325303 -327339 -207085 -55555 -30052 -151219 -262893 -246727 -171927 -165201
30113 -165201 -233028 -298702 -334887 -367258 -401884 -429522 -462189 -504864 -529319 -519105 -494579
$$ packed form
30192c52560N536j0989m8213m1105M489J1901m5322r8586p2209K6708J14550J11963
30180c93837K5206n2643m2104L0928P5670M8741j8756p6806q0624j182J09096
30169c76311J15256k4009j36704m7767J35656J48760k8896j31357j6908J24030
30159b38250Q8010l7196n6687K0550N1018J1075j5328j7966m5355o6831j7031
30148c23991O2257P2334J5790k5909l5501n5358p6756n6603j4550n15L729M5053
30136c90020R6231R5574N3143K0331l389l6231l7764K6836R2472P0826j9000r1432
30124a22423j13391q9489k036J20254J51530K5503j21167j11674J6166P4800O726
30113a65201o7827o5674l6185l2371l4626k7638l2667m2675k4455J0214K4526
$$ plain form
30102 -494579 -464479 -416264 -380276 -417909 -506518 -532456 -456362 -387902 -421143 -489583 -481366 -421764
30090 -421764 -427933 -524157 -606187 -578188 -455185 -338149 -324934 -416893 -490269 -414867 -227342
30079 -227342 -111122 -164652 -277057 -292240 -206731 -126687 -108639 -134492 -183053 -235624 -255690
30068 -255690 -239314 -242654 -298126 -358136 -379030 -390570 -417942 -416479 -362820 -327933 -368629 -427192
30056 -427192 -437007 -443557 -506482 -564000 -530229 -459565 -463960 -514405 -483769 -363907 -281393 -296263
30044 -296263 -334232 -337176 -342172 -376701 -400410 -399994 -435850 -534248 -612873 -574501 -424378 -250772
30032 -250772 -127135 -65409 -38548 -26888 -50719 -147391 -300411 -422155 -443356 -392292 -346682
30021 -346682 -336450 -332613 -300073 -227403 -144714 -135594 -261331 -436177 -472689 -320558 -164029
$$ packed form
30102d94579L0100M8215L5988l7633q8609k5938P6094O8460l3241o8440Q217N9602
30090d21764o169r6224q2030K7999J23003J17036J3215r1959p3376P5402J87525
30079b27342J16220n3530j12405j5183Q5509Q0044J8048k5853m8561n2571k0066
30068b55690J6376l340n5472o0010k0894j1540k7372J463N3659L4887m0696n8563
30056d27192r815o550o2925n7518L3771P0664m395n0445L0636J19862Q2514j4870
30044b96263l7969k944m996l4529k3709M16l5856r8398p8625L8372J50123J73606
30032b50772J23637O1726K6861J1660k3831r6672j53020j21744k1201N1064M5610
30021c46682J0232L837L2540P2670Q2689R120j25737j74846l6512J52131J56529
$$ plain form
30010 -164029 -187807 -338673 -434967 -423930 -386073 -353469 -290990 -223809 -217565 -240616 -201549
29999 -201549 -126454 -145355 -281342 -397394 -391487 -320380 -285251 -299666 -315866 -299637 -247826
29988 -247826 -195975 -208125 -286311 -316162 -204450 -44947 -22388 -164225 -321646 -390171 -401051
29977 -401051 -388954 -333905 -267587 -276063 -344785 -352961 -281778 -273533 -404041 -544767 -553516 -472887
29965 -472887 -425538 -423810 -408544 -390796 -425289 -493526 -521617 -482686 -405836 -324076 -274052 -291984
29953 -291984 -348118 -346655 -253654 -158306 -142510 -167213 -167225 -175188 -242365 -300935 -238683 -91472
29941 -91472 -37168 -176977 -408737 -546273 -508507 -366265 -241987 -193685 -191706 -193068 -209730
29930 -209730 -273699 -357962 -394993 -377128 -371602 -416752 -466015 -459671 -393817 -296951 -202370 -165643
$$ packed form
30010a64029k3778j50866r6294J1037L7857L2604O2479O7181O244k3051L9067
29999b01549P5095j8901j35987j16052N907P1107L5129j4415j6200J6229N1811
29988b47826N1851j2150p8186k9851J11712J59503K2559j41837j57421o8525j0880
29977d01051J2097N5049O6318q476o8722q176P1183Q245j30508j40726q749Q0629
29965d72887M7349J728J5266J7748l4493o8237k8091L8931P6850Q1760N0024j7932
29953b91984n6134J463R3001R5348J5796k4703j2p963o7177n8570O2252J47211
29941i1472N4304j39809k31760j37536L7766J42242J24278M8302J979j362j6662
29930b09730o3969q4263l7031J7865N526m5150m9263O344O5854R6866R4581L6727
$$ plain form
29918 -165643 -234021 -362744 -433506 -396581 -325603 -292802 -269822 -206607 -131059 -99352 -107945
29907 -107945 -126007 -163834 -237244 -305461 -315781 -283697 -269370 -294493 -328521 -337957 -315412 -281174
29895 -281174 -276040 -322556 -383818 -402876 -383717 -372809 -362992 -301842 -206715 -169385 -214587 -258432
29883 -258432 -251936 -256682 -316593 -364592 -339323 -296944 -312578 -353811 -349515 -311673 -290667 -274662
29871 -274662 -232995 -202921 -234040 -292227 -309562 -288085 -274214 -277331 -288706 -325130 -377145 -377685
29859 -377685 -304343 -243946 -267583 -317987 -320485 -320580 -385317 -443467 -374810 -213685 -113295 -129308
29847 -129308 -177656 -194662 -206959 -244534 -302900 -389754 -502294 -570273 -530556 -442451 -416693
29836 -416693 -448696 -442020 -379029 -337312 -343904 -346290 -330816 -340888 -371719 -372962 -358805 -385493
$$ packed form
29918a65643o8378j28723p0762L6925P0978L2801K2980O3215P5548L1707q593
29907a07945j8062l7827p3410o8217j0320L2084J4327k5123l4028r436K2545L4238
29895b81174N134m6516o1262j9058J9159J0908R817O1150R5127L7330m5202m3845
29883b58432O496m746n9911m7999K5269M2379j5634m1233M296L7842K1006J6005
29871b74662M1667L0074l1119n8187j7335K1477J3871l117j1375l6424n2015n40
29859c77685P3342O0397k3637n0404k498r5o4737n8150O8657J61125J00390j6013
29847a29308m8348j7006j2297l7575n8366q6854j12540o7979L9717Q8105K5758
29836d16693l2003O676O2991M1717o592k386J5474j0072l0831j243J4157k6688
$$ plain form
29824 -385493 -420374 -378170 -293239 -293718 -378390 -390355 -267167 -152790 -183003 -308092 -417630
29813 -417630 -501835 -583911 -616411 -566011 -506573 -511781 -531566 -480536 -378391 -300510 -255254
29802 -255254 -212499 -194196 -233452 -294001 -327953 -363448 -435128 -478455 -408189 -268777 -187264
29791 -187264 -188591 -172109 -78402 25024 48958 -10483 -98908 -171349 -207029 -213978 -243590 -348335
29779 -348335 -497366 -580614 -531365 -411498 -338685 -349453 -371548 -327267 -229009 -155676 -155217
29768 -155217 -203059 -257497 -314148 -375614 -404022 -362728 -292580 -276885 -319645 -329748 -258550
29757 -258550 -186248 -215653 -327638 -407635 -388594 -304240 -217061 -159806 -147624 -183325 -231685
29746 -231685 -238508 -200424 -176080 -201389 -234437 -226492 -212872 -265726 -362912 -385246 -280123 -157669
$$ packed form
29824c85493l4881M2204Q4931m79q4672j1965J23188J14377l0213j25089j09538
29813d17630q4205q2076l2500N0400N9438n208j9785N1030J02145P7881M5256
29802b55254M2755J8303l9256o0549l3952l5495p1680m3327P0266J39412Q1513
29791a87264j327J6482R3707J03426K3934n9441q8425p2441l5680o949k9612j04745
29779c48335j49031q3248M9249J19867P2813j0768k2095M4281R8258P3333M59
29768a55217m7842n4438n6651o1466k8408M1294P0148J5695m2760j0103P1198
29757b58550P2302k9405j11985p9997J9041Q4354Q7179N7255J2182l5701m8360
29746b31685o823L8084K4344k5309l3048P945J3620n2854r7186k2334J05123J22454
$$ plain form
29734 -157669 -154487 -250175 -313566 -307763 -328454 -417060 -463323 -370053 -217284 -159226 -220088 -297544
29722 -297544 -323942 -313144 -276482 -210983 -166207 -209677 -312728 -369486 -345145 -312600 -327065
29711 -327065 -361252 -387368 -425355 -476264 -498646 -486615 -483969 -488712 -440497 -344066 -301199 -359789
$$ packed form
29734a57669L182r5688o3391N803k0691q8606m6263R3270J52769N8058o0862p7456
29722b97544k6398J0798L6662O5499M4776m3470j03051n6758K4341L2545j4465
29711c27065l4187k6116l7987n0909k2382J2031K646m743M8215R6431M2867n8590
$$ [...]
##END NTUPLES=NMR SPECTRUM
##END=
