##TITLE=31Pdec_LY-DiX-24
 CD3CN, 24 sc
 10.2.2021
##JCAMPDX= 6.0         $$ Bruker NMR JCAMP-DX V2.0
##DATA TYPE= NMR SPECTRUM
##DATA CLASS= NTUPLES
##ORIGIN= UXNMR, Bruker Analytische Messtechnik GmbH
##OWNER= root
$$ XWIN-NMR		Version 3.5
$$ Wed Feb 10 12:40:15 2021 Russian Standard Time (UT+4h)  she@DPX200
##.OBSERVE FREQUENCY= 81.013821
##.OBSERVE NUCLEUS= ^31P
##.ACQUISITION MODE= SIMULTANEOUS
##.ACQUISITION SCHEME= undefined
##.AVERAGES= 24
##.DIGITISER RES= 17
##SPECTROMETER/DATA SYSTEM= spect
##.PULSE SEQUENCE= zgpg30
##.SOLVENT NAME= CD3CN
##.SHIFT REFERENCE= (INTERNAL, CD3CN, 0, 182.463)
##AUDIT TRAIL= $$ (NUMBER, WHEN, WHO, WHERE, WHAT)
$$ ##TITLE= Audit trail, XWIN-NMR		Version 3.5
$$ ##JCAMPDX= 5.01
$$ ##ORIGIN= Bruker BioSpin GmbH
$$ ##OWNER= she
$$ F:/spectra/data/she/nmr/P31/1/pdata/1/auditp.txt
$$ ##AUDIT TRAIL=  $$ (NUMBER, WHEN, WHO, WHERE, WHAT)
(   1,<2021-02-10 12:39:02.01 +0400>,<she>,<DPX200>,
      <created by zg, POWCHK disabled, PULCHK disabled
       configuration hash MD5:
       00 E9 B6 7A A2 85 ED C7 34 08 36 98 17 FE 4E 26
       data hash MD5: 32K
       B8 35 99 AC D4 26 E9 4F 0C 01 F1 CD 9C 04 E6 11>)
(   2,<2021-02-10 12:39:05.14 +0400>,<she>,<DPX200>,
      <Start of raw data processing
       efp BC_mod = 2 LB = 1 FT_mod = 6 PKNL = 1 PHC0 = -1751.614 PHC1 = 85.40216 SI = 64K 
       data hash MD5: 64K
       9B E8 07 3D CD C6 AC F4 C9 1B A7 9C 43 94 4A 23>)
(   3,<2021-02-10 12:39:28.67 +0400>,<she>,<DPX200>,
      <pk PHC0 = 20.42019 PHC1 = -48 
       data hash MD5: 64K
       66 A6 62 6C 84 7B AC EA 1D DE 1F F2 77 7F 3D A5>)
(   4,<2021-02-10 12:39:33.12 +0400>,<she>,<DPX200>,
      <abs ABSG = 5 
       data hash MD5: 64K
       35 ED C0 76 67 B5 D6 1A C7 20 1B 65 AA 17 C7 C2>)
$$ ##END=
$$ 
$$ hash MD5
$$ 26 74 CA D0 14 25 8C C8 7E 21 5C 8B 1B 5D 58 5F
##$RELAX= 
##$RELAX= 
##$RELAX= 
##$RELAX= 
##$RELAX= 
##$RELAX= 
##$RELAX= 
##$RELAX= 
$$ Bruker specific parameters
$$ --------------------------
##$DU= <F:/spectra>
##$EXPNO= 1
##$NAME= <P31>
##$PROCNO= 1
##$TYPE= <nmr>
##$USER= <she>
##$AMP= (0..31)
100 100 100 100 100 100 100 100 100 100 100 100 100 100 100 100 100 100 
100 100 100 100 100 100 100 100 100 100 100 100 100 100 
##$AQSEQ= 0
##$AQ_mod= 1
##$AUNM= <au_zg>
##$AUTOPOS= <>
##$BF1= 81.014009
##$BF2= 200.13
##$BF3= 200.13
##$BF4= 200.13
##$BF5= 200.13
##$BF6= 200.13
##$BF7= 200.13
##$BF8= 200.13
##$BYTORDA= 1
##$CFDGTYP= 0
##$CFRGTYP= 5
##$CHEMSTR= <none>
##$CNST= (0..31)
1 1 145 1 1 1 1 1 1 1 1 1 1 1 1 1 1 1 1 1 1 1 1 1 1 1 1 1 1 1 1 1 
##$CPDPRG= <waltz16>
##$CPDPRG1= <>
##$CPDPRG2= <waltz16>
##$CPDPRG3= <>
##$CPDPRG4= <mlev>
##$CPDPRG5= <mlev>
##$CPDPRG6= <mlev>
##$CPDPRG7= <mlev>
##$CPDPRG8= <mlev>
##$CPDPRGB= <>
##$CPDPRGT= <>
##$D= (0..31)
0 1 0 0 0 0 0 0 0 0 0 0.03 2e-05 3e-06 0 0 0 0 0 0 0 0 0 0 0 0 0 0 0 0 
0 0 
##$DATE= 1612946341
##$DBL= (0..7)
120 120 120 11 120 120 24 19 
##$DBP= (0..7)
150 150 150 150 150 150 150 150 
##$DBP07= 0
##$DBPNAM0= <>
##$DBPNAM1= <>
##$DBPNAM2= <>
$$ [...]
##$SUBNAM3= <"">
##$SUBNAM4= <"">
##$SUBNAM5= <"">
##$SUBNAM6= <"">
##$SUBNAM7= <"">
##$SUBNAM8= <"">
##$SUBNAM9= <"">
##$SW= 369.568048894756
##$SWIBOX= (0..15)
0 1 3 0 0 0 0 0 0 0 0 0 0 0 0 0 
##$SW_h= 29940.119760479
##$TD= 32768
##$TD0= 1
##$TE= 0
##$TE2= 300
##$TE3= 300
##$TEG= 300
##$TL= (0..7)
0 120 53 12 22 120 120 120 
##$TP= (0..7)
150 150 150 150 150 150 150 150 
##$TP07= 0
##$TPNAME0= <>
##$TPNAME1= <>
##$TPNAME2= <>
##$TPNAME3= <>
##$TPNAME4= <>
##$TPNAME5= <>
##$TPNAME6= <>
##$TPNAME7= <>
##$TPOAL= (0..7)
0.5 0.5 0.5 0.5 0.5 0.5 0.5 0.5 
##$TPOFFS= (0..7)
0 0 0 0 0 0 0 0 
##$TUNHIN= 0
##$TUNHOUT= 0
##$TUNXOUT= 0
##$USERA1= <user>
##$USERA2= <user>
##$USERA3= <user>
##$USERA4= <user>
##$USERA5= <user>
##$V9= 5
##$VALIST= <valist>
##$VCLIST= <CCCCCCCCCCCCCCC>
##$VD= 0
##$VDLIST= <DDDDDDDDDDDDDDD>
##$VPLIST= <PPPPPPPPPPPPPPP>
##$VTLIST= <TTTTTTTTTTTTTTT>
##$WBST= 1024
##$WBSW= 4
##$XGAIN= (0..3)
0 0 0 0 
##$XL= 0
##$YL= 0
##$YMAX_a= 26444
##$YMIN_a= -52780
##$ZGOPTNS= <>
##$ZL1= 120
##$ZL2= 120
##$ZL3= 120
##$ZL4= 120
##$ABSF1= 182.463
##$ABSF2= -187.1042
##$ABSG= 5
##$ABSL= 3
##$ALPHA= 0
##$AQORDER= 0
##$ASSFAC= 0
##$ASSFACI= 0
##$ASSFACX= 0
##$ASSWID= 0
##$AUNMP= <proc_1d>
##$AZFE= 0.1
##$AZFW= 0.5
##$BCFW= 0
##$BC_mod= 2
##$BYTORDP= 0
##$COROFFS= 0
##$CY= -3
##$DATMOD= 1
##$DC= 0
##$DFILT= <>
##$DTYPP= 0
##$F1P= 0
##$F2P= 0
##$FCOR= 1
##$FTSIZE= 65536
##$FT_mod= 6
##$GAMMA= 0
##$GB= 0
##$INTBC= 1
##$INTSCL= 5.30512e-09
##$ISEN= 30
##$LB= 1
##$LEV0= 0
##$LPBIN= 0
##$MAXI= 10000
##$MC2= 0
##$MEAN= 0
##$ME_mod= 0
##$MI= 50
##$NCOEF= 0
##$NC_proc= -2
##$NLEV= 6
##$NOISF1= 182.463
##$NOISF2= 159.3651
##$NSP= 0
##$NTH_PI= 0
##$NZP= 0
##$OFFSET= 182.463
##$PC= 4
##$PHC0= -1731.194
##$PHC1= 37.40216
##$PH_mod= 1
##$PKNL= yes
##$PPARMOD= 0
##$PSCAL= 0
##$PSIGN= 0
##$REVERSE= no
##$SF= 81.014009
##$SI= 65536
##$SIGF1= 159.3651
##$SIGF2= -187.1042
##$SINO= 113.3802
##$SIOLD= 16384
##$SREGLST= <1H.CDCl3>
##$SSB= 0
##$STSI= 65536
##$STSR= 0
##$SW_p= 29940.119760479
##$SYMM= 0
##$S_DEV= 0
##$TDeff= 32768
##$TDoff= 0
##$TI= <>
##$TILT= no
##$TM1= 0
##$TM2= 0
##$TOPLEV= 0
##$USERP1= <user>
##$USERP2= <user>
##$USERP3= <user>
##$USERP4= <user>
##$USERP5= <user>
##$WDW= 1
##$XDIM= 65536
##$YMAX_p= 304770808
##$YMIN_p= -6120694
$$ End of Bruker specific parameters
$$ ---------------------------------
##NTUPLES= NMR SPECTRUM
##VAR_NAME=  FREQUENCY,     SPECTRUM/REAL,   SPECTRUM/IMAG
##SYMBOL=    X,             R,               I
##VAR_TYPE=  INDEPENDENT,   DEPENDENT,       DEPENDENT
##VAR_FORM=  AFFN,          ASDF,            ASDF
##VAR_DIM=   65536,         65536,           65536
##UNITS=     HZ,            ARBITRARY UNITS, ARBITRARY UNITS
##FACTOR=    0.456856943014862, 1,           1
##FIRST=     14782.0589164895, 0,            0
##LAST=      -15158.0608439895, 0,           0
##MIN=       -15158.0608439895, -6120694,    0
##MAX=       14782.0589164895, 304770808,    0
$$ Real data points
##PAGE= N=1
##DATA TABLE= (X++(R..R)), XYDATA
$$ [...]
36052a75611o2529q595M5802M7804K5573L3871O4004O6691L6336P834j0459k8670
36040D2051j8627M4217R0668K4475j03366j17615K9582J58438J01783o4970j45439
36029D1197q6288L793L7044K4510O633J0551M9954Q8975N1296o2583j34302q6062
36017e5282Q9J5487j6044k4773l6404q5495r0568J4017J11970O2975m9946m2749
36005a96723O0522P4157k8828q9364m8465r422K182Q1099J97875J72885j8734
35994A97184j57411j03340J0578K9766Q452M4756P7626J7530o8552o5918O896
35983b433O0393P1072M4120m3757j54752j63876l2944J06491J42920J25904J18682
35972B71820O5604o5817j62370j33047o3869n6590n1031L0547J00756N4205k3704
$$ plain form
36052 -175611 -238140 -246735 -200933 -153129 -127556 -93685 -29681 37010 73346 81180 70721 42051
36040 42051 23424 67641 158309 182784 79418 -38197 -8615 149823 251606 186636 41197
36029 41197 -45091 -41298 -4254 20256 26889 37440 87394 176369 227665 165082 30780 -55282
36017 -55282 -55193 -39706 -55750 -80523 -116927 -202422 -292990 -278973 -167003 -104028 -153974 -196723
36005 -196723 -136201 -62044 -90872 -180236 -228701 -238123 -235941 -154842 43033 215918 197184
35994 197184 39773 -63567 -52989 -23223 -14771 29985 107611 125141 56589 -9329 -2433
35983 -2433 57960 129032 173152 129395 -25357 -189233 -222177 -115686 27234 153138 271820
35972 271820 337424 271607 109237 -23810 -87679 -144269 -195300 -164753 -63997 -9792 -33496
35961c3496P181R7917J03440L2322O9Q494j8690m3035K6431J19474P6350q0094
35949B96363j56748q1766J3685K4138m779j0731o316J435L5587O1012P302r5966
35937H3216j36882q8997l0855N305N7557R9244M4630p7871j18992k7348P0256
35926a20737O4053P65l1250k4373N136O8550J27976R1340l5756j08447m1697N5500
35914E1060M3456m5111p6217j7980M0968L4034k1460p9225j00640n8492K7809
35903b01798Q1153M9315k2078m9310j7126K5406M7550N7494N9312M8561M4028
35892A22507O9214R8196O8632l3351j35261j51673q0826j991K2747J5039K8271
35881B1504N4561L3912m1877r5181o5550M222L4476K1119K0019M5673N4141J9282
$$ plain form
35961 -33496 -26315 71602 175042 207364 207433 215927 197237 154202 180633 300107 376457 296363
35949 296363 139615 57849 71534 95672 90893 80162 73846 75281 110868 171880 179182 83216
35937 83216 -53666 -142663 -173518 -168213 -110656 -11412 33218 -44653 -163645 -190993 -120737
35926 -120737 -56684 -55919 -87169 -111542 -106406 -37856 90120 181460 145704 37257 -4440 51060
35914 51060 94516 49405 -26812 -44792 -3824 30210 8750 -70475 -171115 -229607 -201798
35903 -201798 -120645 -71330 -93408 -142718 -159844 -134438 -86888 -29394 29918 78479 122507
35892 122507 191721 289917 358549 325198 189937 38264 -42562 -44553 -21806 -6767 21504
35881 21504 76065 109977 68100 -27081 -92631 -88409 -53933 -32814 -12795 32878 87019 106301
35869A06301l4461p4755q6512n9546j959M1100L5055J4259L4349P4289N7857k0546
35857H5431o9799l2202K9023K4111k8127k7071N7186J20789M9929j17740k08343
35846a16813j10716Q0629J74967J16390K6923J3220K8482j9260j05924j29488
35836d1590o4791J2643M2726M0368L6532K5720r111n5823p3573k9320N5662J02837
35824D2280N9909j7017k9148J4593N574q1568j27458m9743O5214R9815P2878O6037
35812A21366P4970N2400J8561L947m1072j44107j94422q5931Q2870J21876K3207
35801C3665n0954k8006Q895P200J1895K6994j3744r8953j20434m7956J6795L295
35789b51308m0869n9288n2696r812Q8848J71636J29433K700m0568M3725J09153
$$ plain form
35869 106301 71840 -2915 -89427 -148973 -150932 -109832 -74777 -60518 -26169 48120 105977 85431
35857 85431 15632 -16570 12453 36564 8437 -18634 38552 159341 209270 91530 -116813
35846 -116813 -227529 -146900 28067 144457 171380 184600 213082 193822 87898 -41590
35836 -41590 -106381 -93738 -51012 -10644 25888 51608 42497 -13326 -86899 -116219 -60557 42280
35824 42280 102189 85172 56024 70617 76191 -5377 -132835 -182578 -117364 -17549 55329 121366
35812 121366 196336 248736 267297 271244 230172 86065 -108357 -194288 -111418 10458 33665
35801 33665 -17289 -45295 -36400 -29200 -17305 9689 -4055 -103008 -223442 -271398 -254603 -251308
35789 -251308 -292177 -351465 -404161 -413973 -325125 -153489 -24056 -21356 -61924 -18199 90954
35778I0954N8259k1172l4672k8387o0003p6124l0245J1403n879j9652K1421M9374
35766d4723J3752l19P3834J30023M5978r6338j14463O215J05080P7862k2087r9406
35754G5408j14543o9289R343O7860P3480N0749K9617L40l4589k8931K3610M3648
35742A26703j8759q8192o8711J2673N5814L1995p840k7318k5525o71L5080M1219
35730F6468Q794j1768M656Q136l3532o5720l8254R448K4780K2595J8067k4460
35718a0790r0393p2652N8708J54289Q8519l6360m6654L2506M4925k6857o1257
35707C3984l1706l2387p2387n0139L8344O4006o114l0905O7951J59232J07761
35696B47640j2577n0674j9747m5873j28127j21677K2879J49485J03190m4749q8193
$$ plain form
35778 90954 149213 128041 93369 64982 4979 -71145 -101390 -89987 -95866 -115518 -94097 -44723
35766 -44723 -30971 -31290 42544 172567 218545 122207 7744 13959 119039 196901 174814 75408
35754 75408 -39135 -108424 -99081 -31221 42259 93008 122625 122965 88376 59445 83055 126703
35742 126703 107944 19752 -48959 -36286 19528 51523 43683 16365 -9160 -9831 25249 66468
35730 66468 75262 63494 68150 76286 42754 -22966 -61220 -51772 -26992 -4397 13670 -10790
35718 -10790 -101183 -173835 -115127 39162 127681 91321 44667 77173 122098 95241 33984
35707 33984 2278 -30109 -102496 -152635 -114291 -50285 -56399 -87304 -19353 139879 247640
35696 247640 235063 184389 164642 118769 -9358 -131035 -108156 41329 144519 99770 11577
35685A1577K7324J30266O8981p7354j26282n5286l254l5881o3053j4905M5072
35674i2795M2576L527k6714n8987q3056l6858O2684Q6713n911o9111P390J11090
35662e9452R2261M264k0665j3577p3591j29821m3377J11069J23887o314o5681
35651h0997K0169P8614m032j05254r0154j1451K5896L4298O2952Q1124M9725N590
35639F6480j0023j6112k8377k8223l2781q2623j30475p6853M9407R9060L6368
35628a54152k209N3910R2923L3532k6741J879L5630j4629o0132J0601J14266R2473
35616A77351l6064j16872r3329l9988r462O990J934l3561m9816o272M3326L8186
35604a17577K1516N0719P2447K3419k1824L1752J00964L6032j08124j27260L836
$$ plain form
35685 11577 38901 169167 238148 160794 34512 -20774 -24028 -59909 -122962 -137867 -92795
35674 -92795 -50219 -46692 -73406 -132393 -215449 -252307 -189623 -102910 -108821 -177932 -170542 -59452
35662 -59452 32809 37073 16408 2831 -70760 -200581 -243958 -132889 -9002 -15316 -80997
35651 -80997 -60828 17786 13754 -91500 -181654 -193105 -167209 -132911 -69959 11165 60890 66480
35639 66480 56457 40345 11968 -16255 -49036 -131659 -262134 -338987 -289580 -190520 -154152
35628 -154152 -156361 -102451 -9528 24004 -2737 -858 34772 20143 -39989 -29388 84878 177351
35616 177351 141287 24415 -68914 -108902 -118364 -111374 -109440 -143001 -192817 -199089 -155763 -117577
35604 -117577 -96061 -45342 27105 50524 28700 60452 161416 197448 89324 -37936 -34100
35593c4100Q0508n953j04686o2906L8983M6692j4309n346Q8806J47228J03699
35582B78616J8037l8092n9182n8470k9660J7769M5199L3589O033j5425l9062p1548
35570H7804r0404p4294l8124j1402K376J7133K8895K3680J2982J9196K6599Q02
35558E243l3792q766O0634M9775r2840k14847j38213P3421J78655R0701j8249
35547d8278Q945R9432J05584L4866j0879k5308p1453j24720j01336k4669j3862
35536a71678r2523j37610n5686R0404J73987J48487O2753o314q192M1517N9103
35525A04248j5062j15619j15470o925O5254j818j18100j18454J4779J33789J21132
35514e2246K2971l9907l3379k2897m5674m5109L0719J18025J01114k0680j13288
$$ plain form
35593 -34100 46408 40455 -64231 -127137 -88154 -41462 -55771 -61117 27689 174917 278616
35582 278616 296653 258561 199379 140909 111249 129018 174217 207806 213839 198414 159352 87804
35570 87804 -2600 -76894 -115018 -126420 -124044 -106911 -78016 -54336 -41354 -22158 4441 5243
35558 5243 -28549 -37315 23319 73094 -19746 -234593 -372806 -299385 -120730 -30029 -48278
35547 -48278 -39333 60099 165683 200549 189670 164362 92909 -31811 -133147 -157816 -171678
35536 -171678 -264201 -401811 -457497 -367093 -193106 -44619 18134 11820 3628 45145 104248
35525 104248 89186 -26433 -141903 -148828 -83574 -85392 -203492 -321946 -307167 -173378 -52246
35514 -52246 -29275 -69182 -102561 -125458 -171132 -216241 -185522 -67497 33617 12937 -100351
35503a00351q3723Q27K6474J095K2835J11429J67942J14273j022o6644l6448L1504
35491A88191M3968k7073j05693r3755m513L4499m5420j38838j07131J3384O4460
35480a77921J1797p767P8832J45179N9992r4486j31913k9664N5701K8145k9530
35469i1635q329O9685J09798Q1150K1447m2654j02047j20665o4274K7928O7887
35458e1709K7389l1503m7311k6136J074K9590N4269M5275j987l7276k8177j7704
35446h4206m5609n9516N402R2041Q2560j0538m4079L4161R6672M0715m1225j0867
35434E5511Q6020Q6752k9805j05433l7288Q2660J12510M1459m3269r4678j24991
35423B9448j26015o2331M9790J25716J07517L7915J395J2003P861l9850o9709
$$ plain form
35503 -100351 -184074 -183247 -156773 -155678 -132843 -21414 146528 260801 259779 193135 156687 188191
35491 188191 232159 205086 99393 5638 1125 35624 -9796 -148634 -255765 -242381 -177921
35480 -177921 -166124 -173891 -95059 50120 110112 15626 -116287 -145951 -90250 -62105 -91635
35469 -91635 -99964 -30279 79519 160669 182116 139462 37415 -83250 -147524 -119596 -51709
35458 -51709 -24320 -55823 -103134 -129270 -128196 -98606 -44337 938 -1049 -38325 -66502 -84206
35446 -84206 -129815 -189331 -183929 -91888 -9328 -19866 -63945 -29784 66888 107603 66378 55511
35434 55511 141531 228283 198478 93045 55757 138417 250927 292386 249117 154439 29448
35423 29448 -96567 -158898 -109108 16608 124125 162040 163435 175438 183299 143449 73740
35412G3740k2504N0893M4241n0716j22165q7420P611P2596Q5860O8143R033r6282
35400C3030j75258j39474j4241P7702P4717M2453N4845P9602L6106p2590j47626
35389a50734j12098J489R7524J26511J18393J09600P9512k644r4710j12194m8789
35378A1860K829k0190o8493p2731n0786n4316o6997m4886j4820k8198m2942K7414
35366d22256J45489J60402K5415j11758j02544J4601J00310J06975Q6939O6784
35356G0357K6313k1174l3604k2751l7645o1163k1412P2682J08623L0134p2657
35345C7703r9792q3121r8254j07845k3017J11564J42833L7678n3141j3359Q0019
35334f8732R5658L5849j8367n6941j07529j21492l9689O7078P5143O765n889M8639
$$ plain form
35412 73740 51236 102129 146370 95654 -26511 -113931 -106320 -33724 52136 120279 129312 33030
35400 33030 -142228 -281702 -295943 -218241 -143524 -101071 -46226 33376 69482 -3108 -150734
35389 -150734 -262832 -261343 -163819 -37308 81085 190685 270197 267553 172843 60649 11860
35378 11860 14689 -5501 -73994 -146725 -197511 -251827 -318824 -363710 -378530 -406728 -449670 -422256
35366 -422256 -276767 -116365 -90950 -202708 -305252 -290651 -190341 -83366 3573 70357
35356 70357 96670 75496 41892 19141 -18504 -79667 -101079 -28397 80226 110360 37703
35345 37703 -62089 -145210 -243464 -351309 -374326 -262762 -119929 -82251 -135392 -148751 -68732
35334 -68732 26926 62775 44408 -12533 -120062 -241554 -281243 -214165 -139022 -132257 -138146 -89507
35322h9507M4428m0264n8578N0888J32483N9562n2068l8263L9954J2380j01204
35311d0189j23629j5719P3204N8039K3240L5242L3521j7365k8833N5110J30474
35300A83095Q0895m1217j01406q0469o1317o6750m1161K0548N0037K5357N849
35289b6539J7468L066o2804j01160m7913K6106J6641l7607n124J17194J70412
35278F9740O5865p5842j03048m0892j839K0352J04073J94651J38723n7218j84445
35267A30120j14382L0716P7503L3648P434J2200j1034n3284n8965m3346o5589
35256e4979j11315j07355l4174O0719J32284J47304P4599m8459r7411j0166R8903
35245D9950Q3844k7955r6895q2698n2185j8988N8762J33853R5479l8933j13601
$$ plain form
35322 -89507 -45079 -85343 -143921 -93033 39450 99012 46944 8681 48635 61015 -40189
35311 -40189 -163818 -179537 -106333 -48294 -25054 10188 43709 26344 -2489 52621 183095
35300 183095 263990 222773 121367 40898 -20419 -87169 -128330 -107782 -57745 -32388 -26539
35289 -26539 -9071 -6005 -68809 -169969 -217882 -191776 -175135 -212742 -217866 -100672 69740
35278 69740 135605 59763 -43285 -84177 -86016 -65664 38409 233060 371783 314565 130120
35267 130120 15738 46454 123957 157605 165039 177239 166205 112921 53956 10610 -54979
35256 -54979 -166294 -273649 -307823 -247104 -114820 32484 107083 58624 -38787 -48953 49950
35245 49950 133794 105839 8944 -73754 -125939 -144927 -86165 47688 143167 104234 -9367
35234i367n6350K7531L1486q879r409K9575M8620J6065n2341j05801q4312K928
35222a70254M7450j8583r0305k8280J04384J14179j6716r2009p672J00892R4769
35211C7855K9079Q050P255l1787o6132m3016j3641l0302l5163K4743P4949L6685
35199a425k3957q722L7612J2996n2714n0739J2932L1966j6150m3489n366M1580
35187f5476M1602M120l7101n3735k2638L9426O5718K4715k3392j5713K1035L2074
35175A0635K1524M430m6566j16370j02048L0957J38535Q5946l5690m5977L9678
35164a4946N2055m3727j06638o3715K498L1824O2026R0715M9393l2055k2819P4671
35152G9282P9135p6209j89704p8530J34800K00843R3517j2535l8860o6294j21498
$$ plain form
35234 -9367 -65717 -38186 -6700 -15579 -24988 4587 53207 69272 16931 -88870 -173182 -170254
35222 -170254 -122804 -141387 -231692 -259972 -155588 -41409 -58125 -150134 -157806 -56914 37855
35211 37855 66934 74984 82239 50452 -15680 -58696 -72337 -102639 -137802 -113059 -38110 -1425
35199 -1425 -25382 -34104 3508 16504 -36210 -86949 -74017 -42051 -58201 -101690 -107056 -65476
35187 -65476 -23874 -19754 -56855 -110590 -133228 -93802 -28084 -3369 -26761 -42474 -21439 10635
35175 10635 32159 36589 -9977 -126347 -228395 -197438 -58903 27043 -8647 -54624 -14946
35164 -14946 37109 -6618 -113256 -176971 -174473 -142649 -80623 10092 59485 27430 4611 79282
35152 79282 158417 82208 -107496 -186026 -51226 149617 243134 230599 191739 125445 3947
35141C947j08948M96Q3156M5216l2194k4277M8965O7238q756r9578j29510r8575
35129b52820l5610L8088Q4271O4541J1796J2782P6837R8336J7115o1278j2243
35118D1815R8283R4128l9348j26921p3548O303P07k3678K3022O6744N13j02145
35106c4125r1236N193K5766n0607p5553Q864P3015J9698o3728n6705K1060P7289
35094a41069Q5592O9086K8838k8677n8304l9827j5113p135K5099Q9422R9745j680
35082A05977j25014j33969k9224O1923O1496K0459J9127N7881P3462L2250j8459
35071A25909k862P3926J01129o26j40303j45522r18J09733M9106q7270j12744
35060c0442O07J14187J16610K6617p1873j11322p1467J459K2314l0754p4146l5991
$$ plain form
35141 3947 -105001 -104505 -21349 23867 -8327 -32604 16361 83599 74843 -24735 -154245 -252820
35129 -252820 -288430 -250342 -166071 -101530 -89734 -76952 -115 98221 115336 54058 41815
35118 41815 140098 234226 194878 67957 -5591 712 1419 -22259 763 67507 68020 -34125
35106 -34125 -125361 -120168 -94402 -145009 -220562 -211698 -138683 -118985 -182713 -239418 -218358 -141069
35094 -141069 -55477 13609 42447 13770 -44534 -84361 -99474 -106609 -81510 7912 107657 105977
35082 105977 -19037 -153006 -182230 -120307 -58811 -38352 -19225 38656 112118 144368 125909
35071 125909 123047 196973 298102 297476 157173 11651 10733 120466 169572 82302 -30442
35060 -30442 -29835 84352 200962 227579 155706 44384 -27083 -25624 -3310 -34064 -108210 -144201
35048a44201L5958N9639N0764O4143O0383k6771j21925p8670O9457J10614l1464
35037D7927j60021r1903O8795R8592j1013p2842r243N5226K2143l0504M709Q9401
35025A1267J03094J5633q4803j05871l9394M5181O3302p377r3015r5988j4486
35014b02457N1150K9440l4559n4285j6487K5897M2396N2678P4776Q7275N2763
35003A08587l1069j06684j01216j8571M3395K0633q433O2419J65311J15935r5408
34992A54899k33328j32341O4116J18719L2368j7308J6122J3668o1460r4342k6873
34981a65760M5170L9529K839j947O587M797K1658N8051N2955j1481o5595o0401
34969g3598k6548R921O4624J12204Q4088p357o0269m1840l1010o3152p3660m3256
$$ plain form
35048 -144201 -108243 -48604 2160 66303 126686 99915 -22010 -100680 -31223 79391 47927
35037 47927 -112094 -203997 -135202 -36610 -47623 -120465 -129708 -74482 -52339 -82843 -78134 11267
35025 11267 114361 129994 45191 -60680 -100074 -54893 8409 1032 -91983 -187971 -202457
35014 -202457 -151307 -121867 -156426 -210711 -227198 -201301 -158905 -106227 -31451 55824 108587
35003 108587 77518 -29166 -130382 -148953 -105558 -84925 -93358 -30939 134372 250307 154899
34992 154899 -78429 -210770 -146654 -27935 4433 -12875 3247 16915 -44545 -138887 -165760
34981 -165760 -120590 -81061 -78222 -80169 -73582 -68785 -47127 10924 63879 52398 -13197 -73598
34969 -73598 -100146 -90225 -25601 86603 170691 163334 103065 61225 30215 -32937 -106597 -149853
34957a49853m0901o3297q562J12694J35207J3680o6712P792Q2473J7477n0726
34946a0728L3881J28302K1943j64499j43330O4921J63933O0128l1399J5617O0930
34935A99699m501p5475o2005n2362j14931j47998o5252M4568P4269O0311O4948
34924g8729M0977n4125j29573q0625M7737J26226J04694L1137k6170j8557M8749
34913A1741Q6073J2129j00436r1190M4783J20941K4786j21649j46846m8386O1867
34902a46187J17647J12095N0311k5749m8325k3879l2001p8623o7686K5204Q4790
34891c2403L7949k9901k9955j0925m1787p6437m9371Q53J4563J7052L9244L9043
34879a22075N562K4175J19783J56630L5020j21854j33837k5495L9640J1030k8543
$$ plain form
34957 -149853 -190754 -254051 -262613 -149919 -14712 -1032 -67744 -59952 22521 39998 -10728
34946 -10728 23153 151455 173398 8899 -134431 -69510 94423 154551 123152 138769 199699
34935 199699 195198 119723 57718 5356 -109575 -257573 -322825 -278257 -203988 -143677 -78729
34924 -78729 -37752 -91877 -221450 -302075 -254338 -128112 -23418 7719 -18451 -37008 11741
34913 11741 97814 109943 9507 -81683 -36900 84041 108827 -12822 -159668 -208054 -146187
34902 -146187 -28540 83555 133866 108117 59792 35913 3912 -74711 -142397 -117193 -32403
34891 -32403 5546 -24355 -54310 -65235 -107022 -183459 -232830 -231977 -217414 -200362 -161118 -122075
34879 -122075 -116513 -92338 27445 184075 219095 97241 -36596 -62091 -22451 -11421 -39964
34868c9964l7784m5970m2142R942O5697M6624k1509m1070K911L5300J9569j4382
34856f2778m9947q5734p9720L799J07260J33663P1573j0555o2163o7819j5960
34845a18381O5357R4704M5200L564L2342N4372j3731r9264q3879k641K3173n704
34833d888Q560O9224Q9966O7734P8023J06261N6940n9151j13658o3649j3751m0380
34821A81231r2767j08557j00572q4932l4611N2540J28249J58292J34949M1283
34811B75105r4512j44283k3336J33040J08599p6305j75675p6071N9436P2375K7748
34800H6121L8271N7718N855m9271j3581L5151l7968j75884j87201l6595R7931
34789a79453Q1508j1735l9673J8113Q1436R8518P5070K0165n9166j19181r8540
$$ plain form
34868 -39964 -77748 -123718 -165860 -155918 -90221 -43597 -65106 -106176 -103265 -67965 -48396 -62778
34856 -62778 -112725 -198459 -278179 -274380 -167120 -33457 38116 27561 -34602 -102421 -118381
34845 -118381 -53024 41680 86880 90444 122786 177158 163427 64163 -19716 -22357 816 -4888
34833 -4888 3672 72896 162862 230596 308619 414880 471820 412669 299011 235362 221611 181231
34821 181231 88464 -20093 -120665 -205597 -240208 -187668 -59419 98873 233822 275105
34811 275105 180593 36310 12974 146014 254613 178308 2633 -73438 -14002 58373 86121
34800 86121 124392 182110 187965 138694 125113 160264 122296 -53588 -240789 -277384 -179453
34789 -179453 -97945 -109680 -149353 -131240 -49804 48714 123784 143949 84783 -34398 -132938
34778a32938M698J07634J18519L0657p0171q7901n865R2171R1571l5006j72174
34767e8805j67609j7576J09092Q3709j1211j6680N5246N4145m4436q4630J2869
34756h5886J09831O3141o2225j12468o4258J974N2636R3874R5072M8522L0206
34745A70419P6141Q3905k3386j29011q7980K2557J6580r5340j33175n6306j5201
34734a70797p4273j03909j0841J10989J38190P6129q600p8358r0193p029J00316
34723a18376R6674j5452p6386j4100M1743j9895j00897m9279J00157J77500J12601
34712A34290j147n2852l1616m46q520l7103k5054L8498P1641L184j05910j25962
34700a40997l3330O7337R2009N3651r073p4627r9972m4544M7155Q1200M4286N169
$$ plain form
34778 -132938 -128240 -20606 97913 128570 58399 -29502 -35367 56804 148375 113369 -58805
34767 -58805 -226414 -243990 -134898 -51189 -62400 -79080 -23834 30311 -14125 -98755 -85886
34756 -85886 23945 87086 24861 -87607 -151865 -149891 -97255 -3381 91691 140213 170419
34745 170419 246560 330465 307079 178068 90088 112645 129225 33885 -99290 -155596 -170797
34734 -170797 -245070 -348979 -359820 -248831 -110641 -34512 -43112 -121470 -211663 -218692 -118376
34723 -118376 -21702 -37154 -113540 -127640 -85897 -105792 -206689 -255968 -155811 21689 134290
34712 134290 133143 80291 48675 48229 39709 2606 -22448 16050 87691 90875 -15035 -140997
34700 -140997 -174327 -106990 -14981 38670 29597 -45030 -145002 -189546 -142391 -61191 -16905 -11736
34688a1736j0352l4374n0957q117N2857K3453q5568j26381l1024Q7680J09474
34677h5045N6236P088j6392j2431M1641J16777J15083K862j13272j09988O232
34666H791J16015J05224l9333j97202k02851m4163P9764J2666j17209p6608J11679
34655b43227K06481J24920L3510L8565M1007l1052q5229n6154j8324j4471J7227
34644A3253N7892j7206j75082j86937J0582J67960J01061l4258l9616N116m2861
34633a40096q5206K1956J54082J04724n1294q5132j071P239q2413j05847k8592
34622b91650Q197l7324m2804M1139J09487R3142M5267J1802k2728m8786l6817
34611a71075k1406m3944m5720L2820R8834L0202r5700r5883K4473Q3427K2276
$$ plain form
34688 -11736 -22088 -56462 -107419 -115536 -62679 -39226 -124794 -251175 -282199 -194519 -85045
34677 -85045 -28809 -21721 -38113 -50544 -8903 107874 222957 225819 112547 2559 8791
34666 8791 124806 230030 190697 -6505 -209356 -253519 -173755 -161089 -278298 -354906 -243227
34655 -243227 -36746 88174 121684 160249 201256 170204 84975 28821 10497 -3974 13253
34644 13253 71145 53939 -121143 -308080 -297498 -129538 -28477 -62735 -102351 -97235 -140096
34633 -140096 -225302 -203346 -49264 55460 4166 -80966 -82037 -74798 -157211 -263058 -291650
34622 -291650 -283453 -320777 -363581 -322442 -212955 -119813 -74546 -62744 -85472 -134258 -171075
34611 -171075 -192481 -236425 -282145 -249325 -150491 -120289 -215989 -311872 -287399 -203972 -181696
34600a81696k1077L4995R0993M8960m5864j02923r3497k2926Q3175J44260R4108
34589B8508o982m4272k1169k9964o9293m5178M6231R4391N1696p013k3276k2973
34577d9294k7553j7690K589J3033L8683R4675J04802R141r0006n2991N9798O0861
34565A46048o8020j50089r4927o329K3200L2051N2097L4735j6909n593R3829J65605
34553B05698J19932O371q9651j39867j26353l8351M7512K8613m5336j5385J19289
34542G2472J57975L804j65463j52693j8187M2529j3219o2361k7377L9845O5275
34531e7400M0697L401j1208M208K3910K1102O715P391J5280M603j5446j5829K830
34518C0254K7179O3455R4131N5179o3282j52213j18037k4246R574j3504j2877
$$ plain form
34600 -181696 -202773 -167778 -76785 -27825 -73689 -176612 -270109 -293035 -209860 -65600 28508
34589 28508 21526 -22746 -43915 -73879 -143172 -188350 -142119 -47728 3968 -3045 -26321 -49294
34577 -49294 -76847 -94537 -91948 -78915 -40232 54443 159245 168386 78380 25389 85187 146048
34565 146048 78028 -72061 -166988 -173317 -150117 -118066 -65969 -31234 -48143 -53736 40093 205698
34553 205698 325630 332001 242350 102483 -23870 -62221 -14709 13904 -31432 -46817 72472
34542 72472 230447 234251 68788 -83905 -102092 -59563 -72782 -135143 -162520 -122675 -57400
34531 -57400 -16703 -13302 -24510 -20302 3608 24710 31425 38816 54096 58699 43253 27424 30254
34518 30254 57433 120888 215019 270198 206916 54703 -63334 -87580 -78006 -91510 -104387
34507a04387J4838K8726O1670J42732J68507L8463j35927j59548m7944K0831J0032
34496C7993L9063J10161Q1070o3313j60391j35842q9003p2156k1881M5296J9376
34485b09627o1975j8187J51467K15741Q0940n4863l8097J7261j0838l4409K4761
34474F2174M4706o1557j41433n5624N8656J2181j11710r9371M8999J46943J06215
34463A0179k124r3791j14967k6223J13058J45748L4956m5540K3043J02136L0275
34452A76750r5357q2414L6600P5330r7n4450k2295K7231K9953k0526j12946j87451
34440b29672j39988K3426J38386J10769O2830J07420J34775J8075j18864q0044
34430B7113O6913R0833l4728j15297n5211L9428O8336M2833j3368r0887j29580
$$ plain form
34507 -104387 -89549 -60823 847 143579 312086 350549 214622 55074 7130 27961 37993
34496 37993 77056 187217 268287 204974 44583 -91259 -180262 -252418 -274299 -229003 -209627
34485 -209627 -271602 -289789 -138322 77419 158359 103496 65399 82660 71822 37413 62174
34474 62174 106880 45323 -96110 -151734 -93078 -80897 -192607 -291978 -242979 -96036 10179
34463 10179 8055 -85736 -200703 -226926 -113868 31880 66836 21296 44339 146475 176750
34452 176750 81393 -1021 35579 110909 110812 56362 34067 61298 91251 70725 -42221 -229672
34440 -229672 -369660 -346234 -207848 -97079 -34249 73171 207946 226021 107157 27113
34430 27113 94026 184859 150131 34834 -20377 19051 87387 130220 116852 25965 -103615
34419a03615q0968r802O675K0895J01689J61128Q2550n3970q1771j8229m647l5292
34407a5357Q314Q9077M4638j10744j73461p5200K2405J3652j450O3832J20854
34396a3440P1179k5804n6871q669O1878J10982J06228L4235n2386q1777o9409
34385G6146q4218j13952p8832K1060R3020R2745O4493L9065M498k3209j0793J6164
34373I6187R300j2298r279j4489o0639p4961J1492J09174Q6836j2390m8062k0836
34361F0035l6062p6661l5751M8741L0850o8557o4844Q1867J92893J53082M7518
34350C33111l3864j07692j52814p9582P3274J23456K0935o1959j2860N2055J6336
34339A70396l9392j0380L6353l155p8114q0955k8850q840k8807l9296k7294J489
$$ plain form
34419 -103615 -184583 -194385 -187710 -166815 -65126 96002 178552 124582 42811 24582 19935 -15357
34407 -15357 -7043 82034 126672 15928 -157533 -232733 -210328 -196676 -198126 -134294 -13440
34396 -13440 57739 31935 -24936 -33605 28273 139255 245483 279718 227332 145555 76146
34385 76146 -8072 -122024 -200856 -179796 -86776 5969 70462 109527 114025 90816 80023 96187
34373 96187 105487 93189 83910 69421 8782 -66179 -54687 54487 141323 128933 80871 60035
34361 60035 23973 -52688 -88439 -39698 -8848 -77405 -142249 -60382 132511 285593 333111
34350 333111 299247 191555 38741 -40841 32433 155889 176824 114865 102005 154060 170396
34339 170396 131004 120624 156977 153822 75708 -5247 -34097 -42937 -71744 -111040 -138334 -136845
34327a36845N2743Q8261L9793o1225q5848m305N3297R687l3794J2887N9861l474
34315h962j00006p4048O3566J47537Q3752m9701j14356n3486O3157J06069K9569
34304I3091n7477l6060L3744k218j25904j43949P192J43589J12593J2131M386
34293D1118O3354O2409j704l4147j6918j3231m4481p9220j02313j02283m2386
34282b69802O9594J40931J07319K8025j0054j6324m1152o4537l4819L1210P2393
34271A2784O7316K7070m5972j25716j42526o8438K0830L6571m942j4917M1906
34260a96034J01834P7504l4351j18099n0122J22393J89560N1296j09060p0366
34250c5445Q8072J02312o4036j75892j11581k3400l7801n5905J9051Q8894N5236
$$ plain form
34327 -136845 -84102 4159 43952 -17273 -103121 -107426 -54129 -44442 -78236 -65349 -5488 -8962
34315 -8962 -108968 -183016 -119450 28087 111839 62138 -52218 -105704 -42547 63522 93091
34304 93091 35614 -446 33298 31080 -94824 -238773 -231581 -87992 24601 36732 41118
34293 41118 104472 166881 165177 131030 114112 100881 56400 -22820 -125133 -227416 -269802
34282 -269802 -200208 -59277 48042 76067 66013 49689 8537 -56000 -90819 -59609 12784
34271 12784 80100 107170 61198 -64518 -207044 -275482 -254652 -218081 -223023 -237940 -196034
34260 -196034 -94200 -16696 -51047 -169146 -219268 -96875 92685 143981 34921 -35445
34250 -35445 52627 154939 90903 -84989 -196570 -219970 -257771 -313676 -294625 -205731 -150495
34239a50495P834M7477R6119N8665J1108M2781O3185l3033j40851r9683L0977
34228f5916O8823M524j6947L7939N5859o387n6368l0354K3876M4002K0412l6360
34216D3103j03133j27402p9062q07M6981N0338J1291p0420j37846r9215K7302
34205d38870J01654O4328K4008O1664R3131L5836l5223k8730N981J080O256N5767
34193e3118N3745l9975p3048N0271J47786L0891j49979j21411N7768Q3658r2662
34182a06074j88811m7088J42442J64739O4815j1510m8922r0391r0562O364J31431
34171g3567J59328P1300l2510o1839k5826L029q476j0138M5607J02209O8029k2552
34159B14594m4116O864k580r4126j12026q80O5997j5902p7652K6633J32112L4557
$$ plain form
34239 -150495 -142661 -95184 935 59600 70708 113489 176674 143641 2790 -96893 -65916
34228 -65916 2907 7431 -9516 28423 84282 77895 21527 -8827 15049 59051 79463 43103
34216 43103 -60030 -187432 -266494 -267301 -220320 -169982 -158691 -229111 -366957 -466172 -438870
34205 -438870 -337216 -272888 -248880 -187216 -94085 -58249 -93472 -122202 -116221 -115141 -108885 -53118
34193 -53118 627 -39348 -112396 -62125 85661 116552 -33427 -154838 -97070 -13412 -106074
34182 -106074 -294885 -341973 -199531 -34792 30023 18513 -30409 -120800 -211362 -204998 -73567
34171 -73567 85761 157061 124551 62712 36886 39915 31439 21301 66908 169117 237146 214594
34159 214594 170478 177342 174762 80636 -31390 -32270 33727 17825 -59827 -33194 98918 133475
34147A33475j33381j07358O2699J09934P715k4793N8945O6462n3992j01324L1398
34136D9780J79234J69147L3398j14752k13088k06620p3298O6911O2553l3898m3879
34125a24512L5332M6702j9201j2006O9145N5993n5319o5778N7746R7469k5380
34114F0191j00812j1611N6851l2054j14116m1232L6711l8605j16906N27J88836
34103a12220J90499K8757o4193k5643R962q591r85M4926M6020j4494o7693p8650
34091e2305n2612K5678J33693J65577P0381m8750r0805r9048j21583p9554N7007
34080i2321J20032j1780j58556q4831J12253J47814R034m4750P4252J59848Q1151
34069C12146k4838k8668j2517o5593j00907l5531K8699k3243j08610q2405K2554
$$ plain form
34147 133475 94 -107264 -44565 65369 73084 48291 107236 173698 119706 18382 49780
34136 49780 229014 398161 431559 316807 103719 -102901 -176199 -109288 -46735 -80633 -124512
34125 -124512 -89180 -42478 -61679 -73685 -4540 51453 -3866 -69644 -11898 85571 60191
34114 60191 -40621 -52232 4619 -27435 -141551 -182783 -146072 -184677 -301583 -301056 -112220
34103 -112220 78279 107036 42843 17200 27162 18571 17586 62512 108532 94038 26345 -52305
34091 -52305 -104917 -79239 54454 220031 290412 241662 150857 51809 -69774 -149328 -92321
34080 -92321 27711 15931 -142625 -227456 -115203 32611 41645 -3105 71147 230995 312146
34069 312146 287308 258640 246123 180530 79623 44092 72791 49548 -59062 -141467 -118913
34058a18913O6425L7606L8844P7400M8159o4333j26416n0844O8715R3580K7287
34047I7510j9113R57K5832K214m0937n5548m3368k4175J1768O8393R7952N1219
34035A72704m1667r4727o5248J3528Q5927J11830O6842l3900j14183r9904j2517
34024a1315N0566L4215k2071n0533k7183K1454M2550Oo6638n8899M8207J35016
34012I5375Q0881o2746j44557j21684p3545l7350K0457P2257L5050o0675p0953
34001b67490L5149J03971L1351p6879q0394j2860O637k9194l7845K96L4250M7090
33989b45918O2688P2596M3813j3232m8222l1518K6396R1028J14593P0251l491
33978A38984l9992l7400n0537q2063p0284r728J5570l3791p7720l6819M9750Q9699
$$ plain form
34058 -118913 -52488 -14882 23962 101362 149521 85188 -41228 -92072 -23357 70223 97510
34047 97510 78397 79354 105186 107400 66463 10915 -32453 -56628 -44860 23533 121485 172704
34035 172704 131037 36310 -28938 -15410 70517 182347 249189 215289 101106 1202 -11315
34024 -11315 39251 73466 51395 862 -26321 -4867 37683 37689 -28949 -87848 -39641 95375
34012 95375 176256 113510 -31047 -152731 -226276 -263626 -243169 -170912 -135862 -196537 -267490
34001 -267490 -232341 -128370 -97019 -173898 -254292 -267152 -260515 -289709 -327554 -327258 -293008 -245918
33989 -245918 -183230 -110634 -66821 -80053 -128275 -159793 -133397 -42369 72224 142475 138984
33978 138984 98992 61592 11055 -71008 -141292 -151020 -135450 -169241 -246961 -283780 -234030 -144331
33966a44331N9554P006j7170R492O8586R7873N4948j3159l2245j8493l8276o8996
33954c5211k8215O1405Q3039J6711l3345k4743k5733m8751j9254M2417J0710j01216
33942a02186j03015O0185J74748Q3131o5508o7323K2733L8440R41L3045R4911
33931A70102N2755o1350r3844l3987j5561o9306p5217K3160J24387J20448K2724
33920A64311q1308j11639m4597N2637P0061n138o2693m0510j7980n8661q7443
33909b22960l6172K0927J1902J0292P7481J06111J0382o9578J7193J38030O6121
33898A29729j25548j57975P025J22398O6635p720P376N285p7167r8653L0855J48730
33886E0970Q0382p6462j02420J1439P5970N877o7680r548J21031J53484L3919
$$ plain form
33966 -144331 -84777 -77771 -94941 -85449 -16863 81010 135958 122799 90554 72061 33785 -35211
33954 -35211 -63426 -2021 81018 97729 64384 39641 13908 -34843 -54097 -11680 -970 -102186
33942 -102186 -205201 -145016 29732 112863 47355 -19968 2765 41205 42146 75191 170102
33931 170102 222857 161507 67663 33676 18115 -51191 -126408 -103248 21139 141587 164311
33920 164311 83003 -28636 -73233 -20596 49465 44327 -18366 -58876 -76856 -135517 -222960
33909 -222960 -259132 -238205 -226303 -216011 -138530 -32419 -22037 -91615 -74422 63608 129729
33898 129729 4181 -153794 -146769 -24371 42264 34544 41920 47205 -29962 -128615 -97760 50970
33886 50970 131352 54890 -47530 -36091 39879 45756 -21924 -31472 89559 243043 276962
33875B76962j05916j20283l0462K9986J6944J1375M3222K3532p5694j18301q892
33864e7527J18242P9814p1502j25621k8138P3308P6911L7327J8332K553k0993
33853A02706k0238l006j6094m1048q177O9271R3179L2473l5961n7537o0690o5494
33841a0616l9694K1505O2493M6143j257l5131k4680M4554J32637J42311L8344
33830C76609o8421n5397L2442N2243k0723p5684m8875Q332M5483P3321R3099P4416
33818D86845K5574j608P355J6105R827J8789P0771J63754K67763L28568L17920
33807A711663K98354L60396M90399O26744Q39112J219605J527143J247190K35114
33798H555720r30039j515776j400507j008507o77175m42308l14202l38813l87275
$$ plain form
33875 276962 171046 50763 20301 50287 67231 78606 121828 145360 69666 -48635 -57527
33864 -57527 60715 140529 69027 -56594 -84732 -11424 65487 102814 121146 123699 102706
33853 102706 82468 79462 63368 22320 14143 83414 176593 209066 173105 115568 54878 -10616
33841 -10616 -50310 -28805 33688 79831 78574 43443 18763 63317 195954 338265 376609
33830 376609 308188 252791 285233 337476 316753 241069 192194 200526 246009 319330 412429 486845
33818 486845 512419 510811 518166 534271 544098 562887 633658 797412 1065175 1393743 1711663
33807 1711663 2010017 2370413 2860812 3487556 4326668 5546273 7073416 8320606 8555720
33798 8555720 7625681 6109905 4709398 3700891 3023716 2581408 2267206 1928393 1541118
33789A541118k59555m1375k8325k45500l70279k17266P955N5656l9370j10021
33779B93038j08382o9267n962M4038J9995m3875m7589l018j3305o5811m4964M0275
33767d827O2843K0406K9892O8906m526j45352j35025L6594J15089L746p3942L0864
33755D668J42456Q0309n0155q4352o8681r6049r1100K3897J32608J01530J341
33744I6472k8448O272L0549M5092N5615J0040o9427n9528M2527O3849n2611j17346
33732B3056q198J05730L9622j10019j47154p8156k8203j2169J6390K9489J3302
33721a56310M7216J36432J32665j5141j16642k9266R8291P4902k5966l0836L3059
33710A48404L6413m123r281k6922j08892j38592j6304J18606R0502j7986k0684
$$ plain form
33789 1541118 1281563 1240188 1211863 966363 596084 378818 386773 442429 403059 293038
33779 293038 184656 115389 109427 153465 173460 129585 81996 78978 65673 -138 -45102 -4827
33767 -4827 58016 78422 108314 177220 172694 27342 -107683 -71089 44000 47746 -26196 4668
33755 4668 147124 227433 177278 92926 24245 -71804 -162904 -139007 -6399 95131 96472
33744 96472 68024 74296 104845 149937 205552 215592 146165 86637 129164 193013 140402 23056
33732 23056 14858 120588 160210 50191 -96963 -175119 -203322 -215491 -199101 -169612 -156310
33721 -156310 -109094 27338 160003 144862 28220 -1046 97245 172147 146181 115345 148404
33710 148404 184817 180694 171413 144491 35599 -102993 -119297 -691 89811 71825 51141
33699E1141M8818K8918o2107p4719j146N0562P6289J27703J28897o930j52879
33688B14547j19239K9361O3349n0653j30557q9753k1935J0103M0615O0823K1506
33677B8167k9568j760O4329N6769n578j4419K1854L964n8158o0551J546L1147
33665C7742k166m6806q2146j00083m0068J00340J72486O7716q7320j11681m7589
33654a39575m9125r4189m6998O7975J04579N6864M0606N5054L384q1169o8703
33643a51297K4691N2854j2524n6620k7914K0425O2583R1424L7093j15182k06621
33632b81088j11878L2745L6972k4665K8481J26670P5451n4072k1172J46753J85365
33621A39562N0107l6180q513m4573j69562j67908O657J04954O015p9245P851J09499
$$ plain form
33699 51141 99959 128877 66770 -7949 -9095 41467 117756 245459 374356 367426 214547
33688 214547 95308 124669 188018 137365 6808 -82945 -104880 -94777 -54162 6661 28167
33677 28167 -1401 -3161 61168 117937 112359 97940 119794 123758 65600 5049 6595 37742
33665 37742 35576 -11230 -93376 -193459 -233527 -133187 39299 107015 19695 -91986 -139575
33654 -139575 -188700 -282889 -329887 -261912 -157333 -100469 -59863 -4809 -1425 -82594 -151297
33643 -151297 -126606 -73752 -86276 -142896 -170810 -150385 -87802 3622 40715 -74467 -281088
33632 -281088 -392966 -360221 -323249 -347914 -319433 -192763 -117312 -171384 -192556 -45803 139562
33621 139562 189669 153489 144976 100403 -69159 -237067 -230410 -125456 -119441 -198686 -190835 -81336
33609h1336O2013k2362K743M8524j1013q3072k5208R3349J09763K2078n3516p5236
33597a3273p4736n5428j7792o601l8941o2197m4349j8286j518K4342L9452J2836
33585b56491n81O4146J28496P2373l4133j9923P8769N8755q2257j07389N9312
33574c8923J84786R8762n2347p3831j0934j679l9244m9236m3237m7762k0694M2280
33562e2059N7835P229j2850K8783L7035j3689j7192M5572L8028p5307j25012k1956
33550a03583P1493J2641q3206n3658M2353N6666J419k0274q288j6693j8045K7904
33538i1271O6897M7599K9209O9578J04929N6017l8787r3093q2551j6694Q6362
33527A38195J43926O7178p3291j02534j1677J8914p1982j19220k6478O7551M5761
$$ plain form
33609 -81336 -19323 -41685 -38942 9582 -1431 -84503 -109711 -16362 93401 115479 61963 -13273
33597 -13273 -88009 -143437 -161229 -167830 -206771 -268968 -313317 -331603 -333121 -308779 -269327 -256491
33585 -256491 -257072 -192926 -64430 7943 -26190 -46113 32656 91411 9154 -98235 -38923
33574 -38923 145863 244625 192278 118447 107513 105834 66590 17354 -25883 -73645 -94339 -52059
33562 -52059 5776 13005 155 28938 65973 52284 35092 80664 118692 43385 -81627 -103583
33550 -103583 -32090 -19449 -102655 -156313 -113960 -57294 -55875 -76149 -84437 -101130 -119175 -91271
33538 -91271 -24374 23225 52434 122012 226941 282958 244171 151078 68527 51833 138195
33527 138195 282121 349299 276008 173474 161797 180711 108729 -10491 -36969 30582 76343
33516G6343K449K5382J9876p1501r9306L2220J40350L7065j45287j52813q20Q4779
33504e1263K0626p3995j04391q1419k4654M3545N7935M363j6943N3669J15523
33493e7004P3364O842K6408P7314N0404j9618l5411j8710m2931p4648m7385r148
33481g0523l5311p4985m0356K9703M6232K9897M6386O5180L1550l325K6248O1323
33469A12019K1549l3862n225O0373M0801n7090j12983p1120J9125R3096J00782
33458A67465J4199j01189j09125P549Q4637J0239r9539q7037O100L8371M485K084
33446f1761L6419K6037l6866p3368m3233J9311O8436P3980K7693k9948m6110l7456
33434g6866m8779l7308O2324J64351J13833m1267q5559J3954N0168n6526j16401
$$ plain form
33516 76343 78792 104174 124050 52549 -46757 -14537 125813 162878 17591 -135222 -136042 -51263
33504 -51263 -30637 -104632 -209023 -290442 -315096 -271551 -213616 -209253 -226196 -172527 -57004
33493 -57004 16360 23202 49610 126924 177328 157710 122299 103589 60658 -13990 -61375 -70523
33481 -70523 -105834 -180819 -221175 -191472 -145240 -115343 -68957 -3777 27773 24448 50696 112019
33469 112019 133568 99706 94481 154854 195655 138565 25582 -45538 -26413 66683 167465
33458 167465 181664 80475 -28650 -21101 63536 73775 -25764 -112801 -106701 -68330 -63845 -61761
33446 -61761 -25342 695 -36171 -109539 -152772 -133461 -65025 8955 36648 6700 -39410 -76866
33434 -76866 -125645 -162953 -100629 63722 177555 136288 50729 64683 114851 58325 -58076
33423e8076j9986O0799o873p3835L715R3330M0080m4270k36Q4015N8548m629J6025
33410A48607K3863j02935k20222j27272O7367R9054l3248r8872j7052P2494P7362
33399a10854M5033J6452j1958j6823N805n129m6700m774J28813J66691K0955j11493
33387G6018o0418L3195j6339j02208l6576R2823Q6620p129j3312L1687j8921j03517
33375c8077n3880Q2186J23679P1111N0687M2772m5163j32687q2076L2659M8281
33364I9492J207K3482O9542K6545l0056K0767Q0715L303j13191j03399m5593q0118
33352d7304r7697M2401J69649O5290j08266n8443J20058J23064j6477l3106M7041
33341B06210j1376j42678p5859J18450J10321q4703j23862L0180M5209j53111
$$ plain form
33423 -58076 -78062 -17263 -24136 -97971 -94256 -926 39154 -5116 -5352 78663 137211 132582 148607
33410 148607 172470 69535 -150687 -277959 -210592 -111538 -144786 -243658 -260710 -188216 -110854
33399 -110854 -65821 -49369 -61327 -78150 -72345 -77474 -124174 -128948 -135 166556 187511 76018
33387 76018 15600 48795 32456 -69752 -106328 -13505 73115 65986 52674 84361 65440 -38077
33375 -38077 -91957 -9771 113908 185019 235706 278478 233315 100628 18552 51211 99492
33364 99492 100699 124181 193723 220268 190212 210979 291694 294997 181806 78407 32814 -47304
33352 -47304 -145001 -102600 67049 132339 24073 -34370 85688 208752 192275 159169 206210
33341 206210 194834 52156 -23703 94747 205068 120365 -3497 26683 71892 -81219
33331h1219k31303l8773J53627J46891Q8281J06437R4036j043n1102l3748p9931
33320G2153j60318r6932O3148Q4374j4768J0851J37196Q5546j18792j27818R6121
33309C0761J76757n550r9549O5066J70137R763j35522l3417Q5011j0695j19692
33298A33070j3881J23280M5548j07089q3928M0838O2731K4892O9440J28497O3992
33287D87390o8571j41286j56650j40256m4319P9288N7173r9810j44177L613J04709
33276f2896J8295o6206k834N1609k6719p4253L2900J20823M2977m4556Q342O2411
33264E9893k0361r1719L955J32927J21345N1956N9542P0336j5136j06287j01902
33253A64549o2897l8590K8333Q8374j8603k19326k12986K6852J51341J7083o8589
$$ plain form
33331 -81219 -312522 -351295 -197668 -50777 37504 143941 237977 236934 185832 152084 72153
33320 72153 -88165 -185097 -121949 -37575 -52343 -41492 95704 181250 62458 -65360 30761
33309 30761 207518 201968 102419 167485 337622 347385 211863 178446 263457 252762 133070
33298 133070 119189 242469 288017 180928 97000 137838 200569 225461 294901 423398 487390
33287 487390 418819 277533 120883 -19373 -63692 15596 72769 -27041 -171218 -167605 -62896
33276 -62896 -44601 -110807 -113641 -62032 -88751 -163004 -130104 -9281 33696 -10860 -2518 59893
33264 59893 39532 -52187 -48232 84695 206040 257996 317538 387874 372738 266451 164549
33253 164549 101652 63062 91395 179769 161166 -58160 -271146 -244294 -92953 -75870 -144459
33242a44459Q6339K05577N5466j30862q3592N4087O1849L9929J07674Q9049j18460
33231B22597k37210p0661R9800l296j46294j3923K07010J66734l4553p9534q938
33220A01732n5609j41516m7275J18893J10346J2984N4396J31020P921j83164j39710
33209b9982N8766Q2237p5748j28457j7645M5392K194m093M4291L5903j669L6130
33197D7319Q1380J8156n6721l180P5460K6239m3562K2171R5417n992j46557j02520
33185G610K3828L279q8793l7007Q8711P5430k1390n804O9381K8723o2529l9891
33173D1548J6912m5205j16479l4682O5029j821q5440K3951J62182O9889j12346
33162a6462q6309P1918Q8682N13J3121N6094l9817j28472n918J34732K0546j56328
$$ plain form
33242 -144459 -58120 147457 202923 72061 -11531 42556 104405 144334 252008 341057 222597
33231 222597 -14613 -85274 14526 11230 -135064 -148987 58023 224757 190204 110670 101732
33220 101732 46123 -95393 -142668 -23775 86571 99555 153951 284971 292892 109728 -29982
33209 -29982 28784 111021 35273 -93184 -110829 -65437 -63243 -67336 -23045 12858 11189 47319
33197 47319 128699 146855 90134 86954 162414 188653 145091 167262 262679 256687 110130 7610
33185 7610 31438 34717 -54076 -91083 -2372 73058 51668 45864 115245 143968 81439 41548
33173 41548 58460 13255 -103224 -137906 -72877 -74698 -160138 -136187 25995 95884 -16462
33162 -16462 -102771 -30853 57829 58342 71463 127557 87740 -40732 -46650 88082 108628 -47700
33150d7700n9417J54632J10616q5501n4264J30677R0018j24006j21972P9385R2662
33139A65130j05987j49757K2248R1708p191j2910Q9610L7807j41420j38354M0064
33128a09052P2430n7791m6024J13610J07016p0583q4119R5074J28512m4378j08262
33117c567J7323O9018j315L9407J63755R1176j18749j14981O2172J6400k33635
33106a2996k32842O4856J71645n7813j69775N2954K24106R1729m4070M3882J06433
33095B38109l6913j36844j8680R0275L0699m456Q4896Q6774o0371r9796L1880
33084B05573N0503j16561j63875J357P2161m9644n1234J60391K32679K3421j23060
33073B41711k1587L8284r9011j43799L8179J21871n6079j67277j6193R5229k7427
$$ plain form
33150 -47700 -107117 47515 158131 72630 18366 149043 239061 115055 -6917 72468 165130
33139 165130 59143 -90614 -68366 23342 16151 3241 92851 130658 -10762 -149116 -109052
33128 -109052 -36622 -94413 -140437 -26827 80189 9606 -74513 20561 149073 104695 -3567
33117 -3567 13756 82774 81459 120866 284621 375797 257048 142067 204239 220639 -12996
33106 -12996 -245838 -180982 -9337 -67150 -236925 -183971 40135 131864 87794 131676 238109
33095 238109 201196 64352 45672 135947 166646 162190 247086 333860 273489 173693 205573
33084 205573 256076 139515 -24360 -23003 49158 -486 -51720 108671 341350 364771 241711
33073 241711 220124 258408 159397 15598 53777 175648 119569 -47708 -63901 31328 3901
33062C901r0484R5961K21936O1569r8218q379R1537k9389j51612n6207N9191p081
33050I2725q4703j0141O3280L0206M5527J20273J7366k14558j76923J58473K85722
33039C27247K872k38854j37651j0450j01074j18673J16230K48054N9060r2773
33029E3988L7906J19976o6556j61453O0200J92731m1908k24023j893K39494Q7440
33018B95902j61097j03727M2418l5737j00427J00737K38134J3619j98894j0887
33008H0041K40737J09705j48515r6770P8544Q887j16565J3975J49703l4446k39697
32997D5599p5569J75141P1458j62138q5758J24502O3898j04803j2281J64169P0186
32986B74404j00152k571J36631m1120k74098j43069J12911L5559j86187r6510
$$ plain form
33062 3901 -86583 9378 231314 292883 194665 186286 277823 248434 96822 40615 99806 92725
33050 92725 8022 -2119 61161 91367 136894 257167 274533 59975 -116948 41525 327247
33039 327247 330119 91265 -46386 -56836 -157910 -276583 -160353 87701 146761 53988
33029 53988 91894 211870 145314 -16139 44061 236792 194884 -29139 -31032 208462 295902
33018 295902 134805 31078 73496 37759 -62668 38069 276203 289822 90928 80041
33008 80041 320778 430483 281968 185198 263742 272629 156064 170039 319742 285296 45599
32997 45599 -29970 145171 216629 54491 -31267 93235 157133 52330 40049 204218 274404
32986 274404 174252 171681 308312 267192 -6906 -149975 -37064 -1505 -187692 -284202
32976b84202J48897J03884j05417n0689J73207J76217K8016L7060Q9987o3546
32966B53414k09841o7592R7934l1117j56265O7550K80806M8715k58595r2905K50867
32955A82971J70019j50654j48744M4154n5195k66955j03492K21485J69387p8403
32945a5427J3825K63214J20780k21876j64056J52501J20458j64824j21000J68738
32935A52333J33678j50890j16660J77126J64783j31984j89555q702k2535j58072
32925a50478j6981K18258R5086j44339K5054L27385J41440k68249j79734K17591
32915B65033J55240k61724k57531J49951K33877l3284q927K86271K23703j11829
32905F40780j3704M66164N61492J87046k1656J118k37551n69081l48990J93374
$$ plain form
32976 -284202 -135305 -31421 -136838 -187527 -14320 161897 189913 226973 316960 253414
32966 253414 43573 -24019 73915 42798 -113467 -45917 234889 283604 25009 -67896 182971
32955 182971 352990 202336 53592 97746 42551 -224404 -327896 -106411 62976 -15427
32945 -15427 -1602 261612 382392 160516 -3540 148961 269419 104595 -16405 152333
32935 152333 286011 135121 18461 195587 360370 228386 38831 30129 7594 -150478
32925 -150478 -167459 50799 145885 1546 26600 353985 495425 227176 47442 265033
32915 265033 420273 158549 -98982 50969 284846 251562 242635 528906 752609 640780
32905 640780 627076 1093240 1654732 1841778 1820122 1821240 1583689 1014608 665618 858992
32895H58992K04175k44849k89853J03296J43142k03608j80718K02425J61046k78768
32885D75280k77335J71394K05176k13764k21283K27523K45944k30902k87892J95299
32875B89440L26392m9802j15430K16415J35275l31858k46725L59434M07719j86537
32865H04323l27598J47379J84002l55584l70370K85260M30808j61531l01224K92335
32855F27800M26312k16147m32248J40786L22626k42831l60119L04947M77449k15199
32845H33376m20979L24268O41247l3884l57695K67952N19309j91931m87736K68232
32835A362159O58281j5571k92216O29349J263630N90248j69284q2640j63465r26011
32825B854480j029648n358M72375l04355o31487K64984O05535m05644p94986L88738
$$ plain form
32895 858992 1063167 818318 528465 631761 774903 571295 390577 593002 754048 475280
32885 475280 197945 369339 574515 360751 139468 366991 612935 382033 94141 289440
32875 289440 615832 566030 450600 667015 802290 470432 223707 583141 990860 804323
32865 804323 476725 624104 808106 452522 82152 367412 798220 636689 335465 627800
32855 627800 1054112 837965 405717 546503 869129 626298 266179 571126 1048575 833376
32845 833376 412397 736665 1377912 1344028 986333 1254285 1773594 1581663 1093927 1362159
32835 1362159 2020440 2004869 1712653 2342002 3605632 4195880 4026596 3943956 3780491 2854480
32825 2854480 1824832 1819474 2291849 1987494 1356007 1620991 2226526 1820882 1025896 1414634
32815A414634J019806r8497q20969K43033R87962p4071q28049K93307J132554
32806C269710N3778p03028N57053J428030R4216q21341P26387J943282N38395
32797G086482n09130J385783L058997J581096K55901K272358M037954K122203
32789B1291644Q15632M303269P713288O017659N082014J1541451J8700729J8521177
32781I3986863K1541099M3020539O9423703O3638608J3159996m6852207p2214596
32774A85704005n7134104l0119743j5925945j7301879k4918781k7953465j8470782
32767f120694O76691J4152836J0903631p51974m949310l52333J839539j982221
32759A3416165m054928q96837J296059r23495k579981n12324J083313o56290k004892
$$ plain form
32815 1414634 2434440 2335943 1514974 1758007 2745969 2671898 1843849 2137156 3269710
32806 3269710 3323488 2620460 3177513 4605543 4699759 3878418 4604805 6548087 7086482
32797 7086482 6577352 7963135 11022132 12603228 12859129 15131487 19169441 21291644
32789 21291644 22107276 26410545 34123833 40141492 45223506 56764957 75465686 93986863
32781 93986863 115527962 158548501 227972204 291610812 304770808 257918601 185704005
32774 185704005 128569901 98450158 82524213 65222334 40303553 12350088 -6120694
32767 -6120694 -5444003 8708833 19612464 18860490 13911180 13558847 15398386 13416165
32759 13416165 9361237 8464400 9760459 8836964 6256983 5744659 6827972 6171682 4166790
32750D166790k75901J151349l38275j706526l87394R41435j69962j335315k37267
32741A808934R57241L2602j051161j95223Q06939k0495r88379j99460P46858J546
32731A899402r20108j81824Q08325K05486p54382k82541N57718J15294o29927
32722H17443j57607N61192O9104o66275j93646N67293J68842n55342k01483M72566
32712H82087J34094n01249j72168M14850N0044n43162j56336M97440J96291l97754
32702D04137r4131M61483J00429n21320k09856L98642Q0656n57602k41669M92401
32692C13170L21003l52418k29858M03160L21410k66722k19650L00293K33819k79911
32682E44296k56879J77357J27129k56086j55978J91297k1109m54946j93373M37793
$$ plain form
32750 4166790 3890889 5042238 4703963 2997437 2610043 3551478 3381516 2046201 1808934
32741 1808934 2766175 2798777 1747616 1552393 2359332 2338837 1350458 1150998 1897856 1899402
32731 1899402 979294 797470 1605795 1811281 1056899 774358 1332076 1447370 817443
32722 817443 659836 1221028 1290132 623857 430211 997504 1166346 611004 409521 882087
32712 882087 1016181 514932 342764 757614 807658 264496 108160 605600 801891 404137
32702 404137 310006 771489 871918 350598 140742 539384 620040 62438 -179231 313170
32692 313170 634173 281755 51897 455057 776467 509745 290095 590388 824207 544296
32682 544296 287417 464774 591903 335817 179839 371136 350027 -104919 -298292 139501
32672A39501L99309j40825j81929K11631J47528k99849k70957J69887J87274j84823
32662A76747j69871J84693J33329k55669k31784J56646J77997j46408j41841J54015
32652C7854J16173j58111m2726L02293J85436k31352j84256K26224K11817k01743
32642B61609k46129J12493J56798j65020j69632K03636K80564n1092j79124L7167
32632B41270R0973j04372j03917R3249N3421j32492Q254K97258J38785k95114
32622B87315k76529J48327K35984q5713j49244J40588J62027j75946k51877O6185
32612A01117J95821k5985r8002R8840R6641j60448j77253Q0329Q8572j75455j43506
32601a19329K21202K88758o5144k26114N304R4479j46475k15405N5741J62012
$$ plain form
32672 139501 538810 397985 216056 427687 575215 275366 4409 174296 361570 176747
32662 176747 6876 191569 324898 69229 -162555 -5909 172088 25680 -116161 37854
32652 37854 154027 -4084 -46810 255483 440919 209567 25311 251535 463352 261609
32642 261609 15480 127973 284771 119751 -49881 153755 434319 383227 204103 241270
32632 241270 332243 227871 123954 217203 270624 138132 146386 443644 582429 287315
32622 287315 10786 159113 395097 309384 160140 300728 462755 286809 34932 101117
32612 101117 296938 270953 172951 271791 368432 207984 30731 111060 199632 24177 -119329
32601 -119329 101873 390631 325487 99373 104677 199156 52681 -162724 -106983 55029
32591E5029p2363j46790J24671K38395k6983j91425N811J55584J8370m5331J43519
32580B58487J99635n3992k20969r3051p441j15524p3144K08607K84643m973k00267
32569A82011n3771N7306r6300j66633M9245J90756L6159p3664Q5888J89773J0513
32558D11283j41216k3630R3725j7709j24289k8049O0498j7395o4896J9000J6510
32547A83832j19993j06042J08344J79701L208r0143J7222J4291j76817j86075
32537a72472R4545K49833P6702p4365J3957N9796q7927j21273Q8686J81934j0854
32526B98562j24271M6988J53953k9824j76669m6644O4673o7142j50396L5399J95616
32515B00245R2962q211J02634J49937o7320k36940j00736P2441J6507n8662M4133
$$ plain form
32591 55029 -17334 -164124 -39453 198942 171959 -19466 -13655 141929 160299 114968 258487
32580 258487 458122 404130 183161 90110 82669 -32855 -105999 102608 387251 382278 182011
32569 182011 128240 185546 89246 -77387 -28142 162614 198773 125109 210997 400770 411283
32558 411283 270067 246437 340162 322453 198164 170115 230613 213218 148322 167322 183832
32547 183832 63839 -42203 66141 245842 249050 158907 176129 190420 13603 -172472
32537 -172472 -77927 171906 248608 174243 188200 247996 160069 38796 127482 309416 298562
32526 298562 174291 221279 375232 345408 168739 122095 186768 119626 -30770 4629 200245
32515 200245 293207 284996 387630 537567 470247 233307 132571 205012 221519 162857 206990
32504B06990Q3697j10448k32721o1787R3530l0700j53229p60J53807J3026j72218
32493b10813p2317J28900J24202L7595Q8952J21479m0659j67456m0592J03803
32483G3094K1323o5230Q2416K12168L7534k02680j66106j1415n0990j54494l9029
32472b63409J62628J53496J2163j0600L6131q529m0934N6441Q8535r4469k28782
32461a37329o4133J66569J48511J9799M6990J08892j0884j44168n1183R3258K4614
32450B00936r8109n629J43838N0580j68395k07144j02244n4359J2710K21212L37220
32439C30616J13085k09367k40806n6794J9389l757O8872J37154j341j85246j33584
32428a61779L6186L2391o8364n232J36592R0877p0203q2203J1976o037o8724K4211
$$ plain form
32504 206990 290687 180239 -52482 -114269 -20739 -51439 -204668 -205428 -51621 -38595 -210813
32493 -210813 -283130 -154230 -30028 7567 96519 217998 177339 9883 -30709 73094
32483 73094 94417 29187 111603 323771 361305 158625 -7481 -18896 -69886 -224380 -263409
32472 -263409 -100781 52715 64878 54278 90409 81880 40946 97387 185922 91453 -137329
32461 -137329 -201462 -34893 113618 133417 180407 289299 278415 134247 83064 176322 200936
32450 200936 102827 97198 241036 291616 123221 -83923 -186167 -240526 -227816 -6604 330616
32439 330616 443701 234334 -6472 -63266 -43877 -47634 21238 158392 157051 -28195 -161779
32428 -161779 -125593 -93202 -161566 -166798 -30206 60671 -9532 -91735 -79759 -85796 -154520 -130309
32416a30309J60759J03199m7920m5128L0032m6354j67586r3017P1249P5958J6534
32405g2583J15395K20111N4302k12759k02927J4152N5328j08865j67058m8228
32395c53132L3322K8896O4020R4993J6553k2972J28848K43411N8507j98358j57689
32384f3601M5392M2901p8297P633J74044N9556j88797j26000J49637J33835j55006
32373A297j78120J57411L20519O7977j99713j72572n2247m2048k9812K4633m2740
32362a45415j69149n8600K35143K84015N031j73153m4144O3520o8810j69547j7744
32351b58853J61560J39816N4936N6470J9498j15519j35070M7518J74137P3160
32341B17653o4536o6457n7042j32413j34946J6611J30807R5773P5871J53625J39592
$$ plain form
32416 -130309 30450 133649 85729 40601 70633 24279 -143307 -236324 -165075 -89117 -72583
32405 -72583 42812 262923 317225 104466 -98461 -84309 -28981 -137846 -304904 -353132
32395 -353132 -319810 -290914 -226894 -131901 -115348 -138320 -9472 233939 292446 94088 -63601
32384 -63601 -18209 24692 -53605 -45972 128072 187628 -1169 -127169 22468 156303 1297
32373 1297 -176823 -19412 301107 369084 169371 -3201 -55448 -97496 -127308 -102675 -145415
32362 -145415 -314564 -373164 -138021 145994 151025 -22128 -66272 -2752 -71562 -241109 -258853
32351 -258853 -97293 42523 97459 153929 173427 57908 -77162 -29644 144493 217653
32341 217653 153117 86660 29618 -102795 -237741 -221130 -90323 5450 81321 234946 374538
32330C74538m9019j82008j07722j806j2966j2968Q2561R9502n2742j61861p5233
32319i9724L6822J2287k3644N3468J09343K7229m6231K1556R1524J3507r8710
32308I7427q0397J4712N7176M8212K1573m8795j14072n4868P5991P5229n8942
32297C3246r7313R336L5638q6441j18930L8504J40916L7284n6568L7704J37547
32286A10923M6997r4777r3433l8707p9470j18497j4723J31113J53816R0708M8524
32275A42474L032o9142o9077K5096N4079n0945j21138m3045M6665K9350N887N0856
32263D092L8639q7987j48796l6315P1269K3161m3418K0388J01843O6137J4961
32252B3974O1336Q9004j4012j11891o0825K5967j398n5602l203P2497M2063k5256
$$ plain form
32330 374538 325519 143511 35789 33983 21017 8049 90610 190112 137370 -24491 -99724
32319 -99724 -62902 -50615 -74259 -20791 88552 115781 69550 91106 182630 196137 97427
32308 97427 17030 31742 88918 137130 158703 109908 -4164 -59032 16959 92188 33246
32297 33246 -64067 -54731 -19093 -105534 -224464 -185960 -45044 -7760 -64328 -26624 110923
32286 110923 157920 63143 -30290 -68997 -148467 -266964 -281687 -150574 3242 93950 142474
32275 142474 145506 76364 7287 32383 86462 35517 -85621 -128666 -82001 -52651 -46764 4092
32263 4092 42731 -45256 -194052 -230367 -159098 -135937 -179355 -158967 -57124 9013 23974
32252 23974 85310 174314 160302 48411 -12414 13553 12155 -43447 -46650 25847 67910 42654
32240D2654j7775O95n2098q4843r462O8314L3843l6446l7067r956k348M2569J06757
32227D4837M9276j12100j40005L4947J55585N3019q7104q1455m6862r8742q5111
32216c13715R1216K04165P8157o6646J6779J68021J17357l8686m7462L5309p644
32205B36851j22144r5690L0822M3167n5998q3431j5568K1583J7675M6201O0887
32194H4355p156n4594L1781J35123Q7499l7382o6624k9490n4849j01016n3785
32183f6138K9300K6839j6066q4K3546j5287l0301L9885O0910n1283j22705j5815
32171a37199R4844K6384o9164J4121J43166Q9135m9073m2289L9607r637j10502
32160a0607m5937J10698J23028K3515J5782O3830j0025j24783o4109Q5932N5559
$$ plain form
32240 42654 24879 25574 -26524 -111367 -120829 -52515 -18672 -55118 -92185 -102141 -104489 -61920 44837
32227 44837 94113 -17987 -157992 -123045 32540 85559 -1545 -83000 -129862 -228604 -313715
32216 -313715 -222499 -18334 59823 -6823 9956 177977 295334 256648 209186 244495 236851
32205 236851 114707 19017 49839 93006 37008 -46423 -61991 -40408 -22733 23468 84355
32194 84355 77199 22605 54386 189509 277008 239626 173002 143512 88663 -12353 -66138
32183 -66138 -36838 -9999 -26065 -26149 -2603 -17890 -48191 -8306 52604 1321 -121384 -137199
32171 -137199 -42355 -15971 -85135 -71014 72152 161287 112214 69925 109532 99895 -10607
32160 -10607 -56544 54154 177182 200697 216479 280309 270284 145501 81392 167324 222883
32149B22883j13794j30839K2450O7370o7432j40896l8694P0157P2073N4712N9182
32138G7172P012p7532o6727J7850K7865l1071j7460N9236N4005k7596m2804J1129
32126h921J2652k9481k0528j7796j19184j87295k6479K24564K43918L3965r7407
32115H008m3646o9n1177n2844K6680K4932q0192r6311M0474J56757J46522R7895
32103A77029O4129j0916r7421q1707Q371L6712J0628L5280N9662l4940j50174
32092A6653j04619J0540k5465j29364l7159J80541J83610n0092j73820n8990L9796
32081a48369p321p614J14607J42335j67o9063N2863J35394K9392o5458K0814J32957
32069C30370R5406l186l6863n8818j05632p3886M0194O6152k9025n6219L8034
$$ plain form
32149 222883 109089 -21750 700 68070 638 -140258 -178952 -108795 -36722 17990 77172
32138 77172 84184 6652 -60075 -42225 -14360 -45431 -62891 -3655 50350 22754 -20050 -8921
32126 -8921 3731 -25750 -46278 -64074 -183258 -370553 -397032 -172468 71450 105415 8008
32115 8008 -35638 -35707 -86884 -139728 -113048 -88116 -168308 -264619 -224145 -67388 79134 177029
32103 177029 241158 230242 132821 51114 59485 96197 106825 142105 201767 166827 16653
32092 16653 -87966 -77426 -102891 -232255 -269414 -88873 94737 44645 -129175 -188165 -148369
32081 -148369 -155690 -163304 -48697 93638 93471 24408 77271 212665 242057 176599 197413 330370
32069 330370 425776 422590 385727 326909 221277 147391 187585 253737 224712 168493 206527
32058B06527O0350m7602p7186L9252O9007q2786j64091k9725Q2176j3755j14993
32047g2826k6347P0955k1972j24842p306J68272J18001p7623j37647m6721M846
32036a53210n917K9213O3776j7367j16264m0008J56233K24123Q8134p7801j14794
32025C6118k9647Q8594J48971R5510k1562p3202k7613O164k5927l6337J6945L6524
32013B14538k3319n9841k2044j0756o8169p6637J3451P3629L9530K9595Q7719
32002A97696O1478r9084j80574m2878J23362R2742n5983j15052o6746j4493K7527
31991g2005P8056Q5141M3123M0282O2620k9625k05341k16023k593J52766P4377
31980A0778k6618M6621J27457K8009q7698j4676R1034m706j70323j38901J7597
$$ plain form
32058 206527 266877 219275 142089 181341 250348 167562 3471 -26254 55922 42167 -72826
32047 -72826 -99173 -28218 -50190 -175032 -182338 -14066 103935 26312 -111335 -158056 -153210
32036 -153210 -159127 -129914 -66138 -83505 -199769 -239777 -83544 140579 228713 150912 36118
32025 36118 6471 95065 244036 339546 317984 244782 217169 223333 197406 161069 178014 214538
32013 214538 191219 131378 109334 98578 30409 -46228 -32777 40852 80382 109977 197696
32002 197696 259174 160090 -20484 -63362 60000 152742 96759 -18293 -85039 -99532 -72005
31991 -72005 6051 91192 134315 174597 237217 207592 2251 -213772 -216365 -63599 10778
31980 10778 -15840 30781 158238 186247 98549 83873 174907 170201 -122 -139023 -121426
31969a21426M0723n1092m6323M2402L2702n3055l9111N0875M3323m1355k8233
31958a70570P3993R0508K370m2498j0915n325l4003j2725L8594L1456p045K731
31946d3429J9208k2725l9388N5706J45222Q2574m0902m6345L1115L8934j4898
31935A65072l3440n3134j32967j56049j8616J19069O2724p1030m8117P7701Q3080
31924e707j9435l9361K4506K1039k9462R747Q6645M8485l8991j277R3544M7364
31912A97097q0206o9641L8448J4441j13779r6032P0335J19932p789p7789Q058
31901C075P2639K7392R620P1913P4935j9461o2437q026P562n5114p0197j3526
31889C8375r564o4202m1484N2864O0458k3742l6633L5116L6648l3259j5177O9718
$$ plain form
31969 -121426 -80703 -131795 -178118 -135716 -103014 -156069 -195180 -144305 -100982 -142337 -170570
31958 -170570 -96577 -6069 -3699 -46197 -57112 -62437 -96440 -109165 -70571 -39115 -46160 -43429
31946 -43429 -24221 -46946 -86334 -30628 114594 197168 156266 109921 141036 179970 165072
31935 165072 131632 78498 -54469 -210518 -229134 -110065 -47341 -118371 -166488 -88787 -5707
31924 -5707 -25142 -64503 -39997 -18958 -48420 -38673 47972 96457 57466 56189 149733 197097
31912 197097 116891 47250 85698 100139 -13640 -109672 -39337 80595 72806 -4983 3075
31901 3075 75714 103106 112726 184639 259574 240113 177676 169650 177212 122098 51901 38375
31889 38375 28811 -35391 -76875 -24011 36447 12705 -23928 11188 47836 14577 -600 69118
31877F9118K5482j30183j51826o48Q3123J7634J446J00181J08374m3277j30294
31866e0870l9555M2034Q382K5573J53804J59220o2551k28944j04162J18607J44292
31855A65830J3895n9615n4808o8147p5211j8663K8636J59k0911L2194P1413L3553
31843D8325R261N0947N8610n141j2650P5076R7467j0479p2459R796O2841l8095
31831B73499j28618n8285K9844k7557j04608k0065J29029J38645K5872o3370j06077
31820H8309j30471o9967P9623J35428o286j55885j13589J7035L8092r783J6357
31809a11137O9996L1989l7113k6932r009p9303j26540k6129R3253N8484k9733
31798a92174J4162J06334N4135o1297j4225J46714J65477J3357q6244m4799M743
$$ plain form
31877 69118 94600 -35583 -187409 -188057 -104934 -87300 -85854 14327 122701 79424 -50870
31866 -50870 -90425 -48391 -40009 -14436 139368 298588 236037 7093 -97069 21538 165830
31855 165830 179725 120110 65302 -2845 -78056 -96719 -68083 -67924 -88835 -56641 14772 48325
31843 48325 57586 108533 167143 162002 149352 224428 321895 311416 238957 248753 311594 273499
31831 273499 144881 86596 116440 88883 -15725 -35790 93239 231884 257756 194386 88309
31820 88309 -42162 -112129 -32506 102922 96636 -59249 -172838 -155803 -117711 -127494 -111137
31809 -111137 -41141 -9152 -46265 -73197 -82206 -161509 -288049 -314178 -220925 -162441 -192174
31798 -192174 -178012 -71678 -17543 -78840 -93065 53649 219126 232483 146239 101440 106183
31787A06183K418L1040Q0663L8337o3829o8259J4976P680j09318j42667k0091
31776a22867Q4086M5053k5584k97N3538J1361r9485j47243p2465N7570J25217
31765i1116P2407k9072m7586K7782O0846j1557o4345k896N9897J4561k0850Q3218
31753E1289J79237N9876j49273j50654L1584Q5266o1407j30149J0996J19772Q094
31742E4631j37075q4655O1210P4534n571J3408J11445R2864o3046j54642p5289
31731a12186M3454O1432K3394L3675P1047M6640k7842n2902j753M1954K2464j0585
31719A38792q696j7840q3562j35766q2832K3302N0899j20j276P7982J10869L0668
31707A02420n2654l7474J0573q774n9563m9827R908M0324J5093l7269q1105o3018
$$ plain form
31787 106183 108601 139641 220304 258641 194812 126553 141529 149209 39891 -102776 -122867
31776 -122867 -38781 6272 -19312 -19609 33929 45290 -54195 -201438 -273903 -216333 -91116
31765 -91116 -18709 -47781 -95367 -67585 -6739 -18296 -82641 -85537 -25640 -11079 -31929 51289
31753 51289 230526 290402 141129 -9525 22059 107325 45918 -84231 -73235 46537 54631
31742 54631 -82444 -167099 -105889 -31355 -36926 -23518 87927 180791 117745 -36897 -112186
31731 -112186 -68732 -7300 16094 49769 120816 167456 139614 86712 84959 126913 149377 138792
31719 138792 130096 112256 28694 -107072 -189904 -166602 -115703 -115823 -117099 -39117 71752 102420
31707 102420 49766 12292 22865 14091 -45472 -95299 -85391 -45067 -29974 -67243 -148348 -211366
31695b11366M7523J53182R8495q4485j60715k4588J26363R1209l4312m2668N0338
31684H976P4967O857k9034Q283M4949N2901N8255K9556o9550j56403j25122k7196
31672a22561M918k7567j5062N8174J00902P8854M3159K0326N170K3612P6632P7888
31660C24445k3070j24297j13876m7112l3987m3403J0684P9745O5965J5474K9970
31649A40538O1711L064q9456p8461M677J4674n0502o7880k2015J740J3278P9152
31637A0520J30143M8147q7144q7909K7795O8185k96k4019K9087J4502r4461j29723
31625i5173j7425R8395R8645L9675o110n2282p9993k1244Q1117R2561J2311k0397
31613A30080K0475R079p5656r2380j422N0186p545m6597J7598P8621M2430j7340
$$ plain form
31695 -211366 -163843 -10661 87834 3349 -157366 -181954 -55591 35618 1306 -41362 8976
31684 8976 83943 90800 61766 70049 114998 167899 226154 255710 186160 29757 -95365 -122561
31672 -122561 -117643 -145210 -160272 -102098 -1196 77658 120817 141143 146313 169925 246557 324445
31660 324445 301375 177078 63202 16090 -17897 -61300 -50616 29129 95094 110568 140538
31649 140538 202249 205313 115857 37396 42073 56747 6245 -61635 -83650 -81910 -68632 10520
31637 10520 140663 188810 101666 13757 41552 109737 109441 85422 114509 129011 34550 -95173
31625 -95173 -112598 -14203 84442 124117 118007 65725 -14268 -35512 45605 138166 150477 130080
31613 130080 150555 159634 83978 -8402 -9824 40362 32817 -13780 3818 82439 124869 107529
31601A07529j7429j233j6593k1723J628Q97j7253K0841Q5391N7187m1679m7489
31589A10074N7384R2775n407o8492J540O0127j2844j05002q2128L09M4171P0160
31577A62667R2678L5622q4929j04552J2188N9662p2301j80103p4773Q8872O3288
31566a681q8334j14805J9242J21715R2639J3956l8020o3323m9352J6513O9865
31555b1585M2560k2880m2542j5885J6840N7762R3314N6831m4128q0796M69O5501
31543A05461P280o7871k6435N7565L7726n2664q0292m6858m3024m5595L2223J38894
31531A6410J33188J2508q1733p3807j8669K5801N3579N2229J0364l2981m1346
31520E5543m3900o0814l7009M7679Q8332K574j11017j04477l816M8712K2146R721
$$ plain form
31601 107529 90100 88867 72274 50551 52179 53076 35823 56664 142055 199242 157563 110074
31589 110074 167458 260233 254826 186334 187874 248001 235157 130155 48027 48336 92507 162667
31577 162667 255345 290967 206038 101486 113674 173336 101035 -79068 -153841 -64969 -1681
31566 -1681 -90015 -204820 -185578 -63863 28776 42732 4712 -58611 -107963 -91450 -21585
31555 -21585 20975 -1905 -44447 -60332 -43492 14270 107584 164415 120287 39491 39960 105461
31543 105461 112741 44870 18435 76000 113726 61062 -19230 -66088 -109112 -154707 -122484 16410
31531 16410 149598 162106 80373 6566 -12103 13698 67277 119506 129870 96889 55543
31520 55543 11643 -49171 -86180 -38501 49831 52405 -58612 -163089 -166905 -118193 -96047 -86326
31508h6326M4085N2001n122o7830p1329k1239K8911L1252p635j6642M6656R9388
31496B6170L9079n8626j7647J34736J59655j3488j40004m2320R9235N0437r4460
31485A42767j00006P099K1507o2222o4490L5771O8331j9914q8716o0356j8479
31474a38708j5948O220O2323O9760O082l7069n474M1022L8761j634m5942p1227
31462i1834n3235l840Q637l7185n0263L2432J17930R7546L0803L5566P4473K8546
31450A89576p8997j20628q0893m8053k8106M1056J17629R3408p706n3690j9720
31439C876j508k2103o346N1439O8212K5623j6241m9353j02074j15406j2077J26655
31427d9303J36655J6220q1449q6222n8680k2474M8170Q7539J056j30482j28045
$$ plain form
31508 -86326 -42241 9760 4638 -63192 -134521 -155760 -126849 -95597 -103232 -119874 -73218 26170
31496 26170 65249 6623 -11024 123712 283367 269879 129875 87555 186790 237227 142767
31485 142767 42761 49860 71367 9145 -55345 -19574 48757 28843 -59873 -120229 -138708
31474 -138708 -154656 -148436 -86113 -16353 -10271 -47340 -52814 -11792 26969 25335 -20607 -91834
31462 -91834 -145069 -148909 -140272 -177457 -227720 -195288 -77358 20188 50991 86557 161030 189576
31450 189576 110579 -10049 -90942 -138995 -167101 -126045 -8416 84992 77286 23596 3876
31439 3876 2368 -19735 -26081 25358 93570 119193 102952 53599 -48475 -163881 -175958 -49303
31427 -49303 87352 103572 22123 -64099 -122779 -145253 -97083 -9544 -8488 -138970 -267015
31416b67015k632O0366J8316K6317J34682J84160Q0968n4053j01103r3743o7825
31405h1562K5327J49663J41373l2817j60999p3285J13890J79821Q8427l8216j13422
31394A98200j22966o7760J4791M8830J9046q486j0041l6263p8500m5398O4917
31383b3630J19128N4186j9434r020J5041k9425q2997o5716k5465l4150m4567J2051
31371a33998P5427M5465l8770m5306N2998J37976J01245l1351j34323j12404k391
31360h5432O2408J7865m1510o556O9977N7206l8863r4175p5486o1330o2908j2029
31348b70833N9205K8566q5076j02438L8635J76473J72366Q2345N068n7924j04239
31337e7852p6620j85M312o6880o3246N5024J24550O0071M044N8845R9981K4269
$$ plain form
31416 -267015 -269647 -209281 -190965 -164648 -29966 154194 235162 181109 80006 -13737 -81562
31405 -81562 -56235 93428 234801 201984 40985 -32300 81590 261411 349838 311622 198200
31394 198200 75234 7474 22265 71095 90141 81655 71614 35351 -43149 -88547 -23630
31383 -23630 95498 149684 130250 121230 136271 106846 23849 -41867 -67332 -101482 -146049 -133998
31371 -133998 -58571 -13106 -51876 -97182 -44184 93792 195037 163686 29363 -83041 -85432
31360 -85432 -23024 -5159 -46669 -53225 16752 73958 35095 -59080 -134566 -195896 -258804 -270833
31348 -270833 -211628 -183062 -268138 -370576 -331941 -155468 16898 99243 104311 46387 -57852
31337 -57852 -134472 -134657 -130345 -197225 -260471 -205447 -80897 -20826 -16782 42063 142044 166313
31325A66313m5024j404K0341r8654j87899n3697J52383J46347k8451q6985K0815
31314D085O0989o0294j50851p4766L9823M1226j9180k3803J4154J4864j9375k8016
31302b01144J856K9981K5813j893j5328J2020M3701R904p2581q2932K9379J38187
31290h3037J16216L4029M0311J08861Q2956n1332j27071o1135J7693k0178j03643
31279d6330p8227N6128J39451O8307o9355j08433j5676P4448M5888m3288o1621
31268c8708r372j153n6538o1793K3036P8976K7992l4745j5601J5983k3700n8551
31256a54174M822P5774J7750r4335p0749P9083J49479N8726m3192l0485K3075
31245A5774N451m7620l5879L2302N9595J1701l7088j2198N5218O0006l6151j28629
$$ plain form
31325 166313 121289 119885 140226 41572 -146327 -200024 -47641 98706 70255 -16730 4085
31314 4085 65074 4780 -146071 -220837 -181014 -139788 -158968 -182771 -168617 -153753 -173128 -201144
31302 -201144 -199288 -169307 -143494 -145387 -160715 -148695 -104994 -95090 -167671 -250603 -221224 -83037
31290 -83037 33179 67208 107519 216380 299336 248004 120933 59798 77491 57313 -46330
31279 -46330 -124557 -68429 71022 139329 69974 -38459 -54135 20313 66201 22913 -38708
31268 -38708 -48080 -49233 -105771 -167564 -144528 -65552 -37560 -72305 -87906 -71923 -95623 -154174
31256 -154174 -149352 -73578 -55828 -150163 -220912 -141829 7650 66376 23184 -7301 15774
31245 15774 21225 -26395 -62274 -29972 29623 41324 4236 -7962 47256 107262 71111 -57518
31233e7518q9633M7278J13195L8070m9882k1378O5134P1044j3093q3485q8274
31222f8542n9099j9908K4293L7244q775o4534n9018K635O4261R8317R5156L5375
31210G7405n0206o4540K1537R2422M5317m9004n5102K4581P5917M6311k2547q2896
31198E9195r6952k7044Q6370J12067M873r1931m5703O0718O9077p302m5782l4833
31186D2753m4867n4134l609L7108l0772j20494o7161Q4340J31652M1349j6335
31175a70L0810O1722P031m0832k3986j5545m8200l9867L3532P0794K7718m408
31163E8599K1991K2893m2042p0704O717R7231Q7710l280r8098j66265j85069j14152
31151c84469J5105R2537P4436L4506L1032M0744N3341R1575J06719J6164j13519
$$ plain form
31233 -57518 -147151 -99873 13322 51392 1510 -19868 45266 116310 103217 19732 -68542
31222 -68542 -127641 -147549 -123256 -86012 -94787 -159321 -218339 -215704 -151443 -53126 42030 77405
31210 77405 27199 -37341 -15804 76618 121935 72931 17829 42410 118327 164638 142091 59195
31198 59195 -37757 -64801 21569 133636 138509 46578 875 61593 130670 123368 77586 42753
31186 42753 -2114 -56248 -59857 -22749 -53521 -174015 -241176 -156836 -25184 16165 -170
31175 -170 30640 92362 99393 58561 34575 19030 -29170 -69037 -35505 35289 63007 58599
31163 58599 80590 103483 61441 -9263 -2546 94685 182395 179115 81017 -85248 -270317 -384469
31151 -384469 -369364 -276827 -202391 -167885 -136853 -96109 -42768 48807 155526 171690 58171
31140E8171j04260M9608J31651K9872q8472n6812L1725J5642n2318k0015Q2985
31129G7777R3747j5697j10795j08384n5734q070L2165N3160K7779k1011l6481
31118g1544j2118R425J2281J9916M2997O7752Q4042Q4999N7404M559m2780n9288
31106A97645m4802r102K4272J1639n2291q7317k3794P0847P0224j4464m8599M751
31094I9009K9606l6004r2131m7788L7654O8044M3301m342q4790j68119j47469
31083c03029O320J51608J46348K9048o6062q8177o7478k0627L4893M4103p143
31072a40196m0323J142N3636L7064j2141l732O6552J21172J00073M300j00189
31061H7358r6884O3495K30799J79774p6536k56732j81364k617N7745K0625K5546
$$ plain form
31140 58171 -46089 3519 135170 165042 76570 19758 51483 67125 14807 -5208 77777
31129 77777 171524 155827 45032 -63352 -119086 -127156 -94991 -41831 -14052 -35063 -71544
31118 -71544 -83662 -74237 -61956 -42040 957 68709 152751 237750 295154 299713 256933 197645
31106 197645 152843 143741 168013 179652 127361 40044 16250 87097 157321 142857 94258 99009
31094 99009 128615 92611 480 -47308 -9654 58390 101691 97349 12559 -155560 -303029
31083 -303029 -296709 -145101 1247 30295 -35767 -123944 -191422 -212049 -177156 -133053 -140196
31072 -140196 -180519 -179377 -125741 -88677 -100818 -104550 -37998 83174 183247 187547 87358
31061 87358 -9526 53969 284768 464542 388006 131274 -50090 -52707 5038 25663 51209
31050E1209N2779o357j02984q9413K2850P8837L4434k185J8145J8753l6037p0829
31038c0798l6612J2370K1392J3321K8630O1985P8191M2096n1697j33484r7696
31027i2302M3158J18338J4279j43701j54568k4292O7658M5094Q104L0893N3332
31016c4007J4119m1111m2474M156M6875N4744K8078r316k0185M263K5586J7321
31004D8049M938L593k2906p9200q8455r657O9980O0642J3098J9989M9319J5427
30992H4817m8411m6239k071j6852o8280l0895J00813J79642J23230J3950n2864
30981B36840q1861r6814p4546j5238K1878M628k4645j8579K2003P2304R6671M9356
30969A91997o3413j44884j13930j9462L6553M0971L2465r120j00067j45391o1415
$$ plain form
31050 51209 103988 97631 -5353 -94766 -71916 6921 41355 39170 57315 76068 40031 -30798
31038 -30798 -67410 -55040 -33648 -20327 8303 70288 148479 190575 138878 5394 -92302
31027 -92302 -49144 69194 83473 -60228 -214796 -239088 -171430 -126336 -118232 -87339 -34007
31016 -34007 -19888 -60999 -103473 -99317 -52442 2302 30380 21064 879 5142 30728 48049
31004 48049 52987 56580 33674 -45526 -133981 -143638 -73658 -13016 82 20071 69390 84817
30992 84817 36406 -9833 -11904 -28756 -97036 -127931 -27118 152524 275754 289704 236840
30981 236840 154979 58165 -16381 -31619 -9741 -5113 -29758 -48337 -26334 45970 142641 191997
30969 191997 128584 -16300 -130230 -149692 -113139 -72168 -39703 -48823 -148890 -294281 -355696
30958c55696M7102K1992p7689n8396P4288J14130R052m7067M7565J30565O4541
30947b9613l6359k9906Q440m5725j16972o2441O4743R8978L4899J1422O2277P5667
30935C5410J354p0090o2416j5854M774L906J2700K2390N885k7653l2467K0851
30923a01210R5063J03236P785j07037j16999j5329P9400Q5300M7359L6616M3221
30912A57405K1099k7668o6603p2844l5777L6717Q6270M9678l6988o3787o854L6073
30900G6721J2313j56N5357R4650L0048p0177q4848l1263k0367o4884o7789Q410
30888f1985P9713O3173k2776r4919q6135N411R8995Q5595m3943j52609j05534
30877b35014N7355J66307J24599q87q3542o7891M426N0944K9204j3132Q181Q7638
$$ plain form
30958 -355696 -308594 -286602 -364291 -422687 -348399 -234269 -225217 -272284 -224719 -94154 -29613
30947 -29613 -65972 -95878 -87438 -133163 -250135 -312576 -247833 -148855 -113956 -102534 -40257 35410
30935 35410 36764 -33326 -95742 -111596 -106822 -102916 -90216 -67826 -61941 -89594 -122061 -101210
30923 -101210 -6147 97089 104874 -2163 -119162 -134491 -55091 30209 77568 114184 157405
30912 157405 178504 150836 84233 11389 -24388 12329 98599 148277 111289 47502 40648 76721
30900 76721 89034 88878 144235 238885 268933 198756 113908 82645 62278 -2606 -70395 -61985
30888 -61985 17728 80901 58125 -36794 -122929 -117518 -18523 67072 23129 -129480 -235014
30877 -235014 -177659 -11352 113247 112360 28818 -39073 -34647 16297 45501 32369 40550 128188
30865A28188J11587J5953j00457j03048j3986K6545l1067q9889o8115r235Q107
30854a25417j3736k0469K998K4806K2871R934J3444M8211R5566J05731M5398n1740
30842A57597j10230r6046m6190q205J3961L5393M6508K9423Q95l68K9458M8389
30830A00585K7628o958j8218k1118n9997j25237j44906q2860R07L0444K0014M3693
30818b36023J15299J61120J19025J5148p2005q8210l5861L5992O5368K8704l7368
30807G1189q4304j03653r9626m4510P2281J69941J39370n615j20732j05539j5557
30796a26755L7364K8859J0224M280j5789n9504q8035n8188K7712J18076J49906
30785B8150J01141J4260m2476m1665j4311l285j4606j6309K0689P6008Q2602O535
$$ plain form
30865 128188 239775 255728 155271 52223 38237 64782 33715 -56174 -124289 -133524 -125417
30854 -125417 -139153 -159622 -156624 -131818 -108947 -99013 -85569 -37358 58208 163939 209337 157597
30842 157597 47367 -48679 -94869 -103074 -89113 -53720 -7212 22211 23106 22738 52196 100585
30830 100585 128213 121255 103037 81919 21922 -103315 -248221 -331081 -330174 -299730 -279716 -236023
30818 -236023 -120724 40396 159421 174569 102564 14354 -21507 14485 79853 108557 71189
30807 71189 -13115 -116768 -216394 -260904 -188623 -18682 120688 115073 -5659 -111198 -126755
30796 -126755 -89391 -60532 -50308 -46028 -61817 -121321 -209356 -267544 -239832 -121756 28150
30785 28150 129291 143551 101075 59410 45099 41814 27208 10899 31588 107596 190198 196733
30773A96733q2639p9876N993M9798p888o8235l1045M7416N1027j8831p5656r2007
30761a05210q8868m3382N5861J17838O4180j7477q76N4116K875j02128p1564Q4152
30749e0483J42738L6480l9606K7872Q5533L831r8151q8264n6429j17036j73367
30738c26882r6930K3983M0987P495N1209J11309N1981n9659m6541P1807J15916
30727e5325M8229l125M821o686l6097P31O6930L2148p6728q3955L7936J08126
30715C7005L4525n0376l3921L886l0557p4859m2840K2181M4691M2582N1630M2324
30703D6271N708J638L1336n593j24603j69730m7437Q7278M7246r0328r9872M1933
30691b76153J32865O8325j4794K7020J30373J44836N5519l0215o2040r3951j52653
$$ plain form
30773 196733 114094 34218 40211 90009 82121 13886 -17159 30257 81284 62453 -13203 -105210
30761 -105210 -194078 -237460 -181599 -63761 419 -17058 -17934 36182 39057 -63071 -134635 -50483
30749 -50483 92255 128735 89129 117001 202534 206365 108214 19950 -36479 -153515 -326882
30738 -326882 -423812 -399829 -358842 -351347 -300138 -188829 -136848 -196507 -243048 -171241 -55325
30727 -55325 -7096 -10221 -5400 -12086 -48183 -47452 19478 51626 -25102 -109057 -71121 37005
30715 37005 71530 21154 -12767 -8881 -39438 -114297 -157137 -134956 -90265 -47683 3947 46271
30703 46271 51979 53617 84953 79360 -45243 -214973 -262410 -175132 -127886 -218214 -318086 -276153
30691 -276153 -143288 -74963 -89757 -62737 67636 212472 267991 237776 175736 81785 -70868
30680g0868j59761m0006J43191K33497J62521K3353n9177p2577q1379r7576o8788
30669h7570J5534Q6941Q5033K5497l4434n2721j9169L5747M8209p546o0084k4644
30657A0793N5678M7724p0346j52454q7595L9078P8536L4789L0129R0114R6666
30646A73112k2626j66553j82530n5691Q7331J33422Q3276O978m2107n0390k4183
30635e9961J3455K2282j7265o3999n1843K1019P5459M9870j6300l7936l812J2351
30623e6680l4105q5496n8618L2303Q1979L3916l3501p433R5529J38665N5534m7177
30611A14916l5922O3619J15625O9729J74l6270o2174q3799n3905K4537O2289J2150
30599A90969n3111n1347N6M3467O6976O8570J8978o7114j03074n1014O439n765
$$ plain form
30680 -70868 -230629 -270635 -127444 106053 268574 291927 232750 160173 78794 -18782 -87570
30669 -87570 -72036 14905 99938 125435 91001 38280 19111 54858 103067 95521 35437 10793
30657 10793 66471 114195 43849 -108605 -196200 -157122 -78586 -43797 -13668 76446 173112
30646 173112 150486 -16067 -198597 -254288 -166957 -33535 49741 56719 14612 -35778 -59961
30635 -59961 -46506 -24224 -41489 -105488 -157331 -136312 -60853 -10983 -27283 -65219 -69031 -56680
30623 -56680 -90785 -176281 -234899 -202596 -120617 -86701 -120202 -127635 -32106 106559 162093 114916
30611 114916 78994 142613 258238 327967 328141 291871 229697 145898 91993 116530 178819 190969
30599 190969 137858 86511 86567 130034 197010 265580 284558 217444 114370 63356 69795 64030
30587F4030l6014m407N7923O7046J5900n0731j20440j73004j33810J4582J41543
30576a57382J15015j3171q7056n8162P93L6316M4180J5125k6167O984J22746J65013
30564A64234K6079j39363j06288P9449J70331Q8530q461k7701n7736j44144j81421
30553a36491j08927k0503N381J5612M6795M3045j2393l6688M151L1457R216J5094
30541a44251Q1483J13157M7426l8770o1895m5012l0092q919j260n7706j25331
30530b71170p1703Q7359J57868N2296p4393p5760j7173m865K516N8113P3880j9492
30518a02524j04572n2372N8751Q1442M0740M7880P6964L0033n2385m6168M1651
30507A9440R3494P3210L4343j3203q2982j12141m7355K2236j1687p5451k2414
$$ plain form
30587 64030 28016 23609 81532 148578 164478 113747 -6693 -179697 -313507 -298925 -157382
30576 -157382 -42367 -55538 -142594 -200756 -199963 -163647 -119467 -104342 -130509 -123525 -779 164234
30564 164234 190313 50950 -55338 24111 194442 282972 274511 246810 189074 44930 -136491
30553 -136491 -245418 -265921 -260540 -244928 -198133 -155088 -167481 -204169 -200018 -168561 -159345 -144251
30541 -144251 -62768 50389 97815 59045 -2850 -47862 -77954 -86873 -88133 -145839 -271170
30530 -271170 -342873 -255514 -97646 -45350 -119743 -195503 -212676 -217541 -215025 -156912 -83032 -102524
30518 -102524 -207096 -259468 -200717 -119275 -78535 -30655 46309 76342 23957 -22211 19440
30507 19440 112934 186144 220487 207284 124302 12161 -35194 -12958 -24645 -100096 -122510
30496a22510J01737J09444k7353j34185j08237m0643k7310l6254j9963l780L209
30485c05845N1273J35752J55483N8169o4152r3059k8783L8799N1803L0540K7944
30474E7924O2367Q6889M3217m0571o4015n273K5885l8909r6606l5071O1492L1788
30462H9117r1033j12872K2763J50172J25627n33j00398j21064p2576J4242O8338
30451b8217K7628m8737k7445R6738J63895P3099p0509j11047m7513P188O99k1582
30439A4197j4168J6670M5798N8565N0922K7839m701m8549r2255r3358k7450N1664
30427a4826N9022r356o9107o1710j8912J481j0415k7953k9132n430L8913Q3320
30415f4105J07350J08057Q3875K5509m9156q6662o6208l7306m0437l7797J2495
$$ plain form
30496 -122510 -20773 88671 61318 -72867 -181104 -221747 -249057 -285311 -305274 -309054 -305845
30485 -305845 -254572 -118820 36663 94832 30680 -62379 -91162 -52363 -560 29980 57924
30474 57924 120291 207180 250397 209826 145811 140538 166423 127514 30908 -4163 57329 89117
30462 89117 -1916 -114788 -92025 58147 183774 183241 82843 -38221 -110797 -96555 -28217
30451 -28217 -589 -49326 -76771 19967 183862 256961 186452 75405 27892 35080 35779 14197
30439 14197 29 16699 62497 121062 171984 199823 195122 146573 54318 -39040 -66490 -14826
30427 -14826 44196 34840 -34267 -95977 -114889 -113408 -123823 -151776 -180908 -186338 -147425 -64105
30415 -64105 43245 151302 235177 260686 211530 124868 58660 21354 -19083 -56880 -44385
30404d4385O3651M6371j1225k3624J8418M8059L5574P095l1686r1178j27649p8276
30392a88855L1646J05507R9615N1926K130l0570j3837N2783Q2213K588j04254
30381I0892r5641J0561N3029k1706p8189q631J09134J42853Q5737K5389J0624
30370C24052K0778J8775j1584m7983m1440J0093K3837n5957j41565j07678R757
30359A085N6528l193m7719j5416L882n0109r2102m1178M2267O2213K5389j1031
30347f9384l5780m8581j8688M6107P4737M5679L3293P2306P7728j2611j10381
30336E4425r5109J1319Q8591Q0649K5457k8365n3138l3058O765L962n2852r1073
30324h2427n9865n646J2880J5191M0990O9846O6674M5230K3213j9404p4422p2521
$$ plain form
30404 -44385 19266 65637 54412 30788 49206 97265 132839 139934 108248 17070 -110579 -188855
30392 -188855 -157209 -51702 47913 99839 101969 71399 57562 110345 192558 195146 90892
30381 90892 -4749 5812 58841 37135 -41054 -49685 59449 202302 288039 313428 324052
30370 324052 344830 363605 352021 304038 262598 272691 296528 240571 99006 -8672 1085
30359 1085 57613 54420 6701 -8715 -4833 -54942 -147044 -188222 -145955 -83742 -58353 -69384
30347 -69384 -105164 -153745 -172433 -126326 -51589 -5910 27383 99689 177417 164806 54425
30336 54425 -40684 -29365 59226 139875 165332 136967 83829 50771 57536 61498 8646 -82427
30324 -82427 -142292 -147938 -135058 -119867 -78877 -9031 57643 102873 126086 106682 32260 -40261
30312d0261J0131Q4805O9504P074j8296j3718l4531o9898o9793l8608r754K6741
30300i6604Q0535R5128K7494m8767l0988M9026O4815q539n3018J5274J22620J35556
30288C52532K4481j12829j64361j12266l3406l481j7416k4440j7511k9087m4805
30277a82589m808Q5967J34170Q8779J5751j3337k8263q1478j29865q8568L1293
30266a72948J21992J04938K376j00759j26951o2302K5733N6592L8989N3216J14338
30255E5214J31835M8865n8341q5758m1050o319j3257k8158k4240l241L0864P0207
30243G6621R3485Q4740L8560n1671j60681k01655j16218J1460M0065k4869m4651
30232b54814J8748M6200j2602l9841K9923P1684j0293q9721j9715J08060J06558
$$ plain form
30312 -40261 -30130 54675 124179 131253 112957 99239 64708 -5190 -74983 -113591 -123345 -96604
30300 -96604 -16069 79059 106553 57786 26798 75824 140639 132100 79082 94356 216976 352532
30288 352532 377013 264184 99823 -12443 -45849 -49330 -66746 -91186 -108697 -137784 -182589
30277 -182589 -187397 -101430 32740 121519 137270 123933 95670 14192 -115673 -204241 -172948
30266 -172948 -50956 53982 56358 -44401 -171352 -233654 -207921 -151329 -112340 -59124 55214
30255 55214 187049 235914 177573 91815 50765 44446 31189 3031 -21209 -24450 6414 76621
30243 76621 170106 254846 293406 241735 81054 -120601 -236819 -225359 -185294 -210163 -254814
30232 -254814 -236066 -189866 -202468 -242309 -212386 -140702 -150995 -240716 -260431 -152371 -45813
30221d5813n78l0499N3013R7327K0074p6151p9457j6180K1020j478l6847j2874
30209a08443Q4412J55216P6019j12514k08203j13522J9602K1174m7119k7137O2379
30198a98136P8979J1153j8891K7978P0232O4555L9012p652q1599j02603l951J10469
30186a0454Q7068k9414n9254K1946O2394L536m2744j3982J1086j0541p331M7422
30174E9732O9546K2172j5817N14J1719j3686k3392p510l1367r2374r5580k2675
30162a38718K9018K5141M4722R5119N9043q9251j91523j34267r703N8791R1713
30151a59915J33147J16450J750q6914k8430R0941R9716r550j01528j03319m8015
30140i5667K9288J00704R7558j0232j17045r1993L0108Q5115J434j19622j51994
$$ plain form
30221 -45813 -46391 -76890 -23877 73450 93524 17373 -62084 -78264 -57244 -58722 -95569 -108443
30209 -108443 -24031 131185 207204 94690 -113513 -227035 -207433 -186259 -233378 -260515 -198136
30198 -198136 -119157 -108004 -126895 -98917 -28685 35870 74882 67230 -14369 -116972 -120923 -10454
30186 -10454 76614 47200 -12054 9892 72286 75822 33078 19096 30182 19641 12310 59732
30174 59732 129278 151450 135633 136147 147866 134180 110788 103278 71911 -20463 -116043 -138718
30162 -138718 -109700 -84559 -39837 55282 114325 25074 -166449 -300716 -310419 -251628 -159915
30151 -159915 -26768 89682 91432 4518 -23912 67029 166745 157195 55667 -47652 -95667
30140 -95667 -66379 34325 131883 121651 4606 -87387 -57279 27836 29270 -90352 -242346
30129b42346q4532N120N0795M9269M4551O9782R7641P0132j5492r1550j04366
30118a50996o6683j2978L9921P1042N9273L1153L8875P2090O5508J1909j9886
30107A39228n186m740m8195p5847m6438p178m59M923K9270K4020l2210p0766m2195
30094a35773l742j7253l9177p63O6900P6489R309p1004r1695j9278J07961J70648
30082E2622P7069q7889j29875n813J07009O7855l8283o4918k2791n020p693K3898
30070c3829N3154J0694o1803p0733k9528k1415m1590j5580M9804P1465L8254K5516
30058b5591N5270N9866P099l8562j5274M6657P0573K8921l0759m2819n461N232
30046A15152o0366j25584p4629N9985J13944K9527n4727k2099M9487L7490k5783
$$ plain form
30129 -242346 -326878 -321758 -270963 -221694 -177143 -107361 -9720 60412 44920 -46630 -150996
30118 -150996 -217679 -230657 -190736 -119694 -60421 -29268 9607 81697 147205 159114 139228
30107 139228 134042 129302 81107 5260 -41178 -48356 -48815 -43892 -14622 9398 -22812 -93578 -135773
30094 -135773 -139515 -156768 -195945 -196708 -129808 -53319 -44010 -115014 -206709 -225987 -118026 52622
30082 52622 129691 41802 -88073 -93886 13123 80978 42695 -22223 -45014 -50034 -57727 -33829
30070 -33829 19325 30019 -31784 -102517 -132045 -153460 -195050 -210630 -160826 -89361 -51107 -25591
30058 -25591 29679 89545 96644 58082 42808 89465 160038 188959 158200 115381 109920 115152
30046 115152 54786 -70798 -145427 -85442 28502 58029 3302 -18797 30690 68180 42397
30035D2397l7514q559j5480m3240k4876J8164J9018n47J8823L6615k2762j05409
30023a23370q8559J3108O4010K9332J7214P6782J11288M6870m3032n5051l617
30012D4975K2330j0460n5512o0042j9290K9400M7231L0757M424j7853l3699k2192
30000c9931K9601P0175L4873l7092m0377K1620L1231l3020m1165N1507Q7931l7656
29988I7697j72850j27852L1149J04087O3245K9900L2361N113l2110j0184K0981
29977D1537k9556r1512k8691R9243J03840j9651q6667l2963J3607n106J0198Q9395
29965F3674J12459L2526l0753l746K8083O74k0158O104Q721m0527n8296j6925
29953H1836j1449p5480r9368k2308N6926N2622J8983J8800K2255J5824M7303Q7980
$$ plain form
30035 42397 4883 -3676 -19156 -62396 -87272 -69108 -50090 -50637 -31814 4801 -17961 -123370
30023 -123370 -211929 -198821 -134811 -105479 -88265 -11483 99805 146675 103643 48592 44975
30012 44975 67305 56845 1333 -58709 -77999 -48599 -1368 29389 33813 15960 -17739 -39931
30000 -39931 -10330 59845 94718 57626 17249 38869 70100 37080 -4085 47422 135353 97697
29988 97697 -75153 -203005 -171856 -67769 -4524 25376 57737 62850 30740 20556 41537
29977 41537 11981 -79531 -108222 -8979 94861 75210 -11457 -44420 -30813 -35919 -25721 63674
29965 63674 176133 208659 177906 174160 202243 202917 182759 188863 197584 157057 98761 81836
29953 81836 70387 -5093 -104461 -126769 -69843 -17221 1762 20562 42817 58641 105944 193924
29941A93924L1347r3414j11088M705N5485m1186q5066N7670J85890P8846j29848
29930A47265j66275m0820L0514N580J3176N0606l054r8400m6816J32704J80798
29919B05278j1107k16644j92080O639J44161J09552j3751r3841p2031J2666O5107
29908e6051L1702l1855l3579K8949Q1362Q9213P5515L7416n2837j57975j83415
29897a71555r8833J9929Q6254P9959K7230l2695n7508l4715l038L521J0034M6418
29885a24999P5296M5487j4413l4960j1829O639R634J6994J1808k5228l9442L3097
29873e1916J35943J38697K1535q8141q4287j612N6095L5928l4363q0126l9669
29862H084O0078J06508L8280n8063o8254j9534j7916n7004l7166L4782L4157n9911
$$ plain form
29941 193924 225271 131857 20769 25474 80959 39773 -45293 12377 198267 277113 147265
29930 147265 -19010 -59830 -29316 -23736 -10560 40046 36992 -61408 -108224 24480 205278
29919 205278 194171 -22473 -214553 -207914 -63753 45799 32048 -61793 -133824 -121158 -56051
29908 -56051 -24349 -56204 -89783 -60834 20528 109741 185256 222672 169835 11860 -171555
29897 -171555 -270388 -250459 -164205 -84246 -57016 -89711 -147219 -181934 -184972 -181451 -171417 -124999
29885 -124999 -49703 -4216 -18629 -53589 -65418 -58779 -49145 -32151 -20343 -45571 -85013 -51916
29873 -51916 84027 222724 244259 156118 71831 70219 126314 162242 127879 47753 8084
29862 8084 68162 174670 212950 154887 86633 67099 49183 -7821 -44987 -10205 23952 -35959
29850c5959j01080j1877O9641j902j42730j59589l6595N4946J7619m6978q740
29839d03244J06388J70059J27165M3635j112m217r108l0361m2174k4572J0267
29828e7274L4682K6719j6675o2047n0555L2135J09842R6114J5801k3171J5159
29817A20730N2755L3695N643J5319J7882l3171q6125p0813j4618J0670o98k0992
29805C0277o7732j45287j69010p0057P0430J18861P9852N3869M6908j2939q9434
29794a54262n8356O3910J02206m519q9332j3636J16370J16269j0135j09319j04056
29783a44860m6419O111M3398N5490L6045J9658L4461L9264j2384p1904n0616L9246
29771e2510R3274O5730J7776m4j7847n9509p3327j7363M8004L5948l1547n2585
$$ plain form
29850 -35959 -137039 -148916 -79275 -81177 -223907 -383496 -420091 -365145 -347526 -394504 -403244
29839 -403244 -296856 -126797 368 44003 42891 38674 29566 -795 -42969 -67541 -57274
29828 -57274 -22592 4127 -12548 -74595 -125150 -93015 16827 112941 128742 105571 120730
29817 120730 173485 207180 212823 228142 246024 212853 126728 55915 41297 51967 51269 30277
29805 30277 -37455 -182742 -351752 -421809 -351379 -232518 -152666 -98797 -51889 -64828 -154262
29794 -154262 -212618 -148708 -46502 -51021 -140353 -153989 -37619 78650 68515 -40804 -144860
29783 -144860 -191279 -185168 -141770 -86280 -50235 -30577 3884 43148 30764 -41140 -91756 -52510
29771 -52510 40764 106494 124270 124226 106379 46870 -26457 -43820 4184 40132 8585 -44000
29759d4000j521L5484K516l6819n999O0038P3953L0109r050k7522n5607p3053
29747e1471k9250L5511J8732o3014o0962P1429J69919R0946p0555j30413q2216
29736a01344n3653o8332l5434N1081Q7127M3268J1002L6701N7748L8665K7398
29725I4227L4310j027o8328n8697M7417J08130L5986m6209O343J23332J21537
29714C97021k2237j52929j62366r3147k3998J9674K3891l0330j00977r1346K4554
29703b12190J42685J46825M6888m6938o0312j6021K8604N0687N0445J4646o1410
29692H3909j28250j14237k1015N9549N7162J1589L313L1497K7073k7192o2149
29681g8751j9887O8934J25524J05612L0567l7537n1631l1010l9199q5999r2909
$$ plain form
29759 -44000 -45521 -10037 -7521 -44340 -50339 9699 83652 113761 104711 77189 21582 -51471
29747 -51471 -80721 -45210 -26478 -89492 -150454 -79025 90894 181840 111285 -19128 -101344
29736 -101344 -154997 -223329 -258763 -207682 -120555 -77287 -66285 -29584 28164 66829 94227
29725 94227 128537 127510 59182 485 47902 156032 192018 145809 152152 275484 397021
29714 397021 374784 221855 59489 -33658 -57656 -37982 -14091 -44421 -145398 -236744 -212190
29703 -212190 -69505 77320 124208 77270 16958 937 29541 80228 130673 145319 83909
29692 83909 -44341 -158578 -179593 -120044 -62882 -51293 -47980 -16483 10590 -16602 -78751
29681 -78751 -98638 -29704 95820 201432 231999 194462 142831 111821 72622 -13377 -106286
29670a06286o137J01801J19809N1067j3800m6290q7836j19479o1008O9365J25380
29659B6586K8976j05525j21249j7863P5555P2181K284m7638j9068O6586J13047
29648G3872M8082o6988r0294J4105J18393R9578q560q5068p8140l2265r437l6483
29636e3205r1030j04580k7473Q4560J14012L8810l4478l0256m7k623O608P5710
29624b3992J35457R4099n006l8957J1851M7493O380n7896o7985j9123L1818L0196
29612A44335k8095q6910q1325j5982L7260L3691J225k3389l8956l6925N884N4539
29600c4648K5724p6426j28306n8605M4069P5469O4051P3280O2898j6130p8165
29589d6789j7828R0000P8421n1180j29570p7654N228L2628M7068R0635J00231
$$ plain form
29670 -106286 -112423 -10622 109187 160254 146454 100164 12328 -107151 -168159 -98794 26586
29659 26586 55562 -49963 -171212 -189075 -113520 -41339 -39055 -86693 -105761 -39175 73872
29648 73872 121954 54966 -35328 -21223 97170 196748 188188 103120 24980 -7285 -16722 -53205
29636 -53205 -144235 -248815 -276288 -191728 -77716 -38906 -73384 -103640 -103687 -106310 -99702 -23992
29624 -23992 111465 205564 200558 161601 173452 220945 227325 169429 101444 82321 114139 144335
29612 144335 116240 29330 -51995 -67977 -30717 2974 4199 -19190 -58146 -95071 -89187 -34648
29600 -34648 -8924 -85350 -213656 -272261 -228192 -152723 -88672 -15392 47506 31376 -46789
29589 -46789 -64617 25383 103804 52624 -76946 -154600 -149372 -116744 -69676 20959 121190
29578A21190J3969j11449j64787j05675J7904J26611J58177J08459L9017L582
29568B06998j7151n2774n7819J5884R7706P4541k6254p0246l3947l1259r3039
29557A2640r3837K6456J31112R2468n245j0175N2898M4076m7909r2883l5900K9477
29545A03178K8349J0674L5108N1851j4743j24730j53715n7378O4205Q9268J9528
29534E1595l6955j2701L9161L0167l9768q9154o8251j3803J4696R660O764K8284
29522h0305N5430N0265K426m4158l0848L5136P2535L1193l1683l3421R270J2692
29510D8532l4522n6643k3746k563l5374n4559J2975J13042J18278k048j35220
29499e1848j56346n9821N7986J15557J14054R5712P3701L3859j3517l4573k9943
$$ plain form
29578 121190 135159 23710 -141077 -246752 -228848 -102237 55940 164399 203416 206998
29568 206998 189847 137073 79254 95138 192844 267385 241131 170885 136938 105679 12640
29557 12640 -81197 -54741 76371 168839 163594 153419 206317 250393 202484 109601 73701 103178
29545 103178 131527 142201 177309 229160 214417 89687 -64028 -121406 -57201 32067 51595
29534 51595 14640 1939 41100 71267 31499 -57655 -125906 -139709 -125013 -115353 -108589 -80305
29522 -80305 -24875 25390 27816 -16342 -47190 -12054 60481 91674 59991 26570 35840 48532
29510 48532 14010 -42633 -66379 -68942 -104316 -158875 -145900 -32858 85420 83372 -51848
29499 -51848 -208194 -268015 -210029 -94472 19582 115294 188995 222854 209337 174764 144821
29488A44821l8435o4238n9835j2773J8302L008N13N0287P8677J5135o6540n1924
29476A6998J9400J5198n9543o6837K1984P1332J6672k6786K1351N3080l5533j35955
29464h8639p6825J03052K00881J31774J1771l3103o530K5901L3785J6844k0541
29453B98370n6894o3664m2785j7922O191L1371K6040m1900j30191j41682m2990
$$ plain form
29488 144821 106386 42148 -17687 -30460 -12158 -9150 -8637 41650 120327 135462 68922 16998
29476 16998 36398 51596 -7947 -74784 -52800 18532 35204 8418 29769 82849 47316 -88639
29464 -88639 -165464 -62412 138469 270243 282014 248911 242381 268282 302067 318911 298370
29453 298370 241476 177812 135027 117105 123296 154667 180707 138807 8616 -133066 -176056
$$ [...]
##END NTUPLES=NMR SPECTRUM
##END=
