##TITLE=31Pdec_LY-DMAA.Per.1.9
 CD3CN, 124 sc
 11.2.2022
##JCAMPDX= 6.0         $$ Bruker NMR JCAMP-DX V2.0
##DATA TYPE= NMR SPECTRUM
##DATA CLASS= NTUPLES
##ORIGIN= UXNMR, Bruker Analytische Messtechnik GmbH
##OWNER= root
$$ XWIN-NMR		Version 3.5
$$ Fri Feb 11 11:53:56 2022 Russian Standard Time (UT+4h)  she@DPX200
##.OBSERVE FREQUENCY= 81.013821
##.OBSERVE NUCLEUS= ^31P
##.ACQUISITION MODE= SIMULTANEOUS
##.ACQUISITION SCHEME= undefined
##.AVERAGES= 124
##.DIGITISER RES= 16
##SPECTROMETER/DATA SYSTEM= spect
##.PULSE SEQUENCE= zgpg30
##.SOLVENT NAME= CDCl3
##.SHIFT REFERENCE= (INTERNAL, CDCl3, 0, 248.564)
##AUDIT TRAIL= $$ (NUMBER, WHEN, WHO, WHERE, WHAT)
$$ ##TITLE= Audit trail, XWIN-NMR		Version 3.5
$$ ##JCAMPDX= 5.01
$$ ##ORIGIN= Bruker BioSpin GmbH
$$ ##OWNER= she
$$ F:/spectra/data/she/nmr/P31/1/pdata/1/auditp.txt
$$ ##AUDIT TRAIL=  $$ (NUMBER, WHEN, WHO, WHERE, WHAT)
(   1,<2022-02-11 11:51:39.10 +0400>,<she>,<DPX200>,
      <continue with go, POWCHK disabled, PULCHK disabled
       configuration hash MD5:
       00 E9 B6 7A A2 85 ED C7 34 08 36 98 17 FE 4E 26
       data hash MD5: 32K
       10 6B E3 24 0B 0C 60 6F A4 0D 86 04 E0 1C 63 E8>)
(   2,<2022-02-11 11:51:54.68 +0400>,<she>,<DPX200>,
      <Start of raw data processing
       efp BC_mod = 2 LB = 1 FT_mod = 6 PKNL = 1 PHC0 = -9712.662 PHC1 = 475.2746 SI = 64K 
       data hash MD5: 64K
       51 39 C0 3B C3 F3 73 1B 74 4A B1 C5 0E 77 24 46>)
(   3,<2022-02-11 11:52:58.07 +0400>,<she>,<DPX200>,
      <pk PHC0 = -21.40338 PHC1 = 137.8 
       data hash MD5: 64K
       C9 3E 6B 6C EE A0 2B 96 BD 23 95 F0 09 DA 46 43>)
$$ ##END=
$$ 
$$ hash MD5
$$ A9 B4 30 00 F4 E8 06 0A 4E 21 14 75 54 7A 1C AD
##$RELAX= 
##$RELAX= 
##$RELAX= 
##$RELAX= 
##$RELAX= 
##$RELAX= 
##$RELAX= 
##$RELAX= 
$$ Bruker specific parameters
$$ --------------------------
##$DU= <F:/spectra>
##$EXPNO= 1
##$NAME= <P31>
##$PROCNO= 1
##$TYPE= <nmr>
##$USER= <she>
##$AMP= (0..31)
100 100 100 100 100 100 100 100 100 100 100 100 100 100 100 100 100 100 
100 100 100 100 100 100 100 100 100 100 100 100 100 100 
##$AQSEQ= 0
##$AQ_mod= 1
##$AUNM= <au_zg>
##$AUTOPOS= <>
##$BF1= 81.014009
##$BF2= 200.13
##$BF3= 200.13
##$BF4= 200.13
##$BF5= 200.13
##$BF6= 200.13
##$BF7= 200.13
##$BF8= 200.13
##$BYTORDA= 1
##$CFDGTYP= 0
##$CFRGTYP= 5
##$CHEMSTR= <none>
##$CNST= (0..31)
1 1 145 1 1 1 1 1 1 1 1 1 1 1 1 1 1 1 1 1 1 1 1 1 1 1 1 1 1 1 1 1 
##$CPDPRG= <waltz16>
##$CPDPRG1= <>
##$CPDPRG2= <waltz16>
##$CPDPRG3= <>
##$CPDPRG4= <mlev>
##$CPDPRG5= <mlev>
##$CPDPRG6= <mlev>
##$CPDPRG7= <mlev>
##$CPDPRG8= <mlev>
##$CPDPRGB= <>
##$CPDPRGT= <>
##$D= (0..31)
0 1 0 0 0 0 0 0 0 0 0 0.03 2e-05 3e-06 0 0 0 0 0 0 0 0 0 0 0 0 0 0 0 0 
0 0 
##$DATE= 1644565707
##$DBL= (0..7)
120 120 120 11 120 120 24 19 
##$DBP= (0..7)
150 150 150 150 150 150 150 150 
##$DBP07= 0
##$DBPNAM0= <>
##$DBPNAM1= <>
##$DBPNAM2= <>
##$DBPNAM3= <>
##$DBPNAM4= <>
##$DBPNAM5= <>
##$DBPNAM6= <>
##$DBPNAM7= <>
##$DBPOAL= (0..7)
0.5 0.5 0.5 0.5 0.5 0.5 0.5 0.5 
##$DBPOFFS= (0..7)
$$ [...]
##$SUBNAM2= <"">
##$SUBNAM3= <"">
##$SUBNAM4= <"">
##$SUBNAM5= <"">
##$SUBNAM6= <"">
##$SUBNAM7= <"">
##$SUBNAM8= <"">
##$SUBNAM9= <"">
##$SW= 501.771253377433
##$SWIBOX= (0..15)
0 1 3 0 0 0 0 0 0 0 0 0 0 0 0 0 
##$SW_h= 40650.406504065
##$TD= 32768
##$TD0= 1
##$TE= 0
##$TE2= 300
##$TE3= 300
##$TEG= 300
##$TL= (0..7)
0 120 53 12 22 120 120 120 
##$TP= (0..7)
150 150 150 150 150 150 150 150 
##$TP07= 0
##$TPNAME0= <>
##$TPNAME1= <>
##$TPNAME2= <>
##$TPNAME3= <>
##$TPNAME4= <>
##$TPNAME5= <>
##$TPNAME6= <>
##$TPNAME7= <>
##$TPOAL= (0..7)
0.5 0.5 0.5 0.5 0.5 0.5 0.5 0.5 
##$TPOFFS= (0..7)
0 0 0 0 0 0 0 0 
##$TUNHIN= 0
##$TUNHOUT= 0
##$TUNXOUT= 0
##$USERA1= <user>
##$USERA2= <user>
##$USERA3= <user>
##$USERA4= <user>
##$USERA5= <user>
##$V9= 5
##$VALIST= <valist>
##$VCLIST= <CCCCCCCCCCCCCCC>
##$VD= 0
##$VDLIST= <DDDDDDDDDDDDDDD>
##$VPLIST= <PPPPPPPPPPPPPPP>
##$VTLIST= <TTTTTTTTTTTTTTT>
##$WBST= 1024
##$WBSW= 4
##$XGAIN= (0..3)
0 0 0 0 
##$XL= 0
##$YL= 0
##$YMAX_a= 2291
##$YMIN_a= -11372
##$ZGOPTNS= <>
##$ZL1= 120
##$ZL2= 120
##$ZL3= 120
##$ZL4= 120
##$ABSF1= 0
##$ABSF2= 0
##$ABSG= 0
##$ABSL= 0
##$ALPHA= 0
##$AQORDER= 0
##$ASSFAC= 0
##$ASSFACI= 0
##$ASSFACX= 0
##$ASSWID= 0
##$AUNMP= <proc_1d>
##$AZFE= 0.1
##$AZFW= 0.5
##$BCFW= 0
##$BC_mod= 2
##$BYTORDP= 0
##$COROFFS= 0
##$CY= -3
##$DATMOD= 1
##$DC= 0
##$DFILT= <>
##$DTYPP= 0
##$F1P= 0
##$F2P= 0
##$FCOR= 1
##$FTSIZE= 65536
##$FT_mod= 6
##$GAMMA= 0
##$GB= 0
##$INTBC= 1
##$INTSCL= 5.30512e-09
##$ISEN= 30
##$LB= 1
##$LEV0= 0
##$LPBIN= 0
##$MAXI= 10000
##$MC2= 0
##$MEAN= 0
##$ME_mod= 0
##$MI= 50
##$NCOEF= 0
##$NC_proc= -9
##$NLEV= 6
##$NOISF1= 182.463
##$NOISF2= 159.3651
##$NSP= 0
##$NTH_PI= 0
##$NZP= 0
##$OFFSET= 248.5645
##$PC= 4
##$PHC0= -9734.065
##$PHC1= 613.0746
##$PH_mod= 1
##$PKNL= yes
##$PPARMOD= 0
##$PSCAL= 0
##$PSIGN= 0
##$REVERSE= no
##$SF= 81.014009
##$SI= 65536
##$SIGF1= 159.3651
##$SIGF2= -187.1042
##$SINO= 113.3802
##$SIOLD= 16384
##$SREGLST= <1H.CDCl3>
##$SSB= 0
##$STSI= 65536
##$STSR= 0
##$SW_p= 40650.406504065
##$SYMM= 0
##$S_DEV= 0
##$TDeff= 32768
##$TDoff= 0
##$TI= <>
##$TILT= no
##$TM1= 0
##$TM2= 0
##$TOPLEV= 0
##$USERP1= <user>
##$USERP2= <user>
##$USERP3= <user>
##$USERP4= <user>
##$USERP5= <user>
##$WDW= 1
##$XDIM= 65536
##$YMAX_p= 269043996
##$YMIN_p= -93865690
$$ End of Bruker specific parameters
$$ ---------------------------------
##NTUPLES= NMR SPECTRUM
##VAR_NAME=  FREQUENCY,     SPECTRUM/REAL,   SPECTRUM/IMAG
##SYMBOL=    X,             R,               I
##VAR_TYPE=  INDEPENDENT,   DEPENDENT,       DEPENDENT
##VAR_FORM=  AFFN,          ASDF,            ASDF
##VAR_DIM=   65536,         65536,           65536
##UNITS=     HZ,            ARBITRARY UNITS, ARBITRARY UNITS
##FACTOR=    0.620285442955139, 1,           1
##FIRST=     20137.2065510759, 0,            0
##LAST=      -20513.1999529892, 0,           0
##MIN=       -20513.1999529892, -93865690,   0
##MAX=       20137.2065510759, 269043996,    0
$$ Real data points
##PAGE= N=1
##DATA TABLE= (X++(R..R)), XYDATA
$$ [...]
12789c5648009j1152613K1991229K7922595J063187k6237812k0100701J1642681
$$ -35648009 -46800622 -24809393 3113202 4176389 -22061423 -42162124 -30519443
12782c0519443K6764850N751677k0933929j9604265k475560j168553j1484697
$$ -30519443 -3754593 1997084 -18936845 -38541110 -41016670 -42185223 -53669920
12775e3669920l360708K3754927L6894445K1906365J929369l243699j994358m617833
$$ -53669920 -57030628 -33275701 3618744 25525109 27454478 24210779 22216421 17598588
12767A7598588l804875M140789N753210n462908j4115485q351392L30908r38630
$$ 17598588 13793713 17934502 23687712 18224804 4109319 -4242073 -3911165 -4849795
12759d849795m044385K380030J0157052O577458j628960k07659P070486N791677
$$ -4849795 -8894180 -6514150 3642902 10220360 8591400 8383741 15454227 21245904
12751B1245904l141776n978410j481145l332387j5323301k2065493j1144497Q050514
$$ 21245904 18104128 12125718 10644573 7312186 -8011115 -30076608 -41221105 -33170591
12743c3170591J6419392R278287j89691K3725N497454K979077r786671j8927455
$$ -33170591 -16751199 -7472912 -7662603 -7638878 -2141424 837653 -8949018 -27876473
12735b7876473j1962137O000028J9641236K1033081J1516296o644762k6555854
$$ -27876473 -39838610 -33838582 -14197346 6835735 18352031 11707269 -14848585
12728a4848585l0337293o515498K5985444L3418205J2260001m631566K770580
$$ -14848585 -45185878 -51701376 -25715932 7702273 19962274 15330708 18101288
12721A8101288J2034291k714139k5923467k4414772p45461J1986126K941062m923608
$$ 18101288 30135579 27421440 1497973 -22916799 -23662260 -11676134 -8735072 -13658680
12713a3658680J033093L450805q309450j4315488K102717K1999238J8063761l052252
$$ -13658680 -12625587 -9174782 -17484232 -31799720 -29697003 -7697765 10365996 7313744
12705G313744j2507946k554258Q262273P447432J319044k633609l766208P43083
$$ 7313744 -5194202 -7748460 513813 7961245 9280289 6646680 2880472 3623555
12697C623555J1750300J5677609j059254k4417653k4867580j547852J2964930
$$ 3623555 15373855 31051464 29992210 5574557 -19293023 -20840875 -7875945
12690g875945J544903j2014714l002941J4900277J4259236k333950j1395785q666540
$$ -7875945 -6331042 -18345756 -21348697 -6448420 7810816 5476866 -5918919 -14585459
12682a4585459j0493727k0470607k2666257r397511P158874J4804308J4647721
$$ -14585459 -25079186 -45549793 -68216050 -77613561 -70454687 -55650379 -41002658
12675d1002658J1501712O822564M097745P363237J2092220R597560R85467m729550
$$ -41002658 -29500946 -22678382 -18580637 -11217400 874820 10472380 11457847 6728297
12667F728297m958546m017144k287769J991905M125565L72876j429021N257629
$$ 6728297 1769751 -2247393 -4535162 -2543257 1582308 1955184 526163 5783792
12659E783792R440022n64187j1640666l271677J4069477R271779j8321166l1320733
$$ 5783792 15223814 14659627 3018961 -252716 13816761 23088540 4767374 -26553359
12651b6553359q455802K3531677K8439377O960618j3509520j6404961n527989
$$ -26553359 -35009161 -11477484 16961893 23922511 10412991 -5991970 -11519959
12644a1519959Q569736J6072712J1968654K757002p66009q95277p918514j6723249
$$ -11519959 -2950223 13122489 25091143 27848145 27082136 26186859 18268345 1545096
12636A545096j1188774M510576O837153o820202r874030P916830J9543514N627487
$$ 1545096 -9643678 -5133102 1704051 -5116151 -14990181 -7073351 12470163 18097650
12628A8097650j1974315q064904L939352J84934r091071p39074J4906114R803603
$$ 18097650 6123335 -1941569 1997783 2182717 -6908354 -7647428 7258686 17062289
12620A7062289j0696250j3668171P072314K0071635M058872k3809515l4662902
$$ 17062289 6366039 -7302132 -229818 19841817 23900689 91174 -34571728
12613c4571728k0226957O714750K6305431K4005994M004172j0994549o012448
$$ -34571728 -54798685 -48083935 -21778504 2227490 6231662 -4762887 -10775335
12606a0775335O847767Q866751K471330J11284p07076p354592r775271L510460
$$ -10775335 -3927568 4939183 7410513 7521797 6814721 -539871 -10315142 -6804682
12598f804682J6933773O475413j9235793k8232005j2780413M009494Q271278R578506
$$ -6804682 10129091 16604504 -2631289 -30863294 -43643707 -39634213 -31362935 -21784429
12590b1784429J2861102Q818198j192133r82185J1028561J5737460N832970k213762
$$ -21784429 -8923327 -105129 -1297262 -2279447 8749114 24486574 30319544 28105782
12582B8105782J088138J664618j0455737k0347769j1652453O925529J5036260
$$ 28105782 29193920 30858538 20402801 55032 -11597421 -4671892 10364368
12575A0364368Q567448L76796N54922N385981K736681j3292941l0071999k5782655
$$ 10364368 18931816 19308612 19863534 25249515 27986196 14693255 -15378744 -41161399
12567d1161399O64753K1195640J5207865M21331M664868K0666465J9278736j298604
$$ -41161399 -40496646 -19301006 -4093141 -3671810 993058 21659523 40938259 39639655
12559C9639655j4397870r968317n084110p751220n478648M470919O658563l119953
$$ 39639655 25241785 15273468 10189358 2438138 -3040510 1430409 8088972 4969019
12551D969019j0162570q729276q147437p754103K199856J2768631N797795p080251
$$ 4969019 -5193551 -13922827 -22070264 -29824367 -27624511 -14855880 -9058085 -16138336
12543a6138336K798882K5529277J9428648j6123408k9858911j075006K3928047
$$ -16138336 -13339454 12189823 31618471 15495063 -14363848 -15438854 8489193
12536H489193Q913901j4174176o016092J1666914M65004k3104874j8367536P035399
$$ 8489193 17403094 3228918 -2787174 8879740 9344744 -13760130 -32127666 -25092267
12528b5092267J4122112J069568k139169P260557O142008m195420j979333P539462
$$ -25092267 -10970155 -9900587 -12039756 -4779199 1362809 -2832611 -4811944 2727518
12520B727518L09628j5050451o334845K1846258K9340659P196761q697358j399726
$$ 2727518 3037146 -12013305 -18348150 3498108 32838767 40035528 31338170 29938444
12512B9938444K91500k2644459m2626426k9939973J060552J7001159J1483182
$$ 29938444 30229944 7585485 -35040941 -64980914 -63920362 -46919203 -35436021
12505c5436021K775524L574888J0522442J1494368l660070k6127572k5826366
$$ -35436021 -32660497 -29085609 -18563167 -7068799 -10728869 -36856441 -62682807
12498f2682807J0258366M4747956L0775943j6631832l5038547n719187K1016997
$$ -62682807 -52424441 -7676485 23099458 6467626 -28570921 -34290108 -13273111
12491a3273111Q337842j3128343n011824J4252284Q241225j2734987j5663452
$$ -13273111 -4935269 -18063612 -23075436 -8823152 -581927 -13316914 -28980366
12484b8980366n500328r214646j8067142n33830L5122510M4457632J5541489j3078464
$$ -28980366 -34480694 -43695340 -61762482 -62296312 -27173802 17283830 32825319 19746855
12476A9746855j1530882N320785J2295822P652588j471044j5033151k6148668
$$ 19746855 8215973 13536758 25832580 33485168 32014124 16980973 -9167695
12469i167695j9265633K751057J5078519P614307j006858R32584j523989j5929577
$$ -9167695 -28433328 -25682271 -10603752 -2989445 -3996303 -3063719 -4587708 -20517285
12461b0517285j9666112K455341K4722008J6653216q200061j4493668n53558O151210
$$ -20517285 -40183397 -37728056 -13006048 3647168 -4552893 -19046561 -19600119 -13448909
12453a3448909n41675J51638J2386731J4101223k014025j3368709n446224N691707
$$ -13448909 -13990584 -13838946 -1452215 12649008 10634983 -2733726 -8179950 -2488243
12445b488243L658837k411657Q46211P143766N946688K101575K557617J260920
$$ -2488243 1170594 -1241063 -394852 6748914 12695602 14797177 17354794 18615714
12437A8615714n822030p990053Q41231P684687L252192N74302J0472673J7582840
$$ 18615714 12793684 4803631 5644862 13329549 16581741 17156043 27628716 45211556
12429D5211556N505838j1607796j0973058J71886q01065j0542352p712068N196612
$$ 45211556 50717394 39109598 28136540 28308426 27507361 16965009 9252941 14449553
12421A4449553N251894p533871q020844Q978138J7966943N615017r903342j3559669
$$ 14449553 19701447 12167576 4146732 13124870 31091813 36706830 26803488 13243819
12413A3243819j4089753j5844389l830810K2753130L3075058P658925k5232785
$$ 13243819 -845934 -16690323 -20521133 2231997 35307055 42965980 17733195
12406A7733195k5808571J494403J8268782P866649q237107p490510M792160Q169795
$$ 17733195 -8075376 -6580973 11687809 19554458 11317351 3826841 8619001 16788796
12398A6788796n802931k4250015k6053279n372176J7593055J7935190j198027
$$ 16788796 10985865 -13264150 -39317429 -44689605 -27096550 -9161360 -10359387
12391a0359387j1704831o6835J4868762J2545349k80677n305283o36867L767931
$$ -10359387 -22064218 -22131053 -7262291 5283058 5002381 -302902 -939769 2828162
12383B828162N215590O130438M174750P0505L777410J6994192K1491235L111821
$$ 2828162 8043752 14174190 18348940 18419445 22196855 39191047 60682282 63794103
12375F3794103k2676108k8896697j3874222n16794k460147r218092n786752O795075
$$ 63794103 41117995 12221298 -1652924 -2169718 -4629865 -13847957 -19634709 -12839634
12367a2839634J3932088M791244j3217001j8351635o60057J8500767R829544j9914041
$$ -12839634 1092454 5883698 -7333303 -25684938 -26344995 -7844228 1985316 -17928725
12359a7928725l0551451l554129L0504346L4753383J2668149q165723j7395817
$$ -17928725 -48480176 -52034305 -21529959 13223424 25891573 17725850 330033
12352C30033k1971570k1218478q975954Q281732J7743100J7672968J2405570J585813
$$ 330033 -21641537 -42860015 -51835969 -43554237 -25811137 -8138169 4267401 5853214
12344E853214j0107885q516134O800271J3101428j579392j5590691q431237M546736
$$ 5853214 -4254671 -12770805 -5970534 7130894 5551502 -10039189 -18470426 -13923690
12336a3923690J642725m286901Q622171K4594115J2681454j6485184k2197225
$$ -13923690 -12280965 -16567866 -7945695 16648420 29329874 12844690 -9352535
12329i352535K877883K4651175K2426820R668215j916710j7229538l0885787k5112273
$$ -9352535 -6474652 18176523 40603343 50271558 48354848 31125310 239523 -24872750
12321b4872750l564555P929188K119727k102274J641276k094056j3868717j2061171
$$ -24872750 -28437305 -20508117 -18388390 -20490664 -18849388 -20943444 -34812161 -46873332
12313d6873332O541726J6437565O701768k147912J818466L034936m710537k308720
$$ -46873332 -40331606 -23894041 -17192273 -19340185 -17521719 -14486783 -19197320 -21506040
12305b1506040J3640270J4053087j2349335l0100261j0008658K2568269K8016259
$$ -21506040 -7865770 6187317 -6162018 -36262279 -46270937 -23702668 4313591
12298D313591J2130774O428554J1636768L299821j8942694k8237243j3732687
$$ 4313591 16444365 22872919 34509687 37809508 18866814 -9370429 -23103116
12291b3103116N482068J0424956J997017r196900j3767603n841320J0579448K1011758
$$ -23103116 -17621048 -7196092 -5199075 -14395975 -28163578 -34004898 -23425450 -2413692
12283b413692J7187258P056030j91893n876309r138654q29738J5910082J8700543
$$ -2413692 14773566 21829596 21637703 15761394 6622740 5793002 21703084 40403627
12275D0403627k078449k2958696j9866585l393447J164638p493237j2911546j1265470
$$ 40403627 38325178 15366482 -4500103 -7893550 -6728912 -14222149 -27133695 -38399165
12267c8399165r017773k403881J3470468K4839616J5867761k768647q464484k485270
$$ -38399165 -47416938 -49820819 -36350351 -11510735 4357026 1588379 -6876105 -9361375
12259i361375l499847j1312397p117756J1088287K2400721J5784580L827811j222514
$$ -9361375 -12861222 -24173619 -31291375 -20203088 2197633 17982213 21810024 20587510
12251B0587510k961105o347528p036377k297017K199356K140553n2492j927490
$$ 20587510 17626405 11278877 4242500 1945483 4144839 6285392 6232900 4305410
12243D305410l332342k866477j353069m792693j3523028j5360646k580360J1898408
$$ 4305410 973068 -1893409 -3246478 -8039171 -21562199 -36922845 -39503205 -27604797
12235b7604797J0428686m416633j6158181j7183788q680630J1216770L7953980
$$ -27604797 -17176111 -21592744 -37750925 -54934713 -63615343 -52398573 -14444593
12228a4444593M9131088K8041146p024479k2445312j3943640n337365o638771
$$ -14444593 34686495 62727641 55703162 33257850 19314210 13976845 7338074
12221G338074l879261P850621J2460408K028586q721915p278321n49919J660828
$$ 7338074 3458813 11309434 23769842 25798428 17076513 9798192 9248273 10909101
12213A0909101L4548m707237j4760874k0652354n934805K4103581L9728691K3899025
$$ 10909101 10943649 6236412 -8524462 -29176816 -35111621 -11008040 28720651 52619676
12205E2619676o509772k6083688k8278505j8635600k306064R962631M905847j0424708
$$ 52619676 46109904 20026216 -8252289 -26887889 -29193953 -19231322 -14325475 -24750183
12197b4750183r872390J2749196K7932157J2912300j1722847j2613316O414713
$$ -24750183 -34622573 -21873377 6058780 18971080 7248233 -5365083 1049630
12190A049630J3818460n92770j5765814j5463813o925266j018948K971787O377468
$$ 1049630 14868090 14275320 -1490494 -16954307 -23879573 -24898521 -21926734 -15549266
12182a5549266L267284p727408j5677280r354955R118993K6039943K7591987J1179038
$$ -15549266 -12281982 -20009390 -35686670 -45041625 -35922632 -9882689 17709298 28888336
12174B8888336r282416j3811222K12836J1329370J662340j5961865j5076407M742305
$$ 28888336 19605920 5794698 6007534 17336904 18999244 3037379 -12039028 -7296723
12166g296723J6791124P784592m076262j576932L304202p478793k3332387j9336882
$$ -7296723 9494401 17278993 13202731 11625799 14930001 7451208 -15881179 -35218061
12158c5218061J900221J1333604p96616q718936O422019K3104812J2038410j4774333
$$ -35218061 -33317840 -21984236 -22780852 -31499788 -25077769 -1972957 10065453 -4708880
12150d708880j8785374O506394K5141506J3433587o427825m751718R867724R336555
$$ -4708880 -23494254 -16987860 8153646 21587233 15159408 10407690 20275414 29611969
12142B9611969o477640j2116016k3745Q860766N97995j2186301j4103281q295500
$$ 29611969 23134329 11018313 10994568 19855334 20453329 8267028 -5836253 -14131753
12134a4131753l330359K444972J0436914J0915391k479703j7873461j9020943
$$ -14131753 -17462112 -15017140 -4580226 6335165 3855462 -14017999 -33038942
12127c3038942o652653O368716J4094923J8737282J8872973J1023768N69977k723426
$$ -33038942 -39691595 -33322879 -19227956 -490674 18382299 29406067 29976044 27252618
12119B7252618O303j366691p654037p441876K946209R616530P38745j3602132
$$ 27252618 27258921 25892230 18238193 10796317 13742526 23359056 24097801 10495669
12111A0495669j4332678j419200O407598Q71813l521758N353410J4923937O968476
$$ 10495669 -3837009 -5256209 1151389 2023202 -1498556 3854854 18778791 25747267
12103B5747267j0776455j3944035j90224O231612n569789j3966823n01208J7800392
$$ 25747267 14970812 1026777 836553 7068165 1498376 -12468447 -12969655 4830737
12095D830737J4725007k929180p407002N016149J1296115J471457r178756j1266403
$$ 4830737 19555744 16626564 9219562 14235711 25531826 27003283 17824527 6558124
12087F558124j4541559k0971547j3870189J0282175K5187172J1644284r497141
$$ 6558124 -7983435 -28954982 -42825171 -32542996 -7355824 4288460 -5208681
12080e208681o998923J2889985J7224621j891619j6462503o291136J2706622J4409522
$$ -5208681 -12207604 682381 17907002 16015383 -447120 -6738256 5968366 20377888
12072B0377888j963907j5927757j4193264j656026J0304747J4154363O402274
$$ 20377888 18413981 2486224 -11707040 -13363066 -3058319 11096044 17498318
12065A7498318j0933064k5688004k1770273J597822K1701091J5010691j1284013
$$ 17498318 6565254 -19122750 -40893023 -39295201 -17594110 -2583419 -13867432
12058a3867432k3438083l322183K6495680L2412786J3445329l546602n285046
$$ -13867432 -37305515 -40627698 -14132018 18280768 31726097 28179495 22894449
12051B2894449m153124q324344p070559M120392Q641738l870297j5478941o820872
$$ 22894449 18741325 10416981 3346422 7466814 16108552 12238255 -3240686 -10061558
12043a0061558R588764Q217000p644165j1438527K407244R676904k626206j4268011
$$ -10061558 -472794 7744206 100041 -11338486 -8931242 745662 -1880544 -16148555
12035a6148555m967476J2289650J1523356o187151j6038414p948175J678539J91933
$$ -16148555 -21116031 -8826381 2696975 -3490176 -19528590 -27476765 -25798226 -25606293
12027b5606293r28241J1257948K4158603J5972193p363155j5408717K476678J8863520
$$ -25606293 -26534534 -15276586 8882017 24854210 17491055 2082338 4559016 23422536
12019B3422536P558397j7632164k4063755p480588P408831P934188O707773J1404632
$$ 23422536 30980933 13348769 -10714986 -18195574 -10786743 -2852555 3855218 15259850
12011A5259850R555337n621599j7994164j2769289J17757L327379j720955k680875
$$ 15259850 24815187 19193588 1199424 -11569865 -11452108 -8124729 -9845684 -12526559
12003a2526559J620704L644886K702367K879469K838608M59351k60167K153518
$$ -12526559 -10905855 -7260969 -4558602 -1679133 1159475 1618826 1358659 3512177
11995C512177J122021m617146n275199J066597O10065j0561359j3027179L771471
$$ 3512177 4634198 17052 -5258147 -4191550 -3581485 -14142844 -27170023 -23398552
11987b3398552J7351704P376005n744800O875773K8138192J6973781k2017117
$$ -23398552 -6046848 1329157 -4415643 2460130 30598322 47572103 25554986
11980B5554986l9152509j4314599J5808644J8080932O257300L490275K456837
$$ 25554986 -13597523 -27912122 -12103478 5977454 12234754 15725029 18181866
11973A8181866q375009j2813259M275755K1550213J0793001j5448727k1696372
$$ 18181866 9806857 -3006402 1269353 22819566 33612567 18163840 -3532532
11966c532532m027244Q420138J758163o514319k122581M816414J915633m699717
$$ -3532532 -7559776 860362 2618525 -3895794 -6018375 -1201961 713672 -3986045
11958c986045l399304L817649O418621J593884l231233j213872N516396Q908068
$$ -3986045 -7385349 -3567700 2850921 4444805 1213572 -300 5516096 14424164
11950A4424164N718216K006380K650643J222700q854617j6947938o890382J3168986
$$ 14424164 20142380 22148760 24799403 26022103 17167486 219548 -6670834 6498152
11942F498152J5273935o309790k1874204r809167J0036555Q055536r813315j5291699
$$ 6498152 21772087 15462297 -6411907 -16221074 -6184519 1871017 -7942298 -23233997
11934b3233997k611401Q554177P507264K463597m75694l386145l283028M422292
$$ -23233997 -25845398 -17291221 -9783957 -7320360 -7796054 -11182199 -14465227 -10042935
11926a0042935J0931686M461151o756719m886006O327641O217946o897398j1967547
$$ -10042935 888751 5349902 -1406817 -6292823 34818 6252764 -644634 -12612181
11918a2612181j727551M759189m322314j2926980m736438R166058Q065987o208187
$$ -12612181 -14339732 -9580543 -13902857 -26829837 -31566275 -22400217 -14334230 -20542417
11910b0542417j2562970o72162J5619697J5664893k702234j8388116j1454722
$$ -20542417 -33105387 -33777549 -18157852 -2492959 -5195193 -23583309 -35038031
11903c5038031Q867276J3495055m216090j5485190m10480J7694311R526737q892146
$$ -35038031 -26170755 -12675700 -16891790 -32376980 -32787460 -15093149 -5566412 -14458558
11895a4458558q79229K6883837L0954985R03385k4822778k1148650q531030p640304
$$ -14458558 -15337787 11546050 42501035 43404420 18581642 -2567008 -11098038 -18738342
11887a8738342o488977M722016P163885r543709j9543344j980357K0459123J7448222
$$ -18738342 -25227319 -20505303 -13341418 -22885127 -42428471 -44408828 -23949705 -6501483
11879f501483j212131p678910k021964r73083j826786O126062J2018562J837397
$$ -6501483 -7713614 -15392524 -17414488 -18387571 -20214357 -14088295 -2069733 -232336
11871b32336r149760N92237J7142057J0827272j3066619k2494446j0260053J543480
$$ -232336 -9382096 -8789859 8352198 19179470 6112851 -16381595 -26641648 -25098168
11863b5098168M111804R776069J8259807J3394146l418132j1265903n154384j237431
$$ -25098168 -20986364 -11210295 7049512 20443658 17025526 5759623 605239 -632192
11855f32192m089862j470472N426150P52737j1938976r206295J0915838K1370575
$$ -632192 -4722054 -6192526 -766376 -13639 -11952615 -21158910 -10243072 11127503
11847A1127503J0261880j113839K384814N215866o758247j9323042j5528364l886170
$$ 11127503 21389383 20275544 22660358 27876224 21117977 1794935 -13733429 -17619599
11839a7619599l37039j995821J592298P366086O661579J320235k247429l993978
$$ -17619599 -17956638 -19952459 -18360161 -10994075 -4332496 -3012261 -5259690 -9253668
11831i253668n470379n553226o613976j1552263j2642674j068355J1886762O456981
$$ -9253668 -14724047 -20277273 -26891249 -38443512 -51086186 -52154541 -40267779 -33810798
11823c3810798j0599301j0587780J1084673K3823179Q708316j3042077j4560427
$$ -33810798 -44410099 -54997879 -43913206 -20090027 -11381711 -24423788 -38984215
11816c8984215M19704J3476167J9055531J7698962M826536j4534431k0762520
$$ -38984215 -38564511 -25088344 -6032813 11666149 16492685 1958254 -18804266
11809a8804266p488928N720269M393221K1045L373415L016863q765129j4828970
$$ -18804266 -26293194 -20572925 -16179704 -16158659 -12785244 -9768381 -18533510 -33362480
11801c3362480k981833P392407l030581j6587135m932003K3538362L4441242J6286519
$$ -33362480 -36344313 -28951906 -31982487 -48569622 -53501625 -29963263 4477979 20764498
11793B0764498q796011j7114644n198635J3348981J7395733l860020l0824355
$$ 20764498 11968487 -5146157 -10344792 3004189 20399922 16539902 -14284453
11786a4284453k9830660j180722J5868722K058742j2066148n1771J4666119L364454
$$ -14284453 -44115113 -45295835 -29427113 -27368371 -39434519 -39486290 -24820171 -21455717
11778b1455717j3270798j996674K0553466J5840647p784509j1611999K901827
$$ -21455717 -34726515 -36723189 -16169723 -329076 -8113585 -19725584 -16823757
11771a6823757P02591j7120946j3206932J4514603K3526695K3396j7049116k826556
$$ -16823757 -16121166 -33242112 -46449044 -31934441 -8407746 -8384350 -25433466 -28260022
11763b8260022J6405949J4892922O566039P107224K540462j5392949k3413776
$$ -28260022 -11854073 3038849 9604888 16712112 19252574 3859625 -19554151
11756a9554151p333359P563379j626318j5892415r110947P464097R622494L035579
$$ -19554151 -26887510 -19324131 -20950449 -36842864 -45953811 -38489714 -28867220 -25831641
11748b5831641O342119J3129861O552189n157277k736819P539421M940202p393366
$$ -25831641 -19489522 -6359661 192528 -4964749 -7701568 -162147 4778055 -2615311
11740b615311p277904Q322222J8562463J0566064p083411k0910316k3822412j3793506
$$ -2615311 -9893215 -1570993 16991470 27557534 20474123 -436193 -24258605 -38052111
11732c8052111J887835O953432l674608j2473835l721244J2157138J6871418J3861717
$$ -38052111 -36164276 -29210844 -32885452 -45359287 -49080531 -36923393 -20051975 -6190258
11724f190258J6911139K0730204R856735r878958j6805366q216380k821371p314080
$$ -6190258 10720881 31451085 41307820 31428862 14623496 6407116 3585745 -3728335
11716c728335o782285O008422J5556354P820381q368614j4738695o381098O849888
$$ -3728335 -10510620 -4502198 11054156 18874537 10505923 -4232772 -10613870 -3763982
11708c763982J2832045O449267n807112r204442K616164J5650568J1578663n713659
$$ -3763982 9068063 15517330 9710218 505776 3121940 18772508 30351171 24637512
11700B4637512j4283212n863050K708765m648185j9993947k2845097o151760J6730646
$$ 24637512 10354300 4491250 7200015 2551830 -17442117 -40287214 -46438974 -29708328
11692b9708328K5873342J2138595j3585027k7538799j6934937L759185J0379658
$$ -29708328 -3834986 8303609 -5281418 -32820217 -49755154 -45995969 -35616311
11685c5616311J677719p98149J2269343K2376384J2933322l394389m753973N206244
$$ -35616311 -33938592 -34736741 -22467398 -91014 12842308 9447919 4693946 9900190
11677I900190N115715p407800j1566047J528078J3113544O415968p178649p046074
$$ 9900190 15015905 7608105 -3957942 -2429864 10683680 17099648 9920999 2874925
11669B874925N350391J2372791Q905318N301740N174587O76530q463009j0912401
$$ 2874925 8225316 20598107 29503425 34805165 39979752 40656282 32193273 21280872
11661B1280872m839276m815171j7315431k5295180j2085242J0638648J6419074
$$ 21280872 16441596 11626425 -5689006 -30984186 -43069428 -32430780 -16011706
11654a6011706P05191j2962145m629885J7318355K8208922J6654225l924913j2669639
$$ -16011706 -15306515 -28268660 -32898545 -15580190 12628732 29282957 25358044 12688405
11646A2688405o416179j705546q991654j4419523m09222K2045804K3138581j923719
$$ 12688405 6272226 4566680 -4424974 -18844497 -19253719 2792085 25930666 24006947
11638B4006947k2681322j6132010L268625J0337543L951215l268918r527514j5512067
$$ 24006947 1325625 -14806385 -11537760 -1200217 2750998 -517920 -10045434 -25557501
11630b5557501r592047J2496313K7869278J4470442j2697436k1808795j0402752
$$ -25557501 -35149548 -22653235 5216043 19686485 6989049 -14819746 -25222498
11623b5222498j242004j107911K984379J1569501J0772325J134513l669264n214844
$$ -25222498 -26464502 -27572413 -24588034 -13018533 -2246208 -1111695 -4780959 -9995803
11615i995803j4686975k1696389n958385K0047612K1101699l412917j4825151
$$ -9995803 -24682778 -46379167 -52337552 -32289940 -11188241 -14601158 -29426309
11608b9426309K751891J9250153J2188484j20842Q72369K088437p193726q564012
$$ -29426309 -26674418 -7424265 4764219 4643377 5515746 7604183 410457 -8153555
11600h153555Q829841K0157347N440711j3820698j1893234k150790o954171j2944589
$$ -8153555 676286 20833633 26274344 12453646 560412 -1590378 -8544549 -21489138
11592b1489138K448073K3351043J8380633n502909j5656980q199746o514710j3118211
$$ -21489138 -19041065 4309978 22690611 17187702 1530722 -6669024 -13183734 -26301945
11584b6301945o901751J2342699J7763761l36782j8370654j5609671J017793J5008063
$$ -26301945 -33203696 -20860997 -3097236 -3434018 -21804672 -37414343 -36396550 -21388487
11576b1388487J9787522J5123282M360573j871599L027178P559615k490369j8462752
$$ -21388487 -1600965 13522317 17882890 16011291 19038469 26598084 24107715 5644963
11568E644963j9259665l593567J0161693J3219853J2832868J1721792M084018
$$ 5644963 -13614702 -17208269 -7046576 6173277 19006145 30727937 34811955
11561C4811955q002787j4722530j4145166r711574K216314K1376870K8263229
$$ 34811955 26809168 12086638 -2058528 -11770102 -9553788 11823082 40086311
11554D0086311O365289k5433537l1660739r369060J0845215J1846704O090808
$$ 40086311 46451600 21018063 -10642676 -20011736 -9166521 2680183 8770991
11547H770991K747183o545176k0153752j7953169M267962J9768507Q371555j3403871
$$ 8770991 11518174 4972998 -15180754 -33133923 -28865961 -9097454 -725899 -14129770
11539a4129770j8278878n993699L700897K117875k541168k255736K502149P146865
$$ -14129770 -32408648 -38402347 -34701450 -32583575 -35124743 -37380479 -34878330 -27731465
11531b7731465O827538J19276o965869o709044o19015L884510O981515J4454625
$$ -27731465 -20903927 -20784651 -27750520 -34459564 -35078579 -31194069 -24212554 -9757929
11523i757929K2216257J7896748R61993j3419208j5471150j2229960j2017175
$$ -9757929 12458328 30355076 31317069 17897861 2426711 -9803249 -21820424
11516b1820424j0306699K88828J4375417J7193282K148059j8749456k4265798
$$ -21820424 -32127123 -31838295 -17462878 -269596 1878463 -16870993 -41136791
11509d1136791p951713R615880M987474j1584398n636178K6937622M3644109J6101247
$$ -41136791 -49088504 -39472624 -34485150 -46069548 -51705726 -24768104 18876005 34977252
11501C4977252k1027856j7598870J6160630K6573960l13381k2133320r873109
$$ 34977252 13949396 -3649474 12511156 39085116 38771735 16638415 6765306
11494F765306J3599257J8082661P490714k145221j0821805j9403313j6080211
$$ 6765306 20364563 38447224 45937938 43792717 32970912 13567599 -2512612
11487b512612L64956R107521q14214j0856412m422410N915275L340535l996317
$$ -2512612 -2147656 6959865 6145651 -4710761 -9133171 -3217896 122639 -3873678
11479c873678j737676K877446l546196j3592302j1532260j15953O771657P052441
$$ -3873678 -5611354 -2733908 -6280104 -19872406 -31404666 -31520619 -24748962 -17696521
11471a7696521O663092M127529k461186m149093N032042J3694962J0132487K666016
$$ -17696521 -11033429 -6905900 -9367086 -13516179 -8484137 5210825 15343312 18009328
11463A8009328M931602J1480660P164647p460462j8198502j8147392j1216329
$$ 18009328 22940930 34421590 41586237 34125775 15927273 -2220119 -13436448
11456a3436448j834794N240431L259962n826342r082259k284511K010449j521889
$$ -13436448 -15271242 -10030811 -6770849 -12597191 -21679450 -23963961 -21953512 -23475401
11448b3475401K112571J9096262K5593838K520555k5721473k0791108J1034880
$$ -23475401 -21362830 -2266568 23327270 25847825 126352 -20664756 -9629876
11441i629876K5925717O344724j7818190j7807072l056461K975158k467738p320222
$$ -9629876 16295841 22640565 4822375 -12984697 -16041158 -13066000 -15533738 -22853960
11433b2853960o412341j556864O522222J3343862R334939n221720j4584581p787554
$$ -22853960 -29266301 -30823165 -24300943 -10957081 -1622142 -6843862 -21428443 -29215997
11425b9215997N611161J1037272J0013377J2309726J5124310O730779j1423982
$$ -29215997 -23604836 -12567564 -2554187 9755539 24879849 31610628 20186646
11418B0186646k2335043j6264001l381077K101604N30756J382829O118300P341039
$$ 20186646 -2148397 -18412398 -21793475 -19691871 -19161115 -17778286 -11659986 -4318947
11410d318947L469911L226283J1490773J8599601J1233917q829185k3952902j9747029
$$ -4318947 -849036 2377247 13868020 32467621 43701538 34872353 10919451 -8827578
11402h827578q59727J4275451J2789947j49572q324995k825014Q904883J3083392
$$ -8827578 -9687305 4588146 17378093 17228521 8903526 6078512 14983395 28066787
11394B8066787M812090r677151k0931146k0815372n560372J5782005K2022528
$$ 28066787 32878877 23201726 2270580 -18544792 -24105164 -8323159 13699369
11387A3699369L541131j8842158j7013995M582700J4853587K549271j0801271
$$ 13699369 17240500 -1601658 -18615653 -14032953 820634 3369905 -7431366
11380g431366j0475397r179766j4457312r176843J3109614K5442037R296215j0180330
$$ -7431366 -17906763 -27086529 -41543841 -50720684 -37611070 -12169033 -2872818 -13053148
11372a3053148m828408Q618586J394910j2671121l184452J7396706J4388180m309817
$$ -13053148 -17881556 -9262970 -7868060 -20539181 -23723633 -6326927 8061253 3751436
11364C751436k996045J1616467j49444l2028721l1840824Q717171L3763781J3817297
$$ 3751436 755391 12371858 12222414 -19806307 -51647131 -42929960 -9166179 4651118
11356D651118j0702818o024955J053470j4348109k1091371Q105707L5545629J6594762
$$ 4651118 -6051700 -12076655 -11023185 -25371294 -46462665 -38356958 -2811329 13783433
11348A3783433k1786324k2152926J3261555L3709916K0603174J23325j0598102
$$ 13783433 -8002891 -30155817 -16894262 16815654 37418828 37542153 26944051
11341B6944051j7059740j6677994k431845R832065K69396j6807563j2905718P173795
$$ 26944051 9884311 -6793683 -9225528 606537 875933 -15931630 -28837348 -21663553
11333b1663553J6481123J1199431M993510n366917k4440479k6200505J0379419
$$ -21663553 -5182430 6017001 11010511 5643594 -18796885 -44997390 -34617971
11326c4617971M8331068L3599524j8843289m1431834j5335128R356584J919123
$$ -34617971 13713097 47312621 28469332 -12962502 -28297630 -18941046 -17021923
11319a7021923p281640P410089K1907772J2471683k519562l555331n882783k0158424
$$ -17021923 -24303563 -16893474 5014298 17485981 14966419 11411088 5528305 -14630119
11311a4630119k0617114Q868573L4419252J9687410j5939166k8183030j2729895
$$ -14630119 -35247233 -26378660 8040592 27728002 11788836 -16394194 -29124089
11304b9124089J699600M893742P589963O717823r345148k7519395k1090632P274600
$$ -29124089 -27424489 -22530747 -14940784 -8222961 -17568109 -45087504 -66178136 -58903536
11296e8903536K7393470K6177057J8506284J3006864O39430j6361617j7196342
$$ -58903536 -31510066 -5333009 13173275 26180139 26819569 10457952 -6738390
11289f738390K177497J4601025J361772j6474587r416879J4469877K2118622N486616
$$ -6738390 -4560893 10040132 11401904 -5072683 -14489562 -19685 22098937 27585553
11281B7585553j0241890r033844n194960j1730880j4317715K349151K1729629
$$ 27585553 17343663 8309819 3114859 -8616021 -22933736 -20584585 1145044
11274A145044J6411080q464390k1847675j2819387K505N239387J1979302J9855166
$$ 1145044 17556124 9091734 -12755941 -25575328 -25572823 -20333436 -8354134 11501032
11266A1501032J0988954j3660491k3667014n500550J2243652M926095q488617
$$ 11501032 22489986 8829495 -14837519 -20338069 -8094417 -3168322 -11656939
11259a1656939k899027O954346k505960j3984213J503573K5613919J6801050j6804222
$$ -11656939 -14555966 -7601620 -10107580 -24091793 -22588220 3025699 19826749 3022527
11251C022527k5207500L194617K5309045J5450192m72961J043125L787944p669562
$$ 3022527 -22184973 -18990356 6318689 21768881 21295920 22339045 26126989 18457427
11243A8457427j4781377j271454J3931955R602286k497851l429577n32217p189304
$$ 18457427 3676050 2404596 16336551 25938837 23440986 20011409 19479192 12289888
11235A2289888j4406432j0454351n728289j0372480r612397R207639K5934907
$$ 12289888 -2116544 -12570895 -18299184 -28671664 -38284061 -29076422 -3141515
11228c141515J6301710n631550p873813Q330842J2361824n931407k2794441j8397652
$$ -3141515 13160195 7528645 -345168 7985674 20347498 14416091 -8378350 -26776002
11220b6776002j198261J0612469J1840488Q424610O237496O328239M707955k266185
$$ -26776002 -27974263 -17361794 -5521306 2903304 9140800 15469039 20176994 17910809
11212A7910809q972729m968510O694666Q331149o232948j8554484j1588545M177068
$$ 17910809 8938080 3969570 10664236 18995385 12762437 -5792047 -17380592 -13203524
11204a3203524O396142o933876j6687354q240669J3727802L0586409K3643455
$$ -13203524 -6807382 -13741258 -30428612 -38669281 -24941479 5644930 29288385
11197B9288385p099278l3751270k6609334M488993J7292590l568326k1842542
$$ 29288385 22189107 -11562163 -38171497 -33682504 -16389914 -19958240 -41800782
11190d1800782m182566K7971769L1241697M468674j5590492j0941850J304369
$$ -41800782 -45983348 -18011579 13230118 17698792 2108300 -8833550 -7529181
11183g529181M894969L124741M14050n763216j1072974o812635J467119L81361
$$ -7529181 -2634212 490529 904579 -4858637 -15931611 -22744246 -21277127 -20895766
11175b0895766n720705M21995J7203565K2664551R304732m440935m855608j715367
$$ -20895766 -26616471 -26194476 -8990911 13673640 22978372 18537437 13681829 11966462
11167A1966462o352777j1719216o886294M527631J2168496J2946654Q524806K59307
$$ 11966462 5613685 -6105531 -12991825 -8464194 3704302 16650956 25175762 25435069
11159B5435069o768631o162609j342257j856854n925650k379672O944269O385307
$$ 25435069 18666438 12503829 11161572 9304718 3379068 999396 7943665 14328972
11151A4328972n617588r678393K352936J0687594m57152j5191919j2196479p23960
$$ 14328972 8711384 -967009 1385927 12073521 11616369 -3575550 -15772029 -16495989
11143a6495989k921309j2706672m501954K0966534L2720071J6137017o496633
$$ -16495989 -19417298 -32123970 -36625924 -15659390 17060681 33197698 26701065
11136B6701065j2237215o992554m175096N03274J2003880J5260961j991229k0830535
$$ 26701065 14463850 7471296 3296200 3799474 15803354 31064315 29073086 8242551
11128H242551j4923025O702270J1937079l611770j1992038j461026O012825l194842
$$ 8242551 -6680474 21796 11958875 8347105 -3644933 -5105959 906866 -2287976
11120b287976r374605L755246J7463464R328654q236688j0755908l524680p171490
$$ -2287976 -11662581 -7907335 9556129 18884783 10648095 -107813 -3632493 -10803983
11112a0803983j5597728n556702J8199786K5149939P590273q184642n528420L23674
$$ -10803983 -26401711 -31958413 -13758627 11391312 18981585 10796943 5268523 5592197
11104E592197n643708j3102962q087442L616974R815679R882405O691924k005255
$$ 5592197 -51511 -13154473 -21241915 -17624941 -7809262 2073143 8765067 6759812
11096F759812j2665745j3187614j821023P223945O120772L768037M851765j157762
$$ 6759812 -5905933 -19093547 -20914570 -13690625 -7569853 -3801816 1049949 -107813
11088a07813j7585301k6636090j3715210R613189K1646670J6584225K951059r831684
$$ -107813 -17693114 -44329204 -58044414 -48431225 -26784555 -10200330 -7249271 -17080955
11080a7080955j2681562m23541J5129882J2792046o263114j3816629N006481K7329703
$$ -17080955 -29762517 -30186058 -15056176 -2264130 -8527244 -22343873 -17337392 9992311
11072I992311K5349626M096049j2543424j5581373j0653751q85363Q688511M971920
$$ 9992311 35341937 39437986 26894562 11313189 659438 -225925 8462586 13434506
11064A3434506j3213224k3436244r758363J0158610J1322786m5177r72683P680197
$$ 13434506 221282 -23214962 -32973325 -22814715 -11491929 -11537106 -12509789 -4829592
11056d829592N271010j0345500j8215109p870829P131538J1753853O673038R04827
$$ -4829592 441418 -9904082 -28119191 -35990020 -28858482 -17104629 -10431591 -9526764
11048i526764Q83780O344786Q304209k242489j6516915j3297609P735678J8518768
$$ -9526764 -8642984 -2298198 6006011 3763522 -12753393 -26051002 -18315324 203444
11040B03444M744142q399189L329146K0966793J2761268j2985389k3096743j3184977
$$ 203444 4947586 -3451603 -122457 20844336 33605604 20620215 -2476528 -15661505
11032a5661505n831267m781112O265522K2761578K0400122l56505j1147249k471251
$$ -15661505 -21492772 -26273884 -20008362 2753216 23153338 22796833 11649584 9178333
11024I178333M680302L30572k47840O745312J951438j7764749k5328699p152321
$$ 9178333 13858635 14189207 13941367 20686679 22638117 4873368 -20455331 -27607652
11016b7607652J2628382J1651620K082097K128025M150914l584311q853094K768250
$$ -27607652 -14979270 -3327650 -1245553 882472 5033386 1449075 -7404019 -4635769
11008d635769J7581324J3047143o551022j8753818j6046422p671638J595193J2016818
$$ -4635769 12945555 25992698 19441676 687858 -15358564 -23030202 -21435009 -9418191
11000i418191J5462170L143204j5891801k1708704q831530P515131R762729n150273
$$ -9418191 6043979 9187183 -6704618 -28413322 -37244852 -29729721 -19966992 -25117265
10992b5117265k4130594k7969513r006294J7145355K5813971J2565269k630982
$$ -25117265 -49247859 -77217372 -86223666 -69078311 -43264340 -30699071 -33330053
10985c3330053l778839L066757N946239N114037N435829N110263K837898L724738
$$ -33330053 -37108892 -34042135 -28095896 -22981859 -17546030 -12435767 -9597869 -5873131
10977e873131Q098392P126858r79594m449841K127994O757658J101825l646460
$$ -5873131 2225261 9352119 8372525 3922684 6050678 12808336 13910161 10263701
10969A0263701K632298Q121896j978277j8199294k0051982q075385m75410k195953
$$ 10263701 12895999 21017895 19039618 840324 -19211658 -27287043 -27762453 -29958406
10961b9958406N20414J4048253K5342540K0958906M368891j0866877j5874361
$$ -29958406 -29437992 -15389739 9952801 30911707 35280598 24413721 8539360
10954H539360j0969506k388361L209212M986225P520120J1045054Q041514l717712
$$ 8539360 -2430146 -4818507 -1609295 3376930 10897050 21942104 29983618 26265906
10946B6265906j2045526n637607O557164N640047q710758j5958699n242939P138188
$$ 26265906 14220380 8582773 15139937 20779984 12069226 -3889473 -9132412 -1994224
10938a994224J721284j3629999j3893108N244088J8451838O930304j2398912r882918
$$ -1994224 -272940 -13902939 -27796047 -22551959 -4100121 2830183 -9568729 -19451647
10930a9451647J3615486K7451860J4485186q422423j9166320j7747840j2930953
$$ -19451647 -5836161 21615699 36100885 27678462 8512142 -9235698 -22166651
10923b2166651k747274J3148099J9472651O807069o529881M84511J5682917J1387269
$$ -22166651 -24913925 -11765826 7706825 14513894 7984013 8468524 24151441 35538710
10915C5538710r664705j7897191m199405Q868241N837551l154578q171475j2881781
$$ 35538710 25874005 7976814 3777409 12645650 18483201 15328623 7157148 -5724633
10907e724633j4431508j267635J8377676J7692332n138551j6867757o41562J5325501
$$ -5724633 -20156141 -21423776 -3046100 14646232 9507681 -7360076 -8001638 7323863
10899G323863M662596j2890338n944192J5157461J6723618k851475j4335627o567250
$$ 7323863 11986459 -903879 -6848071 8309390 25033008 22181533 7845906 1278656
10891A278656J895742j061738n383873l039095r31306l429646m256808k413497
$$ 1278656 3174398 2112660 -3271213 -6310308 -7241614 -10671260 -14928068 -17341565
10883a7341565o572871j5864196j3956800O718301K7796456K5216823P69051j8722687
$$ -17341565 -23914436 -39778632 -53735432 -47017131 -19220675 5996148 6765199 -11957488
10875a1957488j4308897K597196P564235k506764o609739N450876J4005870J225444
$$ -11957488 -26266385 -23669189 -16104954 -18611718 -25221457 -19770581 -5764711 -4539267
10867d539267j4958916o362126J5763682J3013609j7270377l1877389p230037
$$ -4539267 -19498183 -25860309 -10096627 2916982 -14353395 -46230784 -53460821
10860e3460821K4317649K6029833Q867195K026050K672331p413882j8466137q044942
$$ -53460821 -29143172 -3113339 5753856 7779906 10452237 3038355 -15427782 -23472724
10852b3472724J3825825J5978580l553347j6316497j0306513k350541k401774
$$ -23472724 -9646899 6331681 2778334 -13538163 -23844676 -26195217 -28596991
10845b8596991N92299J1355332J6443311Q212756k862770o693491m647048J217754
$$ -28596991 -28004692 -16649360 -206049 8006707 5143937 -1549554 -6196602 -4978848
10837d978848J0319320J3503280J617318j4465593j3689450L518784J4635632
$$ -4978848 5340472 18843752 20461070 5995477 -7693973 -4175189 10460443
10830A0460443Q044673m437210r928931q263685j694314P911600J0443680j865046
$$ 10460443 18505116 14067906 4138975 -4124710 -5819024 2092576 12536256 10671210
10822A0671210j4904243p859487J1645602J4802481l378920j6087477q302291
$$ 10671210 -4233033 -12092520 -446918 14355563 10976643 -5110834 -13413125
10815a3413125K114949j835168j0024417p345626K449679R552077J2791351R786396
$$ -13413125 -11298176 -13133344 -23157761 -30503387 -28053708 -18501631 -5710280 4076116
10807D076116m161859j6807983o168042K0055809K3640294p002500l1717582j6385668
$$ 4076116 -85743 -16893726 -23061768 -3005959 20634335 13631835 -18085747 -34471415
10799c4471415J5696100K3016522Q351728K153520N468463m005169k0573397j4192299
$$ -34471415 -18775315 4241207 12592935 14746455 20214918 16209749 -4363648 -18555947
10791a8555947J4444834K7727625Q567699j5134108j6014322k649116N814377
$$ -18555947 -4111113 23616512 32184211 17050103 1035781 -1613335 4201042
10784D201042Q937205J0442842K526324j3717198j6485644M012446K1632924R618654
$$ 4201042 13138247 23581089 26107413 12390215 -4095429 -82983 21549941 31168595
10776C1168595j6966137k3272762o494599O604998O681474J0359994K0530946
$$ 31168595 14202458 -9070304 -15564903 -8959905 -2278431 8081563 28612509
10769B8612509J5441761j0230121k6891599j3601971P213830N289527r422730
$$ 28612509 44054270 33824149 6932550 -6669421 544409 5833936 -3588794
10762c588794p339704P501004M993329j4340578j4108763J6307918L6260285J3297368
$$ -3588794 -10928498 -3427494 1565835 -12774743 -26883506 -10575588 25684697 38982065
10754C8982065k5451620l3279991j0646443N534805L407002M516217J5137014
$$ 38982065 13530445 -19749546 -30395989 -24861184 -21454182 -16937965 -1800951
10747a800951J3233244p213068j7992381j109839J9953817J6599751k042479r045050
$$ -1800951 11432293 4219225 -13773156 -14882995 5070822 21670573 19628094 10583044
10739A0583044l446706m123904j1416547o889435J0402004J7025830J295599j6751199
$$ 10583044 7136338 3012434 -8404113 -15293548 -4891544 12134286 13429885 -3321314
10731c321314j2656967J0525056K8610130K4826937L559612j7046671k0068639
$$ -3321314 -15978281 -5453225 23156905 47983842 51543454 34496783 14428144
10724A4428144m206061J2293728R611295q262722j6475892l325453J1778044O522231
$$ 14428144 10222083 22515811 32127106 23864384 7388492 4063039 15841083 22363314
10716B2363314r653951q908101J1040716K0182260N14932k4492881k1761930M231296
$$ 22363314 12709363 3801262 14841978 35024238 35539170 11046289 -10715641 -6484345
10708f484345J8968573P539898q230511o973484J666147j890812j3267473j2493172
$$ -6484345 12484228 20024126 11793615 4820131 6486278 4595466 -8672007 -21165179
10700b1165179K280008J1704286N174960o102539r722431p752846m678637L461325
$$ -21165179 -18885171 -7180885 -2005925 -8108464 -17830895 -25583741 -30262378 -26801053
10692b6801053J6193935J8921490K202760j8172368j8398911n2831J2323356P350228
$$ -26801053 -10607118 8314372 10517132 -7655236 -26054147 -26106978 -13783622 -6433394
10684f433394O59773O181634J3313568P369095k676638J471238J3408056Q535889
$$ -6433394 -5773621 408013 13721581 21090676 18414038 19885276 33293332 41829221
10676D1829221j3909173k2823640j503706K2520208J5829070j0749459j9609868
$$ 41829221 27920048 5096408 3592702 26112910 41941980 31192521 11582653
10669A1582653m463662L518510j0813520k2782149j1118315O960077O908041k559221
$$ 11582653 7118991 10637501 -176019 -22958168 -34076483 -27116406 -20208365 -22767586
10661b2767586K67389Q071121j517305j9483265j2393148K1828367M2663768K4178450
$$ -22767586 -22500197 -14429076 -15946381 -35429646 -47822794 -25994427 16669341 40847791
10653D0847791q516563j9072270r827892p272663j6766795k0416891j0831887
$$ 40847791 32331228 13258958 3431066 -3841597 -20608392 -41025283 -51857170
10646e1857170J10016M292968O700384J0655128J2277464J1211304J0647873O632725
$$ -51857170 -51747154 -47454186 -40753802 -30098674 -17821210 -6609906 4037967 10670692
10638A0670692n194967j2759403N99318K4094357K4741635m787788k9059445j8807042
$$ 10670692 5475725 -7283678 -6684360 17409997 42151632 37363844 8304399 -10502643
10630a0502643O144502Q639256r377742j5007762R49404J4079370J0588947M845019
$$ -10502643 -4358141 4281115 -5096627 -20104389 -19154985 -5075615 5513332 10358351
10622A0358351N504376j85323j3990649j2848069J0773491K5231650M709316k7331702
$$ 10358351 15862727 15677404 1686755 -11161314 -387823 24843827 29553143 2221441
10614B221441l2037595j2097878R22758N6116L755572J2934292R607690l693367
$$ 2221441 -29816154 -41914032 -40991274 -40935158 -37179586 -24245294 -14637604 -18330971
10606a8330971m596957O515767N410937q727390p281148J5230058K5309884N331459
$$ -18330971 -22927928 -16412161 -11001224 -19728614 -27009762 -11779704 13530180 18861639
10598A8861639j6149061j2103865K544332N205586M455781J2647099J2928015
$$ 18861639 2712578 -9391287 -6846955 -1641369 2814412 15461511 28389526
10591B8389526q593873k5769908r607424J8981814J8180362p805855j6827789
$$ 28389526 19795653 -5974255 -15581679 3400135 21580497 13774642 -3053147
10584c053147L057763J8575526O220631j7316877k7188750k0963769q384834M397301
$$ -3053147 4616 18580142 24800773 7483896 -19704854 -40668623 -49053457 -44656156
10576d4656156J2532678J2803021R685036P569602J865674p376127n321722J2935165
$$ -44656156 -32123478 -19320457 -9635421 -2065819 -200145 -7576272 -12897994 37171
10568C7171K2273013N21620l1108473l3470609o221333J5571950J4703419N332124
$$ 37171 22310184 22831804 -8276669 -41747278 -47968611 -32396661 -17693242 -12361118
10560a2361118k012678j0428841j2848555L032633K4088205K2950921J962084
$$ -12361118 -14373796 -24802637 -37651192 -34618559 -10530354 12420567 14382651
10553A4382651j0424623p302649p682524j2993380m066447J4287071J3551183
$$ 14382651 3958028 -3344621 -11027145 -24020525 -28086972 -13799901 -248718
10546b48718n162707p852821R983415J0812826j6210263k9311421n110194J8077686
$$ -248718 -5411425 -13264246 -3280831 7531995 -8678268 -37989689 -43099883 -25022197
10538b5022197N344831j5203651l306144K4072574K5092538L659896m539966N015447
$$ -25022197 -19677366 -34881017 -38187161 -14114587 10977951 14637847 10097881 15113328
10530A5113328P170326k272588m146613L399791L052459o763286j0338955n009698
$$ 15113328 22283654 20011066 15864453 19264244 22316703 15553417 5214462 204764
10522B04764k761199n054607k455345N112475J0381319J3838302J6646454R533767
$$ 204764 -2556435 -7611042 -10066387 -4953912 5427407 19265709 35912163 45445930
10514D5445930j0753559k7130101k5020454j4350278q250587Q81285J9963787
$$ 45445930 34692371 7562270 -17458184 -31808462 -40059049 -39177764 -19213977
10507a9213977L0658041J5175032j0711083j9372889j0429948j326477L976678
$$ -19213977 11444064 26619096 15908013 -3464876 -13894824 -15221301 -11244623
10500a1244623J0117458J2061641P037666M880928M998051q794881k8891688k0327882
$$ -11244623 -1127165 10934476 17972142 22853070 27851121 19056240 -9835448 -30163330
10492c0163330J4034730J8582853j8748364j8481129O7876053J45380337R0562846
$$ -30163330 -16128600 2454253 -16294111 -34775240 33100813 178481150 269043996
10485B69043996n4905244j26716992o9382944J406489q358609m2564552j8494411
$$ 269043996 214138752 87421760 18038816 19445305 11086696 -31477856 -49972267
10478d9972267L0572671K5111946k2412939l5437879J021920K9727885J8149431
$$ -49972267 -19399596 5712350 -16700589 -52138468 -51116548 -21388663 -3239232
10471c239232o297325j2787551k917516R744518J5516914O882989r972031j2485782
$$ -3239232 -9536557 -22324108 -25241624 -15497106 19808 6902797 -3069234 -15555016
10463a5555016M951388J4344707k825204k1143221j2158414O964077M736813q809395
$$ -15555016 -10603628 3741079 915875 -20227346 -32385760 -25421683 -20684870 -29494265
10455b9494265k549645J7315765J7245836m641331j5735482k630461J3310276
$$ -29494265 -32043910 -14728145 2517691 -2123640 -17859122 -20489583 -7179307
10448g179307J4624993O269844n021169j7511103k1056311p177899R626330R935057
$$ -7179307 7445686 13715530 8694361 -8816742 -29873053 -37050952 -27424622 -17489565
10440a7489565L342287J1984511K6744566J8472774r094828j9947382m507677
$$ -17489565 -14147278 -2162767 24581799 43054573 33959745 14012363 9504686
10433I504686M753856j1059446k6469973j6610437K275089L836647m383645J560086
$$ 9504686 14258542 3199096 -23270877 -39881314 -37606225 -33769578 -38153223 -36593137
10425c6593137J8547156K1800856O108140o663146k472210N122421j471683j5392844
$$ -36593137 -18045981 3754875 9863015 3199869 727659 5850080 4378397 -11014447
10417a1014447j4335906N887897K1641479J2654468q006269j1299316N098003
$$ -11014447 -25350353 -19462456 2179023 14833491 6827222 -4472094 625909
10410F25909J4280694L987611m122331O696161J7130743M099847j8086308k0562714
$$ 625909 14906603 18894214 14771883 21468044 38598787 42698634 24612326 4049612
10402D049612p827077o726177j7360095j4218770N990826J6983277P427153m160746
$$ 4049612 -3777465 -10503642 -27863737 -42082507 -36091681 -19108404 -11681251 -15841997
10394a5841997o263179r679119j5669662n973297J9499729L0596039J3188415
$$ -15841997 -22105176 -31784295 -47453957 -53427254 -33927525 -3331486 9856929
10387I856929n492135j901760N284072q353232k6283791j7371367J1281113K6331988
$$ 9856929 4364794 2463034 7747106 -606126 -26889917 -44261284 -32980171 -6648183
10379f648183K0247666J3304816J1091998j255492k2489772k9385548j4127512
$$ -6648183 13599483 26904299 37996297 36740805 14251033 -15134515 -29262027
10372b9262027L038124P153764P429981J2981846J5184767O944136k500597n666376
$$ -29262027 -26223903 -19070139 -11640158 1341688 16526455 23470591 20969994 15303618
10364A5303618r985369j9029975k0224542p745571J234023o309264j2628919M597389
$$ 15303618 5318249 -13711726 -33936268 -41681839 -40447816 -46757080 -59385999 -54788610
10356e4788610L1245492L2267340M860870j5327548o713807R071564M646789j1370211
$$ -54788610 -23543118 8724222 13585092 -1742456 -8456263 615301 5262090 -6108121
10348f108121j1952001N091363J6705087J1126168J271653O70616N408098N249186
$$ -6108121 -18060122 -12968759 3736328 14862496 16134149 16804765 22212863 27462049
10340B7462049j431261r644854j4517808j2270488l621794K360689j431210n807854
$$ 27462049 26030788 16385934 1868126 -10402362 -14024156 -11663467 -13094677 -18902531
10332a8902531M072319K1765292K2151922j427360k2409512j7046432K557446
$$ -18902531 -14830212 6935080 29087002 27659642 5250130 -11796302 -9238856
10325i238856R606137J571109m357929l099286l023934k488200O777507J5144415
$$ -9238856 367281 1938390 -2419539 -5518825 -8542759 -11030959 -4253452 10890963
10317A0890963M108107j7182128j6346456J1224363K7869843Q706089j8339669
$$ 10890963 14999070 -2183058 -18529514 -7305151 20564692 29270781 10931112
10310A0931112j5207875O917872P317199j7089037k5347704K927278L3634143
$$ 10931112 -4276763 2641109 9958308 -7130729 -32478433 -29551155 4082988
10303D082988K6186973j0419924l2947725k1330710L292301J4230648J1019608
$$ 4082988 30269961 19850037 -13097688 -34428398 -31136097 -16905449 -5885841
10296e885841R195753J3047695J1680128p30601j2328832p529276J0535536K0414082
$$ -5885841 3309912 16357607 28037735 27307134 14978302 7449026 17984562 38398644
10288C8398644Q204231j4015194k3111118j4280523m557935n816238o919050P764760
$$ 38398644 46602875 32587681 9476563 -4803960 -9361895 -15178133 -22097183 -14332423
10280a4332423L0044721L3294486P663139k3785702l2640843j9386537p304294
$$ -14332423 15712298 49006784 56669923 32884221 243378 -19143159 -26447453
10273b6447453p389862p002294L639902J2554369O179432n885893n145827N093565
$$ -26447453 -33837315 -40839609 -37199707 -24645338 -18465906 -24351799 -29497626 -24404061
10265b4404061N716164l909638l197399J2659302J9359285J820584j7373805j0412657
$$ -24404061 -18687897 -22597535 -25794934 -13135632 6223653 8044237 -9329568 -19742225
10257a9742225J1938325J6874563K93339r940057k56122J0352966N658155k677491
$$ -19742225 -7803900 9070663 9364002 -576055 -832177 9520789 15178944 12501453
10249A2501453K42003N935773m42172j3262005j6667147r935371l298772K282246
$$ 12501453 12743456 18679229 18237057 4975052 -11692095 -21627466 -24926238 -22643992
10241b2643992J1503928J8019064J2198622J704966L216774J4466763J5606870
$$ -22643992 -11140064 6879000 19077622 20782588 23999362 38466125 54072995
10234E4072995N67421j3822406j5177003j1603548j2005331j0023681l40260O008962
$$ 54072995 54640416 40818010 25641007 14037459 2032128 -7991553 -8331813 -2322851
10226b322851j172575j1528294r098010K309326O676962K084128M18800M196784
$$ -2322851 -3495426 -15023720 -24121730 -21812404 -15135442 -13051314 -12632514 -8435730
10218h435730L707346j709591M83996J2671774J7462893K825356j6441723j7246885
$$ -8435730 -4728384 -6437975 -5953979 6717795 24180688 27006044 10564321 -6682564
10210f682564j100133P549621m398474k0565181j7774816K601570J6957482J0950457
$$ -6682564 -7782697 -233076 -4631550 -25196731 -42971547 -40369977 -23412495 -12462038
10202a2462038k794666l364818J0649008K1718287J7623702L470189j0082295
$$ -12462038 -15256704 -18621522 -7972514 13745773 31369475 34839664 24757369
10195B4757369j7646267j5228102O6934J8493301J9464177k300404k2947128j7235171
$$ 24757369 7111102 -8117000 -8050066 10443235 29907412 27607008 4659880 -12575291
10187a2575291P445782K1811026J4157425j15796o626134q625948j1936954j2899532
$$ -12575291 -5129509 16681517 30838942 30723146 24097012 15471064 3534110 -9365422
10179i365422r188474o719829p343934l864514M455739O448203n68389m09153
$$ -9365422 -18553896 -25273725 -32617659 -36482173 -32026434 -25578231 -26146620 -26555773
10171b6555773J7234158L4566516K6867041j430806k1029394j6086561q35728
$$ -26555773 -9321615 25244901 52111942 50681136 29651742 13565181 12729453
10164A2729453L808949m809216j4640100j6237661r616033q3636O693750P772428
$$ 12729453 16538402 11729186 -2910914 -19148575 -28764608 -28848244 -22154494 -14382066
10156a4382066M567293J289871J351098N035966Q861859P521291L35524m588923
$$ -14382066 -9814773 -8524902 -7173804 -2137838 6724021 14245312 14580836 9991913
10148I991913O34233R729029P284587p950976j6451866m285933J3715924J1417218
$$ 9991913 10626146 20355175 27639762 19688786 3236920 -1049013 12666911 24084129
10140B4084129j2724267l2344917k6124341j189817J9457158K2502435J2358912
$$ 24084129 11359862 -20985055 -47109396 -48299213 -28842055 -6339620 6019292
10133F019292J011575l791194k337539J047963M013349O576828O629344Q88541
$$ 6019292 7030867 3239673 902134 1950097 5963446 12540274 19169618 20058159
10125B0058159p606769j0085408m558708n9860k112801k862589M532456J0344665
$$ 20058159 12451390 2365982 -2192726 -2252586 -4365387 -7227976 -2695520 7649145
10117G649145J586843j4026131j4603579M185368J9515039J0018744j6220056
$$ 7649145 9235988 -4790143 -19393722 -15208354 4306685 14325429 -1894627
10110a894627l0046921j3737100J9067342L5574963J7808715j4743313k3979396
$$ -1894627 -31941548 -45678648 -26611306 8963657 26772372 12029059 -11950337
10103a1950337M79592K5614391J7728394j1588213k3180782o456669R930038M870817
$$ -11950337 -11470745 14143646 31872040 20283827 -2896955 -9353624 576414 5447231
10095E447231p593483q646856n054985r292321j1307211L600952K2583731J9971210
$$ 5447231 -2146252 -10793108 -15848093 -25140414 -36447625 -32846673 -10262942 9708268
10087I708268j418339j2519043k652263O252180j897855j1333114l369699R943468
$$ 9708268 8289929 -4229114 -6881377 -629197 -2527052 -13860166 -17229865 -7286397
10079g286397M896138j3565745j7653295r3224J5052495J0633547J020832M942824
$$ -7286397 -2390259 -15956004 -33609299 -33702523 -18650028 -8016481 -6995649 -2052825
10071b052825J3754192P260762j1227815j9037209q623392M309266P009633L121011
$$ -2052825 11701367 18962129 7734314 -11302895 -19926287 -15617021 -8607388 -5486377
10063e486377k230408r609353j2660758k62285K0262345K4064520M679865j3124538
$$ -5486377 -7716785 -17326138 -29986896 -30249181 -9986836 14077684 18757549 5633011
10055E633011j1401375o032134j4236398j9035535K412048L2232554L1654726
$$ 5633011 -5768364 -11800498 -26036896 -45072431 -42660383 -10427829 21226897
10048B1226897N58601k1143218j2772873L256478M211335j269455J574050O749855
$$ 21226897 21785498 642280 -12130593 -8874115 -4662780 -5932235 -4358185 2391670
10040B391670M574035K030295O633587Q558165k307773j6249674j7799124p751959
$$ 2391670 6965705 8996000 15629587 24187752 21879979 5630305 -12168819 -19920778
10032a9920778L207064J0697298J3490166P235213n292693j0442573l370916J542800
$$ -19920778 -16713714 -6016416 7473750 14708963 9416270 -1026303 -4397219 -2854419
10024b854419o721209j6730659j3144103j122810M240450J469869o05550M36641
$$ -2854419 -9575628 -26306287 -39450390 -40573200 -36332750 -34862881 -35468431 -35031790
10016c5031790K368457O704494J1608559Q179509k717764m481977R051207J8302184
$$ -35031790 -32663333 -25958839 -14350280 -6170771 -8888535 -13370512 -4319305 13982879
10008A3982879P473745q536055r390220l283667p992920j4776815m534845J2579746
$$ 13982879 21456624 12920569 3530349 246682 -7746238 -22523053 -27057898 -14478152
10000a4478152J0993210m162769m374982J0664677J0290986j3022251k7588381
$$ -14478152 -3484942 -7647711 -12022693 -1358016 8932970 -4089281 -31677662
9993c1677662j3244930Q536631J2720197O984598R483231J6851358J5974909P165165
$$ -31677662 -44922592 -36385961 -23665764 -16681166 -7197935 9653423 25628332 32793497
9985C2793497l025245j3893666k0450909j1239548Q773135J4781899j716955j5633450
$$ 32793497 29768252 15874586 -4576323 -15815871 -7042736 7739163 6022208 -9611242
9977i611242o038919J1313722J1600693r8884l402492J578652R81294m039032
$$ -9611242 -15650161 -4336439 7264254 7165370 3762878 5341530 6322824 2283792
9969B283792l227295j144957p963344j5375548q543015N603690Q695319K593070
$$ 2283792 -943503 -2088460 -10051804 -25427352 -33970367 -28366677 -19671358 -17078288
9961a7078288L371996R687175O204958m866975n483768N494656J0208076L435912
$$ -17078288 -13706292 -4019117 2185841 -2681134 -8164902 -2670246 7537830 10973742
9953A0973742k191041l996270j2081770k1106777j1755685J2040836K0205848
$$ 10973742 8782701 4786431 -7295339 -28402116 -40157801 -28116965 -7911117
9946g911117K757299j2825569n707139P971220P777743J486710J342610k975496
$$ -7911117 -5153818 -17979387 -23686526 -15715306 -7937563 -6450853 -5108243 -8083739
9938h083739j8436899k2048132M002348L0955087J8658172j9195766k8859845
$$ -8083739 -26520638 -48568770 -44566422 -13611335 5046837 -14148929 -43008774
9931d3008774N460254L9803998L5028653N054214j5272700j7993664j5368285
$$ -43008774 -37548520 2255478 37284131 42338345 27065645 9071981 -6296304
9924f296304r894047K656616J4207730J2567033J857930m255329m247714o147848
$$ -6296304 -16190351 -13533735 673995 13241028 15098958 10843629 6595915 448067
9916D48067q089859o65494J1799951J1576222n724615k0977390j7235991l066142
$$ 448067 -7641792 -8307286 3492665 15068887 9344272 -11633118 -28869109 -31935251
9908c1935251J775884m795457p622052k05401O484891M682595L822019J3468473
$$ -31935251 -30159367 -34954824 -42576876 -42782277 -36297386 -31614791 -27792772 -14324299
9900a4324299K3457157J6264440n677052k1282504j9460615j0356936m384170
$$ -14324299 9132858 25397298 19720246 -1562258 -21022873 -31379809 -35763979
9893c5763979K884491J5309406K0909284P805331j3285063j9675805p123576N630131
$$ -35763979 -32879488 -17570082 3339202 11144533 -2140530 -21816335 -28939911 -23309780
9885b3309780L529684o518317p808410M469296J8182345J7735574K043310j0864074
$$ -23309780 -19780096 -26298413 -34106823 -29637527 -11455182 6280392 8323702 -2540372
9877b540372l664271J3845748J1643773j7767271l9866332k1328544J9711908
$$ -2540372 -6204643 7641105 19284878 1517607 -38348725 -59677269 -39965361
9870c9965361L4678020J1212851j3535868j0832733K199364j441332j4846085
$$ -39965361 -5287341 5925510 -7610358 -18443091 -16243727 -17685059 -32531144
9863c2531144j4067116J582189J3428378J5412920J5966655J5281261O091543
$$ -32531144 -46598260 -45016071 -31587693 -16174773 -208118 15073143 21164686
9856B1164686n742511n303346N744861Q899415k357611j2576162q775593J740684
$$ 21164686 15422175 10118829 15863690 24763105 22405494 9829332 1053739 2794423
9848B794423N409065Q67698m604066p059535p076048o178955o927703j0241145
$$ 2794423 8203488 9071186 4467120 -2592415 -9668463 -15847418 -22775121 -33016266
9840c3016266j0292396l046J5935411K2457387J2675543k473878p589007j09839
$$ -33016266 -43308662 -43311708 -27376297 -4918910 7756633 5282755 -2306252 -2416091
9832b416091R131833Q135963n111775j9396134j8685073O72989K2719187K8529801
$$ -2416091 6715742 14851705 9739930 -9656204 -28341277 -27668288 -4949101 23580700
9824B3580700J7465124L507263n580082j3071339j9231872j7369286o417063N060773
$$ 23580700 41045824 44553087 38973005 25901666 6669794 -10699492 -17116555 -12055782
9816a2055782J0266687Q973373J208257j0557612j4078533K40905J8799459J7554590
$$ -12055782 -1789095 7184278 8392535 -2165077 -16243610 -16002705 2796754 20351344
9808B0351344j100612q643876M220067J0502866q165137k7289226j6562637J0763982
$$ 20351344 19250732 10606856 14826923 25329789 17164652 -10124574 -26687211 -15923229
9800a5923229J8623317M327004k535858P888323J2557376j177721j3941986q468124
$$ -15923229 2700088 7027092 4491234 12379557 24936933 23759212 9817226 1349102
9792A349102L436904M714472N10547K500489M157787o449988k1051377k0280495
$$ 1349102 4786006 9500478 10011025 12511514 16669301 10219313 -10832064 -31112559
9784c1112559k887782J3043550J5795175J0518304M626922j584177p009240o279339
$$ -31112559 -34000341 -20956791 -5161616 5356688 9983610 8399433 1390193 -4889146
9776d889146m29387p18690j3313219k6085250k0358394M544067K6513121K4679052
$$ -4889146 -5318533 -6037223 -19350442 -45435692 -65794086 -61250019 -34736898 -10057846
9768a0057846L984407j0822900n191057R454723J4052497P579275L997276P985875
$$ -10057846 -6073439 -16896339 -22087396 -12632673 1419824 8999099 12996375 20982250
9760B0982250Q421574j059413r008971l053139R426391R916821n149497j8610975
$$ 20982250 29403824 28344411 19335440 16282301 25708692 35625513 30476016 11865041
9752A1865041j4417779L204797J6216752J3403393K25265j0168115j1704587r057180
$$ 11865041 -2552738 652059 16868811 30272204 30497469 20329354 8624767 -432413
9744d32413p753918n564168J578758Q241042L494365j1512059j9995249j0863211
$$ -432413 -8186331 -13750499 -12171741 -3930699 -436334 -11948393 -31943642 -42806853
9736d2806853M384259O937230k287760m915318O109906J5719743J0583200j32072
$$ -42806853 -38422594 -31485364 -33773124 -38688442 -32578536 -16858793 -6275593 -6407665
9728f407665N81074J1169317J4190529K412930j1430691j2662214j968109Q349225
$$ -6407665 -5826591 5342726 19533255 21946185 10515494 -2146720 -4114829 4234396
9720D234396P854439l962331j6096395j3194352O037832J9498401O042508k0339588
$$ 4234396 12088835 8126504 -7969891 -21164243 -15126411 4371990 10414498 -9925090
9712i925090k2698986M478730J9747154n630096l7504307k3558029K6464102M9989994
$$ -9925090 -32624076 -28145346 -8398192 -14028288 -51532595 -75090624 -48626522 1363472
9704A363472K1602614j3278986j0409376J1776979J2860506l089071l529208J1828233
$$ 1363472 22966086 9687100 -722276 11054703 23915209 20826138 17296930 29125163
9696B9125163J2506746p827835k1533509j4676730n473339o229868k688399J3191911
$$ 29125163 41631909 33804074 12270565 -2406165 -7879504 -14109372 -16797771 -3605860
9688c605860K0819029K753149k3919277l0462537j4458126N694973K0143930K9695653
$$ -3605860 17213169 19966318 -3952959 -34415496 -48873622 -43178649 -23034719 6660934
9680F660934K9159523J2197314j0647640j9084133r040911L574448N510010p48169
$$ 6660934 35820457 48017771 37370131 18285998 9245087 12819535 18329545 17581376
9672A7581376p199488j0821226j1014012p074121k415120l773284j1644359j6006583
$$ 17581376 10381888 -439338 -11453350 -18527471 -20942591 -24715875 -36360234 -52366817
9664e2366817n987681J6551310L4710472L0469402M434733k0200647k0611863
$$ -52366817 -58354498 -41803188 -7092716 23376686 27811419 7610772 -13001091
9657a3001091j475852J0248178L6368j6543703j7563811m134422N748261M429169
$$ -13001091 -14476943 -4228765 -4192397 -20736100 -38299911 -42434333 -36686072 -32256903
9649c2256903J198915M354250R531577P694967k839176j3841308j3801426N5334
$$ -32256903 -31057988 -26703738 -17172161 -9477194 -12316370 -26157678 -39959104 -39903770
9641c9903770J4501104J2421125l954080j2571826j705779J2095672Q881710l977007
$$ -39903770 -25402666 -12981541 -16935621 -29507447 -31213226 -19117554 -10235844 -14212851
9633a4212851m387578Q967390J5422279M774731j0081710j5223061j1407143l757930
$$ -14212851 -18600429 -9633039 5789240 10563971 482261 -14740800 -26147943 -29905873
9625b9905873N984858J1007366J175526j7815156k3197079m467687J9260442K3429570
$$ -29905873 -23921015 -12913649 -11738123 -29553279 -52750358 -57218045 -37957603 -14528033
9617a4528033Q397966o930496j1609009q249394n3975J0955023J5933459O013279
$$ -14528033 -6130067 -13060563 -24669572 -32918966 -32972941 -22017918 -6084459 -71180
9609g1180j1215313j5842957r80232J6451722J6333240p58368j6965965j9105536
$$ -71180 -11286493 -27129450 -28109682 -11657960 4675280 3916912 -13049053 -32154589
9601c2154589r275303L867184J4877282K0196696J5776117L448663n592708l739838
$$ -32154589 -41429892 -37562708 -22685426 -2488730 13287387 16736050 11143342 7403504
9593G403504p76943j1589606k9306692k8228095j808119K0986626J4605760l654893
$$ 7403504 6626561 -4963045 -34269737 -62497832 -64305951 -43319325 -28713565 -32368458
9585c2368458Q25598K4375361K8524805J314120k0774899p814841J7916499J7525261
$$ -32368458 -31542860 -7167499 21357306 22671426 1896527 -5918314 11998185 29523446
9577B9523446n779717j6460852l597153P147393j291281j2758413q812662J470305
$$ 29523446 23743729 7282877 3685724 10833117 9541836 -3216577 -12029239 -10558934
9569a0558934l26441j0635586j0189144N526591J9334672J6112619J573307o665685
$$ -10558934 -10885375 -21520961 -31710105 -26183514 -6848842 9263777 10837084 4171399
9561D171399r33883Q180605N355677r602126j9405703j0269580Q467152J4169781
$$ 4171399 3237516 11418121 16773798 7171672 -12234031 -22503611 -14036459 133322
9553A33322N50109j3310533r253348M836143P930389k122674o086710N336179
$$ 133322 683431 -12627102 -21880450 -17044307 -9113918 -11236592 -17323302 -11987123
9545a1987123J5255310O510291j0171749j2052444n40068K015191q284106q034140
$$ -11987123 3268187 9778478 -393271 -12445715 -12985783 -10970592 -19254698 -27288838
9537b7288838J2146539K4764288O672636j8880807j4118891J2618190J8004410
$$ -27288838 -15142299 9621989 16294625 -2586182 -16705073 -4086883 13917527
9530A3917527o400551j9475729J946724K3370052P134634k7266411l3629399p897408
$$ 13917527 7516976 -11958753 -10012029 13358023 20492657 -6773754 -40403153 -48300561
9522d8300561J2904507R779477J082072M024087J1474779J2728218R534322M232948
$$ -48300561 -35396054 -25616577 -24534505 -20510418 -9035639 3692579 13226901 17459849
9514A7459849n176701j2216390n765388P732663P473957r579614k0863895j0845741
$$ 17459849 12283148 66758 -5698630 2034033 9507990 -71624 -20935519 -31781260
9506c1781260Q153978J6942789J3031576L945735n533156r831000k832159R115375
$$ -31781260 -23627282 -6684493 6347083 10292818 4759662 -5071338 -7903497 1211878
9498A211878J0449784L59304m305287K360545M656341o554861j7159175j4506057
$$ 1211878 11661662 12020966 7715679 10076224 14732565 8177704 -8981471 -23487528
9490b3487528o863119l409871K072900J0518404O172003j2150909j5324434J1277436
$$ -23487528 -30350647 -33760518 -31687618 -21169214 -14997211 -27148120 -42472554 -31195118
9482c1195118L2759314J2338632k6119696k8647675O441581K6383262N295241
$$ -31195118 1564196 13902828 -12216868 -40864543 -34422962 -8039700 -2744459
9475b744459k1511099j7760407K774285Q499444n2831l19603J2919065K3458629
$$ -2744459 -24255558 -42015965 -39241680 -30742236 -30795067 -31114670 -18195605 5263024
9467E263024J8347165K85590j6392038j4371803R517113L1465927K2819349r925153
$$ 5263024 23610189 23895779 7503741 -6868062 2649051 34114978 56934327 47009174
9459D7009174k8957977j6032268N563910J0409202M315497J727722k218638j3817270
$$ 47009174 18051197 2018929 7582839 17992041 22307538 24035260 21816622 7999352
9451G999352j9194785p353048N467066K219969l402303P275087J8759463M824524
$$ 7999352 -11195433 -18548481 -13081415 -10861446 -14263749 -6988662 11770801 16595325
9443A6595325k1790564k4331774j467342J0804803r29157q197788P785461K4651165
$$ 16595325 -5195239 -29527013 -30994355 -20189552 -21118709 -29316497 -21531036 3120129
9435C120129J7976062n60357p091138k384026r81199l197353j375454Q43947k922623
$$ 3120129 21096191 20535834 13444696 11060670 10079471 6882118 5506664 6350611 3427988
9426C427988o122681j332323L836553J207107m00285P937681J3743192K030781
$$ 3427988 -2694693 -4027016 -190463 1016644 616359 8554040 22297232 24328013
9418B4328013j4945563j3491664K607224P329650n794639j6467337j3988023j0293310
$$ 24328013 9382450 -4109214 -1501990 5827660 33021 -16434316 -30422339 -40715649
9410d0715649r542398L595835K9819222L8594943J0030190k7961031l2811617
$$ -40715649 -50258047 -46662212 -16842990 21751953 31782143 3821112 -28990505
9403b8990505m672434J8143504J4021224j052431o896146m657081k089981K085310
$$ -28990505 -33662939 -15519435 -1498211 -2550642 -9446788 -14103869 -16193850 -14108540
9395a4108540P578463N444738n697881j1890364m864428L343591L77682n413095
$$ -14108540 -6530077 -1085339 -6783220 -18673584 -23538012 -20194421 -19816739 -25229834
9387b5229834k12020J0435005J0891890J611335l880096l237942n653919r744624
$$ -25229834 -25441854 -15006849 -4114959 -2503624 -6383720 -9621662 -15275581 -25020205
9379b5020205l039316J3553350K1439625J1102769m541653j0980156r667634o623676
$$ -25020205 -28059521 -14506171 6933454 18036223 13494570 2514414 -7153220 -13776896
9371a3776896n71240O734903M657809q422688j6079877p765137K406981j343906
$$ -13776896 -14348136 -7613233 -2955424 -11378112 -27457989 -35223126 -32816145 -34160051
9363c4160051q236168J263702J8922418J7616582n198319k0892273j1781744N848907
$$ -34160051 -42396219 -41132517 -22210099 -4593517 -9791836 -30684109 -42465853 -36616946
9355c6616946J1311604Q680007J0292531J0823495L349j1470446m504058J3967406
$$ -36616946 -25305342 -16625335 -6332804 4490691 4494040 -6976406 -11480464 2486942
9347B486942J5330740p271790k4034618j0330994J5625849J7793822n739208k1041326
$$ 2486942 17817682 10545892 -13488726 -23819720 -8193871 9599951 3860743 -17180583
9339a7180583q117192J3060926J5798008M018564j230417K942422K131938o823147
$$ -17180583 -25297775 -12236849 3561159 7579723 6349306 9291728 11423666 4600519
9331D600519j1427620o391526J1229L434447P470534Q801112k71832j1654853
$$ 4600519 -6827101 -13218627 -13207398 -9772951 -2302417 6498695 6226863 -5427990
9323e427990p691483P121320P649241r123626j3324496Q871691K6894133J2294807
$$ -5427990 -13119473 -5998153 1651088 -7472538 -20797034 -11925343 14968790 27263597
9315B7263597j4792919j9165987o545704n683998j2554229p8366K4371265K2828730
$$ 27263597 12470678 -6695309 -13241013 -18925011 -31479240 -31557606 -7186341 15642389
9307A5642389p382879k1831633J239761K4787913J1822553j7693090k1522119
$$ 15642389 8259510 -13572123 -12332362 12455551 24278104 6585014 -14937105
9300a4937105Q22948J4878631O288676n487802l336779O199285R818020N810731
$$ -14937105 -14114157 764474 7053150 1565348 -1771431 4427854 14245874 20056605
9292B0056605Q55240n28757j40117l429818j1101844j3897810l710118J0778640
$$ 20056605 20911845 20383088 20242971 16813153 5711309 -8186501 -11896619 -1117979
9284a117979J2352046K40577q577699n466279K41135J487738L101330N131266
$$ -1117979 11234067 11474644 2896945 -2569334 -2328199 -840461 2260869 7392135
9276G392135j234570j2355380j0087289P544441J7698951Q564941j291944L672552
$$ 7392135 6157565 -6197815 -16285104 -8740663 8958288 17523229 16231285 19903837
9268A9903837R366646K23564j1230859q298238n11168k391000l692410Q432675
$$ 19903837 29270483 29494047 18263188 9964950 9453782 7062782 3370372 11803047
9260A1803047J7930989M710912j6421242j7842769m737940m18819p47492J3197296
$$ 11803047 29734036 34444948 18023706 180937 -4557003 -4975822 -5723314 7473982
9252G473982K7707037J1026680k6875576l9446774j4361926R092402M953023m094991
$$ 7473982 35181019 46207699 19332123 -20114651 -34476577 -25384175 -20431152 -24526143
9244b4526143N542335J9145556J6873833Q476266O901544l95460k3093465l7630307
$$ -24526143 -18983808 161748 17035581 25511847 32413391 32017931 8924466 -28705841
9236b8705841j8542459J7685593L1409608J2126690j3535267j9291103m863588
$$ -28705841 -47248300 -29562707 1846901 13973591 438324 -18852779 -23716367
9229b3716367J0719850Q457890j1650443k5281884j0451692J8198617K4350030
$$ -23716367 -12996517 -4538627 -16189070 -41470954 -51922646 -33724029 -9373999
9222i373999M209439n561053J2527034K5153403J870417l2219701l3088576l186848
$$ -9373999 -5164560 -10725613 1801421 26954824 28825241 -3394460 -36483036 -39669884
9214c9669884J8896645J7921790J1048940P134326k592660j4934155j2517327
$$ -39669884 -20773239 -2851449 8197491 15331817 12739157 -2194998 -14712325
9207a4712325M753453J5754935R932346j855650r877511j4728178j3568035j733604
$$ -14712325 -9958872 5796063 15728409 13872759 3995248 -10732930 -24300965 -26034569
9199b6034569J1182265J0721554K597841L880192J1442772P399382n399838n726975
$$ -26034569 -14852304 -4130750 -1532909 2347283 13790055 21189437 15789599 10062624
9191A0062624O148003O371298p967766r879990Q888420J8457384O57534j7714711
$$ 10062624 16210627 22581925 14614159 4734169 13622589 32079973 32737507 15022796
9183A5022796r138691Q997817O886889n984223j549612J2725352M958542k2917065
$$ 15022796 5884105 14881922 21768811 15784588 14234976 26960328 31918870 9001805
9175I001805l2430942q568302J6899851J4841685j094347k332008J1218567J7420895
$$ 9001805 -23429137 -31997439 -15097588 -255903 -1350250 -3682258 7536309 24957204
9167B4957204O391253j1502963k3533714k4037015j1915001O756394J7346088
$$ 24957204 31348457 19845494 -3688220 -27725235 -39640236 -32883842 -15537754
9160a5537754J0815852k658852n550780K897792O420928l109458j2636942o525359
$$ -15537754 -4721902 -7380754 -12931534 -10033742 -3612814 -6722272 -19359214 -25884573
9152b5884573J0574476J9254911J0448188m729204j1042095o323619J482649O936498
$$ -25884573 -15310097 3944814 14393002 9663798 -1378297 -7701916 -6219267 717231
9144G17231R108470N766201m200554j3384615j1571119j112882L771615k561064
$$ 717231 9825701 15591902 11391348 -1993267 -13564386 -14677268 -10905653 -13466717
9136a3466717q352743l505966L691742J045798n445496p82872J1977895J3179592
$$ -13466717 -21819460 -25325426 -21633684 -20587886 -26033382 -26816254 -14838359 -1658767
9128a658767k845919j7121821j3227328N03388O319597J758686l488494n525526
$$ -1658767 -4504686 -21626507 -34853835 -34350447 -28030850 -26272164 -29760658 -35286184
9120c5286184o942959n716102K553335J3805900J8414528J3448864L586169o422238
$$ -35286184 -42229143 -47945245 -45391910 -31586010 -13171482 277382 3863551 -2558687
9112b558687j1860553p302715L315925M023801j1138639k1990137p971479J6883794
$$ -2558687 -14419240 -21721955 -18406030 -14382229 -25520868 -47511005 -55482484 -38598690
9104c8598690K0439371J546833q117511L846052J0711249o138954k3213896j3640759
$$ -38598690 -18159319 -16612486 -24729997 -20883945 -10172696 -16311650 -39525546 -53166305
9096e3166305P266474Q157212n626771l076398J8020635K6284764P406107j4932651
$$ -53166305 -45899831 -37742619 -43369390 -46445788 -28425153 -2140389 5265718 -9666933
9088i666933j6526751k644834R614573J5158404J5596470R501581n54815n907712
$$ -9666933 -26193684 -28838518 -19223945 -4065541 11530929 21032510 20477695 14569983
9080A4569983m790149m346093o106633n118982m998705j3612734k1206728p696595
$$ 14569983 9779834 5433741 -672892 -5791874 -10790579 -24403313 -45610041 -53306636
9072e3306636K1060578L1000588O816024k3531610k7260738o979380J4646482
$$ -53306636 -32246058 -1245470 5570554 -17961056 -45221794 -52201174 -37554692
9065c7554692K6935622K7153048P859495k4971770m0315567j8595958J4161591
$$ -37554692 -10619070 16533978 24393473 -578297 -40893864 -59489822 -45328231
9058d5328231J9048118n28638r174866L240214J1470241J697704q238462l635028
$$ -45328231 -26280113 -26808751 -35983617 -32743403 -21273162 -19575458 -27813920 -31448948
9050c1448948M097057K668550L52837N471874O227247q905595k5372139j8544949
$$ -31448948 -27351891 -24683341 -24330504 -18858630 -12631383 -21536978 -46909117 -65454066
9042f5454066J0251376L1867332K4952306J657813q032369O491958K2602053J3253076
$$ -65454066 -55202690 -23335358 1616948 3274761 -4757608 1734350 24336403 37589479
9034C7589479j5002388k7328936q109306J5014137R516014j5096918k2294320
$$ 37589479 22587091 -4741845 -12851151 2162986 11679000 -3417918 -25712238
9027b5712238j989894J8844763J9102633R242569N939569N093838n294655k1420975
$$ -25712238 -27702132 -8857369 10245264 19487833 25427402 30521240 25226585 3805610
9019C805610k8256001j9471713k167252J2248845J5402433O905940l072306k832533
$$ 3805610 -24450391 -43922104 -46089356 -33840511 -18438078 -11532138 -14604444 -17436977
9011a7436977O019416R973616J954875r829341j3491434o448161M257435Q182533
$$ -17436977 -11417561 -1443945 510930 -9318411 -22809845 -29258006 -25000571 -16818038
9003a6818038k8765j1556825r125756P978049J5017653m401638k6187603j4197838
$$ -16818038 -16846803 -28403628 -37529384 -29551335 -14533682 -18935320 -45122923 -59320761
8995e9320761K3700678M0433763J5099711j9326980k6052105j1292605j489388
$$ -59320761 -35620083 4813680 19913391 586411 -25465694 -36758299 -38247687
8988c8247687l83693M708884J1460287N682875j1191771k0511082j0936319R433113
$$ -38247687 -38631380 -33922496 -22462209 -16779334 -27971105 -48482187 -59418506 -49985393
8980d9985393K3125703J7793845k511439j5598767k771922K2949338K7802991
$$ -49985393 -26859690 -9065845 -11577284 -27176051 -29947973 -6998635 20804356
8973B0804356L808204j8126410j4081560m91946j696324r673246m505140N924234
$$ 20804356 24612560 6486150 -7595410 -8087356 -9783680 -19456926 -23962066 -18037832
8965a8037832Q72693j2740447j1028511L713069P143378l099521m227372R338796
$$ -18037832 -17165139 -29905586 -40934097 -37221028 -30077650 -33177171 -37404543 -28065747
8957b8065747J6504418Q283870J305638L321885m12036j2897393j1729376J0661854
$$ -28065747 -11561329 -3277459 -1971821 1350064 938028 -11959365 -23688741 -13026887
8949a3026887K4551252O614981j9974427j9471887K100793R911184m533406j5646344
$$ -13026887 11524365 18139346 -1835081 -21306968 -19206175 -9294991 -13828397 -29474741
8941b9474741p546648O408647J1091353R240552O420747p50924j1448150j3894403
$$ -29474741 -37021389 -30612742 -19521389 -10280837 -3860090 -4611014 -16059164 -29953567
8933b9953567k573408J1500868J6724524J4649603R799321p34920j7033682k7640421
$$ -29953567 -32526975 -21026107 -4301583 10348020 20147341 19412421 2378739 -25261682
8925b5261682k3331995j0547768j48621P478628J4364035J3506153J478838p613860
$$ -25261682 -48593677 -59141445 -59290066 -51811438 -37447403 -23941250 -22462412 -30076272
8917c0076272k65773J2417211J1349554L082504Q179862J8998797N526703k9159248
$$ -30076272 -30342045 -17924834 -6575280 -3492776 4687086 23685883 29212586 53338
8909E3338l9311841l583632L4995630K8627195n809985j8219035l572204J445856
$$ 53338 -39258503 -42842135 -7846505 20780690 14970705 -3248330 -6820534 -5374678
8901e374678j0783841p495900J9729038L2938866R754286j8882968j9986343q388202
$$ -5374678 -16158519 -23654419 -3925381 29013485 38767771 19884803 -101540 -8489742
8893h489742j2408127k2191176j1377279J2284835J9094514P436114K667646J1863451
$$ -8489742 -20897869 -43089045 -54466324 -42181489 -23086975 -15650861 -12983215 -1119764
8885a119764J6006496O875479j684221l112866q209453j8208603j5573888N607367
$$ -1119764 14886732 21762211 20077990 16965124 8755671 -9452932 -25026820 -19419453
8877a9419453K2416991J2677790j2792529k3681270q472754J4243450K0654077
$$ -19419453 2997538 15675328 2882799 -20798471 -29271225 -15027775 5626302
8870E626302Q034224o413993q346636j732008J225195r14288m49258K042507j869772
$$ 5626302 13660526 7246533 -1100103 -2832111 -1606916 -2521204 -2970462 -927955 -2797727
8861b797727q899646m575949R822307J2890812k014164j1089333J914974J5669907
$$ -2797727 -11697373 -16273322 -6451015 6439797 4425633 -6663700 -4748726 10921181
8853A0921181N568425j3012856r387207R924121J2258627n556815j4187597m396454
$$ 10921181 16489606 3476750 -5910457 4013664 16272291 10715476 -3472121 -7868575
8845g868575o19521j3543379j8954129o42032J9311419J4872278n098985j4535930
$$ -7868575 -8488096 -22031475 -40985604 -41627636 -22316217 -7443939 -12542924 -27078854
8837b7078854p136093M793248J2625196J3827980N168799r550042j5750293o500737
$$ -27078854 -34214947 -29421699 -16796503 -2968523 2200276 -7349766 -23100059 -29600796
8829b9600796N344684N729727n53478o08973N813656Q680372L290338o173873
$$ -29600796 -24256112 -18526385 -19079863 -19688836 -13875180 -5194808 -1904470 -8078343
8821h078343j2206528p462995Q441047K1969078J7555243J37100q659626j044320
$$ -8078343 -20284871 -27747866 -19306819 2662259 20217502 20354602 11694976 10650656
8813A0650656P131230K700825p580421j3934652j7625642j8005591o380675J4199792
$$ 10650656 17781886 20482711 12902290 -1032362 -18658004 -36663595 -43044270 -28844478
8805b8844478K3509481J3443256K438787M234141M342692j1112544k4944849j5111993
$$ -28844478 -5334997 8108259 10547046 14781187 19123879 8011335 -16933514 -32045507
8797c2045507N587825P803119p048465j1139385K180742Q882633l617565j5217756
$$ -32045507 -26457682 -18654563 -25703028 -36842413 -34661671 -25779038 -29396603 -44614359
8789d4614359n610669J4789870K1569178R965025k885725l154961L921186M284890
$$ -44614359 -50225028 -35435158 -13865980 -3900955 -6786680 -9941641 -6020455 -1735565
8781a735565m542674q767358K496031J8214901J7139318j617799j5518276j1137438
$$ -1735565 -6278239 -15045597 -12549566 5665335 22804653 21186854 5668578 -5468860
8773e468860j704748j885165m193655K791182R890751L075059q823581o649572
$$ -5468860 -7173608 -9058773 -13252428 -10461246 -570495 2504564 -6319017 -12968589
8765a2968589O670298J1144544L100258j081270N606181J0643090M248160p886622
$$ -12968589 -6298291 4846253 7946511 6865241 12471422 23114512 27362672 19476050
8757A9476050j7620670k2593487j8454852n02472K1958545K8653491J2525004
$$ 19476050 1855380 -20738107 -39192959 -39695431 -17736886 10916605 23441609
8750B3441609j0394283j9974493j1821770L522720J1967832O165511o773075r577277
$$ 23441609 13047326 -6927167 -18748937 -15226217 -3258385 2907126 -3865949 -13443226
8742a3443226M299895J8755086J5094191k239454j4078503j4095600j0599770
$$ -13443226 -9143331 9611755 24705946 22466492 8387989 -5707611 -16307381
8735a6307381o320861K874784J1254300P041993n675881r587848j605091K594236
$$ -16307381 -22628242 -19753458 -8499158 -1457165 -7133046 -16720894 -18325985 -15731749
8727a5731749m089643q447739R3102J2543901J5246688P679400k150695q275391
$$ -15731749 -19821392 -28269131 -28176029 -15632128 -385440 7293960 5143265 -3132126
8719c132126p452097l28140N202624K842555l16076N665718J3720488Q229615
$$ -3132126 -10584223 -10912363 -5709739 -2867184 -3183260 2482458 16202946 24432561
8711B4432561q196561j7029412j2886884p593856m298688O241614J9500233J6298087
$$ 24432561 16236000 -793412 -13680296 -21274152 -25572840 -19331226 169007 16467094
8703A6467094l000627j2551169j823118P263922M89556k281544J5068382K8828785
$$ 16467094 13466467 915298 -907820 6356102 6845658 4564114 19632496 48461281
8695D8461281R466103k7375813l8309243j1253727K3179600L4400047J9931463
$$ 48461281 57927384 30551571 -7757672 -19011399 4168201 38568248 58499711
8688E8499711n646277k6051818k8854100j5150702j957221k76347J232236J3948466
$$ 58499711 52853434 26801616 -2052484 -17203186 -19160407 -19436754 -18204518 -4256052
8680d256052K3527808J1032769j0545628j1348615P749459J4718645l959603k4216625
$$ -4256052 19271756 30304525 19758897 8410282 16159741 30878386 26918783 2702158
8672B702158k2991228p978046K821584O901386Q773120O426970Q31254J271739
$$ 2702158 -20289070 -28267116 -25445532 -18544146 -9771026 -3344056 -2512802 -1241063
8664a241063P450105L653474j4366602k4257912p323521K0914632L1569647K2494467
$$ -1241063 6209042 9862516 -4504086 -28761998 -36085519 -15170887 16398760 38893227
8656C8893227J4299279J3667796O709096j0988750k2858701j7862614q731266
$$ 38893227 53192506 66860302 73569398 62580648 39721947 21859333 13128067
8649A3128067j1306634j9065556j2873850R725401K8145764K2682561k448886
$$ 13128067 1821433 -17244123 -30117973 -20392572 7753192 30435753 27986867
8642B7986867k3123768k0889064k502300Q859155K082067r211111p777200K742879
$$ 27986867 4863099 -16025965 -18528265 -9669110 -7587043 -16798154 -24575354 -21832475
8634b1832475P380039O343889J1171948J6320445K270164k4939611k8224809N594137
$$ -21832475 -14452436 -8108547 3063401 19383846 21654010 -3285601 -31510410 -25916273
8626b5916273L3985229J5230393k5032741k8075083Q079896K5827477p23954k7446369
$$ -25916273 8068956 23299349 -1733392 -29808475 -21728579 4098898 3374944 -24071425
8618b4071425j4636881J2258675J2959895o998P643085K4605601J3575174j8752988
$$ -24071425 -38708306 -26449631 -13489736 -13496734 -5853649 18751952 32327126 13574138
8610A3574138k8348006o075415J0714164K631627o540646O67058Q271243M651859
$$ 13574138 -14773868 -20849283 -10135119 -7503492 -14044138 -13377080 -5105837 -453978
8602d53978L650346R291582J324389k2139920k8517814l673376J8413656J0031758
$$ -453978 3196368 12487950 13812339 -8327581 -36845395 -40518771 -22105115 -12073357
8594a2073357m151315O997200K3981375J1585903j6058205j7137989P197289J6756590
$$ -12073357 -16224672 -9227472 14753903 26339806 10281601 -6856388 340901 17097491
8586A7097491P81498r185098J590029P340858r594138k7218841k0816974r99575
$$ 17097491 17878989 8693891 10283920 17624778 8030640 -19188201 -40005175 -41004750
8578d1004750O853413L92666k733621O336303J7691026J6640130M19014j6518928
$$ -41004750 -34151337 -33758671 -36492292 -30155989 -12464963 4175167 4594181 -11924747
8570a1924747j5609292J974361J2429321J041114j4063789p044630J6705213K8625289
$$ -11924747 -27534039 -25559678 -13130357 -12089243 -26153032 -33197662 -16492449 12132840
8562A2132840J7375348j968940j4356782j6807334q157107Q468006J6182530K828963
$$ 12132840 29508188 27539248 13182466 -3624868 -11781975 -3313969 12868561 15697524
8554A5697524j4419532j0032540Q425182J1111280m378651j0305370J976125R096932
$$ 15697524 1277992 -8754548 -329366 10781914 6403263 -3902107 -1925982 7170950
8546G170950J87112n347188J453910l04263j9942508l0834246j2928210J2064135
$$ 7170950 7358062 2010874 3464784 3160521 -16781987 -47616233 -60544443 -48480308
8538d8480308J5957801O686558O046180J0040428L801995m722320P1411Q485250
$$ -48480308 -32522507 -25835949 -19789769 -9749341 -5947346 -10669666 -10598255 -2113005
8530b113005J293222j3481087j2326502L832953J3063139R744423P730454R595623
$$ -2113005 -819783 -14300870 -26627372 -22794419 -9731280 13143 7743597 17339220
8522A7339220L008745j1436261j6359563n635842O471116Q380835M086545k22083
$$ 17339220 20347965 8911704 -7447859 -13083701 -6612585 1768250 5854795 5632712
8514E632712m961025r294435q784333k838078N936136J6565930K3578214J5157223
$$ 5632712 671687 -8622748 -17407081 -20245159 -14309023 2256907 25835121 40992344
8506D0992344p655895k1394572j0158582O089681r11081k1008975j8640408J0094731
$$ 40992344 33336449 11941877 1783295 7872976 6961895 -14047080 -32687488 -22592757
8498b2592757K8770232J5393793p751197j2684032m872799m351285j0379979q042029
$$ -22592757 6177475 21571268 13820071 1136039 -3736760 -8088045 -18468024 -26510053
8490b6510053L404602J0202034N975595k150961o337866n821936l881688l688436
$$ -26510053 -23105451 -12903417 -6927822 -9078783 -15416649 -21238585 -25120273 -28808709
8482b8808709m919221k200468P936621J8048544J5890832O50966j5616456k2924622
$$ -28808709 -33727930 -35928398 -27991777 -9943233 5947599 6598565 -9017891 -31942513
8474c1942513j9817198o554756J4062509K8752798K3219844L457638q182972l150932
$$ -31942513 -51759711 -58314467 -44251958 -15499160 7720684 11178322 2995350 -155582
8466a55582L141076k559752j2082783j2038290m020003K463928M854536N160689
$$ -155582 2985494 425742 -11657041 -23695331 -27715334 -25251406 -20396870 -15236181
8458a5236181L665415L021548O948837R176957o34374j3963652p988524J5597400
$$ -15236181 -11570766 -8549218 -1600381 7576576 6942202 -7021450 -15009974 587426
8450E87426K1686544p655376l7484060k4966806J6805593L5978117J5013942j1631663
$$ 587426 22273970 14618594 -22865466 -47832272 -31026679 4951438 19965380 8333717
8442H333717j4141277l304148J340871M404611J4819327J9795536M890336j6536844
$$ 8333717 -5807560 -9111708 -7770837 -3366226 11453101 31248637 36138973 19602129
8434A9602129k0080118o880212J022216l486794n972254L24356K488635p885387
$$ 19602129 -477989 -7358201 -6335985 -9822779 -15795033 -15470677 -12982042 -20867429
8426b0867429j7903922j2252607M209303J4695199J2660872M799645j547585l290624
$$ -20867429 -38771351 -51023958 -46814655 -32119456 -19458584 -14658939 -16206524 -19497148
8418a9497148J283327R792045J3415937O938750k102837m134128l028213q067663
$$ -19497148 -18213821 -8421776 4994161 11932911 9830074 5695946 2667733 -5399930
8410e399930j4189786p662392P929504J1420615l515841j5349115o221257J1209955
$$ -5399930 -19589716 -27252108 -19322604 -7901989 -11417830 -26766945 -32988202 -21778247
8402b1778247J5031383O960275L101003L543901l619907j3883291r574018P284286
$$ -21778247 -6746864 213411 3314414 6858315 3238408 -10644883 -20218901 -12934615
8394a2934615J2402677k696160j4291401j586257K1074463K4357381M123033j5723227
$$ -12934615 -531938 -3228098 -17519499 -19105756 1968707 26326088 30449121 14725894
8386A4725894j5122609P31404J0650735J178040j7680060k0302764M067182L1045638
$$ 14725894 -396715 334689 10985424 12163464 -5516596 -25819360 -21752178 9293460
8378I293460K6135504q621928l2918657k1003873N156244J0797099l243742r931808
$$ 9293460 35428964 26807036 -6111621 -27115494 -21959250 -11162151 -14405893 -24337701
8370b4337701o50793O734892O47420q498551q361569o30595Q251979J6551237
$$ -24337701 -24988494 -18253602 -17606182 -26104733 -34466302 -35096897 -26844918 -10293681
8362a0293681K1629546J7710842N624726m459342n159189o1259L028613J074894
$$ -10293681 11335865 29046707 34671433 30212091 25052902 24991643 28020256 29095150
8354B9095150l340397n209856j632903K964244L46611p734714p512014N634786
$$ 29095150 25754753 20544897 18911994 21876238 22222849 14488135 6976121 12610907
8346A2610907J4000461R31092k0866843k4719517r320581R02585m878798j0066460
$$ 12610907 26611368 27542460 6675617 -18043900 -27364481 -26461896 -31340694 -41407154
8338d1407154k855870L573136k928152r303873J567940K1174195K7340985J5809352
$$ -41407154 -44263024 -40689888 -43618040 -52921913 -51353973 -30179778 -2838793 12970559
8330A2970559P76854q449152j2613157j0038781J552801J2902529J1228977P47596
$$ 12970559 13747413 5298261 -7314896 -17353677 -15800876 -2898347 8330630 9078226
8322I078226j708412O703552R418823l659330k0090014k2232046r020242P115397
$$ 9078226 7369814 14073366 23492189 19832859 -257155 -22489201 -31509443 -24394046
8314b4394046J5531635J2641771R60423r761819q743314J092633L365946q104133
$$ -24394046 -8862411 3779360 4739783 -5022036 -13765350 -12672717 -9306771 -17410904
8306a7410904j5970375l115043J8331515K0666696J750792r071397O344031K5988749
$$ -17410904 -33381279 -36496322 -18164807 2501889 4252681 -4818716 1525315 27514064
8298B7514064J8213034j1167445k5074763p199770J5099079R984091j3804723
$$ 27514064 45727098 34559653 9484890 2285120 17384199 27368290 13563567
8291A3563567j9681709M774238K8905827J8836420j7413354l8695175k1626133
$$ 13563567 -6118142 -1343904 27561923 46398343 28984989 -9710186 -31336319
8284c1336319J1378794K1505668J791859j7385542j0697065R771409J4842071
$$ -31336319 -19957525 1548143 3340002 -14045540 -24742605 -14971196 -129125
8277a29125j73275j2478671p897903J361665J926637J716042J1276972J8625769
$$ -129125 -302400 -12781071 -20678974 -19317309 -17390672 -15674630 -4397658 14228111
8269A4228111N975789j6338591j9174651J611145J7040312Q497272n719447k568647
$$ 14228111 20203900 3865309 -15309342 -13698197 3342115 11839387 6119940 3551293
8261C551293Q506230L179100j6585904k4962539j1405564O614199J1538662O051423
$$ 3551293 12057523 15236623 -1349281 -26311820 -37717384 -31103185 -19564523 -13513100
8253a3513100J100251R50592N992566J5378274K0725563J1331659p859766j7559648
$$ -13513100 -12412849 -11462257 -5469691 9908583 30634146 41965805 34106039 16546391
8245A6546391j0325107l27511J312407L153958J2208591J4544368k353397k2211526
$$ 16546391 6221284 5893773 7206180 10360138 22568729 37113097 34759700 12548174
8237A2548174k0556934m023524o13960j3586379j6028379L717588K1924117J7462143
$$ 12548174 -8008760 -12032284 -12646244 -26232623 -42261002 -38543414 -16619297 842846
8229H42846K710954j749478o7760n778486j2094149m548110Q820158Q283670l159798
$$ 842846 3553800 1804322 1736562 -4041924 -16136073 -20684183 -11864025 -3580355 -6740153
8220f740153m723990N044049N559911p970292j3501930P11756J4736352R382659
$$ -6740153 -11464143 -6420094 -860183 -8830475 -22332405 -21620649 -6884297 2498362
8212B498362k057509L423804J8954621J6397451j0228452l3182789k7076124o97689
$$ 2498362 440853 3864657 22819278 39216729 28988277 -4194512 -31270636 -31968325
8204c1968325J5312782N196653j5113606j8123042J548837J9382165J1755755
$$ -31968325 -16655543 -11458890 -26572496 -44695538 -43146701 -23764536 -12008781
8197a2008781j1536669j9070295j462253J5309071Q251304r389929r863209P193057
$$ -12008781 -23545450 -42615745 -44077998 -28768927 -20517623 -29907552 -39770761 -32577704
8189c2577704J6742926P614592l025175J594461J3482265J4473310L449303l787992
$$ -32577704 -15834778 -8220186 -11245361 -9650900 3831365 18304675 21753978 17965986
8181A7965986J524846Q445576K105455j3204938j6571494N1296J5318113N446953
$$ 17965986 19490832 27936408 30041863 16836925 265431 316727 15634840 21081793
8173B1081793j7977142j9400196P752824K5607828N061099k9053535l2175611
$$ 21081793 3104651 -16295545 -8542721 17065107 22126206 -6927329 -39102940
8166c9102940l336735J8098591J2039412j025674j069381L336036J44532k088710
$$ -39102940 -42439675 -24341084 -12301672 -13327346 -14396727 -11060691 -10916159 -13004869
8158a3004869N953301J2348960L089121j1970770j3378499j945599N662362M165479
$$ -13004869 -7051568 5297392 8386513 -3584257 -16962756 -18908355 -13245993 -9080514
8150i080514K965899N504137L916501m234131q831467j484627J2081748J7893543
$$ -9080514 -6114615 -610478 3306023 -928108 -9759575 -11244202 837546 18731089
8142A8731089P971039j1348009k2940141j4899798L505154R165273n379173j9150483
$$ 18731089 26702128 15354119 -7586022 -22485820 -18980666 -9815393 -15194566 -34345049
8134c4345049j0472288J0947940J5990623k978026k1071932j3915164J3255361
$$ -34345049 -44817337 -33869397 -17878774 -20856800 -41928732 -55843896 -42588535
$$ [...]
##END NTUPLES=NMR SPECTRUM
##END=
