##TITLE=31Pdec_LY-8Dix.5.B
 CD3CN, 24 sc
 13.05.2021
##JCAMPDX= 6.0         $$ Bruker NMR JCAMP-DX V2.0
##DATA TYPE= NMR SPECTRUM
##DATA CLASS= NTUPLES
##ORIGIN= UXNMR, Bruker Analytische Messtechnik GmbH
##OWNER= root
$$ XWIN-NMR		Version 3.5
$$ Thu May 13 09:59:09 2021 Russian Standard Time (UT+4h)  she@DPX200
##.OBSERVE FREQUENCY= 81.013821
##.OBSERVE NUCLEUS= ^31P
##.ACQUISITION MODE= SIMULTANEOUS
##.ACQUISITION SCHEME= undefined
##.AVERAGES= 24
##.DIGITISER RES= 16
##SPECTROMETER/DATA SYSTEM= spect
##.PULSE SEQUENCE= zgpg30
##.SOLVENT NAME= CDCl3
##.SHIFT REFERENCE= (INTERNAL, CDCl3, 0, 248.564)
##AUDIT TRAIL= $$ (NUMBER, WHEN, WHO, WHERE, WHAT)
$$ ##TITLE= Audit trail, XWIN-NMR		Version 3.5
$$ ##JCAMPDX= 5.01
$$ ##ORIGIN= Bruker BioSpin GmbH
$$ ##OWNER= she
$$ F:/spectra/data/she/nmr/P31/1/pdata/1/auditp.txt
$$ ##AUDIT TRAIL=  $$ (NUMBER, WHEN, WHO, WHERE, WHAT)
(   1,<2021-05-13 09:58:04.68 +0400>,<she>,<DPX200>,
      <created by zg, POWCHK disabled, PULCHK disabled
       configuration hash MD5:
       00 E9 B6 7A A2 85 ED C7 34 08 36 98 17 FE 4E 26
       data hash MD5: 32K
       B0 DA D4 65 71 89 8F 50 FD 50 FC D6 B3 41 92 DC>)
(   2,<2021-05-13 09:58:07.14 +0400>,<she>,<DPX200>,
      <Start of raw data processing
       efp BC_mod = 2 LB = 1 FT_mod = 6 PKNL = 1 PHC0 = -6358.823 PHC1 = 366.4007 SI = 64K 
       data hash MD5: 64K
       1F B3 85 2D C2 C8 E7 4B 50 AE 75 4C 80 50 60 D6>)
(   3,<2021-05-13 09:58:33.70 +0400>,<she>,<DPX200>,
      <pk PHC0 = 406.3225 PHC1 = -875.2 
       data hash MD5: 64K
       38 B5 3A DF 3C A2 29 92 66 14 2F 1C C1 C0 93 F4>)
$$ ##END=
$$ 
$$ hash MD5
$$ 55 08 33 99 C8 AB 16 2D F4 CC EE F3 25 5A 1F 56
##$RELAX= 
##$RELAX= 
##$RELAX= 
##$RELAX= 
##$RELAX= 
##$RELAX= 
##$RELAX= 
##$RELAX= 
$$ Bruker specific parameters
$$ --------------------------
##$DU= <F:/spectra>
##$EXPNO= 1
##$NAME= <P31>
##$PROCNO= 1
##$TYPE= <nmr>
##$USER= <she>
##$AMP= (0..31)
100 100 100 100 100 100 100 100 100 100 100 100 100 100 100 100 100 100 
100 100 100 100 100 100 100 100 100 100 100 100 100 100 
##$AQSEQ= 0
##$AQ_mod= 1
##$AUNM= <au_zg>
##$AUTOPOS= <>
##$BF1= 81.014009
##$BF2= 200.13
##$BF3= 200.13
##$BF4= 200.13
##$BF5= 200.13
##$BF6= 200.13
##$BF7= 200.13
##$BF8= 200.13
##$BYTORDA= 1
##$CFDGTYP= 0
##$CFRGTYP= 5
##$CHEMSTR= <none>
##$CNST= (0..31)
1 1 145 1 1 1 1 1 1 1 1 1 1 1 1 1 1 1 1 1 1 1 1 1 1 1 1 1 1 1 1 1 
##$CPDPRG= <waltz16>
##$CPDPRG1= <>
##$CPDPRG2= <waltz16>
##$CPDPRG3= <>
##$CPDPRG4= <mlev>
##$CPDPRG5= <mlev>
##$CPDPRG6= <mlev>
##$CPDPRG7= <mlev>
##$CPDPRG8= <mlev>
##$CPDPRGB= <>
##$CPDPRGT= <>
##$D= (0..31)
0 1 0 0 0 0 0 0 0 0 0 0.03 2e-05 3e-06 0 0 0 0 0 0 0 0 0 0 0 0 0 0 0 0 
0 0 
##$DATE= 1620885484
##$DBL= (0..7)
120 120 120 11 120 120 24 19 
##$DBP= (0..7)
150 150 150 150 150 150 150 150 
##$DBP07= 0
##$DBPNAM0= <>
##$DBPNAM1= <>
##$DBPNAM2= <>
##$DBPNAM3= <>
##$DBPNAM4= <>
##$DBPNAM5= <>
##$DBPNAM6= <>
##$DBPNAM7= <>
##$DBPOAL= (0..7)
0.5 0.5 0.5 0.5 0.5 0.5 0.5 0.5 
##$DBPOFFS= (0..7)
$$ [...]
##$SUBNAM2= <"">
##$SUBNAM3= <"">
##$SUBNAM4= <"">
##$SUBNAM5= <"">
##$SUBNAM6= <"">
##$SUBNAM7= <"">
##$SUBNAM8= <"">
##$SUBNAM9= <"">
##$SW= 501.771253377433
##$SWIBOX= (0..15)
0 1 3 0 0 0 0 0 0 0 0 0 0 0 0 0 
##$SW_h= 40650.406504065
##$TD= 32768
##$TD0= 1
##$TE= 0
##$TE2= 300
##$TE3= 300
##$TEG= 300
##$TL= (0..7)
0 120 53 12 22 120 120 120 
##$TP= (0..7)
150 150 150 150 150 150 150 150 
##$TP07= 0
##$TPNAME0= <>
##$TPNAME1= <>
##$TPNAME2= <>
##$TPNAME3= <>
##$TPNAME4= <>
##$TPNAME5= <>
##$TPNAME6= <>
##$TPNAME7= <>
##$TPOAL= (0..7)
0.5 0.5 0.5 0.5 0.5 0.5 0.5 0.5 
##$TPOFFS= (0..7)
0 0 0 0 0 0 0 0 
##$TUNHIN= 0
##$TUNHOUT= 0
##$TUNXOUT= 0
##$USERA1= <user>
##$USERA2= <user>
##$USERA3= <user>
##$USERA4= <user>
##$USERA5= <user>
##$V9= 5
##$VALIST= <valist>
##$VCLIST= <CCCCCCCCCCCCCCC>
##$VD= 0
##$VDLIST= <DDDDDDDDDDDDDDD>
##$VPLIST= <PPPPPPPPPPPPPPP>
##$VTLIST= <TTTTTTTTTTTTTTT>
##$WBST= 1024
##$WBSW= 4
##$XGAIN= (0..3)
0 0 0 0 
##$XL= 0
##$YL= 0
##$YMAX_a= 2267
##$YMIN_a= -22109
##$ZGOPTNS= <>
##$ZL1= 120
##$ZL2= 120
##$ZL3= 120
##$ZL4= 120
##$ABSF1= 0
##$ABSF2= 0
##$ABSG= 0
##$ABSL= 0
##$ALPHA= 0
##$AQORDER= 0
##$ASSFAC= 0
##$ASSFACI= 0
##$ASSFACX= 0
##$ASSWID= 0
##$AUNMP= <proc_1d>
##$AZFE= 0.1
##$AZFW= 0.5
##$BCFW= 0
##$BC_mod= 2
##$BYTORDP= 0
##$COROFFS= 0
##$CY= -3
##$DATMOD= 1
##$DC= 0
##$DFILT= <>
##$DTYPP= 0
##$F1P= 0
##$F2P= 0
##$FCOR= 1
##$FTSIZE= 65536
##$FT_mod= 6
##$GAMMA= 0
##$GB= 0
##$INTBC= 1
##$INTSCL= 5.30512e-09
##$ISEN= 30
##$LB= 1
##$LEV0= 0
##$LPBIN= 0
##$MAXI= 10000
##$MC2= 0
##$MEAN= 0
##$ME_mod= 0
##$MI= 50
##$NCOEF= 0
##$NC_proc= -3
##$NLEV= 6
##$NOISF1= 182.463
##$NOISF2= 159.3651
##$NSP= 0
##$NTH_PI= 0
##$NZP= 0
##$OFFSET= 248.5645
##$PC= 4
##$PHC0= -5952.501
##$PHC1= -508.7993
##$PH_mod= 1
##$PKNL= yes
##$PPARMOD= 0
##$PSCAL= 0
##$PSIGN= 0
##$REVERSE= no
##$SF= 81.014009
##$SI= 65536
##$SIGF1= 159.3651
##$SIGF2= -187.1042
##$SINO= 113.3802
##$SIOLD= 16384
##$SREGLST= <1H.CDCl3>
##$SSB= 0
##$STSI= 65536
##$STSR= 0
##$SW_p= 40650.406504065
##$SYMM= 0
##$S_DEV= 0
##$TDeff= 32768
##$TDoff= 0
##$TI= <>
##$TILT= no
##$TM1= 0
##$TM2= 0
##$TOPLEV= 0
##$USERP1= <user>
##$USERP2= <user>
##$USERP3= <user>
##$USERP4= <user>
##$USERP5= <user>
##$WDW= 1
##$XDIM= 65536
##$YMAX_p= 409167409
##$YMIN_p= -15873744
$$ End of Bruker specific parameters
$$ ---------------------------------
##NTUPLES= NMR SPECTRUM
##VAR_NAME=  FREQUENCY,     SPECTRUM/REAL,   SPECTRUM/IMAG
##SYMBOL=    X,             R,               I
##VAR_TYPE=  INDEPENDENT,   DEPENDENT,       DEPENDENT
##VAR_FORM=  AFFN,          ASDF,            ASDF
##VAR_DIM=   65536,         65536,           65536
##UNITS=     HZ,            ARBITRARY UNITS, ARBITRARY UNITS
##FACTOR=    0.620285442955139, 1,           1
##FIRST=     20137.2065510759, 0,            0
##LAST=      -20513.1999529892, 0,           0
##MIN=       -20513.1999529892, -15873744,   0
##MAX=       20137.2065510759, 409167409,    0
$$ Real data points
##PAGE= N=1
##DATA TABLE= (X++(R..R)), XYDATA
$$ [...]
37998 -494242 -249002 -244467 -506942 -787016 -921445 -839854 -472064 50048 322421 123556
37988 123556 -237364 -338028 -224663 -222545 -341232 -318621 -180059 -255097 -579720 -755330
37978 -755330 -569750 -343180 -409643 -600972 -561013 -323069 -226968 -393533 -595119 -601315
37968 -601315 -416831 -204110 -137820 -276406 -439653 -327833 74838 362787 189600 -254775
37958 -254775 -500057 -394655 -149804 90486 341225 483118 300654 -117981 -396480 -394740
37948 -394740 -365968 -466724 -487926 -272804 -42547 -36166 -142534 -205292 -399009 -895406
37938 -895406 -1362119 -1272117 -666850 -175818 -212816 -508603 -560165 -255317 112986 250523
37928 250523 102913 -191072 -428586 -458938 -277369 -31623 81670 -40692 -311421 -498402
37918 -498402 -464864 -383938 -565768 -1003336 -1277659 -1065159 -569742 -245062 -231265 -322778
37908 -322778 -388624 -508795 -698935 -799499 -721035 -587787 -558464 -659251 -827392 -960095
37898 -960095 -910362 -623661 -301447 -226987 -389969 -495588 -403115 -321650 -456876 -683125
37888 -683125 -747383 -650696 -620537 -757003 -878580 -748743 -377457 -51189 -44415 -306193
37878 -306193 -509997 -458170 -308155 -276477 -279673 -117187 92074 -3393 -440940 -812981
37868 -812981 -795952 -539089 -389095 -469315 -687029 -931500 -1074670 -963306 -623827 -351031
37858 -351031 -406070 -710984 -976751 -1031001 -894946 -651110 -377106 -139609 37838 138310
37848 138310 83662 -139148 -298993 -136018 193732 216767 -184296 -552399 -528842 -377812
37838 -377812 -512836 -827111 -921384 -763022 -647425 -645333 -561655 -372962 -247711 -161249
37828 -161249 53227 269027 162099 -192526 -312520 -46474 156398 -44497 -341766 -296962
37818 -296962 -47651 -58215 -355454 -473651 -157227 260371 312814 5865 -222803 -76508
37808 -76508 248177 357670 193273 60443 109231 58543 -365246 -936031 -1182350 -1003633
37798 -1003633 -693899 -442423 -205054 -39485 -120569 -359499 -449327 -397975 -547286 -888976
37788 -888976 -883797 -289169 308263 245435 -293157 -622895 -567345 -539820 -743515 -892331
37778 -892331 -782669 -624738 -631384 -667459 -526948 -288631 -175786 -226492 -292160 -284531 -286063
37767 -286063 -417932 -646277 -752619 -565791 -229100 -91341 -260324 -446237 -383738 -203621
37757 -203621 -166638 -222277 -140296 43931 68008 -111494 -255681 -255255 -289779 -491022 -713743
37746 -713743 -762496 -653814 -544272 -535900 -626198 -743512 -795438 -763505 -728288 -721803 -652102
37735 -652102 -501442 -451872 -607324 -742699 -610932 -375771 -400412 -684918 -889520 -884992
37725 -884992 -872774 -928580 -848749 -563124 -320985 -311314 -416981 -481052 -506224 -470008 -278792
37714 -278792 -41661 -26522 -170634 -24312 568130 1102320 1054975 587859 250596 221721
37704 221721 239299 136300 44012 79923 134890 22579 -304809 -685917 -841898 -642574
37694 -642574 -318351 -227775 -376318 -423234 -231494 -73351 -148147 -268466 -248894 -235032
37684 -235032 -357697 -421629 -285068 -203933 -394355 -573607 -401058 -99060 -120675 -419273
37674 -419273 -592969 -586196 -667927 -812974 -706830 -356090 -121860 -103457 -29676 172098
37664 172098 239929 114464 74204 180231 115454 -205355 -370855 -109602 245308 257529
37654 257529 -8794 -224211 -324108 -443761 -546950 -468470 -208948 64965 216152 173629
37644 173629 -71419 -359352 -436358 -288414 -208074 -374954 -579758 -543054 -309653 -134676
37634 -134676 -145427 -284890 -428947 -419663 -165027 164835 247081 32760 -180077 -222515
37624 -222515 -288336 -502626 -617521 -447601 -284262 -465994 -769988 -696750 -241161 81789
37614 81789 -39327 -380976 -615995 -689908 -656119 -467573 -121219 199408 309010 241342
37604 241342 165411 153121 115755 -63980 -376838 -649234 -679306 -450914 -182444 -116106
37594 -116106 -287108 -526679 -637515 -542289 -335689 -219132 -304945 -475487 -530697 -445191
37584 -445191 -324757 -158890 125315 363124 246364 -173247 -419308 -224594 84537 79216
37574 79216 -197134 -437134 -566019 -671106 -676129 -497889 -353954 -482587 -678055 -556346
37564 -556346 -214136 -143120 -472921 -773908 -717269 -495063 -406345 -406017 -312604 -179066 -176852
37553 -176852 -278127 -302710 -207656 -149581 -278723 -568013 -836312 -911715 -791155 -615393
37543 -615393 -461395 -258642 10442 178352 128181 23308 76723 201470 152075 -68466
37533 -68466 -231802 -264126 -301364 -384242 -402413 -347944 -328649 -319639 -199731 -35864 -3539
37522 -3539 -18114 177268 505332 544808 147001 -329819 -557624 -621565 -677309 -631441 -434485
37511 -434485 -324708 -444704 -513830 -241239 172485 308315 115387 -129058 -289152 -435090
37501 -435090 -542234 -485987 -307506 -187601 -166421 -127556 -30639 54477 96037 82152 -67006
37490 -67006 -350659 -538929 -424201 -164123 -119575 -373810 -644401 -665937 -460153 -238192
37480 -238192 -202134 -396464 -596312 -440438 123864 640376 632117 187247 -213685 -345375
37470 -345375 -374536 -421027 -388002 -268750 -239437 -330461 -328194 -139785 27361 -7397 -145629
37459 -145629 -222896 -233810 -211128 -128592 -75196 -270427 -711160 -1033289 -948730 -627297 -415103
37448 -415103 -357293 -267657 -124302 -81142 -142268 -127214 13438 96614 -5507 -164244 -183054
37437 -183054 -67724 -273 -93100 -259031 -341427 -329039 -378358 -594559 -856414 -946530 -812091
37426 -812091 -577364 -329867 -57473 195532 294105 190738 -16465 -247709 -492267 -655883
37416 -655883 -578491 -298292 -80352 -59947 -74220 12425 55109 -108550 -367199 -529346
37406 -529346 -597663 -612822 -452831 -89191 163674 16397 -322780 -412332 -199505 789
37396 789 44083 50645 24219 -166425 -418715 -453426 -276932 -151371 -77738 194625 574745
37385 574745 616077 273060 85990 320020 491141 158914 -329056 -400548 -139582 -28247
37375 -28247 -144983 -234700 -318810 -573423 -759874 -469265 103338 301342 -23934 -330979
37365 -330979 -300565 -286332 -603802 -954551 -933862 -666972 -532105 -574037 -588565 -554011 -602835
37354 -602835 -715145 -759944 -734073 -702666 -617268 -442717 -363391 -602893 -1071528 -1395406
37344 -1395406 -1296041 -832179 -319076 -96939 -283354 -646620 -806343 -637115 -372213 -264116
37334 -264116 -312739 -405750 -518420 -635852 -668815 -614594 -634082 -795009 -896473 -735802
37324 -735802 -410118 -162624 -53783 22957 101984 103785 -41051 -344877 -727568 -947385
37314 -947385 -774949 -372858 -247554 -601987 -984040 -871493 -388936 -86145 -163727 -323254
37304 -323254 -314152 -218171 -166706 -138325 -124834 -213997 -404399 -546774 -545359 -457445 -363402
37293 -363402 -286498 -241752 -228447 -209372 -218712 -383693 -677712 -810873 -606396 -328582 -332211
37282 -332211 -523092 -529602 -313944 -202966 -339125 -515037 -582349 -634183 -729903 -810003 -929902
37271 -929902 -1192003 -1396479 -1185339 -624479 -203247 -133390 -116623 21428 -12412 -387055
37261 -387055 -691300 -495162 -23068 174640 -14708 -241872 -261028 -137329 -2778 66179
37251 66179 -774 -193509 -381432 -509381 -663477 -796115 -665923 -278519 -64423 -291216
37241 -291216 -605649 -565483 -346926 -426277 -760927 -855712 -575087 -333757 -436334 -711425
37231 -711425 -888800 -914408 -794639 -527210 -298004 -368111 -641117 -706694 -446651 -223596
37221 -223596 -296327 -426556 -312758 -81301 -35112 -156803 -185131 -32386 160589 274251
37211 274251 263191 64775 -279604 -477875 -243774 280697 598623 432927 50479 -98150
37201 -98150 67140 224574 134230 -42331 -12203 199212 296448 194107 164169 377521
37191 377521 572610 435511 93980 -113499 -211387 -492165 -889101 -947169 -543628 -159924
37181 -159924 -176024 -300746 -68333 401358 570319 247011 -228889 -498953 -514947 -372384
37171 -372384 -156871 899 -5522 -85645 -78974 -61660 -263434 -655340 -908838 -831124 -558897
37160 -558897 -247371 104767 394066 355956 20316 -134908 147354 388339 21524 -651201
37150 -651201 -775034 -198954 257194 4555 -478195 -442124 1166 158343 -122230 -298344
37140 -298344 -64782 216994 175591 -29375 -99562 -103875 -239450 -388877 -308420 -94659
37130 -94659 -93698 -396584 -723973 -810700 -663810 -416788 -134274 166741 419792 502400 316749
37119 316749 -86319 -455636 -531785 -357659 -264026 -446792 -702813 -720288 -489466 -255492
37109 -255492 -184333 -260954 -418346 -572991 -602679 -461083 -253459 -79129 74967 162152
37099 162152 15692 -324289 -462148 -141987 309967 416952 249096 229559 368422 251268
37089 251268 -194080 -499825 -379140 -119475 -28149 28799 231181 383154 267781 83796
37079 83796 120247 245183 124208 -226768 -488881 -516233 -413695 -233019 69557 409307
37069 409307 589330 532154 310495 30005 -149950 -51202 221352 196268 -419307 -1240133
37059 -1240133 -1596782 -1338122 -888784 -597726 -447741 -388104 -490157 -668284 -655116 -419727
37049 -419727 -265370 -332994 -338438 -36145 340568 388130 85826 -242908 -393154 -429396
37039 -429396 -439869 -394538 -261410 -86712 74785 202891 277152 281085 237950 176147 71481
37028 71481 -110416 -312817 -385717 -227791 57944 186925 -42247 -483480 -758991 -708570
37018 -708570 -572039 -584792 -579176 -266971 204675 363669 89301 -216079 -244493 -190634
37008 -190634 -336854 -574875 -639588 -557177 -516549 -469688 -215896 201121 495638 499428 265048
36997 265048 -119149 -543298 -766589 -597919 -187536 116216 185752 144997 44827 -168393
36987 -168393 -380831 -375956 -219503 -215760 -397724 -443730 -232206 -70929 -166328 -280301 -217934
36976 -217934 -253186 -638206 -1014949 -861993 -351645 -175352 -532439 -856199 -670803 -228185
36966 -228185 -57251 -256633 -517601 -587064 -431132 -118272 206559 346125 258032 154552
36956 154552 233797 402976 427008 268307 111927 97860 173330 200727 113947 -37133 -164978
36945 -164978 -281319 -511209 -869385 -1092585 -914224 -497626 -307775 -476437 -613890 -415008
36935 -415008 -120886 -102623 -270593 -260723 -16126 200757 251956 204282 65340 -167329
36925 -167329 -266930 -23544 280914 100315 -605766 -1262758 -1440529 -1281457 -1036720 -671547
36915 -671547 -200785 36854 -174116 -534057 -665228 -653046 -750217 -816435 -547241 -92338
36905 -92338 82904 -90608 -206269 -48750 120157 49011 -143792 -264156 -343949 -447942
36895 -447942 -474587 -376909 -346604 -534238 -755185 -713896 -416027 -147392 -106094 -231134
36885 -231134 -357794 -393774 -347580 -279412 -223069 -126037 74510 290460 308718 55864 -257753
36874 -257753 -356006 -198452 11589 60203 -98745 -330000 -419978 -263008 518 106297
36864 106297 -33318 -250342 -382908 -473987 -620941 -766934 -773205 -603773 -330327 -54751
36854 -54751 83730 -24614 -260372 -321891 -148603 -94065 -413917 -776910 -666262 -160635
36844 -160635 135690 -51419 -356081 -435490 -451643 -621503 -723447 -467754 -63083 53280
36834 53280 -119420 -217588 -162827 -249482 -556394 -747622 -608749 -377327 -321172 -327163 -185916
36823 -185916 -17995 -85125 -333195 -451033 -324365 -150177 -112286 -189525 -304514 -433420
36813 -433420 -500660 -360626 -11411 282615 213982 -240434 -785010 -1094764 -1091305 -915342
36803 -915342 -678040 -346351 76323 383187 363040 135988 65777 277204 475184 360050
36793 360050 21975 -242170 -329211 -349815 -395445 -499107 -700116 -917872 -880987 -447279
36783 -447279 89308 283173 68695 -254078 -481802 -638631 -703326 -582238 -382014 -351659
36773 -351659 -485719 -515287 -352205 -186263 -70874 174189 503356 521067 61229 -481619
36763 -481619 -674422 -563983 -398817 -190328 100687 259005 98875 -186994 -333091 -410798
36753 -410798 -558544 -590206 -335593 -111447 -309020 -706451 -784486 -589827 -626725 -933715
36743 -933715 -979929 -578717 -209983 -213468 -305978 -213923 -190535 -485399 -798072 -748133 -513599
36732 -513599 -503850 -680818 -702753 -539580 -449295 -456646 -329299 -51361 95351 -24755 -197477
36721 -197477 -174644 36841 258610 344382 267795 120213 10233 -97079 -340204 -680039
36711 -680039 -828359 -606076 -209906 47471 95644 30876 -109671 -269694 -279505 -116022
36701 -116022 -61736 -300421 -556839 -496842 -283865 -294296 -441130 -319072 36523 128875
36691 128875 -182153 -416325 -229277 80799 109516 -50051 -91256 -34332 -97892 -269167
36681 -269167 -362735 -344839 -301039 -240741 -204199 -373218 -767784 -1020985 -825194 -462074
36671 -462074 -466480 -820232 -934469 -498929 75528 236426 -33023 -357194 -529116 -628106
36661 -628106 -710259 -684182 -501445 -264867 -103244 -64078 -144392 -297382 -382889 -258720
36651 -258720 3067 128737 -2280 -140338 -4079 247165 174533 -277421 -622683 -515015
36641 -515015 -257298 -311526 -574787 -607954 -430594 -505348 -893698 -1039241 -635042 -164639
36631 -164639 -185291 -505920 -570510 -341687 -237396 -367518 -424883 -298583 -231287 -295049
36621 -295049 -234557 1072 38545 -348254 -809575 -859308 -493497 -101583 46753 -19561
36611 -19561 -151221 -201585 -75688 154495 264914 140927 -81031 -234385 -330049 -417005
36601 -417005 -409616 -228062 22723 179042 212337 177799 121289 152219 398702 728487 756746
36590 756746 360342 -58859 -114099 3675 -121904 -425571 -489691 -287803 -261465 -590060
36580 -590060 -878469 -752051 -361371 -75311 -3960 -61527 -214768 -403259 -434405 -226708
36570 -226708 -8867 -53677 -337540 -638342 -820017 -843490 -668842 -363944 -163034 -189523
36560 -189523 -249479 -133201 9189 -129633 -524655 -834156 -880148 -816422 -788189 -717028
36550 -717028 -536332 -401314 -484165 -693846 -779473 -664295 -523799 -512332 -534256 -389483
36540 -389483 -105740 28970 -159999 -472777 -615593 -623265 -734143 -903910 -813415 -427142
36530 -427142 -139159 -166240 -188451 92890 397909 303235 -36255 -121746 85357 151991
36520 151991 -69678 -241463 -179677 -159535 -385538 -620118 -601324 -457325 -426944 -475254
36510 -475254 -464025 -438923 -468262 -422573 -190425 75315 181100 183907 216868 211804 62886
36499 62886 -101756 -100589 -18346 -57151 -176654 -179616 -85126 -116355 -329200 -516753 -512577
36488 -512577 -391058 -333895 -423918 -561140 -509424 -127164 359980 497676 168426 -199275
36478 -199275 -210221 -40335 -60039 -155066 90421 625329 883287 577536 73005 -186345
36468 -186345 -199927 -155595 -47619 149734 225147 -2012 -326476 -388523 -167261 31215
36458 31215 17973 -110094 -237649 -415472 -695494 -951185 -992153 -800188 -547603 -371696
36448 -371696 -206744 90861 482665 731377 679765 422896 128984 -161775 -423422 -492702
36438 -492702 -265922 52861 171012 124070 182247 357311 342395 19772 -297809 -295469
36428 -295469 -75520 27824 -137339 -462371 -742124 -789167 -558705 -274208 -240496 -429667
36418 -429667 -485985 -270452 -115548 -319309 -654587 -691292 -423629 -240292 -361881 -612671
36408 -612671 -714569 -554860 -189779 194054 343198 157913 -168330 -369940 -393987 -331792
36398 -331792 -225606 -150668 -300642 -679546 -862024 -464373 208280 432503 25574 -416349
36388 -416349 -378908 -86209 -30148 -219272 -290940 -151790 -72473 -194025 -322777 -289170
36378 -289170 -217276 -295134 -474943 -572990 -551637 -518509 -489738 -351476 -108209 4046 -201295
36367 -201295 -563027 -739990 -650643 -543904 -601746 -689750 -609244 -399186 -223252 -116219
36357 -116219 -36945 -46126 -212034 -425128 -521619 -522139 -537621 -522860 -374269 -202590 -212556
36346 -212556 -338834 -325283 -185558 -231977 -551570 -805453 -731488 -544028 -593971 -860729
36336 -860729 -1034471 -933916 -608196 -174407 206653 321731 122861 -136161 -209316 -203573
36326 -203573 -359715 -585288 -535425 -157431 176337 166551 -70680 -294230 -499346 -766232
36316 -766232 -948995 -817537 -448770 -191745 -202828 -256073 -123235 65457 34714 -188674
36306 -188674 -294257 -140978 53549 49954 -105097 -241656 -340305 -443824 -455027 -291112
36296 -291112 -150223 -312619 -675674 -799547 -494725 -78166 83824 21826 -25127 -5588
36286 -5588 -28592 -111632 -198529 -309970 -454489 -500973 -363905 -202953 -192705 -209633 -47973
36275 -47973 142199 4530 -435976 -728985 -639139 -447780 -430994 -403291 -90242 318133
36265 318133 382327 60138 -239799 -232208 -48798 77523 105655 55377 -139947 -464000
36255 -464000 -685223 -599891 -316695 -132633 -177236 -309708 -326881 -163391 76773 196079
36245 196079 57269 -254293 -481556 -488858 -412968 -418952 -434757 -308966 -125711 -115642 -293340
36234 -293340 -443011 -469721 -497416 -579625 -600256 -548594 -592430 -734746 -707032 -423690 -248389
36223 -248389 -497935 -909577 -971898 -647699 -384940 -468992 -735025 -922851 -964545 -868901
36213 -868901 -643802 -426610 -414853 -562671 -588905 -389130 -208669 -287200 -532971 -675749
36203 -675749 -585573 -343303 -135543 -143427 -395012 -691380 -812953 -771500 -681596 -479785
36193 -479785 -75453 292923 275663 11457 34791 457801 738503 488919 17226 -254941
36183 -254941 -415312 -653054 -693876 -258404 229048 89591 -578704 -994395 -812641 -498381
36173 -498381 -471711 -510268 -268823 118746 317372 315775 309367 291207 100330 -243420 -521536
36162 -521536 -575845 -418444 -166824 -5114 -100660 -404654 -618226 -503253 -170183 68643
36152 68643 84070 40352 125118 275705 242478 -71953 -395303 -329516 135810 502289 317388
36141 317388 -255736 -647614 -601008 -396652 -344830 -377466 -296604 -155444 -142667 -246127
36131 -246127 -293690 -257233 -266329 -325164 -255928 218 223591 202901 52629 53544 233552
36120 233552 335657 234735 133193 196386 236935 38950 -180143 -25618 403647 541710
36110 541710 143185 -378693 -575670 -508409 -408271 -216733 143786 382360 208734 -131098
36100 -131098 -178004 37228 109446 -34491 -72340 106216 256566 277196 341752 446865
36090 446865 320209 -73304 -380401 -392182 -328769 -409745 -513432 -457573 -287014 -113662
36080 -113662 9536 -64701 -472773 -939079 -920157 -371425 67107 -60396 -389500 -329029
36070 -329029 75958 305403 133956 -187121 -370024 -356781 -240683 -181326 -294354 -456023
36060 -456023 -399322 -146489 -63818 -294384 -479395 -326673 -116646 -277148 -732952 -1062168
36050 -1062168 -1067992 -829269 -422559 14228 166103 -97132 -431547 -476594 -376799 -427733
36040 -427733 -464618 -144319 341792 433354 24634 -428530 -618003 -673063 -712626 -632663
36030 -632663 -453615 -431973 -676666 -988029 -1154415 -1100362 -744900 -88974 540406 727577
36020 727577 497528 250545 163748 54709 -153576 -282839 -281801 -327656 -458297 -508540
36010 -508540 -480169 -551830 -661331 -543470 -261198 -188523 -345413 -303593 54091 257097
36000 257097 16139 -287055 -254499 -111052 -238564 -502463 -548455 -435377 -448772 -528385
35990 -528385 -402024 -138136 -79626 -299043 -532958 -615884 -621322 -599178 -488166 -286116
35980 -286116 -71189 110721 198567 70213 -247973 -465365 -361236 -104173 3548 -47262
35970 -47262 -73467 -79329 -210564 -416953 -486648 -384719 -269335 -190195 -43115 173549 306215
35959 306215 271995 133294 -60825 -316315 -564977 -666220 -571642 -385521 -272257 -367146
35949 -367146 -688451 -1040879 -1127446 -890191 -620855 -595376 -737334 -805126 -759587 -735305
35939 -735305 -761268 -726321 -555973 -265641 71187 285084 197607 -101454 -248272 -60171
35929 -60171 199612 214215 43340 -84549 -159756 -250189 -205194 105169 424143 406487 177679
35918 177679 169120 450160 644897 512725 225444 40530 38796 201258 427087 478154
35908 478154 218222 -117990 -206497 -113882 -137935 -265197 -232039 -69966 -82448 -264019
35898 -264019 -272793 -61070 2880 -220183 -404161 -350888 -295209 -391327 -427294 -336885 -453540
35887 -453540 -877573 -1109974 -794665 -370027 -416578 -720788 -630628 -117580 184589 -56519
35877 -56519 -465478 -562267 -279667 194470 653728 846009 594714 90508 -231187 -210572
35867 -210572 -96328 -91579 -79056 69815 205830 132543 -69329 -160027 -71219 56776 100017
35856 100017 64531 -1292 -94597 -236330 -407585 -537318 -573588 -564464 -605874 -670685 -574433
35845 -574433 -210867 230981 410400 197460 -197493 -460830 -472041 -366395 -367116 -562040
35835 -562040 -810221 -877149 -677797 -351821 -91459 36858 79486 93397 102682 83219 -37780
35824 -37780 -276735 -476839 -440759 -228607 -153332 -375538 -659852 -677781 -427769 -190541
35814 -190541 -151568 -234912 -282691 -268752 -310372 -490445 -660410 -513769 -11873 363602
35804 363602 100561 -596183 -946712 -612264 -131769 -86531 -289232 -249043 -60175 -202441
35794 -202441 -635715 -766049 -356051 113748 152127 -145607 -410050 -518205 -566433 -613344
35784 -613344 -666248 -717757 -664217 -409132 -136032 -194948 -589545 -875135 -744444 -435296
35774 -435296 -343892 -491383 -629209 -661198 -672607 -675306 -599892 -475271 -394719 -346424 -255087
35763 -255087 -153104 -159616 -312869 -527339 -685354 -713189 -634480 -587137 -686880 -850035 -891915
35752 -891915 -813435 -784915 -809407 -678290 -375273 -219276 -390203 -587860 -460685 -166711
35742 -166711 -159894 -532101 -911067 -972132 -741151 -395515 -66928 107942 15955 -231688
35732 -231688 -312368 -39523 392731 595947 372597 -111398 -493676 -547262 -372653 -246485
35722 -246485 -297809 -426888 -533307 -644884 -759053 -763033 -643650 -583212 -677167 -742931 -612083
35711 -612083 -425925 -390645 -412200 -281536 -91549 -117279 -341764 -460443 -362828 -269799
35701 -269799 -336159 -426152 -384126 -276579 -255922 -371551 -583284 -792526 -837905 -649578
35691 -649578 -413478 -375314 -489769 -497322 -332852 -184379 -147545 -129948 -125567 -250300 -439550
35680 -439550 -454542 -288799 -221182 -341785 -391972 -244152 -163775 -361977 -638839 -742873
35670 -742873 -756927 -823624 -804150 -567080 -341537 -390087 -554685 -532383 -404705 -454774 -612347
35659 -612347 -558621 -310508 -223383 -403562 -554906 -467782 -274528 -150069 -118706 -228201
35649 -228201 -547418 -883245 -858102 -428853 -24808 -5206 -250867 -450541 -514883 -510312
35639 -510312 -428236 -253847 -96596 -50600 -53872 -34726 -49338 -130758 -161620 -54016 90534
35628 90534 146883 135265 78729 -117679 -442736 -609971 -374570 88240 383322 405360
35618 405360 383722 454375 479803 346192 174190 102975 57644 -100568 -311682 -388785 -310027
35607 -310027 -256626 -318425 -318828 -67209 294564 393044 105688 -243641 -295457 -109254 -18441
35596 -18441 -142339 -296568 -347676 -363537 -367828 -245673 -22661 38176 -180402 -394562 -293954
35585 -293954 229 130283 35254 -26812 45796 26439 -258369 -631311 -789296 -670512
35575 -670512 -468081 -380157 -461016 -652487 -847556 -931178 -838034 -608902 -383210 -306886
35565 -306886 -403349 -528874 -513201 -368096 -278487 -337459 -395057 -287831 -140402 -255334
35555 -255334 -682550 -1061824 -999279 -528504 -89523 -55073 -363923 -666383 -765335 -794064
35545 -794064 -939597 -1137305 -1174203 -1009112 -805697 -669757 -549881 -419522 -355600 -378640
35535 -378640 -408181 -441235 -560830 -690276 -604855 -326740 -210890 -408848 -542757 -249602
35525 -249602 191877 203985 -263596 -711936 -844495 -856302 -920702 -868892 -565127 -214569
35515 -214569 -60296 -57651 -62600 -92951 -195649 -282300 -299332 -350819 -466105 -480700 -359874
35504 -359874 -381985 -714570 -1036462 -934166 -514585 -234405 -204373 -83423 305284 650255
35494 650255 591690 191052 -229018 -508303 -703045 -830626 -772533 -450632 4109 316559
35484 316559 315787 115743 -6051 54992 100304 -78899 -374278 -488161 -348139 -204188
35474 -204188 -279544 -489215 -591881 -517984 -444608 -568225 -862357 -1089065 -1068056 -894582
35464 -894582 -783590 -708655 -408755 138781 502299 314920 -171307 -408449 -338818 -428169
35454 -428169 -879779 -1277306 -1206457 -830050 -534495 -319526 57538 514207 666858 414098
35444 414098 124479 143177 365356 425117 157780 -228090 -371243 -122853 258991 322497
35434 322497 -94110 -671387 -1001999 -1048446 -1036477 -1029076 -883487 -586169 -338881 -275266
35424 -275266 -325933 -395067 -450356 -427577 -288792 -181689 -268933 -396871 -259455 91211
35414 91211 292934 287507 404803 687843 696657 286440 7203 288746 822208 1376125
35404 1376125 2598421 4988811 7406522 7858290 5947218 3461358 2153314 1911021
35396 1911021 1662706 1126324 767769 673716 502814 290676 393073 718648 806770 645972
35386 645972 673592 915634 854660 314000 -187392 -208369 53694 246344 381577 544650
35376 544650 546065 253450 -77605 -175785 -173120 -311636 -498811 -505903 -375635 -279322 -179820
35365 -179820 -6197 24173 -331775 -876540 -1175032 -1155846 -1105439 -1090239 -828773 -241857
35355 -241857 256736 231992 -244576 -725065 -883603 -733180 -473630 -284256 -224815 -243531
35345 -243531 -278558 -342656 -452059 -504804 -349771 2880 338076 436797 264873 -32332
35335 -32332 -255507 -290085 -198007 -153721 -223810 -264454 -133457 65194 95939 -84905 -285925
35324 -285925 -363282 -380523 -440490 -497274 -416952 -155025 174882 369746 283236 -26930 -310723
35313 -310723 -362597 -229670 -112278 -110575 -180291 -277141 -376609 -374048 -166094 124943 191078
35302 191078 -99669 -505977 -678414 -542079 -330111 -288357 -418818 -506860 -382858 -151811
35292 -151811 -105927 -362500 -677104 -724233 -481918 -192885 -28359 5309 -115159 -431374
35282 -431374 -789996 -892888 -665982 -375393 -278183 -350926 -455380 -547234 -582131 -440213
35272 -440213 -140327 53590 -45263 -268323 -351929 -324936 -378382 -476357 -419443 -254154 -277781
35261 -277781 -566982 -791131 -637918 -225668 60143 11399 -250837 -473256 -507220 -415766
35251 -415766 -424692 -698905 -1103180 -1273493 -1011419 -525845 -182497 -91499 -77439 -5101
35241 -5101 47289 -27256 -168504 -243861 -247495 -284236 -393009 -497518 -523441 -461549 -311496
35230 -311496 -82638 107341 55814 -301663 -755235 -1004817 -950081 -732146 -539424 -455494
35220 -455494 -453970 -452365 -399276 -370564 -509073 -789026 -955100 -842004 -639140 -622115 -709911
35209 -709911 -578220 -197662 69769 -6520 -216115 -268828 -186080 -132993 -106549 -37474 -6979
35198 -6979 -92467 -147107 -11062 174068 149567 -48622 -164070 -150738 -204022 -361945 -415697
35187 -415697 -297186 -238284 -387800 -528798 -389398 -64394 97334 -53162 -311764 -400184
35177 -400184 -256969 -38429 73609 24220 -115994 -253129 -333786 -324738 -221644 -123416
35167 -123416 -190754 -427741 -602261 -529388 -351173 -346846 -518170 -587659 -408176 -148089
35157 -148089 -29943 -95781 -279779 -486119 -512985 -144015 524244 1029447 992513 496069
35147 496069 -106758 -587434 -874428 -872850 -533036 -56329 209936 126412 -125173 -293324
35137 -293324 -305504 -260694 -277098 -375261 -473617 -506571 -533301 -633913 -701894 -533491 -204172
35126 -204172 -111505 -432110 -750722 -561640 -25161 178752 -219892 -697649 -655242 -194613
35116 -194613 97598 -56551 -368594 -462051 -318165 -173612 -163047 -198468 -155288 -81118
35106 -81118 -167104 -493781 -847150 -887044 -530720 -73283 138189 55541 -136543 -325104
35096 -325104 -529472 -703755 -706330 -538256 -428771 -540852 -704875 -616277 -253862 70423
35086 70423 93633 -119338 -334081 -440421 -467792 -399407 -148063 256140 582948 602339
35076 602339 337750 52521 -22578 90501 184909 123483 -22022 -88635 -20311 98773
35066 98773 168165 153049 58251 -87194 -203746 -209491 -129433 -75123 -81583 -63436 14844 40964
35054 40964 -82110 -277232 -405361 -443093 -433095 -367919 -277384 -320972 -581755 -839372 -790922
35043 -790922 -472637 -209424 -143154 -93565 58194 156714 87221 25229 151384 322897
35033 322897 277734 28554 -191995 -284603 -338615 -388433 -358083 -253296 -200974 -260228 -357956
35022 -357956 -447764 -577310 -738093 -786170 -616682 -349254 -236997 -383941 -599323 -564777
35012 -564777 -156812 411081 788842 811236 585564 308082 87094 -70817 -216455 -418321
35002 -418321 -673608 -860774 -881797 -815972 -784250 -712739 -456950 -138852 -60731 -231267
34992 -231267 -307627 -133234 14642 -84452 -210225 -111891 7596 -191261 -601592 -823298
34982 -823298 -760743 -657133 -628169 -582082 -562402 -742991 -1042523 -1121370 -847690 -469193
34972 -469193 -258070 -239982 -293646 -266101 -9262 425372 682060 502235 150727 65583
34962 65583 173459 36245 -352447 -492992 -197722 100014 63992 -62173 24506 181205
34952 181205 177886 124399 173095 185882 69392 69094 341221 592630 552638 433914 473312
34941 473312 401286 -70590 -562554 -485824 13562 248822 35388 -139025 193 117966
34931 117966 -99445 -471025 -679012 -672795 -549861 -399931 -383052 -607729 -849671 -753031
34921 -753031 -360729 -54728 43252 133649 177694 -122811 -636987 -759741 -370238 -191933
34911 -191933 -719571 -1355094 -1236068 -493045 34822 55796 13143 117577 12086 -440262
34901 -440262 -743711 -495520 -20353 122595 -82557 -239785 -220948 -268959 -485228 -621774
34891 -621774 -486360 -274018 -307741 -582715 -766178 -642901 -397636 -361457 -569055 -727110
34881 -727110 -631228 -442749 -437270 -598772 -645202 -426645 -117020 27317 -47570 -214343
34871 -214343 -340252 -341593 -165589 136143 348186 250390 -124381 -481135 -558544 -374551
34861 -374551 -143298 -26216 -37776 -129817 -244701 -291154 -193372 -9308 98419 72581
34851 72581 56590 194869 404975 457656 260027 -36623 -211023 -186941 -82358 -97184
34841 -97184 -325861 -626376 -722385 -513804 -236200 -211260 -483794 -821757 -1021797 -1051318
34831 -1051318 -921152 -641542 -352580 -269406 -366392 -305837 129080 665252 832464 556524
34821 556524 209585 70387 12278 -160391 -321539 -216462 84147 219032 34385 -215252
34811 -215252 -253181 -138932 -89448 -138772 -188385 -246171 -354310 -380667 -185890 47784 -3971
34800 -3971 -282516 -374294 -154406 2301 -154008 -321166 -158190 136129 179681 61905
34790 61905 142128 376184 402980 237739 289120 612361 718788 343099 -90297 -69064
34780 -69064 321446 636109 682392 562371 365289 176160 192182 462346 648242 409250
34770 409250 -62513 -257320 -55495 155861 95978 -65078 -92826 -55283 -70949 19092
34760 19092 386016 772371 706743 174025 -283364 -263691 10042 135285 167821 417375
34750 417375 771049 747995 277453 -109146 -80534 -488 -256356 -543405 -348059 174773
34740 174773 427463 291531 176262 233822 216742 135286 322822 694459 677904 163650
34730 163650 -191846 -2704 210234 -51567 -365757 -124059 379433 440073 153970 211460
34720 211460 648226 753779 280624 -138666 -12572 327381 390844 235205 124395 18599
34710 18599 -167631 -228318 -25946 155416 49018 -95395 92365 436317 444097 93679
34700 93679 -109589 108421 408770 356634 2026 -249038 -152159 166185 417705 435635
34690 435635 298688 256924 490061 878013 1071369 875152 514439 396163 613705 845085
34680 845085 807453 634699 628623 779856 826814 742105 786947 984722 930770 386299 -254020
34669 -254020 -445499 -221500 -34629 -27254 71382 368181 618333 688907 758167 900955
34659 900955 891562 643378 477281 659358 957690 982058 756797 626398 727404 872583
34649 872583 890662 798062 660578 527725 495736 620385 761536 707355 472480 302810
34639 302810 356236 531659 653683 687936 710733 771697 865930 986616 1132895 1267459
34629 1267459 1299122 1138934 806509 473061 341508 465772 734850 1026959 1286810 1443701
34619 1443701 1399033 1185044 1028247 1134124 1459077 1781527 1942075 1936070 1844311 1772123
34609 1772123 1790740 1834235 1725040 1425145 1190233 1310367 1730671 2100361 2187278 2056224
34599 2056224 1825226 1489349 1108959 953906 1218129 1676812 1870492 1638106 1268459
34590 1268459 1091618 1130516 1247135 1415393 1651799 1819512 1757444 1564964 1520187 1703489
34580 1703489 1922831 2042562 2143036 2275032 2313424 2206902 2138562 2229676 2285077 2090832
34570 2090832 1809728 1786346 2056362 2352984 2539908 2710266 2861909 2818311 2549164 2272624
34560 2272624 2137940 2077331 2071656 2252534 2563159 2620970 2206749 1687938 1622774 2029854
34550 2029854 2370131 2260952 1917967 1783753 1942178 2103422 2080289 2037723 2181080 2374512
34540 2374512 2307055 2008628 1894465 2146748 2338547 1989514 1314021 1000782 1295030 1739674
34530 1739674 1884836 1798395 1706900 1586971 1416449 1442468 1793095 2103242 1978006 1637836
34520 1637836 1615166 1901843 1919510 1391405 763578 577415 798455 1010807 1006691 916934
34510 916934 924170 1092659 1393082 1698956 1817545 1689955 1515469 1523884 1654921 1623816
34500 1623816 1315435 958279 837492 947466 1038644 952238 777105 668432 647063 655538
34490 655538 700318 798391 847936 738078 589741 683882 1071693 1438598 1487658 1306899
34480 1306899 1184468 1180267 1105713 883116 688070 689039 828760 948600 1000042 1035196 1072264
34469 1072264 1072603 1017103 923145 787753 577252 307641 109827 153215 459977 823619
34459 823619 982584 880633 690384 576562 533341 494942 498199 629979 855486 1000360
34449 1000360 928014 705680 567683 668026 848304 752778 286260 -152442 -112484 293040
34439 293040 514531 332955 135611 280149 564771 625043 533620 591168 735565 640768
34429 640768 320982 152209 265850 371634 281766 191123 278605 418191 495776 652594
34419 652594 942815 1065544 772101 305768 86580 132930 153134 73492 75305 163538 117371
34408 117371 -76446 -117995 144822 455898 519452 379356 247379 171944 99479 100563 282886
34397 282886 558222 715730 688397 568496 412408 227456 108737 151365 216403 37809
34387 37809 -358970 -590282 -417380 -108114 -77883 -313250 -421211 -201607 106319 194477
34377 194477 65321 -71512 -99683 -36220 113160 355791 592978 646966 445338 109725
34367 109725 -159000 -243345 -163683 -25121 75703 119608 147215 165383 104133 -90325 -340414
34356 -340414 -477247 -410563 -216648 -36455 78338 182643 320333 438720 442620 310978
34346 310978 128806 3929 -25530 1132 27136 33036 42194 74659 91769 12847 -177015
34335 -177015 -356173 -357867 -127950 251650 659738 972591 1052000 853518 556989 416517
34325 416517 431704 350757 69909 -198221 -289336 -362550 -571173 -695006 -456016 -53586
34315 -53586 41456 -196490 -270642 108370 609555 772569 579968 314908 116862 -58554
34305 -58554 -222278 -349195 -479531 -624329 -675341 -577768 -474344 -506885 -592763 -575810 -486627
34294 -486627 -464340 -514013 -531275 -494803 -460721 -436076 -418545 -476997 -622337 -691719 -558803
34283 -558803 -380928 -418367 -654526 -816451 -752055 -569475 -399866 -241325 -82412 12187
34273 12187 14987 -6028 -8227 -42051 -146784 -275411 -368580 -427184 -480348 -538982 -585955 -562032
34261 -562032 -394880 -117290 93701 106923 25704 47380 151721 97354 -227022 -597170
34251 -597170 -699219 -495674 -235051 -124716 -106073 -3703 175329 217493 12265 -239262
34241 -239262 -255466 -48017 101246 17579 -193393 -359394 -427586 -390131 -233482 -46530
34231 -46530 18899 -14257 36839 167291 120400 -165660 -337916 -116235 248519 328567 136031
34220 136031 14939 49765 -4096 -230386 -395840 -352731 -268885 -347388 -566708 -795848
34210 -795848 -958902 -1004971 -900881 -724355 -605160 -533856 -391406 -190359 -100379 -188921
34200 -188921 -311266 -321842 -254646 -233147 -296870 -346177 -210230 168011 543224 511028 1254
34189 1254 -528031 -614776 -356183 -165811 -134161 -28338 161722 155130 -91784 -237526 -75201
34178 -75201 181068 287301 292462 294957 224539 82148 73616 255720 343230 143290 -90715
34167 -90715 -55480 86443 -44481 -430566 -677293 -601386 -449174 -489744 -667431 -744791
34157 -744791 -598348 -281676 75779 341781 416844 274353 -15350 -306571 -471211 -530904
34147 -530904 -650284 -892073 -1032876 -805600 -319055 -13570 -139429 -488209 -718986 -725195
34137 -725195 -563153 -260256 109715 343482 314888 142082 -22910 -222444 -512739 -712008
34127 -712008 -602680 -311104 -203868 -393649 -586749 -488652 -180426 10268 -90947 -335651
34117 -335651 -453869 -353765 -182943 -99498 -63237 53625 202698 174598 -94767 -396529
34107 -396529 -502134 -410365 -263259 -148471 -81820 -68144 -72679 -24102 65363 72235 -74101
34096 -74101 -295866 -488402 -612192 -609407 -393927 -27500 243827 252090 86786 -82424
34086 -82424 -214996 -322807 -351467 -289824 -257803 -328332 -389785 -342709 -302295 -425294 -643071
34075 -643071 -749511 -671901 -493240 -295723 -145041 -137630 -288938 -447393 -473376 -418828
34065 -418828 -384843 -324157 -170278 -37703 -64156 -151614 -118156 -33076 -110830 -295037 -267583
34054 -267583 56483 329230 215963 -163172 -419430 -399735 -312798 -381015 -533305 -520160
34044 -520160 -267563 -903 34321 -107784 -163591 -45964 40317 -72260 -252672 -276305
34034 -276305 -154874 -88930 -168864 -288550 -317568 -220659 -33128 164696 268961 238128
34024 238128 128866 -8850 -195269 -408912 -514867 -412385 -173913 53163 189664 194128
34014 194128 33190 -200233 -292160 -186470 -118831 -300631 -605875 -761312 -708523 -560269
34004 -560269 -337427 -19276 239336 231756 5961 -206212 -330425 -470371 -626942 -670847
33994 -670847 -589783 -504619 -444163 -358870 -331839 -472322 -604682 -420519 -3275 173199
33984 173199 -86662 -387254 -313122 -4354 113494 -66274 -301858 -406904 -369957 -176883
33974 -176883 164226 440793 365272 -55903 -479496 -606245 -462499 -279031 -236368 -369247
33964 -369247 -592542 -761898 -791097 -738848 -708746 -676771 -536059 -316370 -207139 -305019
33954 -305019 -475010 -546444 -521153 -479318 -403384 -251964 -116342 -111139 -155768 -73380 100438
33943 100438 136312 -18306 -123582 -9536 157688 119702 -140250 -458530 -706829 -777272
33933 -777272 -555793 -149328 35896 -269546 -806326 -1107344 -1074456 -925244 -728809 -415202
33923 -415202 -148253 -194370 -410319 -353922 23737 288190 231156 146464 219138 187868 -101187
33912 -101187 -331191 -273756 -226731 -459912 -668665 -484232 -143507 -90758 -225588 -142008
33902 -142008 125000 204435 67031 -12372 -45254 -266383 -557526 -556402 -318266 -256231 -415321
33891 -415321 -432399 -261524 -272930 -504029 -490718 -78909 235798 100551 -138717 -59760
33881 -59760 158255 118465 -130259 -262494 -217951 -170576 -174431 -164334 -113102 38733 349562
33870 349562 591527 374642 -207586 -509491 -245695 19219 -242261 -636211 -483557 61515
33860 61515 304287 170574 209895 502044 471874 -32571 -332236 27812 522552 461904
33850 461904 17147 -160931 29352 131638 -44623 -210730 -185004 -157189 -275898 -400021
33840 -400021 -407610 -413297 -506044 -543040 -396641 -193293 -102965 -54917 113900 327263 316001
33829 316001 -15171 -437282 -640374 -533962 -311531 -285579 -610237 -1078312 -1260216 -962456
33819 -962456 -474504 -210401 -196440 -147414 3926 -11119 -300965 -536339 -404024 -100616
33809 -100616 -67650 -359835 -606126 -585991 -525316 -704871 -1009089 -1068952 -767619 -406363
33799 -406363 -323006 -469865 -498579 -241680 56193 83574 -105943 -204393 -115397 -57333 -202807
33788 -202807 -483082 -800802 -1149321 -1413327 -1351671 -962975 -605002 -537492 -588723 -499473
33778 -499473 -337587 -292745 -305404 -226677 -136591 -158825 -159230 -1211 99608 -96803 -356203
33767 -356203 -295166 -66409 -147585 -494107 -530296 -79375 302605 141118 -324643 -597588
33757 -597588 -572305 -426947 -238675 -36655 39829 -62247 -165135 -140833 -120286 -228692
33747 -228692 -356188 -396645 -463366 -636575 -725638 -529141 -150817 156214 288769 255593
33737 255593 32730 -340718 -669497 -764257 -580237 -155520 363616 621513 338397 -201525
33727 -201525 -353870 18846 315320 71532 -399634 -599226 -614634 -809639 -1099558 -1102862
33717 -1102862 -799093 -495020 -283830 -51131 104813 -9368 -211500 -121484 196347 282981
33707 282981 19833 -193628 -110833 -8748 -194291 -540650 -750307 -766206 -683806 -504977
33697 -504977 -225225 4334 28982 -79241 -100829 62493 281819 332920 114820 -224913
33687 -224913 -417633 -376992 -279776 -258360 -175358 114341 438314 507286 329366 129712
33677 129712 -56892 -370004 -730544 -841312 -645541 -445587 -448216 -487051 -341820 -78777
33667 -78777 92625 100565 -7940 -197239 -406063 -519205 -511765 -512327 -613606 -722967 -700399
33656 -700399 -554553 -406097 -315799 -219613 -5372 360566 744107 909341 746754 402418
33646 402418 102083 -97620 -287374 -506767 -688205 -740704 -592390 -245326 114093 213124
33636 213124 40001 -97935 -44785 -75686 -422691 -782300 -709994 -313503 -61354 -21245
33626 -21245 149056 475750 554500 289332 151999 440178 778186 692838 289615 259
33616 259 -32832 25757 61048 62204 -543 -94193 -77519 67539 144405 43383 -90589 -143243
33604 -143243 -208263 -302822 -221557 88485 314109 215881 2610 -25343 61646 29235 -100919
33593 -100919 -165445 -175741 -206073 -174305 -29320 68497 39571 87679 298037 349921 20299
33582 20299 -340333 -302070 -49966 -63498 -324551 -406511 -206079 -26494 -17225 -55594 -118873
33571 -118873 -275485 -380076 -268627 -162314 -365919 -672919 -622626 -249561 9804 66930
33561 66930 209034 443158 476487 327218 291475 327606 160606 -44402 135250 558855
33551 558855 692751 569612 696244 1040829 1107977 1005644 1304787 1818127 1819482 1552519
33541 1552519 2000538 2986899 3323861 3201335 4213665 6321141 7558820 8269414 12383632
33532 12383632 21339849 29225769 28410315 19225556 9735253 5745700 5320542 4181948
33524 4181948 2095070 1249889 1613724 1393270 442513 95845 444338 376052 -151206
33515 -151206 -135705 431076 544488 86141 -45313 311353 325655 -241719 -668387 -613184
33505 -613184 -509042 -497064 -226284 150879 5437 -569001 -746594 -355978 -147907 -456003
33495 -456003 -711718 -576729 -461765 -568777 -475267 -86333 9406 -391938 -634273 -314008
33485 -314008 18452 -170488 -549393 -640643 -625616 -794103 -873306 -579235 -261908 -345369
33475 -345369 -619063 -698439 -721099 -968382 -1218400 -1105189 -781700 -632171 -607671 -399328
33465 -399328 -38404 173369 138569 -32720 -269548 -447559 -342427 -23148 46465 -322431
33455 -322431 -638153 -424039 40830 165904 -83928 -292961 -311421 -330569 -420733 -492320
33445 -492320 -578104 -709320 -661433 -260325 206606 322399 149531 79953 210960 316600
33435 316600 334749 416664 529984 448599 156273 -107447 -231850 -353549 -568345 -788804
33425 -788804 -901351 -856508 -634867 -313901 -106652 -154727 -355601 -525210 -593840 -528040
33415 -528040 -291620 -54571 -165813 -681100 -1181189 -1307004 -1184664 -1051528 -825135 -428807
33405 -428807 -189346 -401120 -754667 -753392 -516538 -575079 -957557 -1101894 -738223 -300212
33395 -300212 -278383 -594558 -837984 -814852 -644495 -500332 -442010 -440398 -481411 -619558 -853893
33384 -853893 -966744 -706752 -209571 47055 -130948 -382844 -371412 -285090 -434580 -681785
33374 -681785 -705485 -585517 -644701 -865121 -917554 -676988 -316102 7857 197035 92247
33364 92247 -305032 -637066 -602750 -402395 -382993 -461990 -370354 -245981 -427054 -806679
33354 -806679 -970250 -866790 -765007 -651039 -307824 69442 27770 -352028 -506124 -304464
33344 -304464 -214719 -412078 -452509 -88182 279152 304583 237404 344930 358784 -23646
33334 -23646 -537717 -757566 -761485 -903580 -1180875 -1295060 -1169989 -992430 -854938 -710239
33324 -710239 -589875 -567989 -581887 -536052 -504495 -613104 -803627 -908507 -882042 -795218 -691177
33313 -691177 -592294 -553483 -572613 -546967 -439827 -379799 -469282 -596752 -562675 -312087 47746
33302 47746 367796 513156 401311 86005 -251484 -449861 -465586 -340311 -173097 -111593
33292 -111593 -235208 -426558 -469114 -285108 3545 212774 203669 -60855 -427151 -605845
33282 -605845 -477053 -256175 -200845 -278806 -312633 -288398 -266391 -152193 122260 329140
33272 329140 224636 -8752 -11324 129039 -32782 -558516 -946104 -821938 -416217 -172268
33262 -172268 -207382 -353315 -478647 -577177 -685778 -829111 -952791 -921634 -713514 -523899
33252 -523899 -485082 -420164 -144713 144376 134569 -78132 -134666 13627 105620 64142 30081
33241 30081 -32916 -275934 -552030 -587981 -532821 -758805 -1121934 -1069249 -557619 -186405
33231 -186405 -254310 -361922 -179809 66483 170928 327388 564887 468139 -72710 -450135
33221 -450135 -218175 171458 112055 -183684 -142313 140501 101434 -288447 -488714 -293801
33211 -293801 -86141 -135295 -232098 -151536 -4681 43433 47192 92496 89514 -79410 -345905
33200 -345905 -499009 -389615 -84428 148833 82227 -191693 -326611 -130110 226727 458541
33190 458541 454463 267258 32673 -23605 252016 655790 746143 371318 -160006 -525327
33180 -525327 -707121 -758278 -617511 -354087 -239206 -327538 -299962 17509 321889 317374
33170 317374 179632 175263 149645 -166084 -592938 -721737 -528784 -327917 -228415 -78436
33160 -78436 120166 159759 -19220 -271698 -526870 -797126 -938247 -750851 -347270 -103392
33150 -103392 -187907 -397893 -501363 -486951 -414655 -263095 -30955 184760 308464 357847
33140 357847 331148 147402 -212455 -579435 -698904 -458571 -274 381582 459345 231193
33130 231193 -89664 -218056 20208 531582 957186 968708 637007 369767 399189 515640
33120 515640 435555 197127 -19086 -213745 -423781 -492163 -332876 -198486 -282220 -297778
33110 -297778 45731 385453 155884 -440418 -627681 -203944 240004 312196 264535 282469
33100 282469 116936 -270693 -429824 -187289 -41888 -350346 -708865 -622537 -264187 -78700
33090 -78700 -107251 -186837 -370811 -660398 -736542 -443026 -140576 -127369 -145161 53030 122225
33079 122225 -297410 -843873 -921361 -586536 -301313 -113899 215757 516621 382454 -54786
33069 -54786 -226899 1542 180260 16308 -287342 -492650 -619914 -691958 -626042 -488284
33059 -488284 -491593 -647157 -727039 -644232 -591004 -723664 -934369 -1009545 -869339 -618705 -444464
33048 -444464 -437198 -487019 -453783 -417315 -542222 -710043 -616041 -281113 -83358 -181862 -331848
33037 -331848 -399387 -565560 -817558 -777503 -345646 770 -94126 -368149 -513372 -696059
33027 -696059 -1041512 -1155735 -755233 -304753 -368235 -696237 -641136 -196859 62989 -96700
33017 -96700 -356593 -442322 -385856 -258449 -101442 -41055 -106501 -85897 118122 233919 48219
33006 48219 -228114 -371257 -531536 -799687 -833033 -431200 -54548 -175344 -499578 -466930
32996 -466930 -163052 -48604 -92520 90493 450895 559760 317946 -3753 -279520 -519899
32986 -519899 -553976 -291252 -75305 -208736 -394764 -245728 -25434 -199222 -547051 -490158
32976 -490158 -76363 136810 12038 -118110 -183900 -390248 -601579 -476845 -160094 -115709
32966 -115709 -324026 -331775 -50090 174759 232413 327912 445066 371308 201463 215050 346689
32955 346689 354843 343680 500159 537647 98233 -498163 -635463 -341345 -123261 -93748
32945 -93748 -22971 -6092 -240697 -388339 -54173 344735 164101 -252570 -35220 691119
32935 691119 930367 442853 36839 117853 149885 -182338 -416831 -286655 -220522 -465078
32925 -465078 -630091 -501970 -442586 -598642 -557364 -174674 72440 -43880 -73095 261568
32915 261568 546735 456103 330113 511920 736765 640560 332170 65771 -148137 -274665
32905 -274665 -111883 271380 441995 222349 -60953 -165709 -278578 -549784 -762548 -700640
32895 -700640 -444766 -139399 167467 370406 359415 247493 211964 209207 195836 383273
32885 383273 818671 1051952 790301 491079 623651 795685 453954 -10136 119587 546014
32875 546014 406398 -190925 -303530 277201 796410 852549 796834 816363 724416 660725
32865 660725 951681 1374935 1620743 2193013 3553356 4675978 4048142 2030856 561508
32856 561508 429917 554500 168612 -82577 284881 620744 437610 252708 461783 630812
32846 630812 476274 359880 363714 85968 -291740 -26695 778650 1154846 941080 1021584
32836 1021584 1581394 1705798 1131652 787640 1090077 1290616 1044141 1022855 1413920 1418532
32826 1418532 845843 627915 1154971 1632300 1607282 1589620 1750171 1629775 1439487 1901612
32816 1901612 2617425 2527058 2044072 2505029 3552999 3768024 3892290 6084713 9496285
32807 9496285 10327529 7441710 4220326 3298446 3205895 2191292 1550006 2540758 3473716
32798 3473716 2822612 2185400 3200992 4424587 4234279 3958459 5068843 6192105 6088338
32789 6088338 6579520 9130132 11644466 12332770 13525878 17632487 22650709 26076941
32781 26076941 29646398 35175687 39744289 41373364 45622742 58580157 76473143 92535954
32773 92535954 113837491 159759670 238317615 329588108 396405640 409167409 362707453
32766 362707453 278293131 191839404 131574687 100448377 82159703 64344934 49457282
32759 49457282 42582318 39460634 33218668 25270904 21214751 20560283 18449247 14491298
32751 14491298 12357961 12370684 11351341 8929777 7851603 8386292 7927225 6088959 5237620
32742 5237620 5831420 5765857 4580594 4118354 4686138 4486494 3255037 2778169 3356632
32733 3356632 3251735 2129025 1687705 2302857 2286049 1169833 635259 1361856 1855394
32724 1855394 1309802 930628 1442143 1779530 1277394 885491 1213448 1441443 1090523
32715 1090523 926516 1267147 1271950 702312 544756 1112130 1335092 724167 260708 523615
32705 523615 670072 159019 -178823 256355 697548 449042 60269 117145 169814 -195293
32695 -195293 -429676 -101667 201450 -57610 -400195 -271422 -15712 -122832 -339962 -248716
32685 -248716 32025 294002 618819 850687 547992 -97217 -212836 410442 871333 549688
32675 549688 -8906 -138702 -27884 -41196 19200 308502 412398 95547 -146733 100782
32665 100782 500979 663250 799325 1103046 1187945 775358 305860 244567 367642 332789
32655 332789 358073 681274 885004 476080 -245603 -557378 -288468 120260 301138 232908
32645 232908 23350 -175686 -171939 61720 310364 396266 346906 215879 3571 -203774
32635 -203774 -321116 -474942 -761852 -878560 -487259 109673 257826 -79289 -289209 -116500
32625 -116500 8375 -180480 -320504 -111753 153936 121062 -78992 -152573 -100089 -60835
32615 -60835 -72024 -186460 -455854 -668333 -530156 -198623 -131369 -313577 -225724 263571
32605 263571 618258 508752 330054 485168 729766 676483 472077 482153 654579 667509
32595 667509 467040 248923 81835 -104243 -275308 -315900 -225183 -118956 -100813 -204108
32585 -204108 -360215 -411322 -292022 -167556 -223605 -386440 -447536 -364319 -220917 -40331
32575 -40331 111970 37775 -270551 -447535 -261604 -43194 -168421 -401644 -297529 2526
32565 2526 21579 -192309 -162984 142032 243696 -44014 -394357 -570612 -630171 -522668
32555 -522668 -114809 355382 455672 214555 29010 -30822 -198149 -374408 -237163 59364
32545 59364 57323 -139918 11966 480078 621967 279791 19784 98430 92408 -176403 -256681
32534 -256681 17316 92256 -343764 -735291 -532716 -46559 108831 -109192 -342368 -417032
32524 -417032 -332723 -76683 203999 230556 28217 -92152 -115714 -324105 -591336 -389756
32514 -389756 260458 595729 213300 -342735 -495071 -423857 -481366 -497877 -220503 123989
32504 123989 236026 222546 224859 87886 -179991 -188289 148330 301541 -12948 -298134
32494 -298134 -139701 40625 -251279 -668051 -627288 -334663 -387608 -720541 -759952 -404268
32484 -404268 -97788 -61902 -110012 -129522 -166448 -114379 161019 459935 454911 165303 -150207
32473 -150207 -411757 -652163 -738753 -574559 -389775 -423698 -496017 -297227 68588 233194
32463 233194 109525 -78969 -175004 -171345 -71535 52610 44685 -68364 -50527 91747 7072
32452 7072 -374116 -562434 -255663 97091 -14177 -329326 -283501 55506 209411 189130
32442 189130 402327 760766 660408 -47369 -726957 -808589 -453419 -142563 -25842 48065
32432 48065 147512 186737 109164 -44010 -201596 -316176 -373659 -367677 -273517 -110473 -18058
32421 -18058 -128553 -339888 -394466 -241503 -132088 -277701 -592903 -839430 -849898 -590510
32411 -590510 -214087 -36322 -197205 -389896 -256306 22517 -17333 -320009 -346600 9908
32401 9908 193135 -107758 -444329 -349100 -32010 79485 23989 81112 235974 287917 196537
32390 196537 -11111 -366804 -720729 -741493 -431092 -244796 -422613 -629145 -543983 -347620
32380 -347620 -304689 -332802 -306228 -308997 -295107 -46632 242787 13933 -664397 -920163 -398832
32369 -398832 65121 -234270 -719171 -558003 -85610 -126700 -498965 -391318 138623 274782
32359 274782 -113252 -314158 -63636 96865 -135584 -397224 -443478 -484644 -551225 -349181
32349 -349181 37344 74685 -341489 -645424 -491567 -217871 -159940 -151430 -16706 30478
32339 30478 -169961 -378752 -388106 -372527 -509372 -640653 -605425 -560347 -676422 -798315 -676102
32328 -676102 -331367 11862 194648 181951 6810 -238072 -449012 -572100 -557649 -373720
32318 -373720 -173581 -226957 -487798 -513717 -110121 262670 135469 -217161 -184800 251491
32308 251491 570355 530320 352760 183511 -45894 -265440 -320670 -339159 -530432 -707611
32298 -707611 -560413 -301035 -416093 -839636 -1033707 -869867 -738233 -756192 -604566 -265399
32288 -265399 -188653 -509674 -768143 -662514 -477925 -495396 -543848 -429843 -304038 -319116
32278 -319116 -373228 -417497 -570736 -751476 -678392 -397407 -285526 -374820 -261865 115148
32268 115148 260741 -35506 -308794 -242435 -212033 -518278 -706938 -292688 320255 348488
32258 348488 -227829 -692212 -610217 -245807 -19853 -30516 -129385 -147041 -32830 51521
32248 51521 -121720 -482434 -670672 -564939 -495125 -699812 -916216 -831746 -612046 -570096
32238 -570096 -585892 -339731 47809 120028 -212149 -530568 -523374 -348767 -276350 -286736 -208295
32227 -208295 -48294 17370 -79230 -187777 -142398 4891 50999 -60746 -152115 -104416 -76494
32216 -76494 -236678 -413100 -292866 85929 342839 263538 23171 -120477 -95266 36746
32206 36746 134577 -12384 -442429 -808980 -737087 -365540 -153083 -176455 -106151 86443
32196 86443 -10249 -477157 -735436 -363295 214776 306321 -100439 -423008 -318512 -4880
32186 -4880 157137 52910 -193486 -379612 -387005 -298109 -279228 -307199 -193880 64186 216487
32175 216487 145157 44663 65280 53888 -157190 -448893 -606893 -604647 -515803 -348609 -131821
32164 -131821 29689 110849 165238 97621 -257328 -730566 -871471 -586389 -340825 -485240
32154 -485240 -761578 -779887 -615487 -560394 -599550 -556123 -512608 -647303 -818613 -740004 -474764
32143 -474764 -371696 -551290 -778012 -819537 -675214 -483529 -409005 -550705 -785255 -816672
32133 -816672 -561195 -329835 -427496 -738478 -932113 -906251 -783871 -643139 -518346 -513202
32123 -513202 -639988 -689275 -524456 -344949 -369381 -433336 -249757 75493 190488 84335
32113 84335 98210 327135 425546 142220 -288611 -495047 -474290 -515895 -735055 -918214
32103 -918214 -850089 -620057 -481850 -481735 -410556 -170545 16225 -64617 -257296 -261617 -96920
32092 -96920 -17218 -46550 7992 101304 -35328 -350990 -422907 -120614 128638 -23391 -362367
32081 -362367 -544054 -613450 -761777 -915530 -921260 -842552 -745595 -495203 -95539 99424
32071 99424 -105383 -355366 -283698 -111299 -219670 -423628 -258670 188676 352418 40959
32061 40959 -334029 -408921 -265423 -108437 38282 206837 357642 452857 456860 300158
32051 300158 37720 -85637 33061 138508 17094 -119005 -17802 88311 -176756 -653514
32041 -653514 -844003 -671892 -494316 -437620 -319848 -212486 -421543 -803611 -745547 -61766
32031 -61766 636636 749219 390344 -169 -293692 -557414 -678776 -531670 -296787 -244221
32021 -244221 -333333 -332820 -232238 -253341 -492170 -768010 -840211 -659233 -403983 -314964 -454593
32010 -454593 -626172 -589611 -328333 -17808 203890 306613 293821 228183 252482 395948
32000 395948 443946 205135 -190144 -476096 -598100 -613810 -439422 -70061 116509 -229985
31990 -229985 -788439 -870832 -394007 4514 -78130 -311802 -297631 -172529 -213857 -305350
31980 -305350 -210389 -42975 -60025 -226049 -346387 -427395 -562260 -638686 -502505 -283820
31970 -283820 -244370 -382911 -454154 -307724 -366 326943 493174 338774 -42408 -278201
31960 -278201 -163586 11047 -149223 -545772 -704719 -448980 -115967 -52296 -189696 -265356
31950 -265356 -243634 -300729 -470458 -525701 -283880 97041 272604 133440 -92149 -191651
31940 -191651 -224237 -304738 -351314 -274812 -230886 -374875 -510704 -361202 -92573 -121535 -417490
31929 -417490 -494799 -180107 125698 119799 16399 34728 -26146 -331231 -574971 -458444
31919 -458444 -247816 -366805 -710044 -870387 -829619 -885224 -1034750 -987042 -734371 -584435
31909 -584435 -604202 -521887 -250103 -54184 -90788 -185589 -201086 -255559 -427436 -575309 -607190
31898 -607190 -623556 -639601 -466249 -47497 353508 491211 418460 263473 -2966 -358648
31888 -358648 -545643 -381104 -73093 60580 48320 134842 291643 208902 -193279 -552138
31878 -552138 -495695 -101111 219519 176010 -181960 -617361 -921407 -983357 -792251 -459535
31868 -459535 -178505 -58013 -5476 131636 314175 340313 170500 47388 151605 295280
31858 295280 190925 -65257 -79039 251854 536362 409343 5491 -279500 -316141 -288458
31848 -288458 -321464 -331300 -253172 -191606 -256854 -394224 -479102 -497455 -521181 -537185 -429386
31837 -429386 -190099 -55761 -277179 -738553 -987875 -785029 -467354 -517202 -835928 -800919
31827 -800919 -140462 598914 716113 233152 -231654 -311538 -204112 -166475 -139464 -18587
31817 -18587 69536 18350 12838 249283 540321 512911 133317 -258355 -421201 -432349 -399362
31806 -399362 -254025 35628 289862 336921 236890 109705 -91726 -410061 -623674 -458412
31796 -458412 -25042 252945 192047 51200 84878 172380 84682 -105393 -155261 -74578 -119569
31785 -119569 -381180 -644069 -710051 -638404 -564702 -467966 -272728 -69881 -59590 -284934
31775 -284934 -538157 -563072 -311361 11386 147682 48694 -80092 -27958 164771 284532
31765 284532 245492 168333 139842 66440 -139148 -371568 -470328 -437297 -367827 -253832 -34270
31754 -34270 206887 286595 172811 23761 -41882 -56609 -55912 9301 130121 154760 -25810
31743 -25810 -283603 -367431 -196459 38183 78835 -119298 -335538 -340093 -194745 -195829 -456562
31732 -456562 -687062 -559862 -188958 6199 -117650 -274333 -227828 -119335 -163684 -283952
31722 -283952 -278021 -172604 -172126 -357381 -632935 -888410 -1043566 -1031455 -905093 -857207 -964485
31711 -964485 -1030820 -871262 -618963 -524858 -575494 -569731 -474800 -420464 -410863 -343021 -266403
31700 -266403 -315195 -415006 -387563 -326668 -488894 -779154 -772837 -382698 -87241 -264314 -655719
31689 -655719 -790856 -654112 -583393 -697142 -786689 -704255 -545869 -442232 -393583 -348081
31679 -348081 -302792 -291663 -325821 -335701 -190265 125637 384235 353070 154570 128358 294750
31668 294750 283896 -70484 -423689 -446289 -334545 -468975 -814028 -1025216 -985616 -882254
31658 -882254 -872294 -991206 -1252321 -1508483 -1384095 -751843 -146309 -227470 -871145 -1276109
31648 -1276109 -1007211 -447600 -117775 -47352 -42363 -126198 -371144 -590059 -553396 -355279
31638 -355279 -277605 -389416 -508274 -492962 -397513 -368235 -484593 -655259 -651261 -354752 29107
31627 29107 183218 91936 -1334 -53355 -287660 -693037 -849764 -517607 -72325 -14743
31617 -14743 -284895 -437409 -322513 -186216 -189515 -245260 -325681 -538895 -832910 -966034
31607 -966034 -877386 -792135 -842459 -864999 -719898 -539739 -463964 -365240 -97809 155836 91819
31596 91819 -229983 -404606 -215913 90799 157710 -49658 -282597 -362564 -342406 -355191
31586 -355191 -432068 -492702 -449186 -300949 -163999 -196870 -436967 -706135 -754430 -532905
31576 -532905 -253541 -124752 -107882 -37688 83330 77864 -118919 -352144 -496412 -625615
31566 -625615 -795939 -837763 -600135 -294397 -289310 -566412 -704417 -508644 -336147 -570709
31556 -570709 -1032067 -1226909 -1034194 -779624 -682429 -609228 -435353 -289949 -276910 -238021
31546 -238021 -11386 280196 418738 405675 365664 277088 47946 -226748 -334557 -243773
31536 -243773 -123985 -89742 -108725 -136729 -156373 -103864 54344 184483 107732 -145893 -371045
31525 -371045 -449877 -412282 -283033 -74797 104226 158039 185941 322883 439534 282795
31515 282795 -101689 -399466 -495674 -584161 -764247 -884202 -885130 -948512 -1155284 -1317017 -1293162
31504 -1293162 -1164443 -964396 -604141 -224889 -205202 -562636 -755898 -413886 99591 211774
31494 211774 -101455 -465595 -680601 -709637 -421029 140720 489571 270394 -104228 5919
31484 5919 441738 439701 -172102 -689760 -594924 -249591 -241623 -558547 -777128 -707273 -484310
31473 -484310 -254911 -79171 -6418 -28832 -53520 -42774 -73627 -193153 -344052 -459994
31463 -459994 -488701 -344707 -40206 172220 41059 -310253 -516857 -474447 -423508 -531253
31453 -531253 -697374 -799265 -818369 -692728 -368932 -42154 -9662 -233510 -386998 -375736
31443 -375736 -430203 -616302 -681242 -519070 -370214 -375354 -326148 -77417 153696 135285 -46334
31432 -46334 -206090 -301209 -274323 -8640 348960 378610 -52406 -548875 -737355 -713070
31422 -713070 -709338 -710229 -677518 -772634 -1012549 -1066717 -763156 -458085 -518723 -760939 -797660
31411 -797660 -629172 -470355 -310009 -98107 -65871 -360059 -631565 -512045 -247471 -301675
31401 -301675 -570556 -614206 -481594 -610496 -989491 -1131676 -911772 -743745 -807860 -752327
31391 -752327 -377438 -42728 -110394 -436576 -685714 -772321 -750621 -604405 -375717 -226056
31381 -226056 -203960 -213179 -296976 -620687 -1077307 -1286371 -1118137 -847576 -660872 -427657
31371 -427657 -131956 -68122 -341263 -596091 -559779 -464001 -570349 -651646 -386087 27088
31361 27088 131548 -94014 -277200 -271804 -286052 -431669 -556262 -554944 -520450 -542533 -613503
31350 -613503 -733578 -872769 -863290 -586323 -226054 -67700 -90008 -61298 9390 -100517
31340 -100517 -326995 -281372 129075 436211 232025 -247225 -470814 -328061 -149134 -144913
31330 -144913 -189111 -140762 -65446 -69204 -136421 -197774 -193614 -51814 213623 374403 181788
31319 181788 -271739 -622817 -729858 -818704 -1025093 -1117871 -909260 -641620 -631684 -761153
31309 -761153 -716280 -554070 -551859 -587728 -238356 432784 751795 338816 -335299 -615982
31299 -615982 -494609 -396867 -475832 -570073 -648069 -807145 -911182 -679845 -166567 213138
31289 213138 201478 -23815 -149008 -77283 66978 102148 -79411 -404491 -644843 -661698
31279 -661698 -565096 -511889 -464410 -317861 -132839 -32708 -2661 -16574 -205108 -616430
31269 -616430 -958902 -909993 -566510 -264172 -97955 -263 -114085 -570442 -995800 -852023
31259 -852023 -296618 -74506 -419332 -712448 -501067 -214386 -425161 -923983 -1087062 -816947
31249 -816947 -546584 -508289 -530119 -473036 -414974 -413256 -433539 -497670 -622535 -673660 -551915
31238 -551915 -438020 -556004 -774636 -763606 -495868 -264574 -209301 -155930 24141 197087
31228 197087 210699 121373 61567 47451 20337 -29797 -48406 38150 254098 481664 505574
31217 505574 271506 19560 -6043 92243 12954 -288360 -537069 -561073 -533242 -682035
31207 -682035 -933792 -1002373 -774180 -475724 -430198 -695032 -1004172 -1097595 -1021104 -973382
31197 -973382 -935288 -705232 -319763 -114475 -220108 -319957 -155907 25962 -121571 -453956
31187 -453956 -573022 -475558 -474591 -573552 -462079 -147777 -36924 -260817 -448715 -377304 -337942
31176 -337942 -556474 -716476 -471942 -66865 27503 -163410 -244087 -139098 -165022 -461274
31166 -461274 -789321 -921267 -864070 -675864 -402788 -224376 -314756 -508473 -448833 -135570
31156 -135570 41228 -81626 -190077 -51776 77222 -84786 -318295 -252738 -14705 -57506
31146 -57506 -437304 -723945 -658258 -477448 -476738 -613879 -720865 -799296 -883873 -851893 -614648
31135 -614648 -331886 -203057 -174377 -76810 59448 70212 -43653 -134983 -186650 -309636
31125 -309636 -460381 -422261 -143804 120243 117602 -101395 -288456 -282573 -113135 71971
31115 71971 111718 -37074 -221794 -242835 -107934 -18426 -80704 -184561 -208875 -176226 -140477
31104 -140477 -102824 -116980 -273558 -474987 -456880 -190559 -24541 -204658 -480373 -473570
31094 -473570 -242873 -134305 -219038 -285881 -313651 -489999 -731375 -659554 -210418 159621
31084 159621 109388 -117358 -152444 -96708 -256740 -524613 -497279 -151309 55771 -156796
31074 -156796 -494161 -516413 -224867 -12761 -145846 -463231 -581102 -317609 94859 235495
31064 235495 -42048 -441075 -595796 -511714 -465296 -550240 -592080 -524444 -533508 -681461 -674060
31053 -674060 -282036 185135 180657 -330110 -760723 -643876 -197928 42902 -43356 -104931
31043 -104931 75899 242781 72445 -299428 -418829 -138818 145164 -9914 -521900 -876090
31033 -876090 -740961 -324964 -89010 -232628 -545197 -691800 -548578 -269746 -101035 -156743
31023 -156743 -352423 -520039 -561802 -488738 -356912 -223525 -146754 -154133 -199138 -209042 -180929
31012 -180929 -160549 -129752 -26192 96976 70372 -145110 -337946 -305966 -134956 -46231
31002 -46231 -40252 82683 346590 489251 325889 26057 -130234 -136340 -206137 -404112 -538643
30991 -538643 -454543 -266423 -205641 -319962 -427338 -348583 -107277 123898 230745 264138
30981 264138 338238 466640 544740 489664 347590 228917 157472 30698 -240540 -561344
30971 -561344 -674531 -415879 54471 354206 257053 -88610 -362660 -410660 -296615 -124015
30961 -124015 21827 -4706 -321631 -789668 -1056293 -944173 -661435 -510475 -523257 -538499
30951 -538499 -514836 -540621 -577780 -452008 -166703 -18736 -252313 -710995 -992035 -898541
30941 -898541 -589186 -293410 -58206 144095 221189 69181 -179461 -248211 -112343 -83433
30931 -83433 -355360 -660825 -618782 -296916 -120346 -251452 -398604 -314130 -149543 -139359
30921 -139359 -216046 -194458 -134127 -226861 -444132 -574201 -537873 -415134 -229923 15649
30911 15649 142891 -50826 -422973 -584634 -441591 -325523 -452909 -565521 -347165 46153
30901 46153 188011 -17187 -266158 -359809 -440797 -638051 -764464 -588333 -245876 -116770
30891 -116770 -308594 -505013 -404616 -112409 63603 61254 71075 142186 68724 -234315 -486529
30880 -486529 -377893 -11642 212207 98958 -162273 -309270 -298060 -248576 -271054 -421285
30870 -421285 -698522 -986537 -1069031 -809441 -324457 60460 62986 -304321 -719270 -843034
30860 -843034 -662092 -475031 -508922 -661420 -704020 -610926 -533711 -537162 -540192 -481092 -376639
30849 -376639 -240216 -96438 -55177 -211074 -477809 -668838 -724598 -712364 -640184 -456402
30839 -456402 -217946 -66771 -37673 -68882 -179901 -418288 -639364 -605152 -356752 -234815
30829 -234815 -433393 -749925 -879564 -765236 -563805 -446759 -510361 -702336 -788970 -597739
30819 -597739 -307849 -233922 -318399 -219822 20272 -116508 -811256 -1474657 -1520843 -1178052
30809 -1178052 -1038505 -1121413 -981397 -563121 -289296 -312183 -309350 -137031 -96422 -320822
30799 -320822 -425867 -116012 269506 220499 -215108 -567295 -614999 -521671 -419139 -266152
30789 -266152 -114763 -152692 -395966 -609525 -630396 -557398 -537084 -569474 -628309 -765464 -943782
30778 -943782 -948740 -672261 -358393 -331015 -542870 -644222 -488515 -307647 -330255 -483525
30768 -483525 -592491 -635724 -630433 -487108 -216385 -93065 -314992 -627641 -624440 -342396
30758 -342396 -184475 -275326 -324679 -201237 -180412 -420571 -622319 -521090 -360541 -486193
30748 -486193 -741321 -709588 -386374 -155873 -187202 -293236 -362571 -494425 -658418 -627706
30738 -627706 -356116 -74077 93313 258514 404931 266206 -215018 -634293 -609399 -285477
30728 -285477 -90101 -170335 -333866 -395947 -321183 -131351 81982 135884 -36339 -237944
30718 -237944 -263986 -190563 -188822 -185220 -5190 228530 191984 -133552 -388849 -358062 -264251
30707 -264251 -401781 -716779 -924003 -857907 -547783 -109735 262683 342150 98964 -196780
30697 -196780 -275885 -197876 -207960 -338756 -369613 -187075 15146 -16012 -258165 -428353
30687 -428353 -312280 -26540 75071 -226653 -765620 -1172784 -1279097 -1213417 -1108912 -918783
30677 -918783 -613476 -348584 -258751 -249928 -199083 -200907 -365566 -519769 -432421 -245416 -308488
30666 -308488 -605785 -740212 -541000 -293020 -246457 -286089 -262981 -277427 -389515 -392836 -176108
30655 -176108 -17697 -188393 -500201 -589342 -443284 -304823 -241378 -170611 -152179 -281894
30645 -281894 -428317 -431972 -415895 -518027 -498766 -90141 407614 438098 48091 -154723
30635 -154723 59996 260286 141400 -15456 59761 126642 -90583 -367385 -341649 -105227
30625 -105227 -39014 -271647 -624421 -903580 -977495 -766481 -409152 -232907 -330344 -403640
30615 -403640 -261808 -178658 -442077 -818365 -853130 -524703 -215033 -144579 -187725 -181660 -112902
30604 -112902 -32823 -16100 -142278 -349920 -437336 -365496 -360010 -524714 -611943 -430685 -208340
30593 -208340 -225766 -353789 -323296 -214820 -262488 -378661 -322612 -172905 -170882 -243812 -164136
30582 -164136 -44331 -151382 -339079 -235800 58042 66116 -258468 -447532 -323384 -259516
30572 -259516 -464786 -620699 -492207 -336318 -381167 -407793 -216762 -53730 -165567 -335043
30562 -335043 -290307 -220556 -408870 -646410 -532957 -163837 11757 -87321 -119634 18844
30552 18844 -2458 -349543 -657679 -520814 -77561 176554 39975 -193524 -181345 40136
30542 40136 190461 176079 181816 332591 485180 468036 329599 164893 -112779 -549631
30532 -549631 -849657 -661255 -118924 271742 291506 169069 67140 -136679 -432898 -519693
30522 -519693 -307937 -168890 -361416 -582212 -466862 -218139 -270100 -540786 -536461 -139755
30512 -139755 192568 95948 -223343 -330688 -122784 128526 145814 -90617 -399616 -620420
30502 -620420 -741102 -809304 -792215 -650374 -519801 -614706 -892097 -1024373 -817242 -459729
30492 -459729 -227159 -138833 -82366 -81006 -209149 -377523 -431169 -381999 -362848 -424464 -518442
30481 -518442 -581745 -516218 -224696 195582 456969 429126 303568 253672 161066 -93771
30471 -93771 -305616 -218021 53836 202910 197879 234167 327146 313306 196760 141155 141867
30460 141867 46458 -108310 -126119 -35927 -96603 -353543 -525761 -440938 -278144 -240660 -260019
30449 -260019 -194903 -99404 -96728 -133621 -45877 195448 420293 417186 127191 -272345 -503476
30438 -503476 -485007 -429213 -526385 -641304 -522760 -221951 -30671 -35767 -34811 74653 124060
30427 124060 -13314 -205390 -291906 -316813 -389941 -490540 -538938 -522490 -449262 -315114 -198730
30416 -198730 -237095 -417943 -544982 -500716 -403107 -409355 -492057 -496783 -319680 12424 315972
30405 315972 303600 -144712 -731067 -979864 -792517 -529868 -461440 -420702 -187557 59215
30395 59215 -29183 -427238 -717465 -602573 -226335 37334 -18943 -274955 -449268 -409628
30385 -409628 -300274 -308324 -375605 -314713 -170614 -199652 -440472 -601046 -502675 -348742 -364464
30374 -364464 -451258 -451247 -494943 -761103 -1087036 -1173814 -1042568 -925620 -814289 -517914 -128306
30363 -128306 407 -214239 -451258 -477134 -413366 -402581 -369812 -288049 -335441 -546642 -607915
30352 -607915 -298603 96879 150170 -103831 -271483 -208818 -145887 -210512 -208483 4393 239029
30341 239029 256746 127065 78284 112097 7105 -305350 -572161 -511463 -177429 68210
30331 68210 -54359 -434463 -682512 -543866 -166917 68540 -37585 -324845 -499413 -458348
30321 -458348 -332191 -264632 -252998 -220152 -157993 -134253 -189165 -290527 -388361 -452867 -441816
30310 -441816 -298300 -39408 194624 261306 180915 103151 99688 80400 -40589 -184469 -201642
30299 -201642 -78918 40024 26988 -111390 -273633 -354082 -308173 -196556 -149282 -222756
30289 -222756 -329787 -390495 -479411 -673502 -813151 -645084 -228227 52794 -15888 -201021
30279 -201021 -201991 -81955 -82695 -188543 -181266 -40594 29844 -33380 -63747 17789 69279 -7270
30267 -7270 -109965 -147282 -186951 -282058 -347163 -327192 -302066 -299008 -190994 70182 294733
30256 294733 288679 90644 -172104 -479325 -783022 -868898 -612009 -247368 -120252 -242423
30246 -242423 -343721 -297542 -231005 -243875 -284965 -325170 -420190 -562523 -655689 -647837 -526668
30235 -526668 -231919 198133 444514 185390 -408276 -767227 -606716 -223322 -640 54711
30225 54711 89955 39210 -210019 -498299 -583105 -520212 -522837 -523773 -252994 229858 456983
30214 456983 156588 -350753 -568273 -430224 -252301 -217496 -210018 -145417 -172365 -426658
30204 -426658 -785253 -1033760 -1153975 -1260920 -1334952 -1234112 -960033 -691513 -515560 -344347
30194 -344347 -174570 -184821 -421206 -618439 -562393 -432814 -495974 -621608 -478788 -128170
30184 -128170 14365 -163159 -285852 -108223 101755 34025 -169967 -210290 -118951 -85869
30174 -85869 -29163 218445 424394 148443 -550504 -1038366 -879054 -345767 13096 33593
30164 33593 -56645 -73018 -50025 -76999 -180457 -351398 -541036 -637885 -559020 -365970 -222176
30153 -222176 -242356 -415134 -629246 -737775 -661887 -494294 -444271 -605106 -814726 -824622
30143 -824622 -590194 -325433 -266089 -425208 -600915 -613034 -510431 -503915 -679650 -863886
30133 -863886 -867840 -791103 -896937 -1186604 -1325180 -1095479 -722855 -560691 -594626 -503140
30123 -503140 -161959 161798 169877 -96863 -338822 -338275 -140847 39499 43415 -75578 -111864
30112 -111864 40687 244608 302900 225681 185355 250518 328821 358651 366678 313738 92035
30101 92035 -253592 -500970 -550044 -557263 -642989 -663581 -466706 -208331 -164475 -309816 -334967
30090 -334967 -74978 284512 447228 292446 -86952 -480671 -674698 -600089 -400945 -275660
30080 -275660 -269238 -303003 -337272 -364796 -309445 -120331 54597 -13597 -316465 -569409 -527292
30069 -527292 -219794 120351 233565 -18961 -500671 -818378 -705437 -382434 -311205 -581355
30059 -581355 -801467 -658212 -318842 -160411 -314958 -603914 -744011 -535810 -49979 303696
30049 303696 139040 -379194 -645960 -387129 -20269 -53129 -425726 -716249 -731191 -571561
30039 -571561 -333572 -97576 -51712 -263825 -443712 -282668 65516 195937 53617 -68878
30029 -68878 -77051 -171942 -372835 -403355 -192480 -68606 -230768 -387577 -219208 80179
30019 80179 77735 -239020 -442881 -274710 48024 195103 146223 107719 157363 156567 -5213
30008 -5213 -224675 -302203 -172835 44159 179762 132561 -99247 -405260 -607331 -616365 -519460
29997 -519460 -416304 -252411 9773 150987 -73782 -475898 -565581 -235125 59770 -28535
29987 -28535 -259275 -246547 -29777 125341 182000 210608 90845 -240378 -481579 -365848
29977 -365848 -160821 -276210 -556479 -521053 -177339 21130 -27256 25150 230598 179627
29967 179627 -253372 -625736 -632752 -530015 -567624 -545758 -282312 -34711 -55962 -143204 -42036
29956 -42036 54690 -160561 -561830 -780015 -716012 -512931 -245289 24405 103646 -75862
29946 -75862 -260482 -231692 -140945 -201552 -308625 -284929 -230176 -275306 -275037 -135257 -146724
29935 -146724 -527017 -902241 -785543 -367294 -241069 -468201 -537330 -236639 51702 27177
29925 27177 -110859 -103766 -43596 -124799 -316971 -470483 -507725 -412172 -252899 -236648 -468452
29914 -468452 -682694 -539761 -171071 -48686 -302216 -581409 -646921 -649864 -713693 -692355
29904 -692355 -525351 -415922 -444635 -398050 -207889 -160361 -387969 -537223 -293353 85706
29894 85706 146441 -101702 -302621 -336965 -382002 -500063 -548855 -464813 -327172 -165995 37740
29883 37740 205731 254402 275426 392021 505414 427313 193986 -6986 -150840 -334131
29873 -334131 -480207 -410821 -200310 -116953 -172138 -82157 218399 384874 175334 -168043
29863 -168043 -320294 -385987 -652304 -1001024 -997174 -562138 -155742 -150679 -346906 -333753 -98706
29852 -98706 28250 -75773 -167499 -58885 90562 34381 -216127 -481967 -702528 -921767
29842 -921767 -1072555 -1012431 -782278 -620909 -658095 -760638 -770289 -739401 -791989 -861988 -757074
29831 -757074 -465085 -224942 -232606 -392006 -454680 -347910 -251306 -346742 -595536 -808461
29821 -808461 -850304 -702986 -419608 -157056 -193248 -686697 -1359051 -1628519 -1219779 -514155
29811 -514155 -127037 -235814 -512356 -638564 -635473 -657878 -700438 -643103 -474676 -342374
29801 -342374 -388519 -572913 -657668 -418250 72210 440705 408692 124959 -47072 -15080
29791 -15080 -9709 -147782 -213912 -14432 252629 196664 -264953 -783152 -963961 -776663
29781 -776663 -549975 -606087 -923822 -1179263 -1121803 -843024 -608880 -510196 -423999 -274876
29771 -274876 -140379 -76632 -29060 25480 25262 -14769 26667 143835 135276 -78840 -249603
29760 -249603 -117331 193652 335086 211472 43925 -19475 -89451 -267351 -424576 -396114
29750 -396114 -254814 -229760 -396264 -565126 -482404 -87855 405635 652957 442989 -99157
29740 -99157 -576379 -644705 -299672 171868 497620 614031 564227 335946 -68341 -450114
29730 -450114 -501222 -167638 202787 225243 -77476 -358870 -433018 -451785 -555446 -596235
29720 -596235 -394983 -109064 -82125 -364217 -634320 -646941 -520476 -459389 -405157 -191139
29710 -191139 83834 130207 -90913 -293563 -320296 -384820 -674551 -964807 -930631 -679945
29700 -679945 -602436 -739107 -711083 -349438 662 -7193 -242086 -389848 -442263 -562046
29690 -562046 -663564 -517166 -198580 -73750 -309843 -673827 -856139 -777080 -547805 -326792
29680 -326792 -244113 -306483 -371756 -345277 -336178 -456578 -577836 -523270 -399105 -434289 -559328
29669 -559328 -487632 -199132 17252 28575 -3597 -5293 -117432 -327137 -367496 -162999 -6429
29658 -6429 -78937 -151861 -27155 66567 -152432 -522834 -675463 -569161 -448316 -410449 -342733
29647 -342733 -197957 -56610 19832 -2575 -156231 -338532 -331878 -139680 -63302 -216511
29637 -216511 -258129 70780 446395 421620 122377 -18184 -8249 -193172 -531698 -633007
29627 -633007 -508367 -597554 -922962 -911455 -338001 189659 104335 -287685 -345126 -55023
29617 -55023 100325 -33886 -176520 -198840 -273565 -437144 -475601 -325146 -199832 -207811 -165353
29606 -165353 66439 326469 395508 285526 122690 -89939 -399119 -687658 -737590 -514381
29596 -514381 -247654 -172959 -273423 -357714 -356441 -411074 -607561 -753564 -607008 -285199
29586 -285199 -198481 -497508 -822943 -780234 -474575 -330755 -504461 -761512 -903246 -1007321
29576 -1007321 -1181147 -1328764 -1285639 -1015879 -583387 -95790 232163 159784 -273211 -675730
29566 -675730 -723111 -525190 -391217 -363185 -255559 -92474 -157329 -510042 -748942 -475281
29556 -475281 158552 592044 494047 68571 -269679 -349300 -303839 -293592 -290600 -158077 119658
29545 119658 369262 422951 311490 176351 48939 -132129 -308290 -323100 -214423 -243983
29535 -243983 -491562 -659581 -519862 -342861 -535340 -970198 -1090668 -691311 -187438 -207
29525 -207 -60441 -119905 -198339 -408302 -580651 -429277 6954 386329 489170 385268 215688
29514 215688 33940 -138085 -282267 -427285 -595688 -730451 -774834 -759269 -709379 -584676
29504 -584676 -436540 -459239 -681292 -780814 -496811 -92752 -60580 -428349 -743704 -746956
29494 -746956 -655383 -692041 -731071 -592243 -351907 -143290 61916 236364 138956 -327750
29484 -327750 -811821 -885885 -588703 -290867 -148080 -34842 51328 -74320 -377951 -502365
29474 -502365 -251792 78093 85422 -185872 -331283 -157598 81113 62905 -185276 -374102
29464 -374102 -338272 -176387 -43352 25268 43617 -14373 -135203 -209715 -180389 -156381 -244466
29453 -244466 -349362 -314338 -194859 -183213 -290768 -336394 -256754 -181559 -161915 -90565 27038
29442 27038 9693 -148086 -150178 152523 436143 312935 -110056 -387023 -335360 -181315
29432 -181315 -169367 -312232 -503211 -620399 -533931 -242358 23261 55116 -29610 57
29422 57 61213 -106809 -411308 -445059 -144638 31902 -207351 -524905 -483461 -201840 -90796
29411 -90796 -174982 -134954 79509 143867 -90450 -334067 -288968 -53502 66786 -51404
29401 -51404 -309994 -587297 -810912 -923693 -917630 -860375 -800411 -691505 -483064 -240560
29391 -240560 -106482 -159647 -338951 -470439 -374347 -35994 304993 348069 78637 -186417
29381 -186417 -192502 -76516 -155644 -465162 -710086 -682936 -519118 -442198 -434221 -338910 -190722
29370 -190722 -203548 -412128 -548527 -402890 -147407 -106567 -287704 -380845 -241223 -119047
29360 -119047 -277598 -585412 -704173 -564271 -404727 -385337 -425911 -458867 -567363 -756291
29350 -756291 -829144 -679554 -513446 -545991 -620812 -424454 -24544 131250 -174337 -591838
29340 -591838 -638548 -288834 52546 68099 -162647 -349051 -339083 -237142 -229899 -343524 -409190
29329 -409190 -294786 -109283 -65532 -168059 -212067 -136545 -172998 -488711 -838644 -813296
29319 -813296 -396598 -42625 -131472 -517032 -732090 -553137 -228638 -144066 -358459 -555604
29309 -555604 -451362 -153976 -23804 -216820 -518975 -668111 -671160 -676493 -662968 -458288
29299 -458288 -43940 338060 436372 253164 17379 -51170 58318 148207 33812 -212041
29289 -212041 -306574 -97324 246775 461372 466885 294522 -93388 -658772 -1070280 -954631
29279 -954631 -387214 141912 301514 204685 74355 -74149 -284287 -468618 -563801 -667573
29269 -667573 -828832 -883394 -691075 -366376 -83136 164347 383809 371385 -14718 -497318
29259 -497318 -638423 -408441 -182656 -185766 -262595 -242013 -215106 -333298 -565399 -777986
29249 -777986 -882447 -823618 -603396 -381912 -355746 -458665 -397476 -83903 198224 195905
29239 195905 31194 -41577 -14725 -30983 -79583 -64226 -62752 -222272 -441156 -449335 -216817
29228 -216817 -6280 27932 14968 43719 -50487 -375225 -679344 -638073 -325351 -116850
29218 -116850 -160065 -235656 -187336 -179333 -358406 -520906 -402583 -148881 -141206 -372576 -380397
29207 -380397 55165 481968 329921 -314495 -823795 -823681 -530681 -313939 -275263 -349998
29197 -349998 -497926 -619794 -542448 -293239 -176775 -353239 -532163 -357129 52573 255577
29187 255577 97497 -164370 -321101 -447575 -615717 -702884 -632204 -537644 -513189 -419407
29177 -419407 -138724 159886 231762 100913 -13202 948 117278 317222 519486 476560
29167 476560 50329 -448402 -527465 -159682 157332 79017 -171132 -230981 -135271 -152898
29157 -152898 -315430 -430161 -437571 -437216 -415196 -249531 19015 196864 229232 216181 129683
29146 129683 -170812 -573292 -705219 -451477 -168839 -160319 -223673 -23966 324390 432633
29136 432633 259210 143339 242875 332788 226129 48024 -23785 5635 99309 292404
29126 292404 490197 430810 45827 -374890 -583844 -707108 -932036 -1103783 -967352 -638596
29116 -638596 -444901 -386870 -175738 200564 389248 251607 105996 181678 207044 -136763
29106 -136763 -633310 -801467 -603154 -470580 -650379 -904379 -940545 -804036 -675462 -545638
29096 -545638 -318535 -72605 17279 -58347 -155385 -199076 -220112 -219937 -197714 -280392 -589174
29085 -589174 -950225 -996774 -663685 -330982 -297458 -344608 -97274 354310 552400 332897
29075 332897 4362 -178620 -330888 -573517 -728037 -644713 -534034 -618280 -678066 -372010
29065 -372010 117732 243569 -91333 -357312 -179299 155214 228042 137482 227460 439825
29055 439825 404713 75251 -185413 -178294 -117541 -188483 -231466 -85917 50746 -86954 -369194
29044 -369194 -431552 -221672 -56359 -122825 -239871 -213593 -143682 -193077 -285551 -282766 -293513
29033 -293513 -492234 -707890 -555855 -31294 372941 302435 7254 -64292 92523 116279
29023 116279 -134425 -422205 -540701 -555473 -566491 -511168 -336550 -158710 -102924 -134498
29013 -134498 -176009 -257437 -418087 -574494 -622600 -585636 -539532 -471584 -337952 -202425 -197270
29002 -197270 -365949 -609248 -750399 -633631 -262087 116100 193502 -39707 -252501 -179157
28992 -179157 73448 230891 189253 -8733 -349253 -761810 -995669 -866032 -563007 -446807
28982 -446807 -566378 -644913 -527473 -360503 -301484 -330241 -407159 -544156 -631104 -466129
28972 -466129 -86578 185312 175008 79320 80741 17110 -286208 -583539 -482203 -52716
28962 -52716 207110 28165 -342111 -579100 -691750 -823949 -894473 -704464 -317201 -82642
28952 -82642 -236658 -613753 -830154 -693499 -376614 -210766 -357442 -694172 -982170 -1088317
28942 -1088317 -1033102 -891067 -722660 -586761 -527502 -512214 -448719 -315371 -213185 -209785
28932 -209785 -186259 21297 319754 371955 26466 -396098 -436780 -72223 252581 187874
28922 187874 -130605 -340795 -317876 -230973 -261647 -425668 -607268 -650985 -493812 -304909
28912 -304909 -375895 -740130 -1042395 -976580 -716271 -652792 -801191 -788269 -430616 -4653
28902 -4653 145596 10806 -181098 -249631 -146517 47263 110482 -143472 -584174 -839225
28892 -839225 -732733 -446646 -175838 103481 379370 418415 96171 -301266 -402915 -246974
28882 -246974 -167619 -286419 -412161 -413991 -407782 -518439 -667228 -687158 -544936 -389478 -403810
28871 -403810 -583064 -659806 -375475 128612 376101 130283 -290667 -453337 -372788 -384416
28861 -384416 -597675 -781508 -737511 -509602 -241388 -69509 -135273 -448160 -736110 -678511
28851 -678511 -315486 -8446 24610 -78756 -88190 67900 332499 573436 579269 239088
28841 239088 -226739 -449890 -383619 -347346 -533933 -741474 -725976 -571076 -515954 -596596
28831 -596596 -658557 -610461 -489998 -352346 -230277 -152364 -105446 -29246 95653 218211
28821 218211 296694 312266 199582 -91793 -442069 -634619 -638199 -650051 -792815 -941055
28811 -941055 -933553 -787142 -595878 -379231 -153936 -22498 -63459 -220940 -370884 -396560
28801 -396560 -194891 195853 441632 157065 -564500 -1119623 -1081543 -697831 -490241 -573265
28791 -573265 -648394 -524595 -334168 -280255 -420188 -682548 -913400 -945070 -777981 -623170
28781 -623170 -613144 -593372 -398867 -192228 -242161 -456275 -465917 -174138 100107 91760 -75371
28770 -75371 -137118 -47270 53811 69450 4358 -116390 -279258 -469945 -661838 -781470
28760 -781470 -724803 -495426 -267144 -176678 -118089 76710 304987 277620 -55649 -411694
28750 -411694 -564001 -590469 -632966 -640037 -510977 -322629 -227368 -233306 -251074 -282873 -415248
28739 -415248 -670332 -982282 -1275876 -1465772 -1434668 -1138961 -719584 -398135 -247221 -134447
28729 -134447 82320 342814 406594 119810 -341721 -585541 -441651 -199564 -248209 -544556
28719 -544556 -684636 -514378 -365666 -543943 -867136 -971698 -860510 -800946 -795181 -571465
28709 -571465 -155126 -43986 -569861 -1327445 -1551985 -1010754 -267843 -18223 -337651 -706985
28699 -706985 -691973 -431714 -380196 -662514 -888753 -692576 -274763 -161541 -465762 -706090
28689 -706090 -489686 -86780 -40434 -377050 -586602 -378954 -63315 -19232 -130689 -47541
28679 -47541 203681 252881 -21127 -308107 -362156 -352279 -515751 -696644 -518498 62382
28669 62382 636067 793338 519462 98714 -213083 -347497 -378275 -421232 -527173 -609699
28659 -609699 -525710 -274928 -55040 -47777 -205528 -341529 -390464 -454874 -587038 -659645 -524575
28648 -524575 -209700 123337 339552 355998 101685 -376972 -801584 -857606 -565039 -291255
28638 -291255 -313804 -523147 -654303 -633201 -527361 -316229 42235 393651 488506 293307
28628 293307 1132 -237127 -380769 -359769 -159647 -29494 -250973 -635747 -640483 -141185
28618 -141185 306329 248704 -5357 86199 415169 410974 -17875 -319818 -151056 137411
28608 137411 92711 -167013 -198314 99332 404078 458257 341361 252521 227782 142166 -98478
28597 -98478 -424845 -658186 -694170 -602091 -498379 -382054 -210083 -88733 -203978 -533842
28587 -533842 -815703 -878675 -846826 -913287 -1067271 -1175081 -1193230 -1134351 -924499 -495609
28577 -495609 9249 305699 271783 56554 -139440 -272776 -393991 -479406 -435276 -254180
28567 -254180 -73240 -22085 -53380 -8633 138254 205177 40495 -247981 -415647 -371958
28557 -371958 -212474 -14413 209812 358007 256569 -88449 -433126 -578753 -559729 -473873
28547 -473873 -320022 -132857 -82768 -247921 -434859 -433619 -325170 -307085 -327288 -172175
28537 -172175 130713 297152 203187 55126 70393 206288 290434 236647 53656 -191382
28527 -191382 -353423 -327413 -239724 -324191 -551711 -630299 -473278 -376813 -539329 -685591
28517 -685591 -460694 11702 300926 258128 87034 -68699 -226420 -304571 -178753 -19876
28507 -19876 -147609 -457775 -444922 27359 436492 369746 146021 246946 491204 337713
28497 337713 -191215 -508688 -358498 -118043 -98532 -95398 121445 333485 234214 -61024
28487 -61024 -222846 -203559 -191297 -236995 -255668 -284730 -422111 -570858 -540892 -375116 -300986
28476 -300986 -365773 -381132 -247230 -85644 -11415 -4100 -59232 -239703 -490719 -615509 -553106
28465 -553106 -496815 -596119 -700909 -580327 -288021 -107510 -164898 -281363 -247433 -98875
28455 -98875 -27062 -92670 -147690 -46063 165958 322641 331154 211288 3867 -235257 -379003
28444 -379003 -328080 -185948 -170725 -313717 -431702 -455895 -544127 -732178 -745174 -401946
28434 -401946 20230 140482 17625 -25828 17832 -109642 -346743 -282864 173513 561801
28424 561801 516333 246884 105380 35912 -187132 -448924 -447028 -223053 -143064 -369539
28414 -369539 -677145 -813502 -769245 -638097 -435433 -144348 194190 490686 626084 490989
28404 490989 128979 -197024 -238610 -53523 85213 59389 6518 25462 -19662 -281518
28394 -281518 -642424 -810014 -683062 -487952 -488692 -640358 -655687 -419429 -173205 -170665 -296591
28383 -296591 -262123 -103899 -169780 -562304 -932904 -985164 -868045 -829616 -773866 -508136
28373 -508136 -212576 -230545 -476646 -489543 -103853 317429 411231 232784 16717 -167359
28363 -167359 -332922 -394866 -286234 -108967 -4447 9031 -35599 -136310 -224403 -155831
28353 -155831 68607 237555 218114 135894 118431 71749 -60829 -21455 438225 1040903
28343 1040903 1167594 622814 -81924 -337644 -104457 189875 240976 140439 116933 207320
28333 207320 249548 114797 -134116 -321845 -357415 -304147 -257751 -238802 -258721 -394220 -660045
28322 -660045 -855975 -728216 -323727 -12215 -56899 -305714 -447330 -450719 -540459 -776593
28312 -776593 -900617 -681315 -244264 68081 69548 -141814 -348397 -397404 -288607 -192952
28302 -192952 -325714 -679087 -940408 -824442 -437050 -131573 -47181 -25987 11777 -82820
28292 -82820 -347242 -517914 -410563 -256803 -367540 -621222 -623128 -299153 9674 40763
28282 40763 -124419 -325072 -529764 -683341 -640680 -403710 -192009 -142322 -162418 -202566
28272 -202566 -391338 -710363 -821475 -507898 -68602 62167 -64345 -36954 245154 409221
28262 409221 151131 -373327 -779810 -839794 -571816 -169264 91760 55827 -145084 -272019
28252 -272019 -301881 -367784 -431083 -321357 -121709 -161580 -513666 -831124 -848166 -720369
28242 -720369 -659632 -560789 -289561 -59246 -144094 -401329 -463095 -288714 -148897 -139257 -109999
28231 -109999 -67759 -233996 -610976 -847946 -704496 -386162 -252335 -381420 -567751 -601508
28221 -601508 -439634 -213560 -126398 -229581 -304302 -126930 176150 266884 75605 -135919
28211 -135919 -205485 -234809 -265155 -173712 -34781 -169849 -586316 -766006 -379729 120119
28201 120119 73529 -455575 -818464 -714537 -461281 -360174 -320992 -227050 -216443 -390545
28191 -390545 -576454 -598730 -547986 -593127 -717321 -787850 -716393 -446833 7827 398461
28181 398461 346240 -194675 -758874 -852965 -490178 -72017 127771 152611 124544 49295
28171 49295 -117078 -352412 -575468 -723141 -800700 -846304 -829955 -657541 -370825 -246957
28161 -246957 -488954 -860190 -907921 -581995 -309707 -345740 -408121 -195504 74830 16825
28151 16825 -275513 -374963 -203365 -100238 -205008 -232549 -696 215232 90793 -267156
28141 -267156 -505379 -492511 -352479 -181450 -471 91456 -13120 -206190 -230127 -10032
28131 -10032 246396 326223 243643 142671 102342 115880 160013 199554 188677 125561 44377
28120 44377 -68427 -239944 -364797 -269319 -21067 28689 -291171 -644575 -608872 -292084
28110 -292084 -163769 -323104 -381230 -149292 32537 -117756 -342710 -301287 -146677 -212405
28100 -212405 -397748 -371305 -208977 -278389 -553947 -605757 -310683 -44380 -52018 -127297 -89209
28089 -89209 -106793 -319063 -552938 -672830 -822297 -1059010 -1145606 -1000191 -950589 -1177799
28079 -1177799 -1297603 -939745 -399392 -194934 -251305 -106292 243031 326518 3170 -309206
28069 -309206 -283900 -64576 112717 221668 235875 41668 -268671 -394318 -294679 -300890
28059 -300890 -563515 -756383 -601638 -366646 -487011 -906280 -1157761 -1007927 -690834 -513933
28049 -513933 -499754 -471330 -304091 -11187 316073 574818 688809 627584 418072 158363
28039 158363 -11759 -18544 71270 137248 143642 120583 43330 -156156 -448248 -668361 -650615
28028 -650615 -371284 8690 221110 108847 -170229 -290396 -202667 -241062 -607012 -967897
28018 -967897 -880185 -457691 -224029 -359182 -523800 -467159 -361678 -386721 -397560 -256707
28008 -256707 -154735 -292956 -492210 -444483 -199713 -90018 -245926 -460815 -519597 -446504
27998 -446504 -402356 -471332 -574056 -541126 -306574 -46838 -28814 -285985 -570833 -665888
27988 -665888 -585868 -429097 -236013 -88434 -130043 -343750 -504086 -504373 -528474 -717775 -882708
27977 -882708 -784680 -520439 -346469 -264873 -95966 126655 169629 1843 -125350 -57884
27967 -57884 54819 24463 -100482 -130919 10098 202939 231385 -30451 -442037 -651455
27957 -651455 -466083 -130832 -61440 -315605 -538147 -467690 -275371 -283209 -522366 -746286
27947 -746286 -791021 -737085 -716212 -710925 -618513 -433011 -261540 -168270 -103340 -37772 -76724
27936 -76724 -317193 -632180 -751869 -587380 -336285 -217886 -243819 -325066 -456261 -661541
27926 -661541 -859807 -926418 -835163 -637564 -372996 -104980 34398 -30497 -194634 -281121
27916 -281121 -228712 -88544 78862 190274 120482 -145257 -399194 -415507 -239970 -129769
27906 -129769 -224052 -414887 -539791 -572559 -607928 -742122 -959860 -1085762 -922043 -525304
27896 -525304 -243811 -332853 -621452 -744060 -635014 -568733 -724060 -946789 -1002137 -865727
27886 -865727 -669239 -500758 -362994 -243550 -144709 -82390 -81933 -141822 -227277 -353815 -606092
27875 -606092 -963810 -1185991 -1039581 -611732 -221645 -47802 -38316 -165046 -492869 -923276
27865 -923276 -1137943 -971477 -660583 -542634 -644295 -754986 -791635 -860675 -994546 -1047977
27855 -1047977 -899864 -604050 -287479 -25794 120538 76299 -129240 -300007 -277541 -177146
27845 -177146 -256766 -531324 -711342 -634287 -561548 -811548 -1212872 -1246200 -751755 -172446
27835 -172446 31444 -85958 -208496 -267580 -394323 -541504 -508679 -291711 -103353 -57939
27825 -57939 -97257 -204747 -410115 -582733 -523613 -307543 -240716 -410643 -575523 -592603
27815 -592603 -632483 -808007 -908620 -747763 -516157 -500485 -637153 -640889 -441889 -208545
27805 -208545 -51066 -2833 -191313 -663047 -1067574 -919676 -268187 268409 305939 182347
27795 182347 365719 690256 628084 178433 -53860 227191 506665 194170 -478891 -759761
27785 -759761 -432871 -72595 -180713 -548883 -711869 -639153 -598065 -586234 -366974 4194
27775 4194 142968 -93868 -367641 -341485 -128625 -74695 -290345 -579167 -698578 -556712
27765 -556712 -262600 -71783 -149860 -327869 -278936 -10220 82573 -193644 -475359 -357468
27755 -357468 -19309 43081 -231690 -417369 -273628 -38071 40589 53475 127204 114570
27745 114570 -137929 -453869 -544045 -398333 -203790 -28632 127021 110917 -190846 -509776
27735 -509776 -438805 -47933 146337 -64874 -277174 -143158 58767 -101084 -474298 -570049
27725 -570049 -355138 -276289 -487260 -590957 -313292 17765 -65047 -541156 -999620 -1120774
27715 -1120774 -834273 -246201 334022 516523 256654 -28360 -18207 64638 -129133 -464065
27705 -464065 -538911 -341790 -216172 -259010 -239237 -108697 -110639 -314434 -495389 -573146 -720182
27694 -720182 -907069 -811054 -378919 -28481 -31090 -123430 -38102 11905 -224287 -494916 -435401
27683 -435401 -212520 -253546 -523502 -610416 -424326 -272858 -269606 -204832 -65030 -159229 -557232
27672 -557232 -848552 -705028 -342392 -166699 -231338 -310894 -316014 -360004 -502478 -635678
27662 -635678 -606843 -364739 -33425 142317 38157 -164541 -199569 -107621 -160915 -371991
27652 -371991 -402215 -94858 222947 201242 -42444 -175828 -163365 -189967 -249436 -191986 -88346
27641 -88346 -149487 -302660 -244294 34063 163013 -36666 -269311 -245551 -121830 -188796
27631 -188796 -380457 -419422 -283242 -190003 -211967 -230223 -234706 -346035 -520668 -541907 -371929
27620 -371929 -228551 -208294 -106525 227928 591188 674439 449520 130252 -94173 -122796
27610 -122796 70378 296402 185104 -353808 -842473 -742097 -170765 245373 209744 34931
27600 34931 18338 -18203 -328099 -727699 -826460 -583975 -320845 -271825 -404107 -619562
27590 -619562 -862480 -1011276 -893908 -495643 -32531 236324 214921 3118 -208461 -299525
27580 -299525 -327533 -426378 -571730 -574237 -388381 -266337 -433388 -730700 -795152 -533315
27570 -533315 -208844 -91810 -218987 -475674 -704958 -737186 -520816 -247318 -157038 -211028
27560 -211028 -162561 35904 149034 38192 -139962 -222953 -269932 -341430 -302957 -72688
27550 -72688 139492 106284 -53008 -66515 40151 2155 -221421 -373524 -323521 -252984 -315090
27539 -315090 -389623 -338919 -271907 -343989 -470614 -472009 -375454 -323454 -269857 -58629 208534
27528 208534 201467 -141452 -428609 -327331 -54657 -89122 -497683 -847471 -797872 -502940
27518 -502940 -317836 -333277 -389454 -403671 -442204 -506203 -486998 -394064 -425966 -676601 -908561
27507 -908561 -813647 -449518 -202220 -271719 -401304 -257207 84486 257492 141992 4662
27497 4662 52158 117527 -35845 -305247 -399519 -291226 -234952 -349470 -463477 -450005 -462281
$$ [...]
##END NTUPLES=NMR SPECTRUM
##END=
