##TITLE=31Pdec_LY-8Dix.4.b
 CD3CN, 24 sc
 13.05.2021
##JCAMPDX= 6.0         $$ Bruker NMR JCAMP-DX V2.0
##DATA TYPE= NMR SPECTRUM
##DATA CLASS= NTUPLES
##ORIGIN= UXNMR, Bruker Analytische Messtechnik GmbH
##OWNER= root
$$ XWIN-NMR		Version 3.5
$$ Thu May 13 09:48:28 2021 Russian Standard Time (UT+4h)  she@DPX200
##.OBSERVE FREQUENCY= 81.013821
##.OBSERVE NUCLEUS= ^31P
##.ACQUISITION MODE= SIMULTANEOUS
##.ACQUISITION SCHEME= undefined
##.AVERAGES= 24
##.DIGITISER RES= 16
##SPECTROMETER/DATA SYSTEM= spect
##.PULSE SEQUENCE= zgpg30
##.SOLVENT NAME= CDCl3
##.SHIFT REFERENCE= (INTERNAL, CDCl3, 0, 248.564)
##AUDIT TRAIL= $$ (NUMBER, WHEN, WHO, WHERE, WHAT)
$$ ##TITLE= Audit trail, XWIN-NMR		Version 3.5
$$ ##JCAMPDX= 5.01
$$ ##ORIGIN= Bruker BioSpin GmbH
$$ ##OWNER= she
$$ F:/spectra/data/she/nmr/P31/1/pdata/1/auditp.txt
$$ ##AUDIT TRAIL=  $$ (NUMBER, WHEN, WHO, WHERE, WHAT)
(   1,<2021-05-13 09:46:57.81 +0400>,<she>,<DPX200>,
      <created by zg, POWCHK disabled, PULCHK disabled
       configuration hash MD5:
       00 E9 B6 7A A2 85 ED C7 34 08 36 98 17 FE 4E 26
       data hash MD5: 32K
       FD 33 B8 BF 20 52 58 04 7A 72 20 95 0D 27 78 2C>)
(   2,<2021-05-13 09:47:28.67 +0400>,<she>,<DPX200>,
      <Start of raw data processing
       efp BC_mod = 2 LB = 1 FT_mod = 6 PKNL = 1 PHC0 = -6378.678 PHC1 = 366.4007 SI = 64K 
       data hash MD5: 64K
       77 F0 3D 75 BC 5F 3E 34 2A 0A 77 2F CD 75 B1 99>)
(   3,<2021-05-13 09:47:54.76 +0400>,<she>,<DPX200>,
      <pk PHC0 = 19.85559 PHC1 = 0 
       data hash MD5: 64K
       E9 20 1D F6 56 F2 03 8A 3E FF 92 48 5E 63 A8 28>)
(   4,<2021-05-13 09:48:00.23 +0400>,<she>,<DPX200>,
      <abs ABSG = 5 
       data hash MD5: 64K
       7A 30 FF 8A 8F CA FF 5B 89 89 BF BE 47 0A 5B 67>)
$$ ##END=
$$ 
$$ hash MD5
$$ 99 1A 9F 6E 0C EE 5E 1D 6D BE E0 53 BA F6 DF 46
##$RELAX= 
##$RELAX= 
##$RELAX= 
##$RELAX= 
##$RELAX= 
##$RELAX= 
##$RELAX= 
##$RELAX= 
$$ Bruker specific parameters
$$ --------------------------
##$DU= <F:/spectra>
##$EXPNO= 1
##$NAME= <P31>
##$PROCNO= 1
##$TYPE= <nmr>
##$USER= <she>
##$AMP= (0..31)
100 100 100 100 100 100 100 100 100 100 100 100 100 100 100 100 100 100 
100 100 100 100 100 100 100 100 100 100 100 100 100 100 
##$AQSEQ= 0
##$AQ_mod= 1
##$AUNM= <au_zg>
##$AUTOPOS= <>
##$BF1= 81.014009
##$BF2= 200.13
##$BF3= 200.13
##$BF4= 200.13
##$BF5= 200.13
##$BF6= 200.13
##$BF7= 200.13
##$BF8= 200.13
##$BYTORDA= 1
##$CFDGTYP= 0
##$CFRGTYP= 5
##$CHEMSTR= <none>
##$CNST= (0..31)
1 1 145 1 1 1 1 1 1 1 1 1 1 1 1 1 1 1 1 1 1 1 1 1 1 1 1 1 1 1 1 1 
##$CPDPRG= <waltz16>
##$CPDPRG1= <>
##$CPDPRG2= <waltz16>
##$CPDPRG3= <>
##$CPDPRG4= <mlev>
##$CPDPRG5= <mlev>
##$CPDPRG6= <mlev>
##$CPDPRG7= <mlev>
##$CPDPRG8= <mlev>
##$CPDPRGB= <>
##$CPDPRGT= <>
##$D= (0..31)
0 1 0 0 0 0 0 0 0 0 0 0.03 2e-05 3e-06 0 0 0 0 0 0 0 0 0 0 0 0 0 0 0 0 
0 0 
##$DATE= 1620884817
##$DBL= (0..7)
120 120 120 11 120 120 24 19 
##$DBP= (0..7)
150 150 150 150 150 150 150 150 
##$DBP07= 0
##$DBPNAM0= <>
##$DBPNAM1= <>
##$DBPNAM2= <>
$$ [...]
##$SUBNAM3= <"">
##$SUBNAM4= <"">
##$SUBNAM5= <"">
##$SUBNAM6= <"">
##$SUBNAM7= <"">
##$SUBNAM8= <"">
##$SUBNAM9= <"">
##$SW= 501.771253377433
##$SWIBOX= (0..15)
0 1 3 0 0 0 0 0 0 0 0 0 0 0 0 0 
##$SW_h= 40650.406504065
##$TD= 32768
##$TD0= 1
##$TE= 0
##$TE2= 300
##$TE3= 300
##$TEG= 300
##$TL= (0..7)
0 120 53 12 22 120 120 120 
##$TP= (0..7)
150 150 150 150 150 150 150 150 
##$TP07= 0
##$TPNAME0= <>
##$TPNAME1= <>
##$TPNAME2= <>
##$TPNAME3= <>
##$TPNAME4= <>
##$TPNAME5= <>
##$TPNAME6= <>
##$TPNAME7= <>
##$TPOAL= (0..7)
0.5 0.5 0.5 0.5 0.5 0.5 0.5 0.5 
##$TPOFFS= (0..7)
0 0 0 0 0 0 0 0 
##$TUNHIN= 0
##$TUNHOUT= 0
##$TUNXOUT= 0
##$USERA1= <user>
##$USERA2= <user>
##$USERA3= <user>
##$USERA4= <user>
##$USERA5= <user>
##$V9= 5
##$VALIST= <valist>
##$VCLIST= <CCCCCCCCCCCCCCC>
##$VD= 0
##$VDLIST= <DDDDDDDDDDDDDDD>
##$VPLIST= <PPPPPPPPPPPPPPP>
##$VTLIST= <TTTTTTTTTTTTTTT>
##$WBST= 1024
##$WBSW= 4
##$XGAIN= (0..3)
0 0 0 0 
##$XL= 0
##$YL= 0
##$YMAX_a= 6470
##$YMIN_a= -15037
##$ZGOPTNS= <>
##$ZL1= 120
##$ZL2= 120
##$ZL3= 120
##$ZL4= 120
##$ABSF1= 248.5645
##$ABSF2= -253.2056
##$ABSG= 5
##$ABSL= 3
##$ALPHA= 0
##$AQORDER= 0
##$ASSFAC= 0
##$ASSFACI= 0
##$ASSFACX= 0
##$ASSWID= 0
##$AUNMP= <proc_1d>
##$AZFE= 0.1
##$AZFW= 0.5
##$BCFW= 0
##$BC_mod= 2
##$BYTORDP= 0
##$COROFFS= 0
##$CY= -3
##$DATMOD= 1
##$DC= 0
##$DFILT= <>
##$DTYPP= 0
##$F1P= 0
##$F2P= 0
##$FCOR= 1
##$FTSIZE= 65536
##$FT_mod= 6
##$GAMMA= 0
##$GB= 0
##$INTBC= 1
##$INTSCL= 5.30512e-09
##$ISEN= 30
##$LB= 1
##$LEV0= 0
##$LPBIN= 0
##$MAXI= 10000
##$MC2= 0
##$MEAN= 0
##$ME_mod= 0
##$MI= 50
##$NCOEF= 0
##$NC_proc= -3
##$NLEV= 6
##$NOISF1= 182.463
##$NOISF2= 159.3651
##$NSP= 0
##$NTH_PI= 0
##$NZP= 0
##$OFFSET= 248.5645
##$PC= 4
##$PHC0= -6358.823
##$PHC1= 366.4007
##$PH_mod= 1
##$PKNL= yes
##$PPARMOD= 0
##$PSCAL= 0
##$PSIGN= 0
##$REVERSE= no
##$SF= 81.014009
##$SI= 65536
##$SIGF1= 159.3651
##$SIGF2= -187.1042
##$SINO= 113.3802
##$SIOLD= 16384
##$SREGLST= <1H.CDCl3>
##$SSB= 0
##$STSI= 65536
##$STSR= 0
##$SW_p= 40650.406504065
##$SYMM= 0
##$S_DEV= 0
##$TDeff= 32768
##$TDoff= 0
##$TI= <>
##$TILT= no
##$TM1= 0
##$TM2= 0
##$TOPLEV= 0
##$USERP1= <user>
##$USERP2= <user>
##$USERP3= <user>
##$USERP4= <user>
##$USERP5= <user>
##$WDW= 1
##$XDIM= 65536
##$YMAX_p= 537887398
##$YMIN_p= -39212676
$$ End of Bruker specific parameters
$$ ---------------------------------
##NTUPLES= NMR SPECTRUM
##VAR_NAME=  FREQUENCY,     SPECTRUM/REAL,   SPECTRUM/IMAG
##SYMBOL=    X,             R,               I
##VAR_TYPE=  INDEPENDENT,   DEPENDENT,       DEPENDENT
##VAR_FORM=  AFFN,          ASDF,            ASDF
##VAR_DIM=   65536,         65536,           65536
##UNITS=     HZ,            ARBITRARY UNITS, ARBITRARY UNITS
##FACTOR=    0.620285442955139, 1,           1
##FIRST=     20137.2065510759, 0,            0
##LAST=      -20513.1999529892, 0,           0
##MIN=       -20513.1999529892, -39212676,   0
##MAX=       20137.2065510759, 537887398,    0
$$ Real data points
##PAGE= N=1
##DATA TABLE= (X++(R..R)), XYDATA
$$ [...]
38252 -143541 -295592 -216701 103241 359359 297451 77073 72612 340304 535489 415523
38242 415523 156652 29101 12104 -40307 -62320 80778 223524 24728 -512439 -933988
38232 -933988 -852893 -381635 49288 151832 -42984 -343388 -587056 -691270 -611248 -324590
38222 -324590 92001 398909 349262 -2254 -265251 -138920 200729 310261 42258 -284242
38212 -284242 -300643 -19253 227340 198439 26480 66463 441046 799496 705074 264522
38202 264522 71255 367654 618780 284425 -276137 -236471 454530 915234 566043 -85979
38192 -85979 -248402 56733 199122 -44341 -248133 -57899 337087 560202 536336 451069
38182 451069 413027 332955 98311 -219045 -371606 -199589 133846 298287 211110 115336
38172 115336 164034 158454 -112159 -470531 -558257 -324657 -39626 105796 143215 124049 60966
38161 60966 70926 295904 629171 760441 564203 249028 75453 119687 344378 669146
38151 669146 899118 812363 433529 45527 -153907 -220058 -218648 -64768 247931 487584
38141 487584 467464 324875 294671 331258 200386 -119405 -370467 -355239 -147654 66214
38131 66214 200174 261757 249472 145194 -18504 -135047 -98721 71112 200763 124135
38121 124135 -123269 -348440 -438405 -449615 -452848 -430413 -374387 -339745 -321395 -217056 -6653
38110 -6653 165785 195249 165633 174095 140497 -54391 -342408 -528342 -501322 -282755 20729
38099 20729 210240 107711 -178581 -287020 -81256 120402 36057 -106542 49864 348795
38089 348795 345893 83072 67575 405527 528086 33126 -674484 -941461 -715342 -437909
38079 -437909 -336602 -252323 -60583 135039 231769 247959 184455 -348 -242422 -388016
38069 -388016 -395787 -380649 -431608 -495965 -454332 -238521 91210 326639 262467 -36848 -236545
38058 -236545 -130051 87281 110357 -49820 -167928 -214556 -349665 -536553 -511078 -225053
38048 -225053 -14495 -147895 -425337 -442249 -128778 181118 180106 -74437 -272871 -211857
38038 -211857 7722 134547 83224 13235 50963 65575 -112138 -332982 -246631 194019
38028 194019 592333 589519 299268 112042 199734 375344 370238 116865 -206940 -332855
38018 -332855 -142951 204245 455447 565490 673403 772477 651218 277396 -16937 41664
38008 41664 256675 248036 10863 -123624 -13593 135814 145179 77676 12794 -119345 -349338
37997 -349338 -516147 -435868 -98176 367282 781416 944819 763585 406947 167881 121655
37987 121655 106016 51262 64657 131677 56583 -160006 -215313 12806 203581 96278 -63979
37976 -63979 38715 191732 -16069 -432058 -468504 13592 477745 470034 139854 -145514
37966 -145514 -271759 -254451 -41077 288375 434111 268005 52583 12300 -38630 -334262
37956 -334262 -677991 -702740 -442743 -258662 -286976 -341008 -321554 -354777 -487487 -572553 -537169
37945 -537169 -493669 -493259 -411093 -188296 12668 20497 -121557 -246573 -257532 -147630 56201
37934 56201 278554 408317 407120 357680 362719 437680 513523 498168 350022 151369 75707
37923 75707 199849 379585 396235 187200 -147778 -488447 -720006 -711214 -453563 -180124
37913 -180124 -150988 -322442 -399765 -215847 107256 358806 416762 235366 -129961 -451626
37903 -451626 -485099 -258456 -47912 -27318 -107105 -149773 -157152 -186997 -251628 -352886 -467570
37892 -467570 -478484 -294574 -46233 47263 12912 81285 291930 440485 478551 614925
37882 614925 873035 912956 549856 135483 88515 278497 257974 -32680 -194210 20322
37872 20322 379963 532553 423524 255266 204336 280531 375288 390916 354475 381457 486975
37861 486975 514173 338102 59324 -113155 -97045 49828 251702 408917 362971 55722
37851 55722 -308626 -434829 -278907 -85786 -71949 -182768 -192771 24783 348783 505277
37841 505277 338869 9969 -142577 28437 323798 456086 365832 208657 112585 42175
37831 42175 -121901 -404292 -623676 -524549 -122067 175686 -6772 -515190 -845540 -793260
37821 -793260 -611384 -509613 -377662 -112494 165651 390117 660632 889628 758802 292178
37811 292178 26405 249879 507691 312779 -68539 -93211 166868 261747 204566 341152
37801 341152 556176 395844 -69619 -296809 -214591 -305228 -615743 -553731 32390 411478
37791 411478 83347 -403794 -342754 56314 174265 61803 216155 599260 696213 421555
37781 421555 202898 169503 -21120 -435729 -612532 -303006 79625 75469 -179850 -278806
37771 -278806 -183488 -156481 -251011 -257325 -91731 82912 140440 151936 215556 311018 386674
37760 386674 443398 451635 307384 -13011 -322601 -377970 -159618 101007 189080 113300 21691
37749 21691 10075 78674 199213 332079 417203 432555 440199 507904 609061 656133 599432
37738 599432 446070 240632 82864 75998 167753 140588 -108749 -364457 -332045 -33300
37728 -33300 217329 219157 99588 103649 307317 567317 656092 444461 38061 -286722 -358023
37717 -358023 -266268 -179060 -121555 -68222 -102717 -277675 -428045 -364775 -180124 -121614 -228163
37706 -228163 -332009 -345361 -280819 -72689 309544 633585 638197 464436 485252 707129
37696 707129 738693 404180 -13129 -236621 -322477 -395292 -418500 -370875 -326270 -243639 -11714
37685 -11714 217062 136030 -170768 -249967 -2320 112381 -169689 -468884 -405426 -208992
37675 -208992 -260476 -432286 -361648 -69496 158375 254671 301569 213285 -89597 -396056
37665 -396056 -480013 -439713 -412774 -253459 94861 246070 -87321 -489692 -364196 166110
37655 166110 488845 448617 408136 480760 390192 85582 -148805 -234819 -352606 -428167 -193194
37644 -193194 188270 206449 -160464 -347959 -116469 81923 -109038 -409896 -457902 -342316
37634 -342316 -259326 -143884 23855 37435 -82360 37413 433583 529047 -11740 -655891
37624 -655891 -747206 -421041 -206513 -140754 53149 230504 7350 -482807 -713661 -582223
37614 -582223 -453483 -416711 -157070 356640 683517 586907 364307 291563 221029 -9477
37604 -9477 -196523 -122183 34180 -33595 -288156 -439606 -360967 -167273 13954 138639
37594 138639 178497 128837 56889 40105 87374 169218 261302 320690 293398 175589 8104
37583 8104 -173014 -302948 -272274 -86358 28251 -126103 -403330 -472935 -272657 -55069
37573 -55069 9854 -5232 -45618 -173854 -324172 -280722 -37956 119136 47464 -50894 -28770
37562 -28770 -44852 -168134 -102542 324398 705954 543262 -17526 -405970 -439477 -410786
37552 -410786 -441467 -305556 37121 252524 155288 -3460 21894 108108 72561 22788 123755
37541 123755 254517 167142 -158964 -516474 -695784 -591602 -252858 80344 194735 223578
37531 223578 468010 828248 810919 291536 -164948 -70307 290950 348180 93103 -56240
37521 -56240 6819 22534 -92022 -177934 -237684 -391870 -480205 -224866 216915 386577 229354
37510 229354 127589 189459 101046 -193599 -301474 -103343 -41730 -346996 -575342 -373278
37500 -373278 -152988 -416994 -843701 -738956 -140347 245142 115272 -100516 -44416 63186
37490 63186 -73615 -305350 -313266 -95950 98537 149584 156743 251294 454266 665432 733246
37479 733246 603313 417111 379725 526432 706415 777036 709470 528550 275291 31010
37469 31010 -123638 -175359 -139443 -4794 193242 314331 259125 141086 187379 469517
37459 469517 811754 952700 757267 333101 -12140 -18297 253561 474618 413900 136415
37449 136415 -176078 -401772 -416548 -114112 354915 595992 424189 112186 -5633 36457
37439 36457 17225 -92159 -198193 -313218 -412912 -288406 108133 386956 213273 -98138
37429 -98138 31572 571684 928380 844281 683994 725594 729592 454314 132637 104439 297109
37418 297109 394321 302593 174424 128157 167865 250652 266576 90494 -211169 -385972 -334304
37407 -334304 -258821 -333887 -428911 -353306 -197684 -187444 -301949 -292335 -67529 140590 62452
37396 62452 -255732 -458264 -253762 231862 548998 431077 118107 47931 311523 607525
37386 607525 683041 575826 416009 249634 129134 145571 266627 329384 281622 250329
37376 250329 297713 308951 208351 77792 -38539 -217533 -410863 -359366 37939 465487
37366 465487 548685 332947 151067 115653 41588 -141490 -212080 -9175 273730 349975
37356 349975 264285 303599 499485 509489 148090 -209422 -72701 419423 603772 198303
37346 198303 -312924 -397829 -180538 -84557 -103275 88609 466539 623583 403975 117317
37336 117317 45242 107241 111544 18603 -135909 -296032 -296411 -4428 384081 480108 207270
37325 207270 -100156 -161398 -24838 170439 386243 545697 512328 330286 222830 265574
37315 265574 324312 359351 467997 565930 396955 -25278 -346404 -375503 -302698 -277490 -162159
37304 -162159 104776 288067 244820 193694 341432 547537 605163 559978 510532 383148
37294 383148 143363 -48581 -103786 -125549 -86528 225320 700123 790459 262956 -332262
37284 -332262 -373115 -13458 145133 -44199 -203131 -94333 116321 199336 101766 -95103
37274 -95103 -204248 -47967 245973 284998 -26621 -268100 -127899 99825 9401 -281226
37264 -281226 -426231 -436039 -461446 -328212 117248 475017 277580 -173071 -156834 369792
37254 369792 743470 642953 438535 402710 292262 -52100 -314871 -230028 -10290 53303
37244 53303 22741 67355 134851 129378 125089 176394 177013 95755 95642 244520 352997 267501
37232 267501 104005 43642 91926 150173 140228 196 -234830 -329404 -87730 279560 330927
37221 330927 -10675 -347696 -362881 -168563 -17848 7668 -89542 -306238 -504091 -485390
37211 -485390 -323328 -319073 -510462 -546881 -215256 217964 384885 268608 82982 -59012
37201 -59012 -157554 -203026 -216129 -258303 -299170 -245920 -157858 -207878 -384444 -490584 -479266
37190 -479266 -490826 -517748 -390367 -170134 -156007 -371213 -460180 -270511 -108139 -187415
37180 -187415 -263319 -102435 94725 83301 1015 31126 6358 -228582 -400788 -236418
37170 -236418 -15743 -172557 -553147 -627157 -302711 20761 142300 245425 383992 322399
37160 322399 620 -299898 -404126 -470248 -616247 -670910 -479296 -174748 24592 67327
37150 67327 1611 -110035 -112543 141339 490946 542570 208714 -92010 13663 339457
37140 339457 442106 254323 98853 159136 265314 234230 139732 126734 151167 66539 -126383
37129 -126383 -268008 -255185 -156627 -106882 -166754 -300705 -415720 -401004 -212993 34692
37119 34692 148510 81759 -7900 -5208 -10772 -115452 -138316 141500 547924 644611 372195
37108 372195 192562 411225 687699 533480 48948 -242210 -166480 -55943 -119733 -118216
37098 -118216 157775 454310 397572 47243 -204535 -171964 -16887 102345 224395 379818
37088 379818 452252 367437 233280 151704 47181 -149090 -279389 -151704 115599 197543
37078 197543 18061 -159862 -174263 -223506 -504919 -813435 -774849 -380594 -12720 57798
37068 57798 -47892 -91746 -64810 -129239 -325300 -475088 -385653 -95368 129280 84165 -117559
37057 -117559 -191868 -76693 15715 389 105636 456292 726814 550382 114419 -59400
37047 -59400 127852 246897 25835 -296461 -431345 -435758 -426386 -273409 110072 454545
37037 454545 457216 232463 106198 101401 -18622 -263379 -338197 -105610 166980 145649 -156460
37026 -156460 -417748 -372810 -74070 161559 54934 -337972 -650743 -590006 -258734 -14114
37016 -14114 -38048 -165554 -152998 -1243 76115 -30414 -151822 -53307 237054 451861
37006 451861 454541 406565 455558 450384 195520 -146931 -216634 26898 259226 268373 152555
36995 152555 9834 -193059 -331998 -110086 440834 798673 595765 144397 -9581 179966
36985 179966 330302 239790 34803 -165657 -331729 -335698 -79756 197429 119702 -280158
36975 -280158 -559349 -476613 -273573 -249040 -378651 -510267 -641795 -790427 -808920 -573347
36965 -573347 -220251 13696 99103 175148 267034 233094 8656 -227359 -193454 201094
36955 201094 709094 921068 656561 175622 -88907 -13850 113637 133 -295492 -493872
36945 -493872 -464787 -332873 -268219 -294832 -312048 -240502 -131055 -119702 -225677 -224269 131621
36934 131621 717905 1053889 861969 457750 347974 537368 549817 153612 -282366 -316834
36924 -316834 -27942 180474 152438 44607 -47901 -171255 -259621 -167151 13132 17172 -127153
36913 -127153 -81701 215365 352104 87086 -203382 -103243 153821 76815 -223540 -173090
36903 -173090 308040 602731 307309 -179147 -259089 61107 317543 286468 178553 232320
36893 232320 399917 459849 305409 90786 90157 360892 611935 557390 325851 270308 412789
36882 412789 415277 149979 -77885 -29685 102606 73284 15503 185104 496989 658140
36872 658140 627366 611149 665304 610430 355603 55043 -120426 -199747 -325670 -535852
36862 -535852 -678647 -541826 -93207 413567 659703 602354 492222 532568 645219 613822
36852 613822 345802 -42766 -314372 -298808 -97304 -26058 -215626 -398967 -314445 -139850
36842 -139850 -189406 -354915 -306024 -110731 -85135 -104201 230107 690850 521920 -323774
36832 -323774 -882071 -540372 96587 261290 155162 287133 405026 39690 -414240 -220137
36822 -220137 413883 626360 305037 138518 319164 279124 -158234 -409470 -194737 -25565
36812 -25565 -251857 -469762 -320596 -111001 -143947 -133250 166871 377403 142405 -176706
36802 -176706 -90404 186657 156621 -69843 -826 351778 501351 296724 79606 46719
36792 46719 9002 -153941 -272431 -233925 -181063 -235282 -301766 -264546 -168433 -114503 -122430
36781 -122430 -160363 -215180 -298200 -411852 -481959 -348134 34502 392419 373159 39282
36771 39282 -174235 -102237 -81673 -330927 -504184 -242763 161851 147397 -277216 -581703
36761 -581703 -505029 -287672 -143205 -17642 56642 -127436 -505186 -634909 -291661 163622
36751 163622 274570 85547 -29059 75208 218539 234539 124184 -60618 -240033 -248298
36741 -248298 8176 324820 356651 65696 -185036 -95122 179103 257147 45857 -203311
36731 -203311 -312077 -377008 -459247 -343239 135254 671446 743533 286908 -201265 -318192
36721 -318192 -206514 -178604 -197854 -50504 166367 135642 -134640 -248020 -4678 267026
36711 267026 153069 -289847 -639085 -633971 -379213 -94210 106915 170059 49153 -185253
36701 -185253 -302125 -117340 272506 563032 563969 379424 246700 270255 370346 429765
36691 429765 392216 245036 34950 -78690 64189 370309 491652 243301 -76172 -17972
36681 -17972 386448 620768 403861 104980 194244 535747 626397 419307 408466 804597
36671 804597 1118670 856549 255893 -61935 73633 326063 465926 561713 602586 414820
36661 414820 34771 -238390 -265213 -183869 -41209 272869 613307 584652 174285 -98403
36651 -98403 32674 127239 -214020 -602886 -427577 165893 496846 370314 221355 301824
36641 301824 369570 255364 150052 165208 112821 -70084 -111553 141010 408499 357901
36631 357901 11208 -410653 -768113 -938223 -761946 -304303 50939 16402 -230090 -291972
36621 -291972 -56403 219015 243258 -13050 -318531 -420205 -307863 -197338 -190251 -100189
36611 -100189 208529 499306 489322 339476 403957 585598 449732 -2164 -227206 34907
36601 34907 351455 264907 -79146 -279020 -265038 -201106 -117974 1471 14714 -170767 -361911
36590 -361911 -326330 -111549 89431 200461 215180 117444 15271 96320 302082 358642
36580 358642 269655 363221 646579 622555 95464 -351259 -169382 307478 409858 156868
36570 156868 81117 296986 440685 389547 353044 314672 55752 -267487 -232547 101232
36560 101232 191395 -127691 -408352 -375847 -318349 -436266 -416531 -38396 313304 204866
36550 204866 -158897 -279060 -114437 -11055 -58684 5445 288816 535883 492259 224155
36540 224155 8843 48051 300640 506091 416506 85453 -161051 -129593 -6756 -66963
36530 -66963 -265657 -324627 -154101 29136 22681 -89179 -46990 283048 755105 1046154
36520 1046154 925413 490402 124431 135061 422502 591621 425359 145983 108902 315931
36510 315931 419220 231106 5240 48246 235623 199540 -82477 -245188 -133493 -66959
36500 -66959 -306334 -571928 -412933 127807 554614 547243 255349 -716 -52786 99315
36490 99315 354354 537485 525588 382936 264775 209147 139481 16874 -148216 -367319
36480 -367319 -599148 -674792 -476367 -138752 91714 136539 66298 -89664 -304812 -424649
36470 -424649 -325597 -148143 -124682 -219472 -191600 16403 210286 247586 160235 -7957 -230229
36459 -230229 -376352 -326245 -199344 -209644 -310263 -274379 -120232 -118276 -330566 -483989
36449 -483989 -398353 -224643 -135968 -81152 3380 9379 -135797 -294562 -320044 -257265 -213006
36438 -213006 -193018 -175345 -173585 -134246 52247 353642 585080 664663 697464 754246 768645
36427 768645 700272 585982 398474 94703 -176317 -198438 -47970 -6179 -80517 -4108
36417 -4108 206119 150268 -297968 -678833 -582516 -221081 -44125 -123923 -272457 -452888
36407 -452888 -670724 -707345 -390075 36025 186543 46454 -136592 -287885 -454614 -485078
36397 -485078 -198191 203335 308622 70839 -163971 -190991 -156279 -217138 -323240 -383680
36387 -383680 -379396 -277207 -68166 113424 141931 133531 275649 479467 492926 319867 211908
36376 211908 253823 275400 188107 96106 48566 -6451 3218 209639 463808 413454 30157
36365 30157 -273688 -202712 40114 90601 -121570 -418351 -628874 -628757 -352888 41921 217013
36354 217013 37478 -236010 -289212 -126642 43424 128894 184998 244930 275245 228051 52369
36343 52369 -256283 -577615 -761257 -805657 -776358 -588232 -150541 280760 292029 -38992
36333 -38992 -119453 297873 661587 403542 -190704 -388759 -54332 272410 254083 154035
36323 154035 271438 460361 425845 174882 -58063 -141876 -126681 -115885 -180137 -309511
36313 -309511 -392299 -326060 -156009 -557 121719 240885 266662 83739 -200172 -330802
36303 -330802 -242413 -88377 61952 271493 438861 293170 -162722 -508074 -423823 -110841
36293 -110841 51778 39413 78317 190614 197217 91202 52223 92384 22890 -173050 -253310
36282 -253310 -113468 26907 1140 -22290 119961 208404 -41921 -424557 -434123 -35382
36272 -35382 202111 -78952 -467719 -381526 78523 328992 207709 129411 307486 390786
36262 390786 115760 -181098 -107658 103376 -32079 -428152 -545191 -244915 32982 -6804
36252 -6804 -142934 -121984 -30117 22239 140461 314623 272610 -12012 -62771 429535 996795
36241 996795 940839 284086 -323796 -515462 -495568 -459532 -281025 82455 332253 223900
36231 223900 -70975 -209757 -73498 243503 627259 942726 1001343 731793 319885 47066
36221 47066 18671 108412 124475 -162 -143620 -132593 27948 158284 210133 390832 788599
36210 788599 1058219 806957 197741 -210374 -202782 -84668 -78007 -7351 236220 360096
36200 360096 120071 -212724 -205195 108259 300203 150758 -136620 -279951 -221776 -81540
36190 -81540 9511 3197 -37141 -18125 32890 -17849 -210490 -435392 -609037 -728304 -718547
36179 -718547 -486089 -208944 -260792 -665449 -941875 -746318 -365222 -244716 -321545 -250104
36169 -250104 -69693 -119103 -371964 -405368 -96229 140901 -21050 -358570 -476983 -338718
36159 -338718 -174842 -111571 -134811 -256832 -465040 -584480 -405879 48311 504086 685380
36149 685380 534913 220773 -32034 -134686 -164426 -190768 -149850 16325 183685 180746
36139 180746 56489 7079 37444 -60142 -320120 -451863 -247767 53122 60270 -201312
36129 -201312 -297471 10128 413146 454535 113169 -220717 -283931 -195778 -131931 -24183
36119 -24183 212945 367921 166980 -248527 -417789 -165104 202218 376882 416137 483272
36109 483272 529499 445636 287615 133495 -63901 -270236 -257789 47149 341287 357231
36099 357231 267959 346088 448485 259333 -112634 -247789 -66692 83677 2743 -122386
36089 -122386 -100509 13784 123596 207936 178543 -53227 -309986 -278886 26113 256865
36079 256865 245458 182020 202205 165046 -25929 -218611 -282617 -285044 -268851 -165897 -53321
36068 -53321 -153482 -422362 -492594 -222447 51569 42861 -61557 -649 72507 -118364 -437426
36057 -437426 -502407 -253083 16792 127296 181663 281288 348412 275585 81563 -108365
36047 -108365 -159547 -53121 41775 -55302 -242228 -218488 47305 192764 -17956 -304694
36037 -304694 -263914 45478 209796 33489 -284208 -475110 -443403 -223952 62270 223529
36027 223529 164806 36883 67931 267663 424595 358775 73141 -279499 -479996 -379693
36017 -379693 -54422 263896 463844 608834 662150 415985 -141031 -640413 -765194 -661147
36007 -661147 -645439 -693967 -552799 -239985 -72405 -205056 -442945 -536260 -431810 -221024
35997 -221024 -37903 -6793 -120947 -202371 -135212 -60469 -159173 -344917 -393288 -282020 -156464
35986 -156464 -43481 129048 299862 354873 383847 535930 651800 409016 -118119 -408705
35976 -408705 -136901 434338 848937 979620 977562 933904 824616 673899 576336 584623 656901
35965 656901 669092 470170 37718 -409502 -594144 -494357 -330404 -245759 -204049 -214795
35955 -214795 -393829 -695381 -832432 -632015 -283517 -70013 -26868 -42891 -123866 -323701
35945 -323701 -533380 -583986 -499443 -430092 -390836 -296803 -222111 -350067 -624736 -715128 -443417
35934 -443417 -40096 171817 168378 125582 85648 -40882 -222556 -316027 -323686 -397087 -537083
35923 -537083 -531794 -298349 -62348 -33640 -93789 -17519 145566 169597 45459 -5450 106423
35912 106423 232798 272247 295283 309225 162725 -161311 -371926 -205851 176228 338832
35902 338832 88073 -321434 -508974 -379500 -160791 -89920 -155024 -192310 -161712 -168484 -201440
35891 -201440 -73813 243746 452675 321926 72607 68499 266761 338226 234344 208771
35881 208771 307380 308804 218827 321395 600652 623965 237415 -107488 -38942 173211 134694
35870 134694 1887 149297 454169 449210 47703 -361544 -483370 -385229 -238536 -127301
35860 -127301 -81029 -36281 145795 391404 331175 -179730 -656337 -502998 186907 757139
35850 757139 818243 534956 168593 -191111 -421381 -354489 -91411 18133 -178312 -473877
35840 -473877 -628810 -592581 -397179 -130297 -22019 -232057 -519240 -456916 -38471 261274
35830 261274 123647 -221605 -367519 -232528 -49234 -37554 -200299 -329217 -200718 120081
35820 120081 260324 11286 -321250 -320628 -69601 23585 -90544 -62505 206334 369604
35810 369604 221005 33815 114623 375151 568619 663589 761590 858752 879607 802691 648903
35799 648903 478653 412283 474708 468151 248479 50341 198120 549234 633491 339729
35789 339729 23959 -88464 -125506 -132713 48241 318847 283676 -105602 -379885 -280398
35779 -280398 -136283 -215840 -250629 -9880 182367 26222 -111571 248866 829364 930674
35769 930674 457226 -21765 -153119 -149436 -241612 -313572 -203969 17659 196960 248008
35759 248008 124405 -112925 -217505 -16802 283653 344904 203248 201907 414571 502693
35749 502693 244941 -110413 -193648 2810 166407 69148 -205652 -383550 -271098 62690
35739 62690 361527 461637 451581 499394 595613 572485 337990 -3425 -243066 -233481 -13501
35728 -13501 201655 234966 162884 188618 295202 228584 -105038 -446737 -518115 -354897 -168935
35717 -168935 -60851 -16299 -9625 38833 236434 514803 643277 569233 514462 597356 636738
35706 636738 503353 351019 279267 120672 -147782 -174517 180985 412062 47622 -533492
35696 -533492 -598552 -160581 124322 60179 120694 470497 589009 192203 -173934 43895
35686 43895 514243 524850 29860 -403146 -500595 -537422 -704909 -776508 -560113 -267439
35676 -267439 -181358 -222664 -130897 67606 74112 -203100 -450794 -359858 -63380 26327 -245330
35665 -245330 -601360 -710324 -550988 -325837 -168970 -67548 13373 45153 -47051 -301359
35655 -301359 -582245 -563978 -50859 646770 904118 486872 -147367 -411436 -231676 69505
35645 69505 285760 411191 394644 195935 33043 206118 635019 871042 641169 138364
35635 138364 -299985 -573299 -768082 -905497 -888139 -646101 -261671 57653 160465 114578
35625 114578 95087 90288 -97817 -472409 -704247 -574167 -324503 -286130 -352172 -191089
35615 -191089 138366 213689 -106909 -465394 -519476 -344240 -191478 -127206 -68514 20544
35605 20544 123321 234954 331872 362843 303620 142171 -144245 -467092 -568358 -298981
35595 -298981 93141 198084 -39930 -281566 -275672 -130966 -57803 -81333 -111955 -123246 -150615
35584 -150615 -204371 -233059 -133234 150940 479829 604340 504717 449230 556272 565161 312476
35573 312476 136855 386959 767381 710971 265516 15000 149106 234957 -696 -271702
35563 -271702 -296208 -198670 -105413 139235 542057 700315 331040 -280105 -668280 -724562
35553 -724562 -589676 -352274 -131220 -135668 -355434 -479025 -360063 -239481 -272231 -228983
35543 -228983 34809 236043 170261 150009 470031 797274 646382 200187 65433 358972
35533 358972 618783 580306 489391 566054 610815 319128 -271739 -780727 -832383 -435069
35523 -435069 -63796 -186592 -623887 -691047 -152459 377175 303119 -112196 -251806 -91817
35513 -91817 -47843 -173793 -196989 -171113 -380861 -669840 -568876 -99198 230394 260761
35503 260761 320298 456074 288710 -168962 -313030 90903 438226 210386 -236625 -310741
35493 -310741 -88931 -14182 -90147 14953 304337 444195 291718 7194 -232479 -287111
35483 -287111 -11299 479263 709902 413633 -5959 -18907 207503 53459 -562950 -998902
35473 -998902 -774254 -169812 240047 285659 205775 203217 245489 216615 99543 -1254 15046
35462 15046 107480 138370 71731 3333 -48063 -180188 -331728 -222072 218169 598572 556059
35451 556059 299426 306222 611310 802532 664229 404336 225927 84422 -42965 -24581
35441 -24581 145445 250705 193202 160853 302325 479759 499085 368280 191203 28560
35431 28560 -1080 266462 736376 981000 700176 112889 -300405 -316709 -71773 199778
35421 199778 332884 270517 128568 125317 296727 421290 388428 443266 806968 1228665
35411 1228665 1272915 977139 826143 1045097 1343201 1538798 2033872 3257327 4806338
35402 4806338 5609600 5053524 3642477 2367872 1661238 1237757 809256 523071 591172
35393 591172 848750 973667 950071 984860 1049873 863561 368824 -85245 -165707 68108
35383 68108 336852 489457 540382 533630 527891 595069 705057 719184 592931 461099 438069
35372 438069 474321 487444 472424 411487 271793 164588 257686 435087 356843 14837 -136493
35361 -136493 140183 439085 342884 124130 305214 775356 945173 664349 375942 361499
35351 361499 422436 395337 426395 576649 655808 634106 752338 1023592 1087672 791430 462289
35340 462289 351401 270097 80439 58818 368620 622121 460405 194275 319900 693870
35330 693870 780171 511848 305019 339660 420625 489164 672976 823104 600851 114478
35320 114478 -98737 122540 307738 103139 -227673 -314526 -231857 -213650 -201924 -39509
35310 -39509 180843 302179 396982 565272 670840 588608 494824 591552 749985 760220 727499
35299 727499 842681 947220 771590 486667 522820 852845 954061 587071 159804 121672
35289 121672 370981 517835 447226 334827 292433 274747 243305 208338 165194 138853 220651
35278 220651 433035 636192 683509 585283 420446 201568 -54629 -248359 -329742 -387406
35268 -387406 -450570 -345112 43248 481055 619781 454855 293064 298767 356410 390231
35258 390231 507405 731968 878723 838722 759007 777931 791102 665449 503284 484099
35248 484099 586520 674724 732401 794034 768898 587265 425932 499310 673925 607358 292067
35237 292067 137561 402584 827304 999176 859603 644770 499716 395772 338370 408696
35227 408696 597626 782957 896298 968339 990501 893788 734216 742991 1034651 1339200
35217 1339200 1230206 671062 161750 194268 659672 992134 873739 559492 441368 549079
35207 549079 673075 773355 962776 1168112 1141200 852934 589665 539861 520829 287927
35197 287927 -60094 -196723 -1226 325102 558210 694744 855344 1063767 1204190 1164883
35187 1164883 967032 740538 597706 558633 591942 674252 779133 854833 864235 822101 761313
35176 761313 701922 676876 720390 799740 850468 912960 1093239 1318500 1316354 979920 574456
35165 574456 393688 394155 406868 508239 841015 1225864 1373169 1394810 1624050 1931285
35155 1931285 1767980 1040082 411245 450494 906660 1165896 1061826 843001 642193 437160
35145 437160 363025 612272 1072518 1414703 1510371 1473088 1351667 1104846 865373 907275
35135 907275 1272716 1648158 1685731 1321982 780936 389078 350851 566149 708638 608655
35125 608655 481289 627773 1006311 1292045 1299684 1145299 1017271 973446 969454 946809 883822
35114 883822 834918 874211 949665 911419 759952 697208 810937 902899 799117 625855 561762
35103 561762 524639 377131 249612 325728 460755 395453 255159 414894 868464 1143578
35093 1143578 940663 516196 297134 384639 579604 685776 654614 584123 657717 942536
35083 942536 1211965 1149140 783176 536259 737811 1227969 1542570 1404834 958453 565120
35073 565120 429798 444390 419888 401323 576417 870115 913096 563804 191287 192584 457943
35062 457943 617310 618326 688301 848223 867685 677475 476162 420389 507522 750296 1163714
35051 1163714 1574078 1718899 1545965 1198112 783744 420447 364927 731463 1166904 1201094
35041 1201094 876238 639449 664660 714170 644244 573391 520003 346118 123919 93261
35031 93261 184693 69510 -228458 -296399 -45829 91566 -97395 -219175 62397 459580
35021 459580 528824 303885 88860 -33501 -118139 -83967 120192 327319 428133 568367
35011 568367 798164 841407 536979 204892 210772 423186 460759 248785 -10374 -197451
35001 -197451 -278085 -172914 50312 95353 -123793 -228680 78594 498500 579911 409334
34991 409334 367060 426982 263589 -74343 -187230 -6623 101611 -13683 -46543 205415
34981 205415 469958 413918 122943 -59684 7431 140300 79547 -217728 -500419 -470196
34971 -470196 -150529 119569 144055 105985 183377 210148 14758 -166625 -24138 265163
34961 265163 274016 12592 -107951 46924 201204 231270 336961 543707 552411 288615
34951 288615 130233 315065 537011 461488 281948 366671 624938 672538 474573 366854
34941 366854 464950 477135 200918 -137793 -221317 -79003 27383 16888 48288 195239
34931 195239 285976 150685 -110695 -230634 -80656 232031 531126 716837 765367 711844
34921 711844 650451 647698 645608 551066 407049 338736 337470 269212 113563 1466 -25473
34910 -25473 -80391 -184061 -177957 2700 186083 232496 236795 303587 326772 183486 -31403
34899 -31403 -156581 -184824 -158118 -36824 130956 129663 -86364 -190740 78452 462053
34889 462053 497375 152680 -210264 -395501 -500935 -535491 -325787 128201 542333 692962
34879 692962 617114 410652 90318 -263064 -467903 -458396 -359548 -273801 -162345 3844
34869 3844 146044 200343 199905 184669 152449 131495 182790 302943 419464 483973 493286 459485
34857 459485 440237 515707 634413 603506 371232 175530 228533 404386 466418 447454 518632
34846 518632 617966 558289 424544 481880 697724 734666 470477 171832 60073 27137
34836 27137 -102584 -322012 -575367 -862185 -1070763 -979649 -596493 -258700 -208160 -266287
34826 -266287 -129945 176595 359734 258541 -11309 -262509 -417779 -493480 -521003 -517796
34816 -517796 -496894 -475211 -439655 -303583 12537 401129 590000 463331 236901 148772
34806 148772 106657 -120502 -458721 -577706 -371841 -104728 -32159 -131809 -259945 -340114
34796 -340114 -329266 -207468 -61586 10896 98619 344929 604764 530601 91851 -287548
34786 -287548 -273184 -56599 -52798 -347799 -647189 -648369 -297841 214624 572029 536184 176864
34775 176864 -167130 -247422 -149729 -107132 -176402 -206989 -67884 184353 339877 217436
34765 217436 -134803 -430347 -421047 -161368 105768 269879 390333 458005 362859 139161
34755 139161 5570 58873 121807 15581 -179097 -262917 -190949 -79908 -39097 -97114 -216609
34744 -216609 -304667 -286479 -218295 -229629 -315085 -315807 -173060 -58161 -141476 -342534 -438538
34733 -438538 -357743 -244524 -253495 -369971 -443247 -349849 -108798 150852 316709 361392 302329
34722 302329 174075 66692 92841 246502 375982 371631 299282 279832 339128 448373 577548
34711 577548 615201 403647 -6712 -312702 -343144 -309239 -455709 -646942 -586418 -312002
34701 -312002 -149425 -235847 -389503 -424003 -326010 -145737 49130 148183 143651 222795 492710
34690 492710 737100 708919 513377 387967 276759 17420 -208226 -92832 218980 294720
34680 294720 129653 149209 454072 628781 432419 141627 21666 -35424 -125921 -80426
34670 -80426 140506 252249 135573 89377 285087 392022 111775 -289245 -381373 -196457
34660 -196457 -53202 -22214 35775 109059 92389 41965 47746 17342 -122219 -205581 -108085
34649 -108085 -21316 -126954 -231870 -100481 78110 -8144 -212188 -144986 135020 193248
34639 193248 -16201 -13863 419000 805830 620016 24021 -382082 -357703 -220141 -301608
34629 -301608 -522965 -598412 -457963 -296804 -278796 -358976 -411015 -378440 -234697 56811
34619 56811 413811 590177 436948 130079 -40515 -33778 -16980 -56813 -102435 -205707 -455806
34608 -455806 -711933 -715202 -488761 -318745 -305711 -262215 -110750 -30129 -96816 -118607 26439
34597 26439 180178 175160 52049 -92307 -197775 -128658 189413 466661 295090 -215527
34587 -215527 -514504 -441591 -424515 -634459 -588217 276 577983 542555 196381 238535
34577 238535 645023 786818 484593 211537 252383 317428 119365 -184290 -301703 -191696
34567 -191696 -2300 103748 8185 -226679 -295583 -9209 321052 194620 -379947 -848254
34557 -848254 -820800 -484135 -214124 -103196 -32253 39844 61704 30145 -11647 -52836 -100349
34546 -100349 -126089 -80569 50663 205346 270912 215529 184638 342481 596614 647692 379671
34535 379671 24573 -153401 -156773 -126599 -102483 -55076 -6707 12979 14364 -10945 -45261
34524 -45261 54399 361612 598686 410453 -40211 -196389 57774 200956 -67009 -332148
34514 -332148 -192224 67693 12162 -213919 -266496 -293492 -578650 -823729 -534124 62007
34504 62007 235623 -151927 -488779 -383495 -134239 -103791 -216688 -273707 -289744 -316986
34494 -316986 -301426 -258992 -276419 -269238 -70864 208009 275205 143401 135977 358156 550963
34483 550963 546183 493053 535920 597837 569384 423941 115865 -344576 -736830 -868216 -894039
34472 -894039 -1028055 -1057474 -646776 -41385 144043 -134066 -273465 -19521 148973 -110548
34462 -110548 -406912 -289861 31995 118240 -11383 -108729 -237345 -539257 -750054 -517860
34452 -517860 -40692 162469 42156 53050 378033 622790 448210 108175 86315 426572
34442 426572 712843 641780 368616 227524 275488 267408 40489 -257331 -397305 -385914
34432 -385914 -403902 -505658 -548533 -417542 -192418 -65653 -149377 -350588 -431737 -282828
34422 -282828 -127205 -278629 -672590 -904498 -812780 -678879 -683002 -585819 -264410 -118583
34412 -118583 -451330 -818434 -618915 -69926 110417 -163879 -300322 -86479 13336 -249001
34402 -249001 -492482 -443756 -372542 -451619 -355063 61530 281301 -119422 -694864 -702666 -150462
34391 -150462 295716 265341 30375 -27057 131866 297301 286844 110129 -26557 40921
34381 40921 161574 50104 -234225 -331191 -183503 -157669 -373800 -400736 55922 609864
34371 609864 750141 552523 378544 221003 -116269 -458451 -455736 -181366 -2492 25399
34361 25399 123227 256155 173592 -68972 -152784 -46194 -1257 -12367 162747 399368 239158
34350 239158 -305950 -591743 -283938 85196 -79970 -529094 -579651 -137999 260276 293209
34340 293209 179730 151773 110125 -28081 -39629 272058 686299 786297 476374 66712
34330 66712 -111263 -2912 224655 363421 274141 -35454 -379273 -525486 -407143 -149639
34320 -149639 100902 276475 324727 210382 39420 23491 207863 365875 301517 139048
34310 139048 135693 291278 357311 218252 57702 92088 287937 424121 357475 167205
34300 167205 62196 160512 362693 484282 502398 553329 653919 596438 242039 -217639
34290 -217639 -443117 -302441 63100 404350 489065 233045 -145216 -276047 -94584 72974
34280 72974 42216 70581 340989 502872 185416 -313996 -425879 -212920 -228156 -532505
34270 -532505 -574266 -166138 120779 -168815 -700471 -934147 -893451 -898150 -898107 -585268 10346
34259 10346 485434 587105 466334 406394 482020 495396 203840 -321761 -615263 -299606
34249 -299606 383714 825723 818406 696327 688217 613158 373946 238200 336634 341035 9708
34238 9708 -353537 -405950 -360044 -571888 -832043 -647697 -82865 259255 82236 -274180
34228 -274180 -409423 -335564 -261946 -264599 -331062 -478744 -666516 -746361 -623889 -380839 -188653
34217 -188653 -162014 -280022 -376681 -266779 18482 195897 57691 -233387 -321262 -87718
34207 -87718 228439 328392 170614 -4498 71697 384955 599303 437728 68645 -83818
34197 -83818 86582 254369 184283 44769 38141 43173 -103997 -241078 -135249 67286 10270
34186 10270 -334173 -627866 -647243 -512794 -421047 -392999 -338990 -196133 35911 267139
34176 267139 329291 145622 -124262 -236534 -150693 -51214 -91843 -224315 -289570 -208335 -67095
34165 -67095 -25876 -118219 -180132 -75876 44223 -110918 -549847 -919103 -921737 -636945 -333250
34154 -333250 -138649 -12623 99263 204160 261687 188526 -29389 -226672 -222396 -83542
34144 -83542 -15245 -6376 139504 407867 530327 398103 189903 16958 -196954 -393602
34134 -393602 -359564 -175243 -231091 -576764 -723411 -392600 4544 15752 -167698 -131395
34124 -131395 57264 93549 49429 160794 262184 54967 -240055 -143719 257634 392934
34114 392934 100204 -198607 -283731 -452278 -845845 -1048654 -699547 -93977 184125 -21509
34104 -21509 -371830 -490504 -271919 108132 319710 157922 -191274 -324811 -141580 26264
34094 26264 -90922 -320732 -351494 -201651 -131438 -209717 -244351 -126296 -636 -23910 -122077
34083 -122077 -114667 3624 43957 -114224 -353727 -459510 -346939 -91736 182426 357364
34073 357364 352515 240314 254996 509288 750628 612276 104423 -360338 -454658 -239092
34063 -239092 46953 259528 350609 318728 248006 217712 136656 -123291 -422695 -466648 -265314
34052 -265314 -162903 -311968 -446035 -316675 -43337 141954 210227 225058 190401 165306
34042 165306 253577 345710 185879 -168185 -313124 -92927 165638 205449 200565 315889
34032 315889 352937 164325 6090 105297 254504 214409 144116 230521 268995 56740 -152600
34021 -152600 -56156 166804 199288 125019 134309 51751 -287547 -530670 -294799 122357 162045
34010 162045 -112468 -213001 -79633 -28650 -26820 225949 583283 584454 281315 186480 360001
33999 360001 294498 -172412 -545905 -467908 -188856 -32353 32642 62293 -79740 -364601
33989 -364601 -489534 -347856 -192652 -170034 -119972 10252 5568 -191452 -318358 -221362
33979 -221362 -49511 99552 299055 444905 261411 -184888 -442654 -332933 -199131 -303151
33969 -303151 -422224 -287910 -23341 107530 53437 -105884 -267658 -222644 143896 476786
33959 476786 249085 -433582 -845847 -636553 -250046 -119344 -56302 183361 325979 89131
33949 89131 -211892 -141567 128847 150196 -22568 28006 324671 460543 274440 53282
33939 53282 29410 94975 86985 20902 -44579 -113770 -143082 -28815 209009 371321 291006
33928 291006 41081 -109322 45959 409109 632505 502427 221378 160814 380412 603405
33918 603405 644443 590092 516668 322829 -34420 -369409 -467286 -293678 46369 364854
33908 364854 398785 39156 -397332 -429473 -36943 277846 162684 -167686 -330319 -261362
33898 -261362 -105767 81826 286276 415510 452604 517823 603329 492465 145965 -95014
33888 -95014 42586 329476 341491 43674 -224629 -243597 -113012 -8500 15672 -21804
33878 -21804 -87168 -113057 -44328 67803 82011 -99937 -419764 -673532 -670695 -421853 -115594
33867 -115594 119667 300358 376365 174121 -257952 -503190 -295464 26403 -18444 -311064
33857 -311064 -344874 -73551 32425 -200257 -377176 -233207 -39457 -61779 -108282 56532
33847 56532 244495 143152 -203392 -509751 -606640 -457217 -82182 312966 413431 222975
33837 222975 140603 386212 642723 528658 147476 -124924 -159420 -80634 40185 188461
33827 188461 241786 84490 -183719 -341986 -278268 -29806 255589 318885 -28930 -600032
33817 -600032 -921492 -766760 -391608 -144123 -92147 -147549 -269592 -385519 -376177 -293948
33807 -293948 -327392 -421103 -257858 209518 563207 495240 245614 186186 270940 225874 41893
33796 41893 -66450 -34246 23445 46378 62366 81512 113276 163942 126108 -123825 -429876
33785 -429876 -436476 -97362 196428 160772 -24843 -85288 -21562 114855 434015 865744
33775 865744 957500 434283 -286414 -574524 -423397 -383496 -739486 -1151397 -1142130 -644517
33765 -644517 7149 443457 547292 457188 334300 183144 -25260 -169608 -133518 -58999
33755 -58999 -151538 -295715 -228594 -49569 -101002 -333474 -333392 -81783 -75936 -463741 -682526
33744 -682526 -347456 62174 -85487 -615391 -863595 -655940 -408663 -414684 -517106 -431701
33734 -431701 -50361 500939 869722 701767 82527 -443410 -501541 -295725 -188850 -183474
33724 -183474 -81208 137173 376257 609582 755273 649806 360188 197332 224104 148826
33714 148826 -87036 -114068 186223 356870 105090 -186722 -151853 -80592 -312952 -530219
33704 -530219 -313946 57224 84629 -88107 -42320 66279 -146038 -407049 -160520 364223
33694 364223 391325 -146786 -509698 -357884 -172980 -299809 -396941 -135290 247002 415186
33684 415186 403806 328409 137394 -86403 -50033 262317 454624 314943 141032 230335
33674 230335 428091 439165 259262 56418 -88154 -120819 16441 172353 27385 -454490
33664 -454490 -876568 -904424 -669832 -498829 -479250 -510236 -571981 -696734 -788932 -697136 -435191
33653 -435191 -197614 -164341 -346592 -593463 -720561 -663448 -511184 -379455 -301065 -264132
33643 -264132 -268734 -299618 -337309 -420506 -562219 -600704 -352272 47807 228550 91115 -68857
33632 -68857 -53007 -7565 -10600 159979 557274 780297 550301 217138 245251 497757 520306
33621 520306 291753 170012 258160 341669 359310 457906 633809 740739 794632 888703 898470
33610 898470 661146 347311 255050 332600 306205 176935 168761 273760 282610 200130 201867
33599 201867 233859 91813 -129058 -96911 220210 456798 329590 -75668 -481556 -627985
33589 -627985 -389115 53668 280247 134269 -33251 90029 260179 95290 -264138 -396860
33579 -396860 -278942 -192299 -130981 138529 525161 669928 514645 329416 220170 63922
33569 63922 -127030 -213707 -226065 -243878 -117292 268289 624141 620356 427690 409310 486682
33558 486682 350864 92098 40967 174263 247736 295017 415114 362381 639 -188306
33548 -188306 199514 696650 763679 923427 1962433 3447488 4541795 6070167 9820115
33539 9820115 15293007 18993840 18111877 13717638 9199269 6518063 5201305 4203635
33531 4203635 3245655 2456098 1888844 1620901 1683064 1813312 1710749 1458127 1315348 1261554
33521 1261554 1124556 967243 945774 954631 789201 516488 353170 312170 257969 178596
33511 178596 157963 205071 286601 376653 365393 137443 -172741 -277999 -165063 -99284 -143176
33500 -143176 -75003 121110 157094 -6200 -4014 306068 554141 477831 356729 488868
33490 488868 670945 584757 332100 199624 205099 235890 344134 551053 622913 391584
33480 391584 89865 64911 325861 597421 646099 406464 4273 -248468 -153622 29408
33470 29408 -105037 -433609 -424997 -15380 220131 -30089 -340688 -283602 -66383 -54492
33460 -54492 -167291 -171921 -133455 -160401 -118644 12758 -61414 -397137 -520882 -163241 173687
33449 173687 -66264 -589979 -662636 -142306 459004 737786 694504 433804 64316 -205024
33439 -205024 -263908 -280237 -381096 -376332 -124720 104397 29135 -148715 -72304 178553 261450
33428 261450 131601 -5316 -108692 -235066 -233248 40501 339473 297919 -16256 -223977
33418 -223977 -209159 -174945 -213194 -210788 -145529 -136590 -224021 -352903 -491858 -541726 -298656
33407 -298656 208862 536681 322636 -181155 -423430 -276066 -89832 -132198 -327354 -497322
33397 -497322 -531754 -350730 9232 295954 282750 86380 36264 270836 635266 892277
33387 892277 866810 506078 -9948 -331642 -296660 -115362 -57199 -111009 -115212 -42211 34911
33376 34911 94144 113128 42621 -18177 158180 552088 779529 572020 164725 -20847
33366 -20847 104355 306350 376810 271712 63211 -81889 -35166 76752 -3496 -255031
33356 -255031 -383773 -317456 -328068 -515517 -570748 -278715 114469 291481 280867 238450
33346 238450 153418 23995 -7666 66856 52201 -42617 62675 362196 428744 125438 -75590
33335 -75590 132221 328170 62452 -365319 -387181 -32883 258663 358478 405278 342830
33325 342830 82086 -121206 -12477 164576 59548 -139381 -36432 212356 111203 -323979
33315 -323979 -553987 -330771 29025 197443 183950 106859 17688 -32296 -54017 -173277
33305 -173277 -355263 -279148 174962 568984 460477 65645 -109406 -58089 -142149 -362857
33295 -362857 -371360 -118933 76198 71616 -5233 -140710 -393482 -548161 -362834 -95597
33285 -95597 -192250 -491544 -399317 106392 344806 -24660 -503112 -586665 -491954 -639081
33275 -639081 -899465 -861197 -540226 -327395 -359220 -370904 -166873 100832 208612 188248
33265 188248 229142 350011 341869 89965 -179034 -143280 151923 296774 52788 -317385
33255 -317385 -395606 -134721 116829 32610 -359856 -711143 -687247 -350456 -133669 -271759
33245 -271759 -408456 -105712 386750 391834 -161177 -583609 -478201 -290325 -464407 -675347
33235 -675347 -434378 25903 108136 -208932 -403665 -221728 93542 293353 374004 373000
33225 373000 294507 210202 157001 26718 -202063 -289941 -71019 209656 184087 -156789
33215 -156789 -522086 -704418 -675063 -470833 -204358 -27761 59736 168680 226209 55059
33205 55059 -202207 -199333 -30671 -184050 -649671 -738781 -140759 505061 559827 269659
33195 269659 154842 143520 -28082 -122376 140491 400405 217014 -80299 99977 583962
33185 583962 727596 478166 322811 372881 315769 157403 220576 454662 478212 282980
33175 282980 212549 266165 97477 -286414 -469580 -316754 -140730 -134090 -154036 -105708 -67855
33164 -67855 -26658 98238 204841 165424 108879 164440 128971 -175784 -463185 -392323 -153028
33153 -153028 -99703 -90985 180571 469804 301809 -168858 -345277 -122505 61826 24937
33143 24937 -4781 22327 -90001 -268053 -218001 1351 38856 -124156 -160320 20574 195898
33132 195898 276031 329906 285500 104961 69962 349267 529502 205344 -229829 -115409
33122 -115409 389102 572321 366012 374473 742831 903611 570545 172619 105135 235691
33112 235691 335274 395481 375321 187221 27594 188159 491882 456187 49020 -246694
33102 -246694 -138706 203297 547950 778818 751646 475847 313397 498810 673897 453230
33092 453230 157463 308401 695881 735066 486420 441531 506308 166495 -440219 -620575
33082 -620575 -300402 -127783 -326235 -398713 -126472 50315 -121656 -298550 -225055 -127522
33072 -127522 -215496 -401690 -618637 -826587 -737582 -193312 288158 113745 -358910 -279080
33062 -279080 304864 504091 47301 -369391 -321368 -201994 -286613 -234823 140765 477468
33052 477468 562211 649426 815498 762821 499226 442904 636789 632480 349790 253792 478060
33041 478060 582930 395603 280885 371971 353699 208861 324101 634254 550285 13471
33031 13471 -261121 82892 512454 549102 427118 439278 397631 147897 -47841 4590
33021 4590 144465 274816 479507 613944 434695 178882 284317 551529 431340 107968
33011 107968 294936 912920 1070444 522727 34404 42491 74331 -181252 -326077 -165384
33001 -165384 -114025 -280261 -172511 261868 342593 -145130 -490745 -291528 -119956 -401263
32991 -401263 -617212 -271997 227801 313799 125886 59150 110228 155398 251124 309459 127795
32980 127795 -48577 237167 716849 616766 -30349 -328849 10720 260352 16987 -206835
32970 -206835 -95553 -54540 -202626 -26889 491374 598072 111507 -160866 123742 225210
32960 225210 -247452 -566079 -251995 26163 -290458 -662284 -528018 -260185 -244955 -100624
32950 -100624 378257 579544 197197 -68014 254124 541064 277587 12717 239180 423485
32940 423485 98317 -151972 209330 612469 433444 114673 209021 283724 -141840 -497113
32930 -497113 -136350 419679 356643 -59595 -93182 144923 77780 -203293 -197184 75938
32920 75938 255780 308455 328388 192752 -23497 83117 475417 541317 183115 117168
32910 117168 579653 777421 244945 -330405 -333965 -193305 -380636 -527933 -322509 -221294
32900 -221294 -475105 -497219 8180 363618 139269 -63067 173014 261326 -154682 -373406
32890 -373406 52633 381125 11430 -419181 -236704 114750 70932 -28869 163343 218393
32880 218393 -90725 -192022 95855 47666 -497597 -545316 306962 983697 725986 297684
32870 297684 440381 642314 452850 494928 1147829 1734262 1932520 2356030 2893461 2389522
32860 2389522 927473 311027 1149038 1713420 990754 444116 1147832 1659464 699657
32851 699657 -398428 -97734 641156 342253 -302462 -52643 446523 165798 -152181
32842 -152181 390004 830055 183736 -486778 -56118 471604 -7096 -426991 349757 1169243
32832 1169243 737773 106076 520462 902940 83251 -613275 234625 1298502 895030
32823 895030 86492 489799 1167907 689468 86092 723318 1472950 1037188 702037 1752653
32813 1752653 2809531 2831606 3671409 6201873 7361374 5046332 2376548 2649021 3746113
32804 3746113 2511937 851690 1824064 3377860 2236272 545200 1951635 4358321
32796 4358321 3704230 1770157 2642971 4560800 3445473 1466269 3221812 6368319
32788 6368319 5694363 3656736 6233386 11011533 11331873 9908535 14731242 23134861
32780 23134861 25781193 26245922 38082580 59899892 75724125 90229316 141646432
32773 141646432 258378929 411091712 524884257 537887398 443387450 287623617
32767 287623617 139746443 52540133 31343058 38705787 37427055 24897364 18863411
32760 18863411 22737641 23236005 15627742 10014252 11595416 12736567 8520527 4963339
32752 4963339 6472887 7971096 5366823 2956189 4407065 5817498 3693832 1570014
32744 1570014 2858726 4410327 2843707 805359 1471971 2625286 1453746 45885
32736 45885 1052699 2533721 1904621 810131 1569475 2645467 1909297 823527 1346859
32727 1346859 2047215 1128171 125100 900366 1982636 1445750 556203 1118719 1928479
32718 1928479 1228644 147508 444688 1215191 913753 373225 863527 1372315 676052
32709 676052 -29960 670564 1680487 1505459 1018394 1493301 1952637 1132722 124758
32700 124758 404140 1075265 678936 -24573 348938 1099172 859281 183795 292945 695711
32690 695711 396498 46554 619550 1312415 965606 253303 354352 766217 490472 62521
32680 62521 374309 784136 383761 -143312 145150 575866 213414 -257914 100214 601478
32670 601478 330297 15536 544860 1021780 381382 -408936 59218 1072344 1046199 260522
32660 260522 125119 639093 745847 436160 441612 536118 81082 -405888 -54830 654972
32650 654972 718777 407268 563697 877553 564445 18691 104188 524011 518563 411907
32640 411907 834760 1217259 734363 -24349 -10678 419774 281066 -171040 -56622 363190
32630 363190 274543 -6589 323989 854197 621993 -68832 -182986 220577 332212 225815
32620 225815 511272 863837 539928 -89526 -100023 343709 432900 298096 584601 944340
32610 944340 564050 -216431 -386315 15421 170990 69150 309201 714613 643714 322241
32600 322241 425358 721669 533231 87792 12518 30204 -372736 -602509 109922 1037682
32590 1037682 943323 192713 76707 516136 386502 -228919 -163622 593052 813652 245286
32580 245286 -31622 364860 564477 191940 -59853 68877 -54951 -567515 -771776 -524330
32570 -524330 -513469 -848976 -801463 -253824 3277 -248829 -277735 153943 349029 71741
32560 71741 20114 454049 663167 304338 27313 237143 412786 212624 135594 486740
32550 486740 722633 450308 151308 293723 534105 382817 -27898 -324380 -421739 -313297
32540 -313297 58677 447008 424783 58215 -162266 -138495 -203696 -329231 -133933 257120
32530 257120 289077 41144 242594 1004384 1506213 1261114 763762 515240 305328 -93002
32520 -93002 -353855 -236802 -82967 -172202 -210332 63695 327523 218245 -43574 -30213
32510 -30213 253956 492235 534607 466873 414502 445329 488586 337872 -38229 -289779 -106538
32499 -106538 297059 488257 424439 336141 229419 -342 -183689 -139938 -95171 -291189
32489 -291189 -454265 -255918 10401 -101058 -356121 -238787 112971 192043 71146 185148
32479 185148 407384 286734 8140 118818 445928 343856 -58787 29260 674547 1054289
32469 1054289 804131 452037 327865 120304 -218836 -203951 174173 175898 -474013 -995869
32459 -995869 -704739 17255 423410 408476 293809 175454 -109 -122523 -88735 11556
32449 11556 103336 207002 234180 87142 -41785 74909 215886 29275 -269959 -178000
32439 -178000 210445 336139 143472 95364 223649 65156 -357102 -431536 -60126 60473
32429 60473 -398869 -811315 -597838 -74607 164560 74322 -88196 -285210 -531307 -640410
32419 -640410 -507562 -300053 -144672 18570 155570 129051 35072 86656 146972 -92801
32409 -92801 -479801 -547444 -294999 -158224 -192376 -18333 356341 450842 190431 87544
32399 87544 332479 462699 204865 -67900 -19673 151872 186445 139091 57717 -134545
32389 -134545 -254399 31801 549524 706540 401847 182615 334045 504259 418359 268246
32379 268246 193660 58615 -83513 -2770 98546 -237750 -804622 -845743 -292027 35974
32369 35974 -247697 -508895 -228696 192686 261875 178910 252622 287205 102972 -11235
32359 -11235 128436 228684 160897 269503 601711 607638 120816 -164393 196849 590108
32349 590108 342295 -181876 -261364 17073 98580 -24647 39626 271714 329585 206653
32339 206653 167536 236131 257452 229566 151213 -147819 -623200 -831754 -539064 -121182
32329 -121182 36059 97632 317369 495716 388610 207418 198727 152590 -145525 -383932
32319 -383932 -195135 206428 389623 371033 402758 431808 292623 144379 217728 377076
32309 377076 362896 207261 47341 -150178 -338906 -261609 72048 216947 -16522 -193176
32299 -193176 466 185133 -19823 -291286 -216548 -99945 -425640 -920942 -930913 -448735
32289 -448735 -31257 104701 194552 300029 265317 204077 382075 652096 588061 174526
32279 174526 -147847 -117740 114252 357216 559921 642771 532263 354621 299521 347707
32269 347707 369506 353233 305776 138727 -92792 -103872 170432 329002 50717 -401722
32259 -401722 -593802 -543309 -522778 -512451 -308181 19935 202276 160377 -4817 -221482
32249 -221482 -360641 -222549 82068 79395 -378122 -751958 -580162 -200697 -183819 -413460
32239 -413460 -365237 -22303 167704 89694 48991 132989 113098 -14434 33629 289568 440736
32228 440736 363208 309532 450767 596530 498336 169425 -178399 -322927 -147679 246615
32218 246615 559888 564900 316985 16999 -193393 -231518 -99582 -6069 -170730 -395890
32208 -395890 -205933 411725 840468 673735 268949 116423 113410 -76240 -343726 -365782
32198 -365782 -233267 -301740 -580469 -738355 -596338 -245350 168974 465678 446823 189843
32188 189843 58203 152327 108238 -254909 -537850 -409346 -169116 -174303 -197944 47989
32178 47989 226921 -78407 -537737 -560047 -283585 -267808 -462947 -367325 -51561 -99566
32168 -99566 -539532 -732432 -445501 -211353 -401417 -669399 -597898 -293468 -49917 83272
32158 83272 142789 85695 -12481 36767 191956 198810 28983 -73916 -33481 -18865 -44362
32147 -44362 71777 288555 326500 147723 15325 362 -115844 -358017 -450262 -321996
32137 -321996 -250524 -336792 -309157 -63263 58868 -183235 -490770 -469088 -213646 -114610
32127 -114610 -277790 -450792 -407529 -155904 166106 410552 480549 410439 361555 452042
32117 452042 606010 619832 386086 56384 -50573 208863 570310 628207 344828 71994
32107 71994 27979 56961 16795 31449 132477 38182 -360530 -636152 -386147 101642 226238
32096 226238 -63209 -270324 -108428 219945 449856 522521 439881 234781 78175 86684
32086 86684 72827 -193581 -568993 -729753 -670876 -618854 -544856 -209476 329585 678854
32076 678854 616760 306276 5897 -117103 63699 516826 904989 882073 524608 197797
32066 197797 77406 87836 168598 257645 164856 -147122 -308022 3269 487468 579419
32056 579419 254781 -20083 -48608 -61815 -145058 -77876 185527 380756 371798 290175 188091
32045 188091 -1211 -121530 102287 533759 669547 335659 -91520 -273008 -286490 -288078
32035 -288078 -222510 -54538 70250 78200 88475 150956 144101 35857 -29067 11503 49063
32024 49063 33518 41101 82021 78330 30084 -22456 -137783 -328245 -398617 -222826 -24397
32013 -24397 -37274 -75819 145559 465091 533976 437640 503097 647973 541545 291275 284289
32002 284289 414904 220022 -203623 -219605 277858 608563 367281 -6170 -44680 49547
31992 49547 -68333 -260901 -256581 -141477 -90162 -15531 155628 248722 201457 265830 553119
31981 553119 775751 728016 607573 567387 389175 -61843 -482030 -594894 -583508 -690018
31971 -690018 -753775 -536450 -183487 11317 12405 -108022 -401381 -786780 -901247 -582399
31961 -582399 -199688 -130825 -201631 -35185 323734 551633 572097 512056 334993 -43377
31951 -43377 -414328 -478632 -318884 -294561 -500471 -659190 -552893 -287611 -94763 -65270
31941 -65270 -123922 -166338 -198217 -328869 -559083 -648319 -387311 44799 257414 159961 -2107
31930 -2107 -88413 -157318 -121345 218785 703624 866871 619386 402904 474912 556648 444371
31919 444371 419537 679362 869716 650508 297445 228850 287795 51462 -392737 -539389
31909 -539389 -212257 252731 503379 470579 249334 16795 -2007 229646 433208 339372
31899 339372 16120 -300662 -503404 -551792 -368281 -23225 226919 302349 409536 579563
31889 579563 483823 9952 -392402 -337802 -88494 -57672 -108668 108350 445226 494269
31879 494269 304203 230541 243230 34507 -283714 -263596 96145 294016 132183 -16502
31869 -16502 112973 278172 204778 -3657 -142201 -193816 -146037 118612 550492 869763
31859 869763 954344 995588 1113428 1131202 917353 651067 531568 481716 363567 257066
31849 257066 282121 329720 220656 4935 -122609 -112391 -65786 -28668 29512 90648 135375
31838 135375 278474 642253 1068093 1167621 781201 237266 -14121 57136 88352 -133075
31828 -133075 -410261 -500227 -461793 -429972 -284627 111491 481848 371918 -172726 -578886
31818 -578886 -501104 -215416 -92604 -71861 61144 201248 103439 -155220 -256554 -97265
31808 -97265 134700 288179 392685 487542 514546 402399 151450 -141694 -299762 -209112
31798 -209112 10282 134447 163865 286862 463480 380524 -21487 -337045 -274664 -114758
31788 -114758 -247108 -539547 -578652 -325716 -91386 185 70202 89031 -119892 -471316
31778 -471316 -624540 -460569 -211302 -56695 79898 256071 337448 225783 32298 -84240
31768 -84240 -80178 28929 212094 361241 343930 162721 -51301 -194200 -230808 -153060 -42307
31757 -42307 -71602 -261234 -355338 -178422 18607 -121171 -494340 -659287 -482320 -258214
31747 -258214 -166402 -46291 171719 255615 120019 90531 396255 708237 578272 136450
31737 136450 -79615 93277 270717 166554 -6528 42767 203904 190516 30655 -9677
31727 -9677 94988 82566 -128211 -251157 -62002 242450 319172 128813 -101622 -211905
31717 -211905 -178041 8308 267002 349801 120634 -172988 -209476 -79914 -105912 -243937
31707 -243937 -119120 321621 664713 662215 552060 549476 460779 99163 -279048 -300424 15452
31696 15452 372393 604918 701852 641334 470791 363884 370590 314833 139922 93324 327546
31685 327546 591375 598733 447873 381471 383746 324573 257155 255165 198630 35672 -17689
31674 -17689 121951 120322 -246747 -596861 -475257 -118898 -114697 -480193 -690839 -524534
31664 -524534 -267801 -100447 119971 387919 423960 174841 -13472 115310 426879 689866
31654 689866 827575 803045 598296 379130 356332 443046 377862 188039 149157 273914
31644 273914 270375 70150 -41625 60909 119967 -59679 -309994 -407634 -352628 -199407
31634 -199407 63681 325118 352136 117467 -155546 -346301 -508292 -543503 -232792 284073
31624 284073 509211 275610 13458 75009 206484 26874 -321563 -408697 -176380 28575
31614 28575 -28778 -228344 -314461 -160209 124182 246446 32135 -272493 -230509 170536
31604 170536 441968 283329 5535 26292 271577 398425 336869 241259 116047 -111195
31594 -111195 -284641 -189363 45927 93351 -54950 -80121 124457 259934 70888 -298539
31584 -298539 -538354 -547987 -430290 -272924 -97442 61018 158695 194401 174883 68347
31574 68347 -129146 -307554 -313517 -130075 73314 110156 -40991 -262879 -451179 -550612
31564 -550612 -489255 -244109 -150 -49614 -409648 -696128 -553346 -110076 171144 34643
31554 34643 -339638 -584930 -469921 -41688 395052 510537 302322 109119 135889 159992
31544 159992 -58938 -304548 -208664 124549 244149 43524 -136254 -107027 -65730 -142531
31534 -142531 -182670 -130472 -187812 -383289 -396599 -65269 306680 421869 417384 509461 551309
31523 551309 333308 62670 113466 443311 651832 545551 306434 142480 71904 44344
31513 44344 29200 -20307 -111346 -149350 -75390 12934 21638 19983 69168 41409 -163241 -356478
31501 -356478 -295699 -88981 -65925 -275986 -414712 -275632 553 197944 298962 369550
31491 369550 370674 242070 53522 -82206 -188445 -373426 -601544 -646137 -353767 102172
31481 102172 354524 255781 44703 20931 163891 214785 53913 -187279 -345009 -351507
31471 -351507 -168004 181326 493704 539797 371042 246742 224956 99534 -194912 -430340
31461 -430340 -460675 -429809 -429307 -277280 106027 398731 282795 -63513 -214969 -83826
31451 -83826 74365 114239 123274 165647 217913 315811 480317 541395 319301 -45725 -216965
31440 -216965 -94990 128598 311382 463810 532556 406098 183998 135523 298782 388979
31430 388979 210348 -89245 -293087 -403458 -499923 -522049 -390776 -203917 -115904 -106424
31420 -106424 -36683 112393 201815 119481 -96873 -308438 -368873 -187925 205556 628473
31410 628473 819962 627703 167302 -223686 -270829 -36602 152783 85553 -120133 -232996
31400 -232996 -217437 -201750 -235011 -245287 -201078 -153464 -127314 -110209 -137591 -246182 -347583
31389 -347583 -294776 -84292 142860 304272 434132 532509 524783 414111 320050 301326 268471
31378 268471 136893 -40311 -141615 -85722 137474 417991 516174 289320 -45214 -95155
31368 -95155 185795 407362 302262 111113 185578 444101 538329 401641 259726 164005
31358 164005 -75951 -442772 -583630 -297219 155587 426140 510352 590375 678556 689874
31348 689874 688450 757988 751336 492611 154765 92609 315245 476551 428822 414157 582877
31337 582877 688812 496889 205386 173298 419673 674443 783776 790486 723336 587064
31327 587064 491636 521341 518891 260346 -180712 -498407 -566059 -519763 -441085 -261046 -32518
31316 -32518 16697 -158886 -277151 -125786 104819 106239 -74163 -91063 208295 568270
31306 568270 652146 450518 255951 256802 276044 24932 -427971 -644719 -361923 157989
31296 157989 502419 643479 814903 1002712 950185 649226 417749 402660 384595 217535
31286 217535 90144 139977 162697 -3737 -114744 90942 363851 235068 -269409 -633592
31276 -633592 -578545 -392258 -423156 -568608 -475140 -62314 369510 499972 309827 37043
31266 37043 -101314 -99225 -89278 -134582 -158553 -81968 50141 119886 65198 -66699 -146334
31255 -146334 -49802 199091 392531 368179 263230 367361 701158 948209 878316 620021
31245 620021 395861 215605 17539 -87666 35697 279041 408837 379940 315631 248126
31235 248126 108585 -60752 -108180 6131 164873 269078 306115 260974 121027 -35716
31225 -35716 -100120 -68175 7611 155181 410847 648938 668376 449395 162808 -72995
31215 -72995 -283381 -486688 -616836 -617945 -488380 -242462 38320 163163 24542 -196874
31205 -196874 -226054 -74315 7463 -46868 -26335 163102 313501 267166 178218 213770 225295
31194 225295 -14736 -401780 -606819 -514672 -293869 -78469 149019 352190 388462 244925
31184 244925 112462 111937 114768 -36907 -268515 -381123 -332303 -257926 -259033 -306024 -340443
31173 -340443 -345453 -299296 -160690 65320 313849 533861 715517 828251 799643 599677
31163 599677 315801 109119 82859 167310 136135 -177269 -620608 -784286 -453728 81060
31153 81060 346656 253675 102713 51291 -88274 -413608 -646772 -544856 -337728 -418348
31143 -418348 -745124 -907732 -731309 -473233 -399566 -468646 -505664 -444942 -317899 -203359
31133 -203359 -253605 -571541 -992434 -1173846 -978516 -609259 -318844 -167478 -115140 -143472
31123 -143472 -191937 -157827 -66475 -82192 -249900 -378784 -291421 -61105 96223 63006 -108046
31112 -108046 -255369 -215217 1852 142930 0 -243050 -195953 173076 448002 342295
31102 342295 70344 -29789 24836 -3061 -156989 -264185 -213103 -45527 146622 265822
31092 265822 247331 175879 244666 485177 676947 637317 447208 285340 221042 279038 486147
31081 486147 710571 694102 418628 193478 184667 141343 -150571 -438411 -381930 -124107
31071 -124107 -70595 -258431 -371236 -288225 -190326 -158216 -85564 -10636 -136619 -453774 -690534
31060 -690534 -715486 -660285 -573914 -313271 91194 308381 156247 -88735 -63371 197005
31050 197005 369417 297124 120315 41815 141157 365992 564640 564957 330026 5665 -247869
31039 -247869 -396689 -436152 -275056 119786 518183 571117 223379 -164565 -220851 2083
31029 2083 137617 -1360 -231553 -328263 -326537 -363749 -411909 -374168 -306671 -294007 -217677
31018 -217677 42060 247032 28759 -500071 -767277 -496066 -55862 120882 95207 137983
31008 137983 235067 213834 103732 13221 -156874 -515196 -836911 -783136 -398834 -82446
30998 -82446 -92006 -326828 -549374 -602459 -463302 -273661 -242934 -367945 -377601 -110157 236488
30987 236488 413282 461017 522372 552440 485621 454708 541515 540263 294932 39938 55374
30976 55374 218078 263991 240135 288333 262510 38579 -80541 174957 447666 259655
30966 259655 -122852 -72640 308706 314897 -181267 -535014 -422929 -266361 -335614 -263499
30956 -263499 191199 630959 684104 544689 451504 252549 -91339 -197075 63601 181048
30946 181048 -155340 -416570 -63669 494558 495018 -16666 -361838 -289803 -120502 -11984
30936 -11984 170200 320180 132151 -286619 -454627 -254233 -97835 -254020 -497156 -570071
30926 -570071 -566211 -667033 -825010 -880720 -775615 -558961 -363730 -370520 -586214 -720160
30916 -720160 -545438 -301524 -397146 -755809 -850435 -435458 124490 354695 174702 -207134
30906 -207134 -589351 -808611 -738201 -448881 -202415 -138922 -113893 36351 210260 162546
30896 162546 -166426 -554678 -724438 -637447 -554196 -729061 -1029451 -1021828 -543632 7120
30886 7120 152703 -78994 -314807 -402558 -458064 -469056 -292601 -41472 -33473 -277200 -417121
30875 -417121 -304550 -207470 -280739 -254890 76959 448015 546359 536001 732176 993987
30865 993987 921340 547139 346572 536186 792887 771932 542774 365229 337093 429465
30855 429465 599545 674518 372521 -313272 -935305 -1053667 -741972 -388829 -149095 90313
30845 90313 311670 340505 230643 264137 447913 396916 -71907 -574011 -667490 -439683
30835 -439683 -258337 -200496 -133112 -152140 -441836 -786483 -756743 -415405 -309080 -620262
30825 -620262 -843913 -565228 -97214 23810 -182086 -294885 -188764 -118334 -229950 -402142
30815 -402142 -540475 -674946 -752003 -633596 -342144 -62383 125367 293418 441800 458199
30805 458199 336829 227919 228518 309036 463363 715898 937796 892664 571053 276627
30795 276627 231881 257296 32681 -404203 -629954 -346071 222746 556670 432318 150262
30785 150262 105070 262260 259076 -29098 -315013 -377389 -408475 -658806 -978518 -1032741 -822597
30774 -822597 -632373 -533421 -330134 -10357 150210 41316 -91081 -83922 -149933 -473008
30764 -473008 -783398 -668204 -152673 346178 559083 552294 423105 145186 -211861 -394957
30754 -394957 -262405 2314 122339 56266 -47184 -127169 -261020 -451639 -542253 -426028
30744 -426028 -238745 -217648 -379765 -456850 -216945 214763 460191 304410 -101349 -475741
30734 -475741 -706703 -813841 -745863 -430068 -3330 234966 179494 47545 45396 87471
30724 87471 14381 -74446 41565 315297 459991 366060 222806 177744 144648 56114 42109
30713 42109 172506 235445 14442 -335785 -428298 -120831 312992 465278 150879 -439392
30703 -439392 -853008 -758863 -314644 -10594 -61686 -179983 -89053 46133 -20212 -132323
30693 -132323 -27262 123087 -18688 -278386 -154386 319105 510084 139015 -292250 -291356
30683 -291356 -68894 -61149 -197471 -126790 108909 137654 -122337 -346663 -296630 -84526
30673 -84526 80144 146676 177282 226403 308665 389965 417665 407731 427238 453807 392999 293765
30661 293765 356887 622360 846200 827782 665445 532906 409510 223321 63523 27651
30651 27651 23984 -56972 -137845 -137048 -174222 -344089 -462792 -330818 -104147 -87254 -257562
30640 -257562 -318586 -168112 2436 55885 56346 49673 -32858 -192466 -290733 -220358 -13201
30629 -13201 230096 401057 409223 272079 132508 83171 64367 38864 112268 318544 453196
30618 453196 333868 87495 -41506 -31337 -6824 20907 81049 58253 -133344 -316268
30608 -316268 -273009 -78767 66741 180187 347660 411653 193249 -109074 -157174 4320
30598 4320 97950 164384 449284 807096 801919 448630 272398 495615 718967 610395 383148
30587 383148 319757 302891 154049 37101 161894 392048 475897 413570 322661 204870
30577 204870 103750 208069 520441 706408 566228 372342 419120 525022 357890 5548
30567 5548 -193250 -195007 -202443 -215983 -75940 129366 130302 -68828 -190139 -132527 -46839 41821
30555 41821 284673 616336 706340 445614 140382 43514 -59 -213175 -452420 -411108
30545 -411108 -114891 79416 -46829 -332977 -491844 -432965 -273352 -141975 -68011 -32149
30535 -32149 -47273 -138337 -251108 -249117 -69344 140932 134853 -152144 -495171 -603938 -411775
30524 -411775 -95472 142310 230161 195231 89256 -13222 -34451 16463 34530 -30178 -86350
30513 -86350 -63556 -71303 -233081 -424204 -398748 -175934 -51467 -174817 -380395 -527548
30503 -527548 -704439 -935661 -1019639 -910827 -928732 -1221950 -1333257 -798338 27898 329298
30493 329298 -55370 -476295 -471106 -300833 -320260 -408229 -334955 -212210 -217193 -251638 -216823
30482 -216823 -270225 -467988 -521762 -302390 -217667 -610211 -1095438 -1058186 -583635 -286042
30472 -286042 -335986 -305682 6370 236247 101897 -154589 -218250 -159798 -171772 -203111 -144450
30461 -144450 -94533 -155207 -182599 -16669 212805 256463 74680 -219687 -575225 -899535
30451 -899535 -903077 -390503 329130 656044 397398 -572 -29224 277718 480231 344314
30441 344314 107622 124660 406328 620267 500611 136591 -184961 -321706 -346817 -332507
30431 -332507 -242316 -92555 -52247 -227998 -435314 -373347 -30320 262067 252307 100123
30421 100123 138181 381751 480618 208592 -181851 -263985 -12993 154080 -35659 -311968
30411 -311968 -236629 165444 433318 321667 120432 186382 415631 442921 207683 -8520
30401 -8520 -68077 -142465 -308411 -331360 -75341 151310 -7189 -369746 -411159 -11253 359766
30390 359766 284986 -98729 -398504 -477620 -439717 -318986 -86898 121036 74682 -225405
30380 -225405 -488361 -460915 -204882 -6845 -75022 -339856 -525491 -442286 -216387 -150401
30370 -150401 -338947 -552872 -558068 -384783 -181529 6649 143181 68638 -279709 -625922
30360 -625922 -608312 -240673 111596 187505 45141 -133910 -207422 -65850 269870 536530
30350 536530 478350 227715 160830 342736 433049 233748 -7337 -23800 38473 -114067
30340 -114067 -431584 -592334 -470878 -269750 -197796 -219698 -159527 67706 364273 538870
30330 538870 482178 262886 26452 -162690 -289794 -254664 45773 467857 647038 387769
30320 387769 -87483 -379439 -326195 -110201 -20770 -161254 -357281 -368224 -221536 -218249
30310 -218249 -481435 -671139 -416615 95995 339927 203481 87826 201155 254170 54117
30300 54117 -85877 124594 411886 357467 72985 -13824 136129 173272 -6581 -103025
30290 -103025 66320 282441 284005 112255 -36317 -84607 -80487 -83796 -146101 -297637 -492374
30279 -492374 -633646 -661832 -557867 -312891 7366 232240 244977 121939 3762 -90683
30269 -90683 -188703 -205297 -53336 143571 149961 -73267 -317495 -381309 -251572 -53415 62774
30258 62774 19036 -101783 -122022 -11948 41807 -77928 -218158 -209021 -149678 -206385 -277182
30247 -277182 -157433 62813 106666 -23863 -44405 122215 201191 7890 -272169 -386607
30237 -386607 -344170 -280862 -212435 -99299 -4768 -16042 -94307 -121369 -30923 162804 375837
30226 375837 460001 317696 52900 -107712 -68728 79927 247745 397360 410416 146825
30216 146825 -275343 -490019 -316486 -6874 78117 -118998 -401940 -614202 -708445 -657640
30206 -657640 -493043 -354302 -340536 -377488 -363994 -355552 -447475 -569309 -581152 -511451 -504784
30195 -504784 -567084 -557812 -429536 -286375 -188008 -78687 53684 134012 182415 355456 684502
30184 684502 918272 782936 320618 -166063 -446823 -516454 -480235 -445280 -503209 -660227
30174 -660227 -768562 -669560 -429573 -288202 -335273 -404665 -361193 -308836 -373860 -445426 -340168
30163 -340168 -125198 -43949 -153023 -253589 -191912 -28120 115349 176553 94564 -159508
30153 -159508 -425338 -439515 -185521 31693 -15544 -183529 -206334 -67725 57544 97828
30143 97828 117890 143063 131478 59973 -108045 -446754 -891247 -1140611 -957797 -509148
30133 -509148 -179498 -81488 8329 222198 383680 311472 109205 -5556 -2208 10270 27890
30122 27890 146604 332883 395295 261010 143894 297270 654635 884647 828306 697985
30112 697985 718234 735430 433128 -116684 -410872 -114916 512275 926016 870913 521167
30102 521167 190154 53258 70701 59926 -97355 -267411 -205289 64439 197509 -20961
30092 -20961 -370180 -503863 -386401 -211706 -49410 165056 380664 435945 290259 46861
30082 46861 -222978 -496065 -682251 -680554 -522361 -308861 -72696 141006 166622 -84642
30072 -84642 -394935 -449097 -234751 -10947 72959 84900 77758 19117 -46850 -29073 -5922
30061 -5922 -164239 -483325 -712246 -703274 -540867 -303375 48788 464517 715805 645465
30051 645465 349598 45676 -98832 -4970 239713 331234 38616 -409085 -519406 -216357
30041 -216357 1542 -236847 -639255 -704061 -446123 -280365 -321014 -237068 161881 585989
30031 585989 675571 475555 290007 257353 311463 429471 616232 675677 336426 -289644
30021 -289644 -681455 -553987 -276631 -352509 -684965 -757551 -433480 -106141 -36205 -29593
30011 -29593 81297 106793 -91027 -254352 -110600 208546 418179 460523 381891 187926
30001 187926 112534 583035 1477386 1861614 1081396 -204052 -757120 -319804 263104 332965
29991 332965 61207 -189098 -374636 -485695 -391488 -166874 -53984 7783 276963 588658
29981 588658 475745 5777 -204301 21913 155145 -69923 -204265 30320 194959 -24812
29971 -24812 -177575 126698 418962 139963 -351645 -357716 -2764 36010 -327768 -567774
29961 -567774 -501693 -449403 -495354 -364156 -60767 62834 -43496 -42554 134891 144173 -137185
29950 -137185 -371873 -309545 -90779 116964 318734 419354 239007 -60096 -47384 304130
29940 304130 495320 258657 -30743 26577 254350 256840 35181 -112806 -73958 21357
29930 21357 56598 -11742 -206259 -429461 -455786 -202212 132232 332916 403881 415476 340579
29919 340579 207494 192358 353544 466860 339336 109647 8147 -17873 -177027 -445079
29909 -445079 -574344 -450840 -217505 -51525 5863 7734 33379 146667 307623 361275
29899 361275 223368 28526 -18846 109369 279996 403240 494905 568636 586737 510459
29889 510459 327571 74377 -104578 -15172 341086 655767 609939 256503 -41915 -44150
29879 -44150 152843 330141 399596 371297 227666 -24934 -247176 -262050 -83215 49417
29869 49417 -72808 -371069 -550566 -437002 -171901 -11202 21027 152192 501052 827755
29859 827755 777780 331523 -144396 -330142 -300793 -342517 -520111 -599050 -405591 -99129
29849 -99129 22248 -98193 -225978 -155392 38193 107997 -72428 -377662 -560750 -484946
29839 -484946 -238409 -24057 66196 123114 233042 306321 215026 48500 43718 235401 372840
29828 372840 279978 115584 117897 238863 245671 98426 -19193 -30533 -69909 -185609 -175502
29817 -175502 114328 480285 562557 302920 2199 -92130 -67474 -131638 -275938 -318806
29807 -318806 -216299 -141466 -237597 -450945 -657870 -802356 -821459 -603667 -191129 98934
29797 98934 -14740 -378853 -545420 -338997 -73250 -117223 -423542 -625230 -493913 -149900
29787 -149900 158466 358587 569611 836867 954403 690993 181642 -129828 -55753 67399
29777 67399 -92744 -308443 -150131 252617 321493 -81753 -408504 -234341 169359 345202
29767 345202 295459 259392 212196 23608 -143399 -55436 127830 57876 -220320 -305159 -31228
29756 -31228 334744 480930 327286 -36319 -374331 -345274 114112 506213 298136 -290654
29746 -290654 -512805 -163152 126682 -122484 -499309 -365114 157098 402466 165466 -94199
29736 -94199 -39534 89613 -1760 -116048 107885 540435 648737 237824 -247683 -308990
29726 -308990 -16026 199965 199870 237953 439729 557761 391241 138778 83977 141799 19503
29715 19503 -277967 -415751 -209742 109042 184066 -62756 -382322 -477164 -302751 -112297
29705 -112297 -155984 -334312 -296434 60099 392482 361839 82397 -89674 -51170 16727
29695 16727 -7650 -72782 -108029 -64298 108837 313491 273236 -86060 -391648 -297011 -46364
29684 -46364 -144259 -554971 -723815 -412705 -12949 96771 42337 108661 303020 500761
29674 500761 693393 848688 811643 580000 410362 415050 321730 -91592 -555923 -616927
29664 -616927 -228880 239615 482592 486629 373353 252825 198544 201586 191363 191666 322112
29653 322112 528203 504528 95196 -386700 -495428 -216989 55273 61153 -62575 -69228
29643 -69228 75414 236425 321460 343954 341071 318454 289159 324809 493060 704246 711155
29632 711155 387060 -51391 -264401 -205569 -129116 -195068 -301885 -340653 -352203 -346622 -230871
29621 -230871 -44806 -7624 -153616 -170331 170208 625454 792600 655788 546086 642570
29611 642570 783073 755227 555758 329061 185104 108467 -4403 -197445 -349934 -323050
29601 -323050 -192833 -145044 -135487 60759 387531 443520 69187 -340330 -380867 -186258
29591 -186258 -100127 -104938 -3903 75770 -127392 -460442 -531645 -371215 -367103 -539337 -473596
29580 -473596 -98945 75324 -227210 -547998 -408576 -82306 -139088 -517494 -627304 -264614
29570 -264614 131090 180827 45725 37568 133180 132508 44551 22008 39330 -79013 -325018
29559 -325018 -440602 -254119 72881 230168 99943 -168661 -359397 -380251 -301519 -280806
29549 -280806 -412405 -585242 -558229 -279447 -47074 -173730 -531992 -675698 -453671 -227811
29539 -227811 -326951 -539701 -431229 -10956 267656 162588 -46907 -27619 113372 38597
29529 38597 -268552 -447293 -265010 50686 112333 -114482 -267865 -54824 385474 655928
29519 655928 546166 203982 -79000 -136104 -9246 109832 23542 -267338 -502500 -430055
29509 -430055 -128397 95946 126952 140033 241298 269954 103176 -86855 -100827 -42798
29499 -42798 -116578 -233785 -131003 187844 432590 448167 374081 352091 345328 317600 334577
29488 334577 372667 258963 -39425 -248778 -99642 304158 594099 550817 281232 41381
29478 41381 2602 155286 343229 409412 356488 314174 324090 274868 122830 31424 142022
29467 142022 315930 296112 64727 -164944 -282851 -376422 -468271 -410074 -144242 141209
29457 141209 270276 318293 423188 516159 453587 296154 217147 218341 191568 191461 347121
29446 347121 535618 492999 285068 287227 579950 757403 545056 228868 177852 291550
29436 291550 297361 280444 441906 567932 302556 -162001 -256607 93914 344732 178721
29426 178721 -75727 -73503 21936 -52351 -155249 -15334 301106 541181 638404 627486 429915
29415 429915 48934 -234072 -192013 -6251 31614 -4707 144889 413565 468928 232104
29405 232104 -38860 -182898 -297799 -413522 -340994 -746 332850 313277 -50252 -398556
29395 -398556 -441774 -272665 -202617 -321299 -365561 -130330 153174 118277 -139856 -148924 209328
29384 209328 478038 322692 39748 57775 274562 290425 61073 -109464 -84963 -1078
29374 -1078 69187 185948 308623 305025 183765 74012 15899 -23661 -21847 7710 -68139
29363 -68139 -270591 -362949 -177716 102963 243592 288179 315030 174543 -149264 -256611
29353 -256611 94671 450701 285394 -119162 -103140 286848 436574 255541 242615 451244
29343 451244 332576 -198499 -463102 -129280 226636 116000 -94305 46962 261756 152634
29333 152634 4845 235404 521002 271481 -338486 -593684 -336337 -120474 -295162 -546532
29323 -546532 -433077 55769 543261 596713 70906 -654725 -944426 -639192 -266405 -265759
29313 -265759 -387703 -247928 -45844 -151878 -330204 -83178 427886 547380 145386 -240501
29303 -240501 -299872 -286908 -359963 -260241 132472 497626 583445 547031 564968 552702 486957
29292 486957 563809 791600 837220 534522 168354 3099 -90561 -258750 -288311 40962
29282 40962 509262 715009 592645 384641 258536 197460 135423 16698 -143889 -163954
29272 -163954 120828 495461 514311 149764 -86027 113604 382231 269633 -82217 -253609
29262 -253609 -213748 -207660 -223212 -75238 128760 100977 -125561 -258669 -250373 -296160 -376168
29251 -376168 -263746 -1481 97472 -10376 -2532 257582 496826 507556 445773 471581 469903
29240 469903 353007 296185 411667 488646 339999 147130 160755 280990 250389 82859
29230 82859 -28853 -96124 -284697 -559247 -700956 -650075 -542021 -421921 -210721 40828
29220 40828 157263 141797 190878 320549 257343 -141982 -591807 -712743 -525195 -386004
29210 -386004 -489702 -641905 -565827 -290364 -125685 -271312 -537245 -544258 -203292 132353
29200 132353 96319 -215565 -384433 -238116 -43801 -81585 -262542 -317075 -187011 -36948
29190 -36948 20939 15063 -24356 -103998 -166687 -114026 33170 118208 41449 -110637 -167995
29179 -167995 -54506 151014 277217 181103 -130080 -482448 -680750 -666604 -507461 -286571
29169 -286571 -82333 1026 -88198 -254090 -360950 -421752 -526975 -595103 -419176 -42657
29159 -42657 151113 -80812 -449240 -482515 -165148 79919 31625 -51369 86972 252680
29149 252680 97432 -317556 -554194 -351660 99804 448942 536911 424829 260053 185232
29139 185232 229548 226902 -14435 -407022 -622259 -518582 -339175 -339537 -407401 -273736 35184
29128 35184 233013 212311 169412 258444 371594 364688 307826 365559 532232 621473 496815
29117 496815 243948 99624 190273 336830 217586 -200366 -525478 -397549 41015 354303
29107 354303 391278 357836 369655 312672 197494 250665 489904 573268 309445 1793 -6187
29096 -6187 139753 64981 -247786 -490730 -517043 -445807 -361302 -236854 -117253 -77361 -22554
29085 -22554 197083 498985 653521 621204 543535 448591 261932 78606 98396 276550
29075 276550 358092 294748 301813 435103 450716 218272 -26325 -17391 178681 301542 218779
29064 218779 -14343 -249074 -301111 -85245 231775 387359 374863 425139 596608 648588
29054 648588 410882 20249 -312998 -515758 -535327 -310143 7720 104696 -54438 -141532
29044 -141532 6760 123025 11305 -49365 249182 696349 865014 740355 634933 646495
29034 646495 619990 525369 449845 298163 -72268 -463597 -518505 -286900 -177666 -306646
29024 -306646 -347040 -145706 -34322 -290604 -655422 -687698 -353952 23727 229147 281159
29014 281159 217816 28800 -215419 -370403 -375152 -284078 -148051 32958 237212 386398
29004 386398 411791 329873 247042 284912 473481 710327 834424 725843 352356 -179504
28994 -179504 -582794 -556967 -140551 226183 192695 -32365 49526 521226 899821 745714
28984 745714 156522 -452798 -814866 -891651 -705550 -328114 53084 255316 268778 201711
28974 201711 122358 48736 1259 -49046 -185668 -368531 -363341 -32753 383439 500969 277559
28963 277559 40430 16999 82699 47553 -55060 -114997 -161818 -220182 -125808 229971 576120
28952 576120 518138 110918 -173451 -123521 -62172 -257645 -435015 -222322 192623 309944
28942 309944 91168 -10750 197371 360761 184832 -105069 -164513 -51449 -43525 -173531
28932 -173531 -257560 -236566 -213416 -240619 -283669 -310475 -262646 -65921 194278 294210 226312
28921 226312 289275 603078 808740 571196 135845 -11665 150940 262834 222732 252249
28911 252249 370810 326650 97702 -23452 57364 92842 -12304 -20464 152028 212440 -7725
28900 -7725 -234096 -202305 -57536 -4529 81020 331826 491916 260098 -179592 -378126
28890 -378126 -229295 12957 194962 358058 457583 371673 171590 47808 -21891 -210428
28880 -210428 -460382 -512703 -356030 -298784 -484247 -648834 -532315 -269512 -158657 -223194
28870 -223194 -242787 -126958 -24538 -54936 -112063 -26418 157213 182897 -95487 -462043
28860 -462043 -514381 -109033 468131 831149 893617 841972 796486 663612 342505 -52437
28850 -52437 -276789 -253203 -197546 -352031 -604771 -556235 -88873 329111 198527 -276081
28840 -276081 -421874 -69782 208647 4549 -315686 -266055 -42733 -128583 -418689 -389393
28830 -389393 -672 235575 106270 -14888 131099 276096 155467 -41827 -59409 -11795
28820 -11795 -113378 -289701 -369413 -385958 -392995 -249224 99223 365136 274034 -38172 -287959
28809 -287959 -473861 -701011 -813852 -625677 -339831 -286625 -358192 -186373 181045 304836
28799 304836 84451 -66330 86723 221519 14629 -342315 -480929 -388732 -287008 -224017
28789 -224017 -112873 -1936 -562 -41477 25655 186133 317667 401195 472441 466048 319885
28778 319885 141368 55800 -21388 -237189 -510624 -633059 -592376 -539751 -486398 -324680
28768 -324680 -138108 -167459 -404342 -526787 -367100 -168760 -199552 -346251 -328446 -147631
28758 -147631 -56892 -163973 -325143 -430829 -556749 -748661 -836395 -617001 -161230 208548
28748 208548 276636 172816 171757 309452 342220 123645 -129809 -91311 237399 512555
28738 512555 462878 158952 -147687 -295972 -276112 -167915 -106169 -199399 -392111 -482103
28728 -482103 -343736 -67294 168801 277256 266058 171398 66675 53403 162386 328495
28718 328495 510755 732673 933748 913015 561836 80167 -187379 -117648 89911 165950
28708 165950 42560 -126038 -158038 -48428 27343 -56393 -192795 -201659 -126819 -177111 -356984
28697 -356984 -413325 -257611 -168062 -357898 -581216 -478265 -157198 -64541 -321224 -558079
28687 -558079 -472630 -215964 -75939 -39527 106976 384011 551089 423664 125273 -20489
28677 -20489 171488 532713 701856 520239 190229 -14888 -73712 -118819 -153353 -99418
28667 -99418 -55023 -205523 -453861 -441061 -57342 322986 304009 -18235 -217077 -96443
28657 -96443 128939 182687 65975 -3004 106668 262524 210188 -109582 -445227 -521515
28647 -521515 -393909 -359290 -510755 -583558 -336497 91214 358864 343924 215578 156238
28637 156238 178554 208059 205772 173767 117741 36159 -77536 -210192 -291500 -233559 -53285
28626 -53285 90771 40631 -205414 -507370 -710062 -729446 -579349 -364613 -197412 -75832
28616 -75832 98157 335955 474198 351232 26122 -261222 -330127 -203205 -40445 11681
28606 11681 -66351 -142323 -43888 239707 482438 421551 46826 -360941 -498097 -307754
28596 -307754 28308 309947 474576 557455 582221 535438 401298 168689 -150297 -442832
28586 -442832 -509896 -300468 -89312 -209864 -574448 -703134 -357654 91555 153246 -121714
28576 -121714 -267379 -88307 124414 71887 -171315 -348286 -353519 -258608 -175588 -193491 -318635
28565 -318635 -411360 -302541 -7216 305162 552134 777673 947910 927291 712922 478277
28555 478277 299825 45980 -348729 -684533 -717222 -458264 -141227 20567 -24087 -167422
28545 -167422 -244806 -219825 -247779 -434911 -616047 -582263 -442780 -458021 -566310 -461438
28535 -461438 -155340 -18907 -153599 -188806 85701 337282 238535 -7094 -46448 68134
28525 68134 101098 105668 240119 355304 209578 -87277 -259592 -315475 -395536 -368067 -50928
28514 -50928 314204 321915 51302 -50998 121009 258792 246926 295565 428047 394556 207015
28503 207015 214641 472666 563081 285470 30742 155002 420565 430296 254144 213474 314691
28492 314691 317695 192100 113259 102654 13837 -167286 -283552 -248692 -129354 -26594 -28572
28481 -28572 -195472 -440096 -538367 -424038 -336215 -472832 -637491 -490855 -63961 267215
28471 267215 300406 220072 245610 323768 298433 202987 204107 325912 395694 286114 95471
28460 95471 1450 -9069 -127821 -412157 -637708 -597123 -431412 -451899 -669415 -746808 -477162
28449 -477162 -90850 34019 -187821 -520463 -698041 -624311 -376240 -129539 -33739 -86599
28439 -86599 -167812 -208782 -241903 -275616 -250707 -153516 -36402 116062 391995 761226 1024540
28428 1024540 1029471 810543 462882 35552 -373390 -587523 -544654 -405158 -366481 -457586
28418 -457586 -566165 -553673 -325641 41732 224433 -66928 -653458 -983553 -776748 -326164
28408 -326164 -26565 117193 305453 537443 670576 692627 655546 495473 191553 -41982
28398 -41982 -7570 154328 178364 91105 114786 259161 340492 348295 456987 681915 831494
28387 831494 808675 679834 455748 105903 -209176 -246343 -60040 43661 -15081 5247
28377 5247 198867 312105 181203 39514 146740 367561 383210 141055 -151084 -335261
28367 -335261 -382602 -289693 -121336 -59325 -198100 -375834 -405330 -372038 -466765 -600931 -480083
28356 -480083 -75034 257898 225338 -49419 -253358 -296539 -329793 -455755 -614223 -733188
28346 -733188 -819462 -853816 -733003 -416143 -58354 109668 18984 -198370 -382836 -463582
28336 -463582 -419735 -266956 -123377 -146557 -310699 -364570 -138795 192187 299115 91425
28326 91425 -220572 -407094 -406108 -267833 -93258 -25232 -119064 -199007 -22375 372073 661993
28315 661993 653654 511023 469282 496976 404469 169552 -24460 -30932 115093 273548 330012
28304 330012 276912 227570 304367 467124 531480 413094 245880 171880 136499 28104 -82620
28293 -82620 -21870 216055 447637 535823 496954 383884 217105 41141 -95644 -231763
28283 -231763 -416125 -524342 -330719 160066 608896 687432 426157 111805 -69090 -156179
28273 -156179 -244704 -334318 -364856 -320653 -268204 -298725 -405967 -423144 -173203 270105 579915
28262 579915 542202 341903 341267 618082 888599 891723 681065 477521 375778 303179 186342
28251 186342 48041 -40500 -43370 -9313 -47139 -192970 -293017 -129290 272541 571964
28241 571964 473941 95800 -168453 -128228 9394 -46751 -304086 -519099 -510641 -326093
28231 -326093 -116477 42195 151729 179855 48360 -232419 -484344 -505444 -296601 -74294
28221 -74294 -28630 -117439 -135477 38646 286619 335997 32477 -437279 -664347 -462141
28211 -462141 -125292 -76102 -302367 -402037 -206316 -25549 -118948 -254883 -103890 183149
28201 183149 191097 -96044 -277893 -167434 -22927 -74068 -191377 -180032 -99548 -104462 -188706
28190 -188706 -252812 -251343 -160360 20644 157685 99452 -15214 151347 606538 897359
28180 897359 710844 309409 106601 85635 -22541 -198415 -175147 69788 240730 149899
28170 149899 -68597 -197164 -175634 -99912 -138399 -396787 -715521 -719038 -265445 288294
28160 288294 513327 458249 472478 612402 604246 353693 98680 17498 36771 89502 226712
28149 226712 386656 377098 202386 113302 211188 286912 183818 40624 22201 73997 109384
28138 109384 189063 333211 389608 281660 176049 212709 270944 198130 72022 29983 26806
28127 26806 -22361 -40461 39537 70396 -93494 -316485 -363252 -235534 -90714 43261 212078
28116 212078 316534 240504 118128 185709 415703 568547 562106 514359 463695 349577 253905
28105 253905 335544 493156 419137 68686 -231777 -251013 -127433 -40679 78360 292881
28095 292881 392435 179677 -151803 -244868 -99495 -62982 -310461 -610052 -664363 -467380
28085 -467380 -229119 -115339 -174849 -390966 -657108 -770334 -603679 -284381 -73897 -36563
28075 -36563 54690 395940 823511 949777 614640 62222 -357989 -516690 -465555 -253568
28065 -253568 37767 188300 12370 -359510 -579211 -503934 -338799 -305490 -373358 -429788
28055 -429788 -515177 -696937 -852422 -813706 -660560 -621627 -686352 -569270 -142760 316919
28045 316919 472384 358977 281454 365951 439499 354478 210940 163562 180901 154190 136197
28034 136197 265320 472625 485966 209551 -79372 -65945 186881 348970 290205 211949
28024 211949 288851 408536 385877 260869 213923 292991 397092 456306 452646 325090 62075
28013 62075 -137999 -35703 287692 474466 374330 240520 306458 416953 320256 136332
28003 136332 205786 530852 693297 395356 -154536 -492977 -374474 81118 560371 780496
27993 780496 653086 323585 15056 -173700 -261809 -247551 -126366 -8414 -24736 -114810
27983 -114810 -105189 -5555 2489 -105826 -155186 -125948 -244696 -568499 -777166 -607120 -247393
27972 -247393 -48914 -45743 -33459 60475 175358 332111 544049 629941 420440 67000
27962 67000 -131573 -114059 2313 220958 559029 762656 548213 97245 -99926 83904
27952 83904 284949 232765 75643 46853 168510 368898 545524 453802 -72848 -709638
27942 -709638 -877081 -519361 -200048 -256034 -347364 -109834 237024 309623 170554 91782
27932 91782 53088 -75799 -151329 -26881 48465 -193724 -468589 -280325 286689 664946
27922 664946 644207 573921 692504 776747 596684 282926 56164 -70249 -146140 -126440
27912 -126440 -13634 77116 114632 187943 251601 84634 -363950 -804265 -923919 -716442
27902 -716442 -394575 -149879 -93594 -248945 -465161 -477250 -187910 189567 354397 215803
27892 215803 -71167 -276775 -268644 -99087 52533 86556 107827 256510 462638 498976
27882 498976 260449 -115445 -378036 -339983 -19000 301096 295096 16324 -98884 160207
27872 160207 405354 193187 -282652 -471664 -294117 -181386 -318559 -383161 -148402 132172
27862 132172 135807 -111021 -404677 -619969 -640046 -367991 32942 232785 200672 229828
27852 229828 386045 363647 69526 -124693 11244 168756 51873 -118235 -62043 20530
27842 20530 -128890 -244433 33281 425457 371691 -38656 -167650 171385 476646 407672
27832 407672 256463 366703 604139 680881 600972 497052 347401 140120 59552 222390
27822 222390 411273 330355 1126 -309765 -453638 -501346 -562222 -669836 -796695 -849049
27812 -849049 -689765 -281129 215352 553961 595770 355895 -62257 -506257 -800727 -831740
27802 -831740 -633572 -370469 -207170 -170478 -142118 -28629 83225 39421 -120197 -183195
27792 -183195 -99097 -75845 -205210 -230730 56131 380875 297269 -157232 -496372 -474152
27782 -474152 -357364 -425641 -564183 -532974 -349106 -178822 -61870 40512 94541 101721
27772 101721 207323 474540 666838 504882 85789 -196853 -154534 -5239 -21651 -172821
27762 -172821 -230528 -96696 130652 354992 566578 706366 621559 286772 -44802 -102213
27752 -102213 36098 56326 -109994 -199580 -97425 -71470 -296035 -452061 -187145 236948
27742 236948 246108 -167042 -404807 -192492 -3461 -287637 -730862 -705335 -178145 292986
27732 292986 354078 210100 177122 256052 271229 167184 8939 -150246 -256561 -216298
27722 -216298 -5316 236907 344337 335454 369251 476034 470598 236372 -11729 58043 434141
27711 434141 746386 779736 749555 888091 1003068 760420 261884 -31763 76127 329781
27701 329781 480569 568030 643744 569234 273135 -64786 -271523 -391981 -491651 -506046
27691 -506046 -454909 -522240 -702954 -655713 -193348 332031 467545 279930 175736 260829
27681 260829 279355 113417 -51682 -61556 44413 216215 432284 550751 436583 256827
27671 256827 317987 555083 532323 79856 -394178 -425609 -76093 233362 289368 243178
27661 243178 287528 393446 387402 186913 -75648 -173169 -50893 90939 71791 -6498 52044
27650 52044 171123 94278 -165208 -279142 -93465 139856 173146 123244 197750 297432 183498
27639 183498 -101240 -281559 -264806 -235213 -335376 -490741 -587851 -625220 -620203 -527605 -337578
27628 -337578 -141447 -19596 54230 129923 178529 152607 96029 100705 166871 192752 123093
27617 123093 31060 -3518 -39098 -198737 -463855 -653624 -646415 -519529 -404648 -304550
27607 -304550 -154286 14161 91876 33120 -128496 -343064 -506970 -449040 -133888 172111
27597 172111 151278 -149238 -361736 -280727 -76320 36902 103762 257311 429611 425254
27587 425254 199528 -82470 -222684 -145017 67484 233449 238599 166589 170341 216303 121159
27576 121159 -126578 -288399 -213103 -57295 -37150 -133298 -195765 -190456 -173720 -146641 -99634
27565 -99634 -98885 -182499 -270908 -301940 -328483 -364099 -295631 -91794 88639 164021 278784
27554 278784 458594 377905 -169303 -756608 -732008 -85364 523830 635625 473718 456034
27544 456034 608193 675319 546173 329298 152907 64789 48169 37078 -21878 -102775 -175418
27533 -175418 -292507 -454935 -477254 -220317 107353 170348 -6342 -105615 -65790 -151356
27523 -151356 -399527 -448159 -125689 196491 143944 -100309 -123030 91786 241958 236852
27513 236852 264062 406258 518569 461443 217264 -165793 -536478 -649510 -445177 -216584
27503 -216584 -254832 -438323 -445379 -269312 -206679 -385621 -618688 -713856 -648964 -447238 -159544
27492 -159544 33375 -19296 -174884 -168289 -26895 3970 -59007 79697 457746 706394
27482 706394 608925 439808 508918 685891 670124 475285 307139 140595 -207597 -648096
27472 -648096 -808158 -504533 5315 310183 233822 -88933 -382491 -441274 -284044 -137243
27462 -137243 -190155 -358371 -376597 -146971 91409 6693 -434059 -875524 -911901 -496972
27452 -496972 36882 361601 444604 415670 318731 171777 138237 362548 670456 726259
27442 726259 517016 377970 458565 493950 274094 19658 26454 188338 193275 26173 -50378
27431 -50378 82370 297824 471968 549618 433669 111917 -148746 -53043 284900 471319
27421 471319 406724 377634 517643 564952 321378 -521 -134356 -171847 -317548 -455790
27411 -455790 -315421 50282 298170 286221 222387 292499 413874 441491 392498 352546 338851
27400 338851 379390 567992 878316 1034993 768731 182134 -299638 -372108 -131574 114913
27390 114913 194332 139181 10031 -199605 -458649 -612916 -506280 -183931 90831 68148
27380 68148 -239612 -559777 -619246 -391178 -73943 141335 222055 220475 157841 63763 50844
27369 50844 199708 372052 300884 -57370 -390679 -375983 -76133 152991 114836 -33504
27359 -33504 -63707 10243 7384 -132257 -284810 -356878 -426154 -601477 -820582 -888033 -708323
27348 -708323 -401708 -166102 -86273 -110436 -147492 -128241 -27714 93171 112616 9668
27338 9668 -40656 131910 403989 435669 100603 -304730 -399340 -171556 48415 35680 -59439
27327 -59439 56513 402578 644598 469213 -20771 -386840 -349387 -82035 70044 31783
27317 31783 -12760 28111 65672 81192 192609 398629 492187 336333 32121 -270964 -512335
27306 -512335 -586302 -352288 69659 303377 223187 162923 363704 540104 370143 114634
27296 114634 231725 559207 484675 -87970 -545974 -467791 -161806 -67859 -115420 -35584
27286 -35584 67961 -94009 -439584 -575339 -370367 -139813 -211881 -526023 -731101 -579243
27276 -579243 -178330 122740 101582 -117464 -266617 -271174 -228873 -145827 37100 175896
27266 175896 19260 -341668 -455786 -117239 305235 362367 94112 -140463 -179699 -122717
$$ [...]
##END NTUPLES=NMR SPECTRUM
##END=
