##TITLE=31Pdec_LY-8Dix.3.B
 CD3CN, 24 sc
 30.04.2021
##JCAMPDX= 6.0         $$ Bruker NMR JCAMP-DX V2.0
##DATA TYPE= NMR SPECTRUM
##DATA CLASS= NTUPLES
##ORIGIN= UXNMR, Bruker Analytische Messtechnik GmbH
##OWNER= root
$$ XWIN-NMR		Version 3.5
$$ Fri Apr 30 14:00:27 2021 Russian Standard Time (UT+4h)  she@DPX200
##.OBSERVE FREQUENCY= 81.013821
##.OBSERVE NUCLEUS= ^31P
##.ACQUISITION MODE= SIMULTANEOUS
##.ACQUISITION SCHEME= undefined
##.AVERAGES= 24
##.DIGITISER RES= 16
##SPECTROMETER/DATA SYSTEM= spect
##.PULSE SEQUENCE= zgpg30
##.SOLVENT NAME= CDCl3
##.SHIFT REFERENCE= (INTERNAL, CDCl3, 0, 248.564)
##AUDIT TRAIL= $$ (NUMBER, WHEN, WHO, WHERE, WHAT)
$$ ##TITLE= Audit trail, XWIN-NMR		Version 3.5
$$ ##JCAMPDX= 5.01
$$ ##ORIGIN= Bruker BioSpin GmbH
$$ ##OWNER= she
$$ F:/spectra/data/she/nmr/P31/1/pdata/1/auditp.txt
$$ ##AUDIT TRAIL=  $$ (NUMBER, WHEN, WHO, WHERE, WHAT)
(   1,<2021-04-30 13:59:02.35 +0400>,<she>,<DPX200>,
      <created by zg, POWCHK disabled, PULCHK disabled
       configuration hash MD5:
       00 E9 B6 7A A2 85 ED C7 34 08 36 98 17 FE 4E 26
       data hash MD5: 32K
       BD D5 02 06 16 F0 4B 54 59 09 20 B4 7B DA 71 4F>)
(   2,<2021-04-30 13:59:17.06 +0400>,<she>,<DPX200>,
      <Start of raw data processing
       efp BC_mod = 2 LB = 1 FT_mod = 6 PKNL = 1 PHC0 = -6172.124 PHC1 = -89.79906 SI = 64K 
       data hash MD5: 64K
       A6 EE 8B 7F C0 19 3A DD 71 71 C0 DE 2B FA 38 2C>)
(   3,<2021-04-30 13:59:53.45 +0400>,<she>,<DPX200>,
      <pk PHC0 = -225.7473 PHC1 = 523.2 
       data hash MD5: 64K
       AC C4 9A E9 CB AB 87 CD 68 A9 66 C9 99 DF 14 47>)
(   4,<2021-04-30 14:00:03.09 +0400>,<she>,<DPX200>,
      <abs ABSG = 5 
       data hash MD5: 64K
       A1 D9 C1 93 E4 8A 23 A4 57 4B 7F B2 56 A9 9A A2>)
$$ ##END=
$$ 
$$ hash MD5
$$ DA DD 56 36 2B C6 12 72 27 D7 65 1B A1 1B 00 07
##$RELAX= 
##$RELAX= 
##$RELAX= 
##$RELAX= 
##$RELAX= 
##$RELAX= 
##$RELAX= 
##$RELAX= 
$$ Bruker specific parameters
$$ --------------------------
##$DU= <F:/spectra>
##$EXPNO= 1
##$NAME= <P31>
##$PROCNO= 1
##$TYPE= <nmr>
##$USER= <she>
##$AMP= (0..31)
100 100 100 100 100 100 100 100 100 100 100 100 100 100 100 100 100 100 
100 100 100 100 100 100 100 100 100 100 100 100 100 100 
##$AQSEQ= 0
##$AQ_mod= 1
##$AUNM= <au_zg>
##$AUTOPOS= <>
##$BF1= 81.014009
##$BF2= 200.13
##$BF3= 200.13
##$BF4= 200.13
##$BF5= 200.13
##$BF6= 200.13
##$BF7= 200.13
##$BF8= 200.13
##$BYTORDA= 1
##$CFDGTYP= 0
##$CFRGTYP= 5
##$CHEMSTR= <none>
##$CNST= (0..31)
1 1 145 1 1 1 1 1 1 1 1 1 1 1 1 1 1 1 1 1 1 1 1 1 1 1 1 1 1 1 1 1 
##$CPDPRG= <waltz16>
##$CPDPRG1= <>
##$CPDPRG2= <waltz16>
##$CPDPRG3= <>
##$CPDPRG4= <mlev>
##$CPDPRG5= <mlev>
##$CPDPRG6= <mlev>
##$CPDPRG7= <mlev>
##$CPDPRG8= <mlev>
##$CPDPRGB= <>
##$CPDPRGT= <>
##$D= (0..31)
0 1 0 0 0 0 0 0 0 0 0 0.03 2e-05 3e-06 0 0 0 0 0 0 0 0 0 0 0 0 0 0 0 0 
0 0 
##$DATE= 1619776741
##$DBL= (0..7)
120 120 120 11 120 120 24 19 
##$DBP= (0..7)
150 150 150 150 150 150 150 150 
##$DBP07= 0
##$DBPNAM0= <>
##$DBPNAM1= <>
$$ [...]
##$SUBNAM3= <"">
##$SUBNAM4= <"">
##$SUBNAM5= <"">
##$SUBNAM6= <"">
##$SUBNAM7= <"">
##$SUBNAM8= <"">
##$SUBNAM9= <"">
##$SW= 501.771253377433
##$SWIBOX= (0..15)
0 1 3 0 0 0 0 0 0 0 0 0 0 0 0 0 
##$SW_h= 40650.406504065
##$TD= 32768
##$TD0= 1
##$TE= 0
##$TE2= 300
##$TE3= 300
##$TEG= 300
##$TL= (0..7)
0 120 53 12 22 120 120 120 
##$TP= (0..7)
150 150 150 150 150 150 150 150 
##$TP07= 0
##$TPNAME0= <>
##$TPNAME1= <>
##$TPNAME2= <>
##$TPNAME3= <>
##$TPNAME4= <>
##$TPNAME5= <>
##$TPNAME6= <>
##$TPNAME7= <>
##$TPOAL= (0..7)
0.5 0.5 0.5 0.5 0.5 0.5 0.5 0.5 
##$TPOFFS= (0..7)
0 0 0 0 0 0 0 0 
##$TUNHIN= 0
##$TUNHOUT= 0
##$TUNXOUT= 0
##$USERA1= <user>
##$USERA2= <user>
##$USERA3= <user>
##$USERA4= <user>
##$USERA5= <user>
##$V9= 5
##$VALIST= <valist>
##$VCLIST= <CCCCCCCCCCCCCCC>
##$VD= 0
##$VDLIST= <DDDDDDDDDDDDDDD>
##$VPLIST= <PPPPPPPPPPPPPPP>
##$VTLIST= <TTTTTTTTTTTTTTT>
##$WBST= 1024
##$WBSW= 4
##$XGAIN= (0..3)
0 0 0 0 
##$XL= 0
##$YL= 0
##$YMAX_a= 6693
##$YMIN_a= -16171
##$ZGOPTNS= <>
##$ZL1= 120
##$ZL2= 120
##$ZL3= 120
##$ZL4= 120
##$ABSF1= 248.5645
##$ABSF2= -253.2056
##$ABSG= 5
##$ABSL= 3
##$ALPHA= 0
##$AQORDER= 0
##$ASSFAC= 0
##$ASSFACI= 0
##$ASSFACX= 0
##$ASSWID= 0
##$AUNMP= <proc_1d>
##$AZFE= 0.1
##$AZFW= 0.5
##$BCFW= 0
##$BC_mod= 2
##$BYTORDP= 0
##$COROFFS= 0
##$CY= -3
##$DATMOD= 1
##$DC= 0
##$DFILT= <>
##$DTYPP= 0
##$F1P= 0
##$F2P= 0
##$FCOR= 1
##$FTSIZE= 65536
##$FT_mod= 6
##$GAMMA= 0
##$GB= 0
##$INTBC= 1
##$INTSCL= 5.30512e-09
##$ISEN= 30
##$LB= 1
##$LEV0= 0
##$LPBIN= 0
##$MAXI= 10000
##$MC2= 0
##$MEAN= 0
##$ME_mod= 0
##$MI= 50
##$NCOEF= 0
##$NC_proc= -3
##$NLEV= 6
##$NOISF1= 182.463
##$NOISF2= 159.3651
##$NSP= 0
##$NTH_PI= 0
##$NZP= 0
##$OFFSET= 248.5645
##$PC= 4
##$PHC0= -6397.871
##$PHC1= 433.4009
##$PH_mod= 1
##$PKNL= yes
##$PPARMOD= 0
##$PSCAL= 0
##$PSIGN= 0
##$REVERSE= no
##$SF= 81.014009
##$SI= 65536
##$SIGF1= 159.3651
##$SIGF2= -187.1042
##$SINO= 113.3802
##$SIOLD= 16384
##$SREGLST= <1H.CDCl3>
##$SSB= 0
##$STSI= 65536
##$STSR= 0
##$SW_p= 40650.406504065
##$SYMM= 0
##$S_DEV= 0
##$TDeff= 32768
##$TDoff= 0
##$TI= <>
##$TILT= no
##$TM1= 0
##$TM2= 0
##$TOPLEV= 0
##$USERP1= <user>
##$USERP2= <user>
##$USERP3= <user>
##$USERP4= <user>
##$USERP5= <user>
##$WDW= 1
##$XDIM= 65536
##$YMAX_p= 561072486
##$YMIN_p= -48906624
$$ End of Bruker specific parameters
$$ ---------------------------------
##NTUPLES= NMR SPECTRUM
##VAR_NAME=  FREQUENCY,     SPECTRUM/REAL,   SPECTRUM/IMAG
##SYMBOL=    X,             R,               I
##VAR_TYPE=  INDEPENDENT,   DEPENDENT,       DEPENDENT
##VAR_FORM=  AFFN,          ASDF,            ASDF
##VAR_DIM=   65536,         65536,           65536
##UNITS=     HZ,            ARBITRARY UNITS, ARBITRARY UNITS
##FACTOR=    0.620285442955139, 1,           1
##FIRST=     20137.2065510759, 0,            0
##LAST=      -20513.1999529892, 0,           0
##MIN=       -20513.1999529892, -48906624,   0
##MAX=       20137.2065510759, 561072486,    0
$$ Real data points
##PAGE= N=1
##DATA TABLE= (X++(R..R)), XYDATA
$$ [...]
35813e22226J54060L8210P4788J88865K29999J66335L7535r7762j57410j24751
35803a2357r7989j21498q6784L1829K2065k26399m02449j53575L16577M44678
35793b85902J01752k23019j23501K20035M03891L33486J61266m4471k80765m11743
35783a48971k79397K1454K01456J33155l099K7976K20827L46594K21749r2823
35773F48921l56619l76863j57967J31363K85714J91167p7139k79778k33191k1136
35763b45528J13358Q4512K8187M3043O4595M9516O5400J05034M2904j06159j40147
35752A04715k4721K337j27065j15744J65229L23993M6645k94891j73431K20747
35742A27814K68901p9768k92215j72577p0351j21759l7247J93832J49623j94105
$$ y = [-522226, -368166, -329956, -255168, -66303, 163696, 330031, 367566, 269804, 112394, -12357, -110346, -231844, -318628, -286799, -264734, -491133, -893582, -1047157, -730580, -285902, -184150, -407169, -530670, -310635, 93256, 426742, 588008, 543537, 262772, -148971, -428368, -406914, -205458, -72303, -75402, -47426, 173401, 519995, 741744, 648921, 292302, -84561, -242528, -111165, 174549, 365716, 288577, 8799, -224392, -245528, -132170, -47658, -19471, 23572, 88167, 137683, 203083, 308117, 351021, 244862, 104715, 79994, 82331, -44734, -160478, 4751, 328744, 375389, 80498, -92933, 127814, 396715, 316947, 24732, -147845, -218196, -339955, -377202, -183370, -33747, -227852]
35732b27852k33170K59240O13671K89141k31588k32376J00202J07424j81493j85946
35722G7253J36362K14096j16217l08031j716M15765M12695J3480l58313m18091
35712F7283k07166L1842N6384j33627k65115j72923o8595j60156k17305O2394
35702a006984M33603L92119j740j86710P725J63141N8749l02J51331J88190o8606
35691A30516k47599o4026J56457M9952j48493n8391J44155N6983k01200j82565
35681c64211J19369K79368J44559j8367o0895j15459j81884n2196K36900L24194
35671C11378O7831k07998k01923m1439J4647j3453K2074N5995p4647k81172k78402
35660f27109K658K71449K25201p6954k83780j63964J41884L21443K68314J38422
$$ y = [-227852, -461022, -201782, 411889, 701030, 469442, 237066, 337268, 444692, 263199, 77253, 213615, 427711, 311494, 3463, 1747, 417512, 830207, 843687, 485374, 67283, -139883, -108041, -51657, -185284, -450399, -623322, -691917, -852073, -1069378, -1006984, -573381, -181262, -183002, -369712, -361987, -198846, -140097, -140399, 10932, 199122, 130516, -117083, -181109, -24652, 25300, -123193, -181584, -37429, 19554, -181646, -364211, -244842, 34526, 179085, 160718, 99823, -15636, -197520, -249716, -12816, 311378, 379209, 171211, -30712, -72151, -57504, -70957, -48883, 7112, -67535, -348707, -627109, -624451, -353002, -127801, -204755, -488535, -652499, -510615, -189172, 79142, 217564]
35650B17564N2950n8275k32466k99620j29408R4360R9878n6687q6185N5488J09737
35639b32664j4757o0680J24262K63685O1152k82492l09174K2406K60215J02825
35629f5222j91476j92456J24337L94534L45997O1281k02183k79938j79876l0276
35619b15278K5532j9566M018K12453M19670L11422q9532l58234k02616J39200
35609B27069K42617P1829o2619k1525J4849p9235j74336j56413j27132j85502
35599b50398k24007j14577O2647J46835J30447J08515R5625M3836l4096q8466
35589a23639j12567j03239l3346N0219L2442n4579J3884L12780N36063L50737
35579H68755j13739l98625l04827q0141k828n2455q6805j03284j56300j72399
$$ y = [217564, 270514, 212239, -20227, -319847, -449255, -354895, -255017, -311704, -397889, -342401, -232664, -247421, -308101, -183839, 79846, 140998, -141494, -450668, -428262, -168047, -65222, -256698, -449154, -324817, 69717, 415714, 476995, 274812, -5126, -185002, -215278, -189746, -209312, -205294, 7159, 426829, 738251, 648719, 290485, 87869, 227069, 469686, 541515, 478896, 457371, 472220, 392985, 218649, 62236, -64896, -250398, -474405, -588982, -526335, -379500, -249053, -140538, -44913, -1077, -35173, -123639, -236206, -339445, -372791, -322572, -290130, -344709, -330825, -18045, 518018, 868755, 755016, 356391, 51564, -28577, -31405, -83860, -170665, -273949, -430249, -602648]
35569f02648l9103J86695L15996K60316J15994J5209j8107m5254j12002k02844
35559a25748k56803k01123o091K49292L92907L13497J08509o76O0804J22802J9434
35548F76804j51403j55783L1360J77942J14262n1563j05112m12J16393Q8737j02889
35537F38336l23475l83188k10489N5899J98643J40978j3365j13079o0801J34120
35527F3579K92225J69047k06206m36001k47271O8888O4313j46258o7360L00010
35517a45034L77921l1703l51726j41834J89810J00507j70286n8732L14527L48371
35507D31821j3730k31978j03781k64r3302p3758J62408K27458n4958k65364q4916
35496a00364J57149O8653j43252r6997O9558J42j70463k4525L68337M98560K15439
$$ y = [-602648, -641751, -455056, -139060, 121256, 237250, 252459, 234352, 189098, 77096, -125748, -382551, -583674, -589765, -340473, 52434, 365931, 474440, 473764, 534568, 657370, 676804, 525401, 369618, 400978, 578920, 693182, 641619, 536507, 536095, 652488, 741225, 638336, 314861, -68327, -278816, -222917, -24274, 116704, 103339, -9740, -70541, 63579, 355804, 524851, 318645, -117356, -364627, -295739, -231426, -377684, -445044, -145034, 232887, 201184, -150542, -292376, -102566, -2059, -172345, -231077, 83450, 431821, 418091, 186113, 82332, 82068, -11234, -84992, 77416, 304874, 249916, -15448, -100364, 56785, 125438, -17814, -114811, -45253, -45111, -215574, -240099, 128238, 626798, 842237]
35485H42237q0826j15249r1819k12827k96640j29094J32631J88217K2869j28577
35475A30922j12662K7352J60752J62559K917j64464j35942M1474Q2748j10801
35465H4855k51348p5139K33585K81643J6832k26833j91198L6819K14626K03651
35455C27493L3969j30694j12652N2994R2002j24430l01271j18223K11491J98103
35445A28782j36194k37767R0120L31720R3035k23931o5217L48451L56268q5489
35435E99778l42578r4935K26728J57895j51859k73895j20640P1328J56451J93145
35425D21418K30974K01962N1751j00501j6658L44848O20729M41796J13017M23044
35415B732380J422460J897390P68184j266185k353305j740481n17879M1994n9626
$$ y = [842237, 761411, 646162, 554343, 341516, 44876, -84218, 48413, 236630, 259499, 130922, 18260, 45612, 206364, 368923, 371840, 207376, 71434, 112908, 195656, 84855, -166493, -241632, -8047, 273596, 290428, 63595, -127603, -90784, 123842, 327493, 361462, 230768, 118116, 171110, 263112, 138682, -162589, -280812, -69321, 128782, -7412, -245179, -155059, 176661, 269696, 45765, -19452, 328999, 685267, 599778, 257200, 162265, 388993, 546888, 395029, 121134, 494, 71822, 228273, 421418, 652392, 854354, 906105, 805604, 788946, 1133794, 1754523, 2196319, 2309336, 2732380, 4154840, 6052230, 6820414, 5554229, 3200924, 1460443, 942564, 984558, 924932]
35406I24932j69814j62822k66928l28904p2652K41635J49652k27830l69888j77212
35396d59831q049j088N2966J97339K00221o381k05469k35292j11439J34844M01234
35385d0945M08127L1811l64650l35910J8192K41103K02053J24666O2112j14404
35375B32155k65944j04169K21440K28333j24890l27280j15625J57032J55725O1095
35365A17872J57611L42477L49776J59530o8664k22633k25041n2887J01908j3553
35355F46396k80254k67875J20155M22703K55328j61664l65331k64760j18528r9621
35345a13451j43426j16234L7163K30061K61766N3163j53668o9684J76155J69474
35335C31319j53131l73750k11691R9431K21745J58952R6207R7464J53735K56303
$$ y = [924932, 755118, 592296, 325368, -3536, -76188, 165447, 315099, 87269, -282619, -459831, -467880, -468968, -416002, -218663, -18442, -24823, -230292, -465584, -577023, -442179, -40945, 367182, 398993, 34343, -301567, -283375, -42272, 159781, 284447, 346559, 232155, -33789, -137958, 83482, 311815, 186925, -140355, -255980, -98948, 56777, 117872, 275483, 617960, 967736, 1127266, 1058602, 835969, 610928, 558041, 659949, 646396, 366142, 98267, 218422, 641125, 896453, 734789, 369458, 104698, -13830, -113451, -256877, -373111, -335948, -105887, 155879, 209042, 55374, -14310, 161845, 331319, 178188, -195562, -407253, -307822, -86077, 72875, 169082, 266546, 420281, 676584]
35325F76584K67291J9593l16465l29200j894J57892j25037m32289k94738R1508
35315b86755K27952Q3427M622N9427o878k26560l05486j16669Q9983Q6555j1268
35304d01650K8864J88067K21930J1425k32162j97885R7665K69559P4406k17150
35294a56931k17502k8647m3499k26445j37951K48255L60058o8961m69374k39849
35284i80846L56680O04243L23280p3803k87141l47087k54850N2345L76562L68561
35274A37944M3618j79414n7571J54133Q9275k32266m42558k82827P4874K06741
35264d88051l3488k71059q9070L37915M43172J09993j52622l0940J18285n8751
35254a14616k67112r1764K27650J70676j65734k11293J30737L38666J21398j81805
$$ y = [676584, 943875, 963468, 647003, 317803, 315909, 473801, 348764, -83525, -378263, -286755, -58803, 24624, 29246, 88673, 81795, -144765, -450251, -566920, -476937, -390382, -401650, -372786, -184719, 37211, 48636, -183526, -381411, -283746, -14187, 60219, -156931, -374433, -403080, -446579, -673024, -810975, -562720, -202662, -271623, -740997, -980846, -624166, -19923, 303357, 229554, -57587, -404674, -659524, -607179, -230617, 137944, 181562, 2148, -55423, 98710, 187985, -44281, -486839, -769666, -694792, -488051, -521539, -792598, -881668, -543753, -100581, 9412, -143210, -174150, -55865, -114616, -381728, -473492, -245842, -75166, -240900, -452193, -321456, 17210, 138608, -43197]
35244d3197k04152n4568J53l4546j1175P5278J42647J67557J33769P945j34148
35233D5563j33906J0554J00795J7430j13607j19508j1260P3134O2096P185j0856
35222g2380J3478N106p9555j63735j46159m6110O8754K23400L91980L20675j30936
35211C84518n20766k39867M95627P16454P7526n23933k63613L21422J90470n12944
35201A24894o77437O901N81499L14166l02486m66775k01416j0918J9329J46213
35191d66030L29757K74648k2398k40351k08877o3931N2118J51739K37006K01542
35181B45223j4360k74978l39280j14974J94747K76741Q6879p8143m01J30916K8804
35170A41174k02300k11664K4724J46112l2529k46439j92155O2720K35896K01739
$$ y = [-43197, -247349, -301917, -301764, -336310, -347485, -272207, -129560, 37997, 171766, 179711, 45563, -88343, -77789, 23006, 40436, -73171, -192679, -203939, -130805, -68709, -61524, -72380, -58902, -53796, -133351, -297086, -443245, -489355, -420601, -197201, 194779, 515454, 384518, -136248, -376115, 119512, 835966, 913492, 389559, 125946, 447368, 637838, 124894, -552543, -545642, 35857, 350023, 47537, -419238, -620654, -631572, -612243, -466030, -136273, 138375, 115977, -124374, -333251, -397182, -345064, -193325, 43681, 245223, 230863, -44115, -383395, -498369, -303622, -26881, 59998, -18145, -18546, 112370, 141174, -61126, -272790, -248066, -101954, -134483, -380922, -573077, -510357, -274461, -72722]
35160g2722O7132k734M3273P2376r2844l62889l56941Q4157N28565M51998p982
35149C51389k36149l9536J44462J2030j70982j10038K7793j2877j04120j6496
35139a54524J19229L7102j66875j64086O8684K09233R3964m7024M3540K51653
35129B90896K21784j53789n09958l89879J62556N77176M38238p240k42795j87039
35119A99950j52318k29451j76126P1151K43330K09019J63697J92565P9983k21549
35109C80251l58134j21016J40243K0612l11072l79120r4153K03162K57588J15054
35099a46585p9193j94856j15227J07427J91796j5298k40357j38995J56355J98948
35089b75985r0377k74585k5297M03824N07759J66712k35604k95295n4409R4754
$$ y = [-72722, -5590, -8324, 34949, 107325, 14481, -348408, -705349, -621192, -92627, 359371, 351389, 115240, 75704, 220166, 232196, 61214, -48824, -21031, -33908, -138028, -154524, -35295, 1807, -165068, -329154, -260470, -51237, 42727, -4297, 39243, 290896, 512680, 358891, -151067, -540946, -378390, 198786, 637024, 629784, 386989, 199950, 47632, -181819, -357945, -286794, -43464, 165555, 329252, 521817, 601800, 380251, 22117, -98899, 41344, 61956, -249116, -628236, -722389, -519227, -261639, -146585, -225778, -420634, -535861, -428434, -236638, -251936, -492293, -631288, -474933, -275985, -366362, -640947, -666244, -262420, 245339, 412051, 176447, -118848, -173257, -78503]
35079g8503n6151k45073j25230J91359K67374P89k16545j14786O7492N0914m162
35068b62522J47885L10515J50887j57681j40044J87949K87089n7492l81528k57036
35058a71978Q3883J70624M799n8426N0122L4305k18521l95221k01851K00788M02198
35047i9278K59897K0629m5081M5988J00145L7719n4206j09363j66013k24986j65790
35036d00339P5129L21169L12796N2807j59066j07049N3578K5133j92871k87752
35026c06465q4369J84713J93747k9537j70832q0229P2306J05888O1918M3584K6734
35015A7458l6141q6679q0213r0532j45514j07622R9672K84686K25165R339r3347
35004c728k9271J3198o0940j24345m0876J66251L48005L05965o4983n41304o34330
$$ y = [-78503, -134654, -379727, -504957, -313598, -46224, -45435, -261980, -376766, -309274, -258360, -262522, -114637, 195878, 346765, 189084, 49040, 236989, 524078, 466586, 85058, -171978, -88095, 82529, 87328, 28902, 79024, 113329, -105192, -500413, -702264, -501476, -99278, 160619, 181248, 136167, 182155, 282300, 320019, 265813, 156450, -9563, -234549, -400339, -325210, -4041, 308755, 361562, 202496, 95447, 149025, 174158, -18713, -306465, -390834, -206121, -12374, -41911, -212743, -292972, -220666, -114778, -52860, -9276, 17458, -18683, -105362, -185575, -276107, -421621, -529243, -429571, -144885, 80280, 89619, -3728, -32999, -19801, -80741, -205086, -245962, -79711, 268294, 574259, 509276, -32028, -666358]
34993f66358j56705M07165M31177l9688l84211k66732K9531J68786J95797K33138
34983d8100J58536j35339m32610m26668j11695K48116M16533L30904Q9938j05909
34973a6294j25607n5110l4574P5J69772L11531J47510j98574k76453O120K10529
34962A38925M5290k17090k35730r9523l3999J1767J41617K04638P8449k6441P5954
34951H3857J49865q7784m12580l61314P0015M17838L83736J18498q8917j01448
34941A71766N3969K15448J81156l3744j61487q3533m4660k16462l26408r0213
34931c34168K38999K18289o6971j50247M4507J25858o0659j89285l3968J78696
34921b8949J80829M6072l7676o6303r5975p7822M315L8895k0481m7565M8766J71289
$$ y = [-666358, -823063, -415898, 15279, -24409, -408620, -675352, -645821, -477035, -281238, -48100, 110436, -24903, -457513, -884181, -995876, -747760, -331227, -323, 89615, -16294, -141901, -197011, -231585, -231510, -61738, 249793, 397303, 198729, -77724, -71604, 138925, 184215, -32875, -268605, -368128, -402127, -390360, -248743, -44105, 34344, 7903, 83857, 233722, 145938, -266642, -627956, -557941, -140103, 243633, 362131, 273214, 171766, 225735, 441183, 622339, 588595, 427108, 343575, 298915, 82453, -243955, -334168, -95169, 123120, 56149, -94098, -49591, 76267, 15608, -173677, -207645, -28949, 151880, 197952, 160276, 93973, -2002, -79824, -75509, -36614, -57095, -104660, -55894, 115395]
34909A15395J87715R4896l2916j22691j06162L842M8594q6424k44423j78378O5034
34898b55518J92808R1320o0840j12338r1758k3111J13831K02545P8535j48058
34888a2584j77829Q467J10379J6424l2993Q2171J41649L2141j0528J21908J12576
34877C91781k34498n32014l52227P1548K07738O7293R4743L30380L21831o5553
34867C01022l54206j83618J65782K69177J67183J26770J15699o5224l13439l14270
34857h5124m2794J91408K10176J50733J29676L8638j85000l42927k40388L75J12676
34846f2551O9686O4981J52211J54983j5392j78771j51668k3650Q957l3268J6831
34835B349J28731P6851j48118k09220R7625M43756L45407j50916m95770l65723
$$ y = [115395, 303110, 398006, 365090, 242399, 136237, 140079, 188673, 102249, -142174, -320552, -255518, -62710, 28610, -32230, -144568, -236326, -259437, -145606, 56939, 135474, -12584, -190413, -181946, -71567, -55143, -88136, -5965, 135684, 167825, 157297, 279205, 391781, 157283, -374731, -726958, -655410, -447672, -380379, -285636, 44744, 366575, 301022, -53184, -236802, -71020, 198157, 365340, 492110, 607809, 542585, 229146, -85124, -127918, 63490, 273666, 424399, 554075, 592713, 407713, 64786, -175602, -175227, -62551, 7135, 72116, 224327, 379310, 363918, 185147, 33479, 9829, 18786, -14482, 2349, 131080, 207931, 59813, -149407, -51782, 391974, 737381, 586465, 90695, -275028]
34825b75028k5538J47371J55183J68410J31516o6358k31066r3111J93286K12283
34815C16948o2049k16056n7504J28351J17959P4966J10014j1577l77837n77239
34805e54024k86142J46510K13818N0853J29247L79231L06804r4644k76259n0860
34795c5466J20598m2998j82556K0731K78544K07984n4698j76105j72724k03354
34785b40044j54978J00857L11079J80576q9711p5114K02370L34320J68141n2092
34775F85404j43878j64618j36201M127J37433K6534k70305l89532j82158N9395
34765c73799M1240j27007j54827o646R6280J8720j26082j53193l3484J00857J47990
34754e69951J69219K69245L83044L19177M5670k20314k88218k13550j39825p5463
$$ y = [-275028, -300566, -153195, 1988, 170398, 301914, 235556, 4490, -88621, 104665, 316948, 254899, 38843, -18661, 109690, 227649, 302615, 412629, 401052, 23215, -554024, -840166, -693656, -479838, -428985, -299738, 79493, 386297, 291653, 15394, -35466, 85132, 42134, -140422, -119691, 158853, 366837, 312139, 136034, -36690, -240044, -395022, -294165, 16914, 197490, 107779, 32665, 235035, 569355, 737496, 685404, 541526, 376908, 240707, 244834, 382267, 408801, 138496, -251036, -433194, -373799, -332559, -459566, -614393, -621039, -524759, -506039, -632121, -785314, -818798, -717941, -569951, -400732, -131487, 251557, 570734, 616404, 396090, 107872, -105678, -245503, -320966]
34744c20966K8054J08684P4837l1277r1313n4523P3022K58930L63606K00754j74768
34733D35040m18193l14441p0687J4041j8230N5562K10041K22162O8020m2785p559
34722A32971O2165P2009N3115L3332q953o3308j03668j42095j46068j7537J95302
34711F7265K33292j0231k36985j33949J40934J95511O019r4326K5080J33389N8638
34700C84637q7637j64636j71446j00358Q7156K66868K13594m9805k14311j03262
34690F0800Q0717M2006k26458m44518l47634L5121L62830L19357J8823j08753
34680b07709O6084J72084k8737j88914L7391L20056J53470k36662k11141J90106
34670F6028K93504l8994j65175J85005L90465J5232l88284j79626L00286L01988
$$ y = [-320966, -292912, -184228, -109391, -140668, -231981, -286504, -213482, 45448, 409054, 609808, 435040, 16847, -297594, -368281, -354240, -372470, -316908, -106867, 115295, 183315, 140530, 132971, 195136, 267145, 320260, 353592, 344639, 281331, 177663, 35568, -110500, -128037, 67265, 300557, 290326, 53341, -80608, 60326, 255837, 261856, 167530, 192610, 325999, 384637, 297000, 132364, -39082, -139440, -52284, 214584, 428178, 378373, 164062, 60800, 141517, 183523, -42935, -487453, -835087, -799966, -437136, -117779, -98956, -207709, -141625, 30459, 1722, -187192, -149801, 170255, 323725, 87063, -124078, 66028, 359532, 320538, 155363, 340368, 730833, 746065, 357781, 178155, 478441, 780429]
34660G80429j39578l67932j84709O743R107M7293J74247J24743j31559k52722
34650F6062q9301Q5697O1352k3422l1085o0846j54669j41093K8260J26966M2918
34639h9161j4949P6833R1680j13710k37632M302L17836K03065k51255m45845j35413
34628e94249K58765L00185P8820q1697j02665q9112n8953j085j4050j39068k08881
34617f51990q9766P9803J20978J13332J93302K29417L8075k10082j94664J4910
34607c56685N3519j14243j27007J34877L17392J82358r265L1809J51905Q1427
34597C46087p7793o2114P6439P2352j06679k43118k19751j18779l4638K071j1025
34586c76948k126J34486L17429K86055p399k39842j55833P5969J79222J79122
$$ y = [780429, 640851, 272919, 88210, 94953, 104060, 151353, 325600, 450343, 318784, 66062, -23239, 62458, 123810, 100388, 69303, 8457, -146212, -287305, -259045, -132079, -89161, -104110, -27277, 64403, -49307, -286939, -282637, 35199, 238264, -12991, -458836, -594249, -335484, -35299, 43521, -38176, -140841, -229953, -288906, -289991, -304041, -443109, -651990, -741756, -661953, -540975, -427643, -234341, -4924, 33151, -176931, -371595, -356685, -303166, -417409, -544416, -409539, -92147, 90211, 80946, 112755, 264660, 346087, 268294, 206180, 282619, 354971, 248292, 5174, -214577, -333356, -367994, -365923, -376948, -379074, -244588, 72841, 358896, 351497, 111655, -44178, 31791, 211013, 390135]
34576C90135K05502J52898r6924l23031k33691N3379J73283M8881p9600o0346
34566B30486M7114J47563J36027r3892m05604m18151n2557K19335N1326j95972
34556c34325m2496K87916K54681o6078j50671M9245J10134l3598m4667O1063p6814
34545A4390l55968k54063J89637K96263j14010l67270o8154K53667J04587j42724
34535d43645K2552L48535L17479L1250p1580J1460m336q6972l5514L1868r2846
34524B8251k17375l9790K57227K40079p9121k79913j81258j433P4329R0431J11996
34513C423J28106J24804M9932j59277l47191k05073K09487L68270J6898l47302
34503a57923j78015K86127M24303J83511N342j1593j92204n51094o31280k09047
$$ y = [390135, 595637, 748535, 651611, 328580, 94889, 148268, 321551, 370432, 290832, 230486, 277600, 425163, 561190, 467298, 61694, -356457, -409014, -189679, -138353, -334325, -376821, -88905, 165776, 99698, -50973, -1728, 108406, 74808, 30141, 91204, 14390, -341578, -595641, -406004, -109741, -223751, -591021, -659175, -405508, -300921, -443645, -421093, -72558, 244921, 276171, 204591, 216051, 211715, 124743, 89229, 121097, 28251, -189124, -228914, 28313, 268392, 189271, -90642, -271900, -273333, -199004, -108573, 3423, 131529, 256333, 306265, 146988, -200203, -405276, -195789, 172481, 189379, -157923, -335938, -49811, 374492, 558003, 563345, 551752, 359548, -191546, -822826, -1031873]
34493a031873L50139O00460M84294J79485j45521l07032j80484P3308J38807j7745
34483A43838j22687n1690J3216l7002m5300P6798J30076m7203k63987k18050P7952
34472c44039L12439K60482J0030j82266j72702n0870k157p9931j63913j39399
34462e52326k4982R8063J68287J30700q800q5648O3362K87471K34608j09886l09961
34451a09112j08886J50855M6469k68660l21042l1159K50456K95653J70999n0207
34441B5366l14522l77623l0634M37410M65889J4418l11555j02578K94953L25462
34431D26586j791k28138j33163N3668P2813l9126r9701n7138o769j3503j8381
34420d4643O6304K13058K78619J61023p3093k41425k12790k2272J52603J48895
$$ y = [-1031873, -681734, -81274, 403020, 582505, 436984, 129952, -50532, 22776, 161583, 143838, 21151, -30539, -17323, -54325, -99625, -22827, 107249, 60046, -203941, -421991, -344039, -31600, 228882, 238912, 56646, -116056, -166926, -169083, -249014, -412927, -552326, -577308, -479245, -310958, -180258, -189058, -274706, -211344, 76127, 310735, 200849, -109112, -217998, -67143, -20674, -289334, -610376, -641535, -391079, -95426, 75573, 25366, -289156, -666779, -697413, -260003, 205886, 220304, -91251, -193829, 101124, 426586, 424795, 196657, 63494, 117162, 189975, 150849, 51148, -5990, -12759, -26262, -44643, 21661, 234719, 513338, 674361, 601268, 359843, 147053, 124781, 277384, 426279]
34410D26279l454j01011l6241L2296p4817k25735j37383J46517K42328j9484l21651
34399g2356l10382o9318P1818J2215p0466l1036Q3787J34316L8413j15150r7265
34388d25424J63073L46753R6358l93951n26596j32578K84552L17712J82041J70752
34378H2692R1378k81570o05364m10930J10154L52926J83786J2544O5765J43773
34368b54846R9973N3528O4343K4225o1629m9495M6326O2683p34l65M8941K6071
34356E9021M345J29329K51195R1334k49200l76703k02683k2118K0255Q2618J91914
34345b0693J33260j05505k18778o7482J12628J32882J08142J51129J75884J41239
34335E42706J32541R3543j29907l78625k72710J36538L13898N9879j55651J369
$$ y = [426279, 422825, 321814, 285573, 317869, 243052, 17317, -120066, 26451, 268779, 249295, -72356, -382738, -452056, -380238, -368023, -438489, -469525, -385738, -251422, -213009, -328159, -425424, -262351, 84402, 180760, -213191, -739787, -872365, -587813, -270101, -88060, 82692, 174070, -107500, -712864, -1123794, -1013640, -660714, -476928, -464384, -398619, -254846, -154873, -101345, -37002, -12777, -74406, -123901, -77575, -14892, -15626, -15991, 32950, 59021, 63366, 192695, 443890, 535224, 286024, -90679, -293362, -315480, -295225, -212607, -20693, 112567, 7062, -211716, -279198, -166570, -33688, 74454, 225583, 401467, 542706, 675247, 768790, 638883, 260258, -12452, 124086, 437984, 497863, 342212, 343581]
34325C43581J46445j28343m67674k85908K41725M10785O6326k25041r7597J36151
34315A40450Q9204j25153j78245k8291J34004K05907J94338P6813j40394l16984
34305E1649l06671j43923J1445O4576L5338j2353m977R8030K03216J24999j36342
34294a5013k67130j1294L82964L81774j05173n21741l79922R0975L02357J16360
34284b5843q1566l3429Q8216P4600l419q741L2296N4868O3358J6675j31703k16499
34272a71187j8469K78960K11189k28959m51163j40280K25102J31935j55440q7650
34262d05962K36316K75336l7635k52635j80651p8434o7928K4523J91640J70557
34252a24873m4191j18515O1218K12288J70130J20919J70800J38155l4863r9446
$$ y = [343581, 490026, 361683, -105991, -391899, -150174, 260611, 326937, 101896, 4299, 140450, 229654, 104501, -73744, -102035, 31969, 237876, 432214, 509027, 368633, 51649, -255022, -398945, -387500, -322924, -287586, -299939, -304916, -206886, -3670, 121329, -15013, -282143, -293437, 89527, 471301, 366128, -155613, -535535, -444560, -142203, -25843, -107409, -140838, -52622, 21978, 18559, 9818, 42114, 96982, 160340, 177015, 45312, -171187, -189656, 89304, 300493, 71534, -379629, -519909, -294807, -162872, -318312, -405962, -169646, 105690, 68055, -184580, -365231, -443665, -511593, -487070, -295430, -124873, -169064, -287579, -226361, -14073, 156057, 276976, 447776, 585931, 551068, 451622]
34242D51622L9850Q4146j66370m21516l05382J04870M18406M13013J61389j39332
34232F40696k80077j58274O5283J02259o9893j72591p5177Q358q3798j81380j21047
34221c25641p0939k13204l29510p4890M31104O52124L16870k19340m13796j71671
34211d18893J12122Q7185j45428k30534l8754K23132L38498K91004J20687j58583
34201A80436l86804k94122R4943L64704K49951q85o6001l2797r9069j37001N10
34190a26135P4363j01626j48832K78122O75050L13039m76854o18197O0106N11661
34180D40697Q9219n23371m96110p5649O7836r515J43795L97024K68016j35195
34170A66747k28199Q0801K64594N7451j70485p0506J59163J46029r2324k19722
$$ y = [451622, 491472, 575618, 409248, -12268, -317650, -212780, 205626, 618639, 780028, 640696, 360619, 202345, 267628, 369887, 299994, 127403, 52226, 60584, -23214, -204594, -325641, -396580, -609784, -939294, -1014184, -583080, 69044, 385914, 166574, -247222, -418893, -306771, -219586, -365014, -595548, -634302, -411170, -72672, 218332, 339019, 180436, -206368, -500490, -405547, -40843, 209108, 208223, 142222, 109425, 10356, -126645, -126135, -51772, -153398, -302230, -24108, 650942, 963981, 487127, -131070, -70964, 440697, 529916, 6545, -489565, -565214, -497378, -506893, -363098, 33926, 301942, 166747, -61452, 19349, 283943, 341394, 170909, 100403, 259566, 405595, 313271, 93549]
34160I3549o7450J54301J26986j76057m25881l20726L5768K77351K48434J27561
34150G3836Q6237P3716n282j23472k06569j99334o0918J16415P8562k24580l91051
34139g82440q4614L48635L17650o3484j36049J95933L07462m3273k94688r5694
34129c30562R2701j02103k48689O9785M21372K58292j00749l7983K88735K97958
34119F08757L5871j4702J02610m1995l43877l05635n253Q107k26135q8494M40870
34108A70124N91302P3140l84085j98503J88538J60153p6730k4342J42959o0491
34098E82065m59181m19697R6821M35589K52360m0489j9317J19604J6k76184l32595
34087f1008j51236o0935j62345j87573q50J44255L6370j20828m6014J45809J45044
$$ y = [93549, 26099, 180400, 307386, 131329, -294552, -615278, -579510, -302159, -53725, 73836, 160073, 233789, 228507, 105035, -101534, -300868, -361786, -245371, -166809, -391389, -782440, -867054, -518419, -200769, -264253, -400302, -204369, 103093, 59820, -234868, -330562, -237861, -339964, -588653, -518868, -97496, 160796, 60047, 22064, 310799, 608757, 644628, 629926, 732536, 690541, 346664, 41029, 35776, 43883, -182252, -270746, 170124, 761426, 834566, 450481, 251978, 440516, 600669, 523939, 499597, 642556, 582065, 122884, -296813, -199992, 235597, 487957, 447468, 428151, 547755, 547771, 271587, -61008, -212244, -273179, -435524, -623097, -623947, -479692, -443322, -564150, -610164, -464355, -319311]
34076c19311l6166j20637l8358N4609J60209L85006N17768J96672l98187n84704
34066a83099j43558K99364J89766j72378k14557O041N6690m9004O1445L61174
34056B11884L89324n342m05120m10645j07232J56476J74794m535j77882j66551
34046c44829j5387O4860L1506O6560J71202N0521l31199m71001k7737N38281N57577
34035B90354J19468j49474p7268m1175j56439r9079J80780K57888l6822k69558
34025A8675q3262K45790K54992n1997l04513k70213k2132K16408K43898O2389
34015C10035o2596P0222K41768R8922k36304k74779O9156K97719Q7996k35866
34005C66273k52445n7425J663j16363k06249k00989j64201p1019J05155K24509
$$ y = [-319311, -355477, -476114, -514472, -459863, -299654, 85352, 603120, 799792, 401605, -183099, -326657, -27293, 162473, -9905, -224462, -218421, -161731, -210735, -149290, 211884, 601208, 595866, 190746, -219899, -327131, -170655, 4139, -396, -178278, -344829, -360216, -295356, -263850, -197290, -26088, 24433, -306766, -777767, -805504, -267223, 290354, 409822, 260348, 183080, 141905, -14534, -113613, 67167, 325055, 288233, 18675, -64587, 181203, 436195, 384198, 79685, -190528, -212660, 3748, 247646, 310035, 247439, 317661, 559429, 658351, 422047, 147268, 216424, 514143, 602139, 366273, 113828, 56403, 58066, -58297, -264546, -465535, -629736, -700755, -595600, -371091]
33995c71091J63157M3260M7132J22583R8982j9012r8202j12848j12770n3725J05611
33984a86923K10674O6221k31922l49259j30072K11061L55203K03782q7420k73190
33974b11845j90304J11338L60817L00409p410k07400p4230J88188K11002l7218
33964D43347k17290j13940O8498M0319j48303k41304j86353j25070o7222Q9722
33954d57596K44678J70642n0132o4880J65996K41680k8907k71268j33312J55472
33944b7627J89943L3493J9741J48395J41902l9104j70000j60736r8732J3871K02742
33933B53888L03140J62610m5612p5461l7995j73232l37886k02291J30781K21603
33923A99545j1681k03398j68110j11438j48501j10193N4186J40699Q8434Q6373
$$ y = [-371091, -207934, -164674, -117542, 5041, 104023, 85011, -13191, -126039, -238809, -292534, -186923, 23751, 89972, -141950, -491209, -621281, -410220, -55017, 148765, 61345, -211845, -402149, -290811, 70006, 370415, 363005, 155605, 81375, 269563, 480565, 443347, 226057, 112117, 180615, 220934, 72631, -168673, -355026, -480096, -547318, -457596, -212918, -42276, -92408, -157288, 8708, 250388, 221481, -49787, -183099, -27627, 162316, 195809, 215550, 363945, 505847, 466743, 296743, 136007, 37275, 51146, 253888, 557028, 719638, 674026, 598565, 560570, 387338, 49452, -152839, -22058, 199545, 187864, -15534, -183644, -295082, -443583, -553776, -499590, -358891, -270457, -184084]
33913a84084J63188J02936j00433j47982M5280J70252M2928j18369j25099j02183
33903b53566j28610l0199K13410K80969L2801j74913m3145J63022N0199k55892
33893a45924l18407m8267K35199K85305J47009k6578j26432j18122p7099r7401
33883b90717r7195P8034K97973K16636j64433l77243j57969J43326J23397p5542
33873c03733j06117j4285l9973r1563O8329K94960K49865J6613l836K09341K33974
33862E13575q3857l44944j96448J75771L62329K39118l3004k68846l34625j74890
33852a45821N9973R6742q9134j75596M5451L03372K10848j36914k59473J0739
33842g9813K68880J25930k21295k86547n821K02272Q7665q7040j0027J84949J67378
$$ y = [-184084, -20896, 82040, -18393, -166375, -121095, 49157, 92085, -26284, -151383, -253566, -382176, -412375, -198965, 82004, 114805, -60108, -103253, 59769, 109968, -145924, -464331, -512598, -277399, 7906, 154915, 128337, 1905, -116217, -193316, -290717, -387912, -309878, -11905, 204731, 40298, -336945, -494914, -351588, -228191, -303733, -409850, -424135, -464108, -555671, -487342, -192382, 57483, 74096, 70260, 279601, 513575, 429718, 84774, -111674, 64097, 426426, 665544, 632540, 363694, 29069, -145821, -85848, 10894, -78240, -253836, -208385, 94987, 305835, 168921, -90552, -79813, 189067, 314997, 93702, -192845, -198666, 3606, 91271, 4231, -5796, 179153, 346531]
33831C46531n4745j86856j31174p1459j02609j15021p5829r5076j39688o692K96769
33820c35849M52596K73201k8879j86533k21489k34614j27601J76481M37539L49558
33810E54410j3193k80934k57166o7186R4764J32188J2214j98772k85566q8735
33800c97976K36076L51185J41912j67490k99323j75111R8357L29878L37094J08007
33790E62609j21032j08589O6550J01895r2158k69821k36149j23682j24607j49119
33780d94103j054K26897K46184N3049j6983J69367K69230j4510l92786l54111
33770c08820N7388K81802Q3432j27712O761K32447J61117n6470j3040K15327J55199
33759F87431k67879n33204k55772K85683N47214L58434l5338l44361m32928k91157
$$ y = [346531, 291786, 104930, -26244, -97703, -200312, -315333, -391162, -486238, -625926, -632618, -335849, 116747, 389948, 361069, 174536, -46953, -281567, -409168, -232687, 204852, 554410, 541217, 260283, 3117, -64069, 30695, 162883, 175097, -23675, -309241, -397976, -161900, 189285, 331197, 163707, -135616, -310727, -212370, 117508, 454602, 562609, 441577, 332988, 399538, 501433, 409275, 139454, -96695, -220377, -344984, -494103, -495157, -268260, -22076, 30973, 13990, 183357, 452587, 438077, 45291, -308820, -251432, 30370, 113802, -13910, -7149, 225298, 386415, 329945, 316905, 532232, 687431, 419552, -113652, -369424, -83741, 463473, 821907, 786569, 442208, 9280, -281877]
33749b81877k0788J86334J84035q91j97063k24732l8488K03953K62815P9904j45156
33738H046k13110j43728m2816P5480J77041J20309q9123j56194R6842L67629K73238
33727D73614n0943j70045m2429j0654j55359j84528q756R1992q242p8234m163
33716a47747L525j26578j15464J58925L56881J78540j72656l23679k34100q6988
33706e09341N0164J80901K29562J80904J61908J96803J21766q7678j93736r4275
33696B36978l2131j74411k91925j33276J52807K53791J24466p0363k20473k51042
33686d05579q0539J79051K32113K5585j07114N6465K89536L07971J71745L5651
33676G04885j46507l63792l57141m5169J99961Q6004j24072p7534P7356L6563
$$ y = [-281877, -302665, -116331, 67704, 66813, -130250, -354982, -393470, -189517, 73298, 153202, 8046, -205064, -348792, -391608, -316128, -139087, -18778, -107901, -264095, -167253, 200376, 473614, 422671, 252626, 210197, 199543, 44184, -140344, -149100, -57108, -65350, -143584, -147747, -144222, -270800, -386264, -227339, 129542, 308082, 135426, -188253, -422353, -509341, -459177, -278276, -48714, 132190, 294098, 490901, 612667, 524989, 331253, 236978, 204847, 30436, -261489, -394765, -241958, 11833, 136299, 65936, -154537, -405579, -486118, -307067, -74954, -49369, -156483, -100018, 189518, 497489, 669234, 704885, 558378, 194586, -162555, -207724, -7763, 78241, -45831, -123365, -46009, -9446]
33666i446o4716M2809J50512j03079m85175m17164R7577M43375L16063O5766J4431
33655E0953J1870j17143j78185L5421L27850L55981J14269q7311m8568R8066R7611
33644F60814q0349j90853o7857P9480n1259l28660l00770R9629L87911K47818
33634D55904k7144r0099p4751j83038j88609J35677M63346L60384q33j55099j15219
33623E80519k08599l58211k03191J81266L49355K15012R0533M4549j37906l72189
33613A81138l11793j3329P7212j13312j58703J10403L23060K05488l8218j50714
33603A11232j43505o3776R9524J90025K6631j94084j33240P1381J81k61161k11660
33592e08452J59500L09633Q9331l7429J05005J08265j49394j79294J99028M27418
$$ y = [-9446, -74162, -31353, 119159, 16080, -469095, -886259, -788682, -345307, -29244, 36522, 50953, 62823, -54320, -232505, -197084, 130766, 486747, 601016, 513705, 465137, 563203, 660814, 580465, 389612, 321755, 401235, 349976, 21316, -279454, -179825, 208086, 455904, 428760, 338661, 263910, 80872, -107737, 27940, 491286, 851670, 850837, 695738, 580519, 371920, 13709, -189482, -8216, 341139, 556151, 646684, 691233, 553327, 181138, -130655, -143984, -66772, -180084, -338787, -228384, 94676, 300164, 261946, 111232, -32273, -96049, 3475, 193500, 220131, 26047, -107193, -35812, -35631, -296792, -508452, -348952, -39319, 50012, 12583, 117588, 225853, 76459, -102835, 96193, 523611]
33582E23611J48939j88865j69361r9115l00914m27644j26298K40918K09538l221
33572a92412J9496J42500N1091j15935j29476j70740l58700l15878J49205M98064
33562d22785L00879J8276J67743L42808j5165m61471k37326L48694L73942j77417
33552B38178m83802k63721J6867J47848L06635L35819l2606l77673j07195L97527
33542A77877L10911j61136j15270M10619N49890K51502K69036N52182L48011p4094
33532B519528K80858J022924Q71398N81377K458936N814244O101043R96274n264624
33523A5381958o811896l647828p39111p18947j440639p66054K03090p2202p30907
33514F57464l88052L60117K45976l98302m63380k7225J12570P063J92268M28025
$$ y = [523611, 672550, 483685, 314324, 215209, -85705, -513349, -639647, -398729, -189191, -192412, -172916, -30416, 20675, -95260, -224736, -395476, -754176, -1070054, -920849, -422785, -121906, -103630, 64113, 406921, 391756, -69715, -307041, 41653, 415595, 238178, -245624, -509345, -492478, -344630, -37995, 297824, 265218, -112455, -219650, 177877, 488788, 327652, 212382, 623001, 1172891, 1424393, 1693429, 2245611, 2593622, 2519528, 2800386, 3823310, 4694708, 5276085, 7735021, 13549265, 19650308, 20646582, 15381958, 8570062, 4922234, 4183123, 3464176, 2023537, 1257483, 1460573, 1388371, 657464, 269412, 629529, 875505, 477203, 13823, -13402, 99168, 106231, 298499, 726524]
33504G26524J41531l75497m09387m9563R5567J4203J08947K59628O4073k72377
33494C03649k36803L7139J3416k56292k61714J9748J62267J41437K99258N46446
33484G68551M31885j1193k69277k07852j86641k98433k31455M0363J35273n8402
33474A12819k24576k34924k95284l90000k27205J37169K65837R2848P2878L72163
33464c18275N39477K64051j12781j72135r587P9473P4375O6767K699j15855j09603
33453A88606M9842J27925M6249K8709J23481K7022l37395n27983k42779J47385
33443c68938J64816k7941N2194L94641N33207K81450n5897j86532j35944j8399
33433F32657J53176L45404M39664L82997K67182K23563L23082N42142P42742P70249
$$ y = [726524, 868055, 492558, 83171, 33608, 129175, 143378, 252325, 511953, 576026, 303649, 66846, 103985, 117401, -138891, -400605, -380857, -218590, -77153, 222105, 768551, 1200436, 1189243, 919966, 712114, 525473, 227040, -4415, 35948, 171221, 112819, -111757, -346681, -641965, -1031965, -1259170, -1122001, -856164, -763316, -690438, -318275, 221202, 485253, 372472, 200337, 190750, 270223, 344598, 411365, 414064, 298209, 188606, 238448, 366373, 412622, 441331, 564812, 591834, 254439, -273544, -516323, -368938, -204122, -232063, -179869, 214772, 747979, 1029429, 973532, 787000, 651056, 632657, 785833, 1131237, 1570901, 1953898, 2221080, 2444643, 2767725, 3309867, 4052609, 4822858]
33423D822858O71421P08141J048876J592705K222011K987475L748908L821500
33415B1623895K475471p8896k558512l728813l510933k777149k228232j826820
33407G390011j317722q40361o99466p86023o87317l50424j87099l87633n56369
33398A577597l16785O2927N7356l05599m80248k03291J72610K31947L7277o0968
33388G72823N8910J72112N2386k13068l31027k06538r1856j86438k48179N7656
33378a63219M95812M50423j21325m91975j99984K78598L19099O9482R759O7552
33368G14222j08499l41479j94140J57134J31595k51846l74465l4591K91499K83032
33358B72462J58715J11085K3011j14144j12053k3946q0294j47277R0534L90965
$$ y = [4822858, 5494279, 6202420, 7251296, 8844001, 11066012, 14053487, 17802395, 21623895, 24099366, 24020470, 21461958, 17733145, 14222212, 11445063, 9216831, 7390011, 6072289, 5231928, 4532462, 3746439, 3059122, 2708698, 2521599, 2133966, 1577597, 1260812, 1323739, 1381095, 1075496, 595248, 391957, 564567, 796514, 833791, 772823, 831733, 1003845, 1056231, 843163, 512136, 305598, 213742, 27304, -220875, -163219, 332593, 783016, 661691, 169716, -30268, 248330, 567429, 636911, 646670, 714222, 605723, 264244, 70104, 227238, 358833, 106987, -267478, -302069, -10570, 272462, 431177, 542262, 565273, 451129, 339076, 315130, 234836, 87559, 178093, 569058]
33348E69058J79339m00649n30556k1921L25517K2985l33377r1622M33947N67348
33338G20069K64520q7488l31401m51351l03741N5077K11928O367j61154j3903
33328i1077J46241P0883M1575K34300K45514j66690m81172k20041J97255J30494
33318A07282k34842k82720p558J19076J4856k6546L2213M2244J27278M07103N21391
33307H19777J21524l99125l84530O3941K69386L7707j94128j90440j81466k82360
33297c19714k87146j14214N6853J32799J67518J21135l7679j03512P4017K34303
33287g5640Q6908j53029j04351J16464J15145q8240j59793p6490o4047o4733J26793
33276c41013L29391J99541j17173j82031j3999m204j61846j22612J15314J46070
$$ y = [569058, 748397, 347748, -182808, -204729, 120788, 143773, -189604, -281226, 152721, 720069, 984589, 897101, 565700, 114349, -189392, -134315, 77613, 83980, -77174, -91077, 55164, 126047, 167622, 401922, 647436, 480746, -426, -220467, -23212, 107282, -127560, -410280, -417838, -298762, -283906, -310452, -278239, -235995, -108717, 298386, 819777, 941301, 542176, 157646, 221587, 490973, 528680, 334552, 144112, -37354, -319714, -606860, -721074, -664221, -531422, -363904, -242769, -280448, -383960, -309943, -75640, 11268, -141761, -246112, -129648, -14503, -102743, -262536, -339026, -403073, -467806, -341013, -11622, 187919, 70746, -111285, -125284, -129488, -291334, -413946, -298632, -152562]
33266a52562j12575k80246j68166J9676J73007L59167M01061L2130m55346m10751
33256e94605J69740N24503K53609j01654L5215L78207K79135k63492o16989l91981
33246c28312Q9781K29963j35064n37906m19465J69941O06359N02184J63103J7411
33236C57995k4650k30786m12008k02649K22820L22961J1868k50610j76964M8480
33226c33543J90361K14045J14177q0585j57418K1804J91588L7113k45598k22993
33216b71049O6858K04802Q8893j0253j5176r6936k17190j74311n4985q3949j08723
33205f72019J58432M75123L31503j56900l47296r1534Q9980m2905r4943J60453
33195a90106L42047J32548k08122l08395j70189M7742K63985L18141O4320k40651
$$ y = [-152562, -265137, -545383, -713549, -693873, -520866, -161699, 239362, 271492, -183854, -594605, -424865, 99638, 353247, 251593, 286808, 665015, 944150, 680658, 63669, -328312, -238531, -8568, -143632, -681538, -1101003, -931062, -324703, 177481, 340584, 357995, 333345, 102559, -309449, -512098, -289278, 33683, 45551, -205059, -382023, -333543, -143182, 70863, 185040, 104455, -52963, -31159, 160429, 197542, -48056, -271049, -204191, 611, 89504, 79251, 64075, -32861, -250051, -424362, -479347, -563296, -672019, -513587, -38464, 293039, 136139, -211157, -302691, -212711, -255616, -350559, -190106, 151941, 284489, 76367, -232028, -402217, -354475, -90490, 227651, 291971, 51320]
33185E1320j56353K20194L20335Q056k19544j04510n283j38370j57349J27311
33175e4193K86891K8801j90639R6630N06606L53752k45714n16201j63762K46763
33165C48934J38342l17238m96225j45220L22793L50503p4185m01640k27229J84550
33155c16615K71415q1069m34450l74435N6091M74778N23394J70564k15371k27828
33145a53526M7927J32180j01249k06506M9586K26166j2154k11381J12132N11880
33135C95055K53513m12562n60874k8205M02234K61177n9311j42398j10846j44190
33125a46407j28966j5249M8005P1939J88654K19501j15244n38199m40155J65007
33115f91114N88263M73143J85840P4754J9340j00375j20067k6K1077j35274k60986
$$ y = [51320, -105033, 115161, 435496, 443552, 224008, 119498, 114215, -24155, -181504, -54193, 232698, 261499, 70860, 167490, 674096, 1027848, 782134, 265933, 102171, 348934, 487276, 170038, -326187, -471407, -148614, 201889, 127704, -273936, -501165, -316615, -45200, -126269, -560719, -935154, -879063, -404285, 119109, 289673, 74302, -153526, -105599, 26581, -74668, -281174, -231588, -5422, -17576, -228957, -116825, 395055, 648568, 236006, -324868, -353073, 49161, 310338, 251027, 108629, -2217, -146407, -275373, -290622, -242617, -170678, 17976, 237477, 122233, -415966, -856121, -691114, -102851, 370292, 556132, 630886, 650226, 549851, 429784, 429758, 450835, 315561, 54575]
33104E4575k61888k26188r9219K06222M41063L20789Q3128J24592K44091j6289
33094H70876m34367l64124J56081M50223L23754K01028J56965j66762o00459m77935
33084A15280J57233M18401m8247n33176m47971j02384P2168J75533L12983K52310
33074C72130L64n2606J07201L523l97375m89253p1719K77919K12984J12137K09936
33063B85241J44998k08410l50423n2333K02003J11713N3367K42680K61643j01736
33053E88743l74721k43727p3449j27836r3880J58259J83031j76548l54671q615
33043e23414L75491L14371K5368j38095k02938j68367J22673M00897J42228m07202
33033e8988l81793K42848M85522K2226k60078J07056L29555j44246n75041k69677
$$ y = [54575, -207313, -433501, -532720, -326498, 114565, 435354, 518482, 643074, 887165, 870876, 436509, 72385, 228466, 678689, 1002443, 1203471, 1360436, 1193674, 593215, 115280, 272513, 690914, 642667, 109491, -338480, -440864, -368696, -193163, 119820, 372130, 372494, 319888, 427089, 430612, 33237, -456016, -527735, -249816, -36832, 75305, 285241, 430239, 221829, -128594, -180927, 21076, 132789, 186156, 428836, 690479, 588743, 214022, -29705, -103154, -230990, -324870, -166611, 16420, -160128, -514799, -523414, -147923, 166448, 191816, 53721, -149217, -317584, -194911, 205986, 348214, -58988, -440781, -197933, 287589, 309815, 49737, 156793, 486348, 342102, -232939, -502616]
33023e02616K26187K29180J06215L53054N14105Q3728m29172l83407j12818j57812
33013g3356k30275N4534K48107q8007l96193m0386N13357M82708O4845p3450L6040
33002D97924n676p5052Q5551J84517l6340j72643N9790J47900k52895m99976p3019
32991a39919L51273K7325m70566k07885M62880N14837l0493k90907n8308Q1399
32981B39636p8494j71674p9217j5151M5341K43503L64858J64872j25024k00589
32971C88061k00104k86039k19958J12814L34004K43837K02857L50715K27463k88443
32961H65207n36991j72653K05509J35858K7286J72425J10588l03354l42765K63175
32951D24285O19380J62296l33830j75797Q3883r5580j48670L06052M33482k91083
$$ y = [-502616, -276429, -47249, 58966, 412020, 926125, 1009853, 580681, 197274, 84456, -73356, -303631, -249097, -990, -88997, -485190, -525576, -12219, 470489, 535334, 461884, 497924, 492248, 417196, 502747, 687264, 650924, 478281, 538071, 685971, 433076, -66900, -139919, 211354, 238679, -231887, -439772, 23108, 537945, 507452, 216545, 158237, 239636, 161142, -10532, -89749, -104900, -59559, 183944, 548802, 713674, 588650, 388061, 187957, -98082, -318040, -205226, 128778, 372615, 575472, 926187, 1153650, 865207, 328216, 155563, 361072, 496930, 524216, 696641, 807229, 503875, 161110, 424285, 1043665, 1205961, 872131, 696334, 780217, 684637, 535967, 842019, 1275501, 984418]
32941I84418q38955k83809N55743N45240O9273j9651k9816m55399o12581R6983
32931A1446P32389L12194l80520k09629K75066K8614m33725j26352L67064O308
32921E82855n65924j48036O57753M28312m89565o11220O7689K87321j21408k17816
32911a30039J03480J39724k9031J65166L61035n7624m70659l0282N54229J63756
32901G69755n81979l80754L40585K68897k94070j02393N22633K77853n49359n40334
32891b69166K25830M04213j01825k10346J04707j5920k91106J89296Q29926L42352
32881A207961o98756o20499L81487O13832q3456l11013J24519R7757l44593p2128
32871B95111O50033M56617m21180m57611K50706J58302o67712n58035N60655R00987
$$ y = [984418, 145463, -138346, 417397, 962637, 1031910, 1012259, 982443, 527044, -85537, 11446, 743835, 1056029, 675509, 465880, 740946, 769560, 335835, 209483, 576547, 582855, 16931, -131105, 526648, 954960, 465395, -145825, -78136, 209185, 87777, -130039, -26559, 113165, 84134, 249300, 610335, 552711, 82052, 51770, 605999, 769755, 187776, -192978, 147607, 416504, 122434, 20041, 542674, 820527, 271168, -269166, -43336, 360877, 259052, 48706, 153413, 137493, -153613, 35683, 865609, 1207961, 509205, -111294, 270193, 884025, 800569, 489556, 614075, 711832, 367239, 295111, 945144, 1401761, 980581, 522970, 773676, 931978, 264266, -293769, 266886, 1167873]
32861A167873N8989l16896M48623J038181O45100L1543l08342p12969q80884j55319
32851A015899O91868L26307o56629n94840K20317J26036o91116n60207L82633
32842B60268M34807l39341k81049N01357L15649o57678n64224M98819O07844k42681
32832E33771j80342P43090N88138n55232o00320M54840M98264m95435m10503O82111
32822A258382N10335q21586p90264O50016Q49338m04955m59517R28036J022833
32813B742618m40727n89847Q88645R37516q14168r13042J501321K862330J457487
32804G632133r8338l16660r71727k169972j369514R64863J060398j110200j218404
32795B402579J270974J752361p27523j407657R89277J660515o83418r08616K248223
$$ y = [1167873, 1226862, 909966, 1358589, 2396770, 3041870, 3073413, 2765071, 2052102, 1171218, 1015899, 1707767, 2034074, 1377445, 782605, 1002922, 1128958, 437842, -122365, 260268, 695075, 355734, 74685, 576042, 891691, 234013, -330211, 168608, 776452, 533771, 353429, 1096519, 1684657, 1129425, 529105, 983945, 1482209, 986774, 576271, 1258382, 1768717, 947131, 156867, 806883, 1656221, 1251266, 791749, 1719785, 2742618, 2301891, 1712044, 2600689, 3538205, 2724037, 1810995, 3312316, 6174646, 7632133, 7533795, 7217135, 6245408, 4075436, 2705922, 3670785, 4731183, 3620983, 2402579, 3673553, 5425914, 4698391, 3290734, 4280011, 5940526, 5257108, 4348492, 6596715]
32786F596715K929058m34836j162042K926712M396627M57456k63003O216308R783604
32777C1446599M143733N32674Q741222J7458996J3326269J0502340L7318636R3483521
32769B16953990J39896002J34853496O9368998k9530133j14952075j44292655
32763B72297623j09935363n0643146j6082350j6692072k3289482j4648675k201309
32756C8805226k125691q048833o419637l99570o61550m961557m109746L53794
32748A2432436L35919l119603k758280P84096R81433j846036j864895P49056P50498
32739F444624j655209j559520Q54074Q97272j346455j377640Q83536J152689q39776
32730C453595j094636P76230J034869q16963j305269K03906O35717n92399p61764
$$ y = [6596715, 9525773, 9090937, 7928895, 10855607, 15252234, 15709690, 15446687, 21662995, 31446599, 35590332, 36123006, 44864228, 62323224, 75649493, 86151833, 123470469, 216953990, 356849992, 491703488, 561072486, 531542353, 416590278, 272297623, 162362260, 111719114, 95636764, 78944692, 55655210, 41006535, 38805226, 36679535, 28630702, 22211065, 21811495, 21149945, 16188388, 12078642, 12432436, 12768355, 9648752, 6890472, 7674568, 8656001, 6809965, 4945070, 5694126, 6444624, 4789415, 3229895, 4083969, 4981241, 3634786, 2257146, 3140682, 4293371, 3453595, 2358959, 3135189, 4170058, 3353095, 2047826, 2251732, 2887449, 2295050, 1533286]
32721A533286M83040N70795o56408o72242N01182K63365j232980j114729O61841
32712C37150J093629k65053o73110M55356O75913n10737p59727L93245O58906
32703A405572m34213o65521M25360O45925m86218p94832K83232O57523k82602
32694G54226n60592M11265P11926k25121m93256M68283P04067m44415r98948p1610
32684B55825N60957p2165m38895L33940P77818J3897n88983j27459K27435k80971
32674F61399n22730J44451N05680j76280p47845l21467K80757L13240K92047M80737
32664I09989K17362m52362m81265J83643L52597j55188j86593L78523K93448n15344
32654E44810n56991M32610Q30347L2894m89393N2527M37083j02295m72537N3232
$$ y = [1533286, 2016326, 2587121, 1930713, 1258471, 1759653, 2023018, 790038, -324691, 337150, 1430779, 1165726, 492616, 947972, 1623885, 1113148, 353421, 746666, 1405572, 971359, 305838, 731198, 1377123, 890905, 96073, 379305, 1036828, 754226, 193634, 604899, 1316825, 1091704, 598448, 1066731, 1770798, 1326383, 327435, 255825, 816782, 744617, 305722, 639662, 1417480, 1431377, 842394, 714935, 942370, 661399, 138669, 283120, 788800, 612520, -135325, -456792, -176035, 137205, 429252, 909989, 1127351, 674989, 193724, 377367, 729964, 574776, 388183, 766706, 1060154, 544810, -12181, 420429, 1250776, 1283670, 794277, 846804, 1283887, 1181592, 709055, 762287]
32644G62287M35881q4833n90287l03765R0998J9358N2006M01937K54663m71956
32634E66289n94807J92685N74248o4461n30793l5240M62630J85592j14902J32783
32624G74024J52628m63486p09284n9158L66784j95513p03612j94467N06380L60890
32614a64814q6918P6628M45714K22816k85981l75062j53006R426K56792N74170
32604E19765L94935k96218n85966j12028K76311N0066j20225K20406L96341m0894
32594G02493l89974j28818J40141n4362j65537J43002K33598j60533k21082L86256
32584D85184O47460o0748p50643m54815K26690L47446J39036J65305J41753k39012
32574F47656m15743j2841K90251m369k30639J37240L85840j00543n87829k93558
$$ y = [762287, 1198168, 1113335, 523048, 219283, 310281, 329639, 381645, 783582, 1038245, 566289, -28518, 164167, 738415, 673954, 143161, 107921, 570551, 756143, 641241, 774024, 926652, 463166, -246118, -305276, 61508, -134005, -837617, -1032084, -525704, -164814, -251732, -175104, 270610, 493426, 207445, -167617, -320623, -311197, -54405, 519765, 914700, 618482, 32516, -79512, 196799, 246865, 126640, 347046, 743387, 702493, 312519, 183701, 323842, 269480, 103943, 246945, 480543, 320010, 98928, 485184, 1132644, 1071896, 321253, -133562, 93128, 440574, 579610, 744915, 886668, 647656, 231913, 219072, 509323, 504954, 274315, 411555, 797395, 696852, 109023, -184535]
32564a84535J92614N9885k35769L7393M22893J86466k25254m3437L24146P4707
32554F09109m22322k71986L03435L64642j19106l38894m8366K40531K37550R6476
32544F51069j06648l33869l27842l5632J31633m36q792K64058K73465j82450l82098
32533e7542R7443N07519J58525l88702l40731m316l5730j78054J02873M42581
32523C03866K25435k04337j49590J64407P7478k30779j14197K92927L29873n724
32513F89359j78221j34952k16630l16944q4317K71242K60016k0410j06643M68
32503A62968m464l9217J33086K82894Q0247k16193j57781J12392J58572J84q3678
32492D29010j11607j40430P7563N22449N48995j42545p55094m81621K00350K87245
$$ y = [-184535, 8079, 67964, -167805, -130412, 292481, 478947, 253693, 210256, 534402, 609109, 186787, -85199, 218236, 582878, 463772, 124878, 76512, 317043, 554593, 651069, 544421, 210552, -117290, -152922, -21289, -21725, -30517, 233541, 507006, 324556, -57542, 39901, 547420, 705945, 317243, -23488, -27804, -63534, -241588, -138715, 303866, 529301, 324964, 175374, 339781, 417259, 186480, 72283, 365210, 695083, 689359, 511138, 376186, 159556, -157388, -241705, 29537, 289553, 269143, 162500, 162968, 158504, 119287, 252373, 535267, 615514, 399321, 241540, 353932, 512504, 512688, 429010, 317403, 176973, 254536, 776985, 1325980, 1183435, 428341, -53280, 147070, 434315]
32482D34315j73518l29128k681J83409R534p6365R4299J30125j35517l32878j82603
32471c81008J24279K72977J56253j23791k94404j14104K25581K22207j66656l55101
32461d33767n5707K23226N3565j94579q7761P9788o7804j75882J92584O31216
32451A64879M85202n4509l13271k19794j77450j80993O2169L74284L16465j4990
32441D41992j59367q4044r7390j71318o1551Q7387l8679k70670k01224Q1676J65202
32430c07986N5688R7875K79522K46683o2128l37486l80593k36672K875J74598
32420d67624P5682j49409l9542M13107N45229L5278m63979l07868J29678J59713
32410f9735p8548l5372J71362M8459k43620j29432L09392M25416P7407k25374
$$ y = [434315, 260797, -68331, -71012, 112397, 121931, 45566, 139865, 269990, 134473, -198405, -381008, -256729, 16248, 172501, 48710, -245694, -359798, -134217, 87990, -78666, -433767, -489474, -266248, -212683, -407262, -495023, -415235, -483039, -658921, -466337, 164879, 650081, 595572, 282301, 62507, -114943, -295936, -233767, 140517, 456982, 441992, 282625, 198581, 101191, -70127, -131678, -44291, -82970, -353640, -554864, -473188, -307986, -252298, -154423, 125099, 371782, 309654, -27832, -408425, -645097, -642222, -467624, -391942, -541351, -580893, -167786, 377443, 412721, -51258, -359126, -229448, -69735, -148283, -183655, -12293, 36166, -207454, -336886, -27494, 397922, 475329, 249955]
32400B49955k07259r9977n7171K1973R9625L0367n7926N3500K13938J32834q4362
32389B95497j34654o2756r9556j66626n3098J28334J46939P2533M3977o0456k70970
32378a60836k49212J31658L82739J41195j66075k8972K76898K28413l5291j04791
32368D15726j15401l43331m54035n1925M34560L55502m6171q9996J27275J2979
32358B45183l14111k08557K67798L97804M8428j81664o1650J4420q6803m7824
32348G3024J25302M5295k37632k22762J18943K34319o5816l22505k31422k4989
32338e08243O1409O4080j2262j63402j11968K88481N33579J16057m88204l89638
32328f10111K74424M87804l9169m76586k61787J49774K28685J27057R4857k8993
$$ y = [249955, 42696, -57281, -114452, -92479, 7146, 37513, -20413, 33087, 247025, 379859, 295497, 160843, 98087, -1469, -168095, -221193, -92859, 54080, 126613, 170590, 110134, -160836, -410048, -278390, 104349, 245544, 79469, 50497, 327395, 555808, 520517, 415726, 300325, -43006, -497041, -548966, -114406, 241096, 194925, 104929, 232204, 245183, -68928, -277485, -9687, 388117, 436545, 254881, 193231, 207651, 120848, 73024, 198326, 243621, 5989, -216773, -97830, 136489, 70673, -251832, -483254, -508243, -446834, -382754, -395016, -558418, -670386, -381905, 151674, 267731, -220473, -610111, -335687, 152117, 112948, -363638, -625425, -475651, -246966, -119909, -25052, -54045]
32318e4045k97533l34066K2119L33563K30103m9411j29219n3747n2431j26128
32308e10795j34536j8550J93452L58957K45968j09352k46536R3454M35834K24923
32298E32819k61822l50573p4436r082j79394p4606K86609K97984j24034l32672
32288b89207n6974J91020P7431m8215P3366J38767n5240k00864q9310K7129q78
32277b32975N8393K35038J55715k56312n12216l14082J4120J44075J90081K56696
32267b61467J60218r0755j38906R1991K02135L4814l5148J62277K26012p1835
32257B79336l14027j46486J22166R2070p8424o8589K0041m9886j65437j09118
32247d18354K3139L1376l0634j1285P2941J41214J65229P5901j34118j98857J02649
$$ y = [-54045, -351578, -685644, -663525, -329962, -99859, -149270, -278489, -332236, -384667, -510795, -645331, -663881, -470429, -111472, 134496, 25144, -221392, -127938, 307896, 532819, 270997, -79576, -154012, -163094, -342488, -417094, -130485, 167499, 43465, -289207, -346181, -155161, -77730, -125945, -52579, 86188, 30948, -169916, -259226, -232097, -232975, -174582, 60456, 216171, -40141, -552357, -866439, -852319, -708244, -518163, -261467, -101249, -192004, -330910, -238919, -36784, -1970, -37118, 125159, 351171, 279336, -34691, -181177, -59011, 33059, -45365, -113954, -93913, -143799, -309236, -418354, -395215, -363839, -394473, -405758, -332817, -191603, -26374, 49527, -84591, -283448, -180799]
32236a80799M34425K69442k22537l28843Q0286L43102J15976j17976K7040K04853
32226F24969O8230j02309j6887M1863j86969l68123j75113P1202l1636k47746
32216c22519j52954J25354K12732J42614J31807P7196j45531k45358K0331K83039
32206A26711R4792k74474k39294J30941K45796k4860k04561n3432Q8995n5886
32196a65272k46326j31752K18167M22285K54491j34230l82801k73418M6611K40674
32186a51571J83763N0149o958l6803r1474j04250p1375r4427j32443q51K55746
32175b00494L16061Q1723j12088j1067J62399J08888n2182k8218J26581J04886
32165D96489j49415l51371k67905K0227K50289K41684L8843j49465j76467j04025
$$ y = [-180799, 253626, 523068, 300531, -28312, 51974, 395076, 511052, 393076, 420116, 624969, 693199, 590890, 574003, 615866, 428897, 60774, -114339, -43137, -74773, -322519, -475473, -350119, -137387, 5227, 137034, 214230, 68699, -176659, -156328, 126711, 221503, -52971, -292265, -161324, 84472, 59612, -144949, -198381, -109386, -165272, -411598, -543350, -325183, 97102, 351593, 217363, -165438, -438856, -392245, -151571, 32192, 82341, 75383, 38580, -52894, -157144, -228519, -322946, -455389, -456240, -200494, 115567, 197290, 85202, 74135, 236534, 345422, 293240, 265022, 391603, 496489, 347074, -4297, -272202, -251975, -1686, 239998, 278841, 129376, -47091, -151116]
32155a51116o1961n4633l9897o4496j17991j9232K71128M12627J34912k47322
32145F2019k30294J03036K34167M8774p1383J6037K0968j55912k23356o2057Q5321
32134a72680J21776K22481L30510J41430k54223l58083q3775P9390n7229o3991
32124i4394K48840M07375J23186j52332k6331J42987p7479m11135l72040n6883
32114b68206J53665K36766L01228J66186k36953m56123j36095L13690K87230j01648
32104B59740k83792j28640M0363Q4279J08386P8880p6236j71407n8010K1703j40114
32093b64848k38119M5854L75763K40994j58150k19779M7552R2629j66406j96985
32083d41495J82242M30315J33255l62209m85600j93894J24864K14007J42979R8662
$$ y = [-151116, -213077, -267710, -307607, -372103, -490094, -509326, -238198, 174429, 309341, 62019, -168275, -65239, 168928, 217702, 146319, 162356, 183324, 27412, -195944, -258001, -172680, -50904, 171577, 502087, 643517, 389294, 31211, -52564, 26826, -30403, -94394, 154446, 561821, 685007, 532675, 506344, 649331, 571852, 160717, -211323, -268206, -114541, 122225, 423453, 589639, 352686, -103437, -239532, 74158, 361388, 259740, -24052, -152692, -112329, -28050, 80336, 159216, 82980, -88427, -146437, -124734, -264848, -502967, -457113, -81350, 159644, 1494, -218285, -170733, -78104, -244510, -441495, -259253, 171062, 304317, -57892, -543492, -737386, -612522, -398515, -255536, -156874]
32073a56874J65507K47729J67341r2688l04870k73418q7687N2371J20348J69496
32063G255J08242j55295m29584l81792K9226M50781M94049J20155l03248l37647
32053c97858L1627L17236J57759j31302l9461K53860J25322l56645l76523K78980
32043a37005O99425K21950m87678m86740l736R9909j97938k12458J30608K16285
32033a57378p9215j84834Q1707K10854R025k2926L19657M39640n9266n91718m50595
32022d85049R8894K80628m207j74957J2203J55899k9555k46372j36747J53183
32012c76080K51660J42798J11532K18845K10369n444j45338j0751J33265n0929
32002D79927m02913m68773j74535J19985K06038K16330K03379J9345k62966l02162
$$ y = [-156874, 8633, 256362, 423703, 331015, 26145, -247273, -334960, -282589, -162241, 7255, 115497, -39798, -469382, -851174, -821948, -371167, 122882, 243037, -60211, -397858, -366231, -48995, 108764, -22538, -61999, 191861, 317183, -39462, -415985, -137005, 562420, 784370, 296692, -190048, -193784, -93875, -291813, -504271, -373663, -157378, -236593, -421427, -339720, -128866, -119841, -142767, 176890, 616530, 557264, -34454, -485049, -386155, -105527, -109734, -284691, -272488, -116589, -146144, -392516, -529263, -376080, -124420, 18378, 129910, 348755, 559124, 553680, 408342, 397591, 530856, 479927, 77014, -391759, -566294, -446309, -240271, -23941, 179438, 198783, -64183, -366345]
31992c66345n2764J00725m218l4853J70231K18533j30881m09244j39047L38958
31982c08905L66020k7117k56600j00149J57036L18351L91267K40764k27171o08069
31972e4573l81473K40097M79162Q4686l51115l02559L9394K37128K12411J09145
31962C12303l1626j63117j16542J27828K88097J34457j85568l58959k82878p6432
31952c52437J30439K64935K73765J55668o503j16192j49860j60851k03627k32120
31942c96783j11374J65038L33176J61207j34698j15033J96427K83632m3242k94448
31932D3902p8602K54957K09865m7527m0326J86503K16494J8767q8079p5866j66230
31921D33858k60244p8932J81130L9037l93254m47981M6510M51937K98573o9924
$$ y = [-366345, -419109, -318384, -322602, -357455, -187224, 31309, -99572, -508816, -647863, -308905, 57115, 29998, -226602, -326751, -169715, 148636, 539903, 780667, 553496, -54573, -436046, -195949, 283213, 367899, 16784, -285775, -246381, -9253, 203158, 312303, 280677, 117560, 1018, 128846, 416943, 551400, 365832, 6873, -276005, -352437, -221998, 42937, 316702, 472370, 465867, 349675, 199815, 38964, -164663, -396783, -508157, -343119, -9943, 151264, 16566, -98467, 97960, 381592, 338350, 43902, -34700, 220257, 430122, 382595, 342269, 528772, 745266, 764033, 675954, 600088, 433858, 173614, 94682, 275812, 314849, -78405, -526386, -479876, -27939, 270634, 200710]
31911B00710j56673m1081m2278j17542m3557J26310J93844J72542J73352J35536
31901F01163k5033j72947j39429j4988q424j16810j47249k153K07290K85505J24043
31890E90968j70797l11311j24438J95178L07843J78371O3088O3991Q535j70313
31880F31115k62347j23234Q6166J53438P3967o9340k44437l58970k63048j6444
31870c93134R2483l4732j15121Q4238L56205L51519R1818r2817l8351R7905J11343
31859E11356l4132k43964l71599k77111K9809L05331K80652j2438k42033j53085
31849b07214J35631K74459Q5694k40039l59747j48044J87059L40504K08843n1966
31839B25180k06901j51849J2743R3539J8590p2627j0738J65537K60138J88900
$$ y = [200710, 44037, 2956, -39322, -156864, -200421, -74111, 119733, 292275, 465627, 601163, 576130, 403183, 263754, 248766, 240342, 123532, -23717, -25870, 181420, 466925, 590968, 420171, 108860, -15578, 179600, 487443, 665814, 728902, 792893, 801428, 631115, 368768, 245534, 331700, 485138, 559105, 489765, 245328, -113642, -376690, -393134, -300651, -335383, -450504, -366266, -10061, 341458, 433276, 340459, 302108, 400013, 511356, 477224, 233260, -138339, -415450, -385641, -80310, 200342, 187904, -54129, -207214, -71583, 202876, 288570, 48531, -311216, -459260, -272201, 68303, 277146, 225180, 18279, -133570, -120827, -27288, -8698, -81325, -92063, 73474, 333612, 522512]
31829E22512N8660k2796n4903m6635O943J7027j25389l11886k78821P31K18792
31818a5765J50542n5497j50067j19370p4093j5577Q3792J40082R2697L5113N0777
31807A22634O8943J8911m0191n7708o6693l4292J16273K54574J33057j62683k37892
31796A14933k5164M5081k38127m42691j49460L80606O11096M50028J55711j28510
31786G73503l21696k41652N5466J25540k10650m56728j95796J83761J42628p2728
31776b18352Q1290L94726K49789k13559k58871J75529L45999m9457m14864k83529
31766a91299J9594O3590l9518k0739Q6723J84785L08761L52171R0186l27773m33278
31755I3203j75052m4415k57652m02453j69201J49919K24882K01701K73516K44622
$$ y = [522512, 581172, 558376, 503473, 456838, 463781, 480808, 355419, 43533, -235288, -234557, -15765, 134777, 79280, -70787, -190157, -264250, -279827, -196035, -55953, 36744, 71857, 122634, 191577, 210488, 170297, 112589, 45896, 11604, 127877, 382451, 515508, 352825, 114933, 89769, 134850, -103277, -545968, -695428, -314822, 296274, 746302, 902013, 773503, 451807, 210155, 265621, 391161, 180511, -276217, -472013, -288252, -145624, -218352, -137062, 257664, 507453, 293894, 35023, 210552, 556551, 507094, 92230, -191299, -171705, -108115, -147633, -168372, -81649, 103136, 411897, 764068, 854254, 526481, 93203, -81849, -126264, -383916, -786369, -955570, -805651, -580769, -379068, -105552, 139070]
31745A39070m5247k89784j65732J15872J39287q4686k02323n1490J99817L20619
31735G5403K19013O693n0649J60784L45754J51494k48977l49223r4716M6105j20423
31724A41258k31685o9522O5355l0908o0753J84834L64705J59583j53893j71927
31714A97047j0982n919j04725n9178N8374J8239r6361l9447J31969J50636j6347
31703B23306j56416j43288j5677J43791K00889L1925k19133k01395J24494L41096
31693C29592J87697l6764M551J27405r096k91343l61835k13571j17088j15367
31683d95819l0306J31511J82878J08805P3888J17126J14237n864k12155m30319
31673d46018m79963j55119M09557O88337L73380j65636l38365p2576K18691K48909
$$ y = [139070, 93823, -195961, -361693, -245821, -106534, -191220, -393543, -445033, -245216, 75403, 294416, 301109, 250460, 411244, 756998, 908492, 659515, 310292, 215576, 261681, 141258, -90427, -159949, -94594, -125502, -186255, -1421, 363284, 522867, 368974, 197047, 186065, 180146, 75421, 16243, 74617, 92856, -3505, -42952, 89017, 239653, 223306, 66890, -76398, -92075, 51716, 252605, 284530, 65397, -135998, -11504, 329592, 517289, 480525, 485076, 612481, 603385, 312042, -49793, -263364, -380452, -495819, -526125, -394614, -211736, -102931, -29043, 88083, 202320, 196456, -15699, -446018, -925981, -1081100, -671543, 16794, 390174, 224538, -113827, -186403, 32288, 281197]
31663B81197J05080j4285j3432Q7821J52850L8539j61503j80471j0948L0790j40039
31652A75599j45366K22823N34434L22242j74721l69854j83347r317j2757j2586
31642C47150L3414l1140j61888j45040k4308l7205j30276j3213K71514L21052
31632D30060J7656k52764j89757J3097M6941o5611j28316j07723q0816l9408M3363
31621c13278Q1792j2065j64590k10003p9774J35955K74952K44595J28657J11788
31611A98029K21110K31795k4958l44521l54655k2426K70772K16536m9874j72365
31601A69443l0876J68414K06337J03068P796n2889j65875k85185k07131Q7092
31591A94K66439O7936k61576k56208J04626L72688K65688l8848k77030l75423
$$ y = [281197, 386277, 371992, 358560, 446381, 599231, 637770, 476267, 295796, 284848, 315638, 175599, 30233, 253056, 787490, 1109732, 935011, 565157, 381810, 372493, 359736, 347150, 380564, 349424, 187536, 42496, 18188, -19017, -149293, -162506, 109008, 430060, 447716, 194952, 5195, 18292, 65233, -378, -128694, -236417, -317233, -356641, -313278, -231486, -243551, -408141, -618144, -697918, -561963, -287011, -42416, 86241, 198029, 419139, 650934, 625976, 281455, -73200, -95626, 175146, 391682, 341808, 169443, 138567, 306981, 513318, 616386, 624182, 571293, 405418, 120233, -86898, 194, 266633, 334569, 72993, -183215, -78589, 294099, 559787, 520939, 243909, -131514]
31581a31514k80488O0568M01210L13837j70880m56519j87169K34610K67113M76
31571E1244r3141J02721K85269K31440l05k39284l05833j03025J88442K30706
31561C48234J8729p4619O4232O1148k29199l14915J24883N27659K22629m56658
31551B92123o15885j34712K60391J81971J4287P6716J32722k6805j60782n7587
31541c7561O8324j7237j62847j35844j5166J245n7702k9046J05371K09414J62381
31530I1332l2951k18921j90207L7831J76627O3984o4671K2008J08230j01217l76159
31519d84114k61436J32445K49519q495j42183Q3208K83468J73260K0649P6919
31509A23240J13308q6422k53844r4732J72313J88288M6052N6957J84165J66198
$$ y = [-131514, -412002, -351434, 49776, 363613, 192733, -263786, -450955, -216345, 50768, 51244, -41897, 60824, 346093, 577533, 577228, 337944, 32111, -70914, 117528, 348234, 366963, 292344, 356576, 417724, 188525, -126390, -1507, 526152, 748781, 292123, -323762, -458474, -198083, -16112, -1825, 74891, 207613, 180808, 20026, -37561, 30763, 13526, -149321, -285165, -300331, -299086, -356788, -385834, -280463, -71049, 91332, 58381, -160540, -350747, -312916, -136289, -72305, -136976, -114968, -6738, -107955, -484114, -745550, -613105, -363586, -372081, -514264, -431056, -147588, 25672, 46321, 123240, 236548, 150126, -103718, -198450, -26137, 162151, 208203, 265160, 449325, 615523]
31499F15523J7217l4866K0197M855q8829j41132k02957l77066m83047k40561K32111
31488f78555M89636L64460J43275P2706M2504j00193k35643j89870n7743p0551
31478b19974k42166l41762j88048J52188M40541M75144K63407L1564r25J12922
31468D82891J13348q5348k39626j36786M7911m634k37932k59465N3586L08586
31458D2531J41725k40805l41526n5408K25965J69554j04084k34600m7381K98649
31448a45380M81507L20449j3054j48529J9428J51695o7162m33258m86676j71870
31438d92850J18759J36772L8460J2944K4957L2533J15558K47616K42852O6893
31428E44494p6788p9960o3581r3223p5344j4828l0916n6339P7992K13571K5087
$$ y = [615523, 632740, 597874, 618071, 622926, 534097, 392965, 190008, -187058, -670105, -910666, -678555, -188919, 175541, 318816, 391522, 434026, 333833, 98190, -91680, -149423, -219974, -462140, -803902, -991950, -839762, -399221, 75923, 339330, 370894, 369969, 482891, 596239, 510891, 271265, 134479, 182390, 177756, -60176, -319641, -266055, 42531, 184256, -56549, -398075, -453483, -227518, -57964, -162048, -396648, -444029, -145380, 336127, 656576, 643522, 494993, 514421, 666116, 598954, 165696, -320980, -492850, -374091, -237319, -198859, -185915, -160958, -128425, -12867, 234749, 477601, 544494, 467706, 387746, 324165, 230942, 155598, 140770, 109854, 53515, 131507, 345078, 370165]
31417C70165l09696k27913K43785L53230j86884o24001l22295K14818J97094j80822
31407d72519j81991K00058L49547J51526P2960K25681K27974M507q0197N2061
31397E49607O6651j07518j61839m3314l9381j61691j20268K7119p9171l23165
31387c92970j74526L07416L81179j57488n10454j03649M86788M45651o7066l03028
31377h8147p1633K01969K65820K25353J10404j48347l82229l17935k3613J71268
31367e7090J63297J28943J34655N0863j26865j86760j9299J86870J72456p3154
31357C73916k92785k41348L2807K24237J33576q3614j50173n5474r167p4681j05787
31346b48493l3411M6278Q1513J15513J25128N4233j5003J5733L2081q9733j52242
$$ y = [370165, 60469, -167444, 76341, 429571, 242687, -381314, -703609, -488791, -291697, -472519, -654510, -454452, -104905, 46621, 119581, 345262, 573236, 577743, 497546, 549607, 616258, 508740, 346901, 303587, 264206, 102515, -17753, 9366, -69805, -392970, -567496, -260080, 121099, -36389, -546843, -650492, -163704, 281947, 214881, -88147, -159780, 42189, 308009, 533362, 643766, 495419, 113190, -204745, -228358, -57090, 106207, 235150, 369805, 420668, 293803, 107043, 87744, 274614, 447070, 373916, 81131, -160217, -127410, 96827, 230403, 146789, -3384, -58858, -68025, -142706, -248493, -281904, -235626, -154113, -38600, 86528, 140761, 125758, 141491, 173572, 83839, -68403]
31335f8403Q2412L65624K29536k27311l99660j07168J43060Q544j95113j43015
31325c11494m1095j20431j40627J10769K90211L1033l58831l29580L7268K00762
31315f32015N3553J8827K63105L98161J26780k63500l12580k9379J56289j927
31305b22686k47807j91304J38074L24734J75288K26Q7287K03401J4341k53309
31295B8245j32904K32134K34958j80411l79928p7885K25028J33393m3145Q403
31285D7888J1091k59048l88835k9653L80729L04352J4816N6070K32189L764m38642
31274f5279m39371l6056J01318j57192k38389M6083J86089k7639q0833L06989
31264d04280N89766K72243k51956l27629l8710M0363j92398k68135O5054M62082
$$ y = [-68403, 14009, 379633, 609169, 381858, -17802, -124970, 18090, 26634, -168479, -311494, -352589, -473020, -613647, -502878, -212667, -181634, -540465, -870045, -832777, -632015, -578462, -559635, -296530, 101631, 228411, -35089, -347669, -377048, -220759, -222686, -470493, -661797, -523723, -198989, -23701, -23475, 63812, 267213, 281554, 28245, -104659, 127475, 362433, 182022, -197906, -275791, -50763, 82630, 39485, 47888, 58979, -200069, -588904, -618557, -237828, 66524, 81340, 137410, 369599, 373363, -65279, -504650, -540706, -439388, -596580, -834969, -788886, -602797, -630436, -711269, -404280, 185486, 457729, 205773, -121856, -160566, -120203, -312601, -580736, -515682, -53600]
31254e3600M73297J04582k42990k59366n3630J5178j81968l54137k02240J22429
31244f32445K29665P4559r496J37307K82815K22214O7425k4829r6316j80038j38796
31233f7935P5539K44045J83585K2626l7284l5730r9002j55711p0904P1043Q8043
31222B18315J1904J0526O0538k0335k20620k95689j41888M0349O8348M0101J08247
31211a20204J76504O3178j35626j36610P3106J68583j4177j99579j09950O8851
31201a65924n477k24669j67111J85213L50374R8562j63377l3476K58230K54401
31191C86746K755r1184K9121L1573j64870k25247O081J96934N7045j72968r7544
31180d1558J82566J90070j88252m60445j99325L04506L78007j04466m96062k43871
$$ y = [-53600, 419697, 524279, 281289, 21923, -31707, -16529, -198497, -552634, -754874, -632445, -402780, -328221, -337717, -200410, 82405, 304619, 372044, 347215, 250899, 70861, -67935, 7604, 251649, 435234, 457860, 420576, 384846, 285844, 130133, 59229, 130272, 218315, 230219, 240745, 301283, 280948, 60328, -235361, -377249, -336900, -268552, -228451, -120204, 56300, 119478, -16148, -152758, -79652, 88931, 74754, -124825, -234775, -165924, -171401, -396070, -563181, -377968, -27594, 70968, -92409, -125885, 132345, 386746, 389501, 298317, 327438, 359011, 194141, -31106, -25025, 171909, 228954, 55986, -41558, 141008, 331078, 142826, -317619, -516944, -212438, 165569, 61103, -434959, -678830]
31170f78830L36183N00176J06322k65773k10067R245J8961r4544r1116m7421j19143
31159e36007j43744P0340K92367J88719p1275m0257K62147L58388P7801j97870
31149B60609j53694M6860J22191N8182l6980j36784j95046j24874k721j2363j02284
31138b76904l1070J61310J38396j22117j68345J90363M41571R8915m78687n40336
31128e86904k4831L83305K52497q2921j33895P4621J97323J24818M3196P4186
31118C21395J17821M5959j06146j79953p2787J31070K09030K8117k65714l60850
31108a32058j28957J98699K71568R587l14236l81468j57912J14660K11867J43100
31098a65150O6704O3543P1823K9102j6792J2418R4455J31860R0330L2697L036
$$ y = [-678830, -342647, 157529, 263851, -1922, -211989, -202744, -183783, -278327, -369443, -416864, -536007, -679751, -609411, -317044, -128325, -199600, -239857, 22290, 380678, 458479, 260609, 106915, 153775, 275966, 334148, 297168, 160384, -34662, -159536, -162257, -174620, -276904, -307974, -146664, -8268, -130385, -298730, -108367, 333204, 432119, -46568, -586904, -611735, -228430, 24067, -58854, -192749, -118128, 79195, 204013, 247209, 321395, 439216, 485175, 379029, 199076, 126289, 257359, 466389, 494506, 228792, -132058, -261015, -62316, 209252, 218839, -95397, -476865, -634777, -520117, -308250, -165150, -98446, -34903, 36920, 66022, 49230, 61648, 156103, 287963, 378293, 410990, 414026]
31087D14026l9786j20759j56699o9391M6294J1357j52571j82822P4735L97831
31077B22215M29412J24699k12375l14540j98772k6834R0839R6929l2609k10883
31067c1919k67884j51191R90O3035Q5632J63095K42781J91511J541j71423j67852
31056d1684J3841J94144J67845n4909k10009r7808J20878J31680p5022k05707
31046e6751j29936m3565q5181j04070L0138J74525J76175J34258J71218J78961
31036D45772M4254r4000q5557n7505j66961k70699j78679m7801j28057k60231
31026g99464q0350L28856M65669J51083j85737j17561K21678L81589J69725j95800
31016C39688l68114j91983J63089L50615K11820m6461j47377j00833p5507o1358
$$ y = [414026, 374240, 253481, 96782, 27391, 73685, 85042, -67529, -250351, -175616, 222215, 651627, 776326, 563951, 249411, 50639, 23805, 114644, 211573, 178964, -31919, -299803, -450994, -450004, -386969, -301337, -138242, 104539, 296050, 297591, 126168, -41684, -27843, 166301, 334146, 279237, 69228, -28580, 92298, 223978, 148956, -56751, -186687, -230252, -315433, -419503, -389365, -214840, -38665, 95593, 266811, 445772, 490026, 396026, 310469, 252964, 86003, -184696, -363375, -411176, -539233, -799464, -879814, -550958, -85289, 65794, -119943, -237504, -15826, 365763, 535488, 339688, -28426, -220409, -57320, 293295, 505115, 458654, 311277, 210444, 134937, 73579]
31006G3579M7640J43950M1262j32741p7570J42576J39054j42469k60118L9175
30996A4338L93106L61110M5198j52636j31821r9260j41172j31900o415J36894
30986B87442J76924N2084k13714m31287l42159K8683K84886J48006j33972j47402
30976b90509P2301J50093J1644k2630J63586K31629n5572l85574l19899P0358
30966c74573L39992L00107J47769K9244j24685k73405j76768J81851M11170K18219
30956F78921j46473k48475p6973M2996o276o0349n2669o8778n9502Q3618J78595
30945B64635n4389m12653l55893J34389M13780J46239j72572n5732J81444K7228
30935A16476l00986k34349J50366K61031j7456j90485j3922J82745J28801k1008
$$ y = [73579, 121219, 265169, 306431, 173690, 96120, 238696, 377750, 235281, -24837, 14338, 407444, 768554, 813752, 661116, 529295, 430035, 288863, 156963, 150548, 287442, 464366, 516450, 302736, -128551, -470710, -442027, -157141, -9135, -143107, -290509, -218208, -68115, -56471, -79101, 84485, 316114, 260542, -125032, -444931, -374573, -34581, 265526, 413295, 442539, 317854, 44449, -132319, 49532, 460702, 678921, 532448, 283973, 207000, 249996, 243720, 183371, 130702, 61924, 2422, 86040, 264635, 210246, -202407, -558300, -423911, -10131, 136108, -36464, -92196, 89248, 116476, -184510, -418859, -268493, -7462, -24918, -215403, -229325, -46580, 82221, 61213]
30925F1213r3062j52175k01723r4073J12375J45549J245r233J77054K31735K1770
30914B00675j41874n9661K5512p7169j37376L6624J80158P263k65249k38845O6448
30903d03494L17446L75313L31570J99246o6222l28201l69203j96113k1933Q030
30893a53561q6585k02320j96259J8639L00673L70097J88523L2188N4063M3550
30883C69008j77108l93571l11422p621K17126K57559J98261O0920j46573k61523
30873a94944j37342J04407K29822K00147J15725p809j76306k66417j78801k5926
30863c37444M3750O8738J21135J15844N599l8247R2400J94079Q7396k9185P6531
30852D00596J99330J3979l11143l26376l7032J06504m7799j56000j1644J34127
$$ y = [61213, -31849, -184024, -385747, -479820, -367445, -221896, -220651, -229884, -52830, 178905, 200675, 58801, -860, 24652, -52517, -189893, -153269, 26889, 34152, -231097, -469942, -403494, -86048, 289265, 620835, 820081, 753859, 425658, 56455, -139658, -161591, -153561, -240146, -442466, -638725, -620086, -319413, 50684, 239207, 271395, 325458, 369008, 191900, -201671, -513093, -520714, -303588, -46029, 152232, 213152, 66579, -194944, -332286, -227879, 1943, 202090, 317815, 310006, 133700, -132717, -311518, -337444, -293694, -224956, -103821, 12023, 17622, -20625, 71775, 265854, 353250, 324065, 400596, 599926, 613905, 302762, -23614, -60646, 45858, -1941, -157941, -169585, -35458]
30842c5458O2931m8199O851R7942K3615j32619j60789m1952R0911J50668J20944
30831A34845M2586M6498J95994K66948j3413m42157m46214J04109N86784M36013
30821I11993r1484l51096k26006j20476k03845k11553j1797J41942P9646K1660
30811f1016J81974L73072K78689q1083m11072n21630m17876j47249J79336L14372
30801c12483J21526j37715p6557K38557L24679L472k82246j20327K25327K11632
30791A95865j43434l02176n1630K03634J27084m7038R846J29086l8232l51760
30781b68755l44017M369J78062n9852k56754J6025M20456L12788k25259m03875
30771f26812J22010O68431M58944k48922n30975j25574K57823O2958l18175k39639
$$ y = [-35458, 27473, -20726, -13875, 84067, 107682, -24937, -185726, -227678, -136767, 13901, 134845, 177431, 223929, 419923, 686871, 673458, 231301, -214913, -110804, 475980, 911993, 820509, 469413, 243407, 122931, -80914, -292467, -304264, -162322, -82676, -61016, 120958, 494030, 772719, 691636, 280564, -241066, -658942, -806191, -626855, -312483, -190957, -328672, -405229, -166672, 158007, 161479, -120767, -241094, -15767, 195865, 52431, -249745, -301375, -97741, 29343, -17695, -7849, 121237, 83005, -268755, -612772, -608403, -430341, -490193, -746947, -730922, -310466, 2322, -222937, -626812, -504802, 163629, 622573, 373651, -157324, -282898, -25075, 37883, -280292, -519931]
30761e19931K08715M40239K85779O9262o5273k63717m23405k05183K81751M33148
30751B41385N1819k73584o0888L09928K25931j83144k93670K8273L05102K30926
30741E82078J9840o0963l6625j6817k2207r9973k82659l80842j59503K21320L11410
30730G5059J8151k29280j25997P4243K0383j70451j46241J05115K77814K26375
30720A25171Q1441n6720k12002l12287j90679J08019K88525K03595O5330R0079
30710A90472J39276l4961l18690l31378M871K97567K00933j38258l18904j87864
30700d96936Q4150K81001K87479Q0617j96742k57654j3625K08984Q8035j65345
30690a00036r0661K49217K75108k10538o37833m66809N2313L06050J84774O3808
$$ y = [-519931, -311216, 129023, 414802, 484064, 418791, 155074, -268331, -473514, -191763, 241385, 293204, 19620, -41268, 268660, 494591, 311447, 17777, 46050, 351152, 582078, 601918, 540955, 504330, 487513, 465306, 365333, 82674, -298168, -457671, -236351, 75059, 93210, -136070, -262067, -187824, -167441, -337892, -484133, -379018, -101204, 125171, 206612, 149892, -62110, -374397, -565076, -457057, -168532, 35063, 100393, 190472, 329748, 294787, -23903, -355281, -350410, -52843, 148090, 9832, -309072, -496936, -412786, -131785, 155694, 236311, 39569, -218085, -231710, -22726, 65309, -100036, -190697, 58520, 333628, 123090, -514743, -981552, -929239, -623189, -438415, -374607]
30680c74607J15293J31610n963j18545n7526Q1164J56870J57022J01492k2989
30670A63821j65676k06077r8905P8511K20795K41534Q3924j85069l55377k90913
30660e13432r6147O9195K21883M10427M70454K05367k37956m61669l10468l7284
30650b79630O3709j3438p2649L0499K58909M03459K47809j49506m12974k69230
30640a93042P1094J76277k4101j88260p9237J50455K39854J36833m3391j75954
30630G0528j73043m4531M3675n9192k35325k05531P6074L32384L26249J31702
30620B62990k8266n7593k2589k4172r0422j34320m1244J32519J54743n2585k21232
30609a22171r5556J53636J71382k4065q3360J07818K84627K55898J28071O521
$$ y = [-374607, -259314, -127704, -133667, -252212, -309738, -228574, -71704, 85318, 186810, 163821, -1855, -207932, -306837, -228326, -7531, 234003, 317927, 132858, -222519, -513432, -609579, -540384, -318501, 91926, 562380, 767747, 529791, 68122, -242346, -279630, -215921, -229359, -302008, -271509, -12600, 390859, 638668, 489162, 76188, -193042, -121948, 54329, 30228, -158032, -237269, -86814, 153040, 289873, 246482, 70528, -102515, -147046, -103371, -162563, -397888, -603419, -527345, -194961, 131288, 262990, 234724, 177131, 154542, 130370, 39948, -94372, -135616, -3097, 151646, 99061, -122171, -217727, -64091, 107291, 83226, -134, 107684, 392311, 648209, 776280, 782801]
30599G82801j53019k82647j65507J69660L56672J94112o6916j44252j25837j96823
30589C68244k53160j08527J15679J43080k5605j32248o2665K5614k0596j31183
30579h1367j10995J13523L54174L03890p7001l85940k20437K32496L80842N7896
30569E67081k36096j08191J34734J6461l31552l98836j07712J14465L2852j03472
30559d20266m6108Q8953J12744R5033J67951K12177J5737l27892m35470j10660
30549f47801L55752M99376K39826m5099m4440P9974r632k70284l23036m4558K19979
30538A0057J59445p4348j46620l2109K5010q6322k32137k68552j80421r242J81583
30527f53656K73752J78482j8130j00175L9597K48845K50476l7549l30765k39158
$$ y = [782801, 629782, 347135, 181628, 351288, 707960, 902072, 835156, 690904, 565067, 368244, 115084, 6557, 122236, 265316, 239711, 107463, 44798, 70412, 49816, -81367, -192362, -78839, 275335, 579225, 502224, 116284, -104153, 128343, 509185, 567081, 330985, 222794, 357528, 373989, 42437, -356399, -464111, -349646, -316794, -420266, -466374, -377421, -264677, -169644, -1693, 210484, 226221, -101671, -537141, -647801, -292049, 207327, 447153, 402054, 357614, 437588, 427956, 157672, -165364, -209922, 10057, 169502, 95154, -51466, -83575, -58565, -144887, -377024, -645576, -825997, -835239, -653656, -379904, -201422, -219552, -319727, -280130, -31285, 219191, 181642, -149123, -388281]
30517c88281K30287N82328M13586o2090l20724k26008o9026k854J00402K07489
30507D65109N8352k96906l94659n4927K69605J68145j18441j47328L6907J04325
30497I0182K9581J3385M6195M953q894J33279K37007P0352j83604k10075j07161
30486A15200j61062k69567j41394Q5244L6162j77954q6722L06844M89073K96611
30476D92435J36409J97913J28616k41133m85064k61475J17636J97442K9666p9890
30466B32555r7557j40473j40438r832J03410N5186k6523Q442N5072j4341r4302
30455f8801p3327n1414r3366o1272O7382N6743j40282j76189J13671L30549J28879
30444C2573j73320j02012J96147K51827O7638j761M9596m4260j81280j7744L10975
$$ y = [-388281, -157994, 424334, 837920, 775830, 455106, 229098, 160072, 157218, 257620, 465109, 523461, 226555, -168104, -223031, 46574, 214719, 96278, -51050, -14143, 90182, 119763, 133148, 179343, 184296, 175402, 308681, 545688, 616040, 432436, 222361, 115200, -45862, -315429, -456823, -371579, -335417, -513371, -600093, -293249, 195824, 492435, 628844, 826757, 955373, 714240, 229176, -32299, 85337, 282779, 312445, 232555, 134998, -5475, -145913, -155745, -52335, 2851, -23672, -15230, 39842, 25501, -68801, -142128, -193542, -286908, -348180, -280798, -224055, -364337, -540526, -426855, -96306, 32573, -140747, -242759, -46612, 205215, 272853, 271092, 320688, 276428, 95148, 77404, 388379]
30433C88379K90650j06878l36522j68784M127o6647q7514J23678K24230j2964
30423B51755k10478k4854K06307K6728l01526j79358L15671M84820P6303l36295
30413C09073k29845J25300J34530k31012m31782j62836K26565K49389l8702j57268
30403b06588O7166K31767k5712m28457m11982N9468M25154K98478o8461k19126
30393b78293p3818J18719J71036Q1701o8497j59604q9281Q4182J79619J54616
30383A20380J52795K10958J57057o5794k25266j38103M5314R9788M6658l779r5400
30372C04608k45762k50740P883K46317J28548j99264k90201k8087K79671L83526
30362C36499L09951J29595j29453l19745k62281l9659Q8770P6438R0247J27851
$$ y = [388379, 679029, 572151, 235629, 66845, 70972, 4325, -83189, 40489, 264719, 251755, 41277, 16423, 222730, 249458, -52068, -231426, 84245, 569065, 645368, 309073, 79228, 204528, 339058, 108046, -323736, -486572, -260007, -10618, -49320, -206588, -139422, 92345, 66633, -361824, -773806, -714338, -289184, 9294, -59167, -278293, -352111, -233392, -62356, 19345, -49152, -208756, -298037, -213855, -34236, 120380, 273175, 484133, 641190, 575396, 350130, 212027, 257341, 357129, 403787, 400008, 304608, 58846, -191894, -184011, 62306, 190854, -8410, -298611, -326698, -47027, 336499, 646450, 776045, 646592, 326847, 64566, 24907, 113677, 190115, 280362, 408213]
30352D08213k47k54793l17356q2596J48793J36977M4433J03207K16810J45194
30342E48635j00684k84380k54033o1614J33959J75367K4648j57313j70617m4338
30332a90370K0247j9765p028R5754J22844K6072j1029R2068J44213Q986j60336
30321A21656j85680j20242o7764Q131J14001J13092k9141j26243p3421p960l369
30310b56940P5259K13182J29186k01466l19440L6286M14277L05578m1065m4308
30300C10549K46993K90231q442k03425j39158j62312m03165n04339k66213J7413
30290h21868J08172J78390L45715L53169N2475k19958j25401J52922K25588N7914
30280C07118j18094k02108k13117j02592J08467K05330Q1237l6991N4710J76933
$$ y = [408213, 407966, 153173, -164183, -246779, -97986, 38991, 83424, 186631, 403441, 548635, 447951, 163571, -90462, -152076, -18117, 157250, 181898, 24585, -146032, -190370, -170123, -189888, -196916, -101162, 21682, 47754, 36725, 128793, 273006, 281992, 121656, -64024, -184266, -252030, -243899, -129898, -16806, -45947, -172190, -245611, -253571, -256940, -181681, 31501, 160687, -40779, -360219, -323933, 90344, 395922, 354857, 310549, 557542, 847773, 839331, 635906, 496748, 334436, -68729, -573068, -839281, -821868, -713696, -535306, -189591, 163578, 216053, -3905, -129306, 23616, 249204, 307118, 189024, -13084, -226201, -328793, -220326, -14996, 66241, 29250, 83960, 260893]
30270B60893P7138j14677j06529M6791N2099j03615j41919K0890J38518K7162
30260A56751j95027l14101k44523k2529K31269L40110K36512P9217N2696J23972
30250D44347J70189K19406L19579K98143k0830m31719n40075l26103j45913j47356
30240a60332r1288J39615K68219P6176k12758k71819j25984Q867J03667K20199
30230d5438K31123o81k68231k19586J03018K72834Q4487j70572j63956J0877N0025
30219a16100p4401r7291J20396L77929L91017J28107j86610l36417k90382j38022
30209b21774M5146J93787J90381k8992k76895k11391K19541N73429L92556j72027
30199G03761n03341l14862J5422M7899j08175q1616J09065J16623j00793j67124
$$ y = [260893, 338031, 223354, 116825, 163616, 215715, 112100, -29819, -8929, 129589, 156751, -38276, -352377, -596900, -619429, -388160, -48050, 188462, 267679, 320375, 444347, 614536, 833942, 1153521, 1451664, 1430834, 999115, 459040, 132937, -12976, -160332, -251620, -112005, 156214, 232390, 19632, -252187, -378171, -369304, -265637, -45438, 185685, 185004, -83227, -302813, -199795, 73039, 157526, -13046, -177002, -166125, -116100, -190501, -287792, -167396, 210533, 601550, 729657, 543047, 206630, -83752, -221774, -176628, 17159, 207540, 178548, -98347, -309738, -90197, 483232, 875788, 703761, 200420, -114442, -99020, -51121, -159296, -240912, -131847, -15224, -116017, -283141]
30189b83141R3603L36743K24123m5456n3420J89151K78527M4572k19771k24407
30179C40524p8645n5317j64224j89515o3308L9487M266l7399N4941J65338R3158
30168A09306r0546j14356N5000J35210k352r6352M6427J61927l9069k96077j50516
30157b81398K59071L34657l7488k98607j23042J11577M8131n4783J23574L45621
30147D27313K71904Q9576R8274O6089l21939o92958m46845J91574M06263L7546
30137A26797k35638m9511J44608j4694j73332M3984L43313K57158j24314l81272
30127f2901l81380k65067r9149R9505K28345K59263K95708K88608L2750l60927
30117C4755m13784J9047M19454L19457n7182k33392j55974k2444J67203M04139
$$ y = [-283141, -189538, 147205, 371328, 325872, 272452, 461603, 740130, 784702, 564931, 340524, 261879, 206562, 42338, -147177, -210485, -170998, -166732, -204131, -149190, 16148, 109306, 18760, -95596, -40596, 94614, 92262, -4090, 42337, 204264, 165195, -130882, -281398, -22327, 312330, 274842, -23765, -146807, -35230, 12901, -41882, 81692, 427313, 699217, 788793, 887067, 953156, 631217, -61741, -508586, -317012, 89251, 126797, -108841, -158352, -13744, -28438, -201770, -157786, 185527, 442685, 318371, -62901, -444281, -709348, -808497, -708992, -480647, -221384, 74324, 362932, 395682, 34755, -379029, -359982, 59472, 378929, 321747, 88355, -67619, -90063, 77140, 481279]
30107D81279L80235n7753m63499l56224K7892J22479o5640o9536J82043K87101
30097D68377J03007o7207m8281L708J3164Q4643J51303K5122j67391j12712Q6364
30086E40097j1705m11070n56755j80827K67923L08698P7374k1900O8762J26898
30076B07495N0254j03185k71620l66174k73344l4044J64343K57206L30749L43333
30066C05013J45229j51695k09811o841O5499j56593k85327P877M28192M71621
30056F13164J31458j82980k40291j47923n6501k3548q6043k08470k33604q6369
30046e21107P8157J06294P6409J05113R7398o7579k48750k10472J6393J88593
30036c79551J96881J35585Q7329M8327K4864K3999r175r7979j47004q8401k3297
$$ y = [481279, 861514, 803761, 340262, -15962, 11930, 134409, 68769, -767, 181276, 468377, 571384, 504177, 455896, 459604, 472768, 557411, 708714, 733836, 566445, 453733, 540097, 528392, 117322, -439433, -620260, -352337, -43639, 33735, 11835, 80597, 207495, 257749, 154564, -117056, -483230, -756574, -790618, -626275, -369069, -38320, 305013, 450242, 298547, 88736, 81895, 147394, -9199, -294526, -286649, 141543, 613164, 744622, 561642, 321351, 173428, 116927, 93379, 7336, -201134, -434738, -521107, -442950, -336656, -260247, -155134, -57736, -125315, -374065, -584537, -568144, -379551, -182670, -47085, 40244, 88571, 113435, 137434, 128259, 30280, -116724, -205125, -228422]
30025b28422o7974j58749j65519r2433o723J02940K07042J14072k75537o75046
30015a246349o47795j43544M19474O30798M68080J85232k483n6412m8571l4658
30005d76228J2473J31053K49055K31250O7113j09664k11455k45859j58345J24401
29995c86206M13864L37511j09067l99539j59499K65763L03466j3189j69140L450
29985H7414J42054J0326j61504j17539O1214J94681K38954J28439k37118o43905
29975b96984n96469m214N09168L72707j22886k42143J40458M28844K33345j18647
29965C03179j60935N9656J87732J08828k9039j50676k74190k90158n5518K81839
29955a9282L49875M0037k96444k75569N3297L15493K75799L2378k00739l28711
$$ y = [-228422, -296396, -455145, -620664, -713097, -719820, -616880, -409838, -295766, -571303, -1246349, -1894144, -2037688, -1618214, -987416, -519336, -334104, -336587, -392999, -441570, -476228, -463755, -332702, -83647, 147603, 214716, 105052, -106403, -352262, -510607, -386206, 27658, 365169, 256102, -143437, -302936, -37173, 266293, 253104, 83964, 87414, 229468, 239794, 78290, -39249, 21965, 216646, 455600, 584039, 346921, -296984, -893453, -897667, -388499, -15792, -138678, -380821, -240363, 188481, 421826, 303179, 142244, 201900, 389632, 498460, 469421, 318745, 44555, -245603, -301121, -19282, 330593, 370630, 74186, -201383, -148086, 167407, 443206, 475584, 274845, -53866]
29945e3866l51130k33632N6722L82374M44980J21608k55009k00341K49571M59423
29935F20700L8315n16101m58100R5493L05424j15390m68393j86670K92631K91041
29925a01050l0036m7192K36563K73483k8744j91009m3610M2950p8599o7708J87697
29914A52745K73011k4013k99247k15140l9908q9152j46942O9884L13110K03619
29904A97967j13910k39940j55551q4360K911K13253L10756M7443k76062j82693
29894b80186J78321K29527q8416k21734Q3018L92856K89734o9515l09547l09600
29884a05542j13241K21983M64776K93296k05831m75129k03949K09777K30113o5929
29874B50324j85455K2515K25460J76338L8619N1767J50919R6292j49316l50396
$$ y = [-53866, -404996, -638628, -581906, -199532, 245448, 367056, 112047, -88294, 161277, 620700, 659015, 142914, -315186, -219693, 85731, -29659, -498052, -684722, -392091, -101050, -131086, -178278, 58285, 331768, 303024, 112015, 68405, 111355, 32756, -34952, 152745, 425756, 401743, 102496, -112644, -152552, -241704, -388646, -318762, -5652, 197967, 84057, -155883, -311434, -395794, -392883, -179630, 131126, 178569, -97493, -280186, -101865, 127662, 39246, -182488, -99470, 293386, 583120, 513605, 204058, -105542, -218783, 3200, 467976, 761272, 555441, 80312, -123637, 86140, 316253, 250324, 64869, 87384, 312844, 489182, 527801, 579568, 730487, 826779, 677463, 327067]
29864C27067l02528q5834N3308J4927o9153o2387n132l763n0336n2910L0607J71684
29852c4450L02577L05643R5055k09455l41093k19722n5321j1477M208O2566J9919
29841h1550j47591j29432K32873N25061K96986j91955l16134m6376N2336k17777
29831b3559l82605j06300K91184L87594K27163M2113j47875l31414k96550J1990
29821c28259K49921J45273o4142j3853K19113K89747J14876j21226l05522l97880
29811b11952k70632Q9676L57190K10674j86222l84430k46876j8001J17328J82464
29801c60781J61993j3485k11812j79649N6010J82206P7706r543J17706K94548
29791A14899K72066P3217j20397k47300l23936k79330p4829J05975N3368j03823
$$ y = [327067, 24539, -61295, -7987, 6940, -62213, -124600, -129732, -133495, -183831, -236741, -206134, -34450, 268127, 573770, 668825, 459370, 118277, -101445, -156766, -168243, -164035, -101469, -81550, -229141, -358573, -125700, 399361, 696347, 504392, 188258, 141882, 194218, -23559, -406164, -512464, -221280, 166314, 393477, 435590, 287715, -43699, -340249, -328259, -78338, 66935, 2793, -11060, 208053, 497800, 612676, 491450, 185928, -211952, -482584, -392908, -35718, 174956, -11266, -395696, -642572, -660573, -543245, -360781, -198788, -212273, -424085, -603734, -547724, -365518, -287812, -297355, -179649, 114899, 386965, 460182, 339785, 92485, -231451, -510781, -585610, -479635, -426267, -530090]
29781e30090r962L70750N99547L49969p6605j40655J44394K24840j37818m72429
29771C21941l07270J16687K50101P3642Q398J27402N9701k72594m18419j16773
29761a57184K53711K53469j745j51598j66229k14297k30113l9244K50433L65382
29751A62585K59807Q2233j05284k71672k63550n1958N5636j57855l66020j38732
29741g94810L14044L90963L7121j72722L9180K56250J08489j52566j53074m926
29731a32051n167q5736j3634J10816K4112j76671j41945J38607K80563R3492j48318
29720e5932j50046n339K6290o8360r2408K3277J29937R0024n6003j69461j58111
29709d86132k4492J42884K04881Q7649r5880j30362L0892J74029J07589n8265
$$ y = [-530090, -540052, -169302, 430245, 780214, 703609, 562954, 707348, 932188, 794370, 321941, 14671, 131358, 381459, 455101, 463499, 590901, 650602, 378008, -40411, -157184, 96527, 349996, 348251, 196653, 30424, -183873, -413986, -453230, -202797, 162585, 422392, 504625, 399341, 127669, -135881, -187839, -132203, -290058, -656078, -794810, -480766, -89803, -52682, -225404, -186224, 70026, 178515, 25949, -127125, -132051, -137218, -222954, -236588, -125772, -101660, -278331, -420276, -281669, -1106, 92386, -55932, -205978, -211317, -185027, -253387, -345795, -322518, -192581, -102557, -158560, -328021, -486132, -510624, -367740, -162859, -75210, -171090, -301452, -270560, -96531, 11058, -47207]
$$ [...]
##END NTUPLES=NMR SPECTRUM
##END=
