##TITLE=31Pdec_LY-8Dix.2B
 CD3CN, 24 sc
 29.04.2021
##JCAMPDX= 6.0         $$ Bruker NMR JCAMP-DX V2.0
##DATA TYPE= NMR SPECTRUM
##DATA CLASS= NTUPLES
##ORIGIN= UXNMR, Bruker Analytische Messtechnik GmbH
##OWNER= root
$$ XWIN-NMR		Version 3.5
$$ Thu Apr 29 14:14:37 2021 Russian Standard Time (UT+4h)  she@DPX200
##.OBSERVE FREQUENCY= 81.013821
##.OBSERVE NUCLEUS= ^31P
##.ACQUISITION MODE= SIMULTANEOUS
##.ACQUISITION SCHEME= undefined
##.AVERAGES= 24
##.DIGITISER RES= 16
##SPECTROMETER/DATA SYSTEM= spect
##.PULSE SEQUENCE= zgpg30
##.SOLVENT NAME= DMSO
##.SHIFT REFERENCE= (INTERNAL, DMSO, 0, 248.564)
##AUDIT TRAIL= $$ (NUMBER, WHEN, WHO, WHERE, WHAT)
$$ ##TITLE= Audit trail, XWIN-NMR		Version 3.5
$$ ##JCAMPDX= 5.01
$$ ##ORIGIN= Bruker BioSpin GmbH
$$ ##OWNER= she
$$ F:/spectra/data/she/nmr/P31/1/pdata/1/auditp.txt
$$ ##AUDIT TRAIL=  $$ (NUMBER, WHEN, WHO, WHERE, WHAT)
(   1,<2021-04-29 14:13:29.40 +0400>,<she>,<DPX200>,
      <created by zg, POWCHK disabled, PULCHK disabled
       configuration hash MD5:
       00 E9 B6 7A A2 85 ED C7 34 08 36 98 17 FE 4E 26
       data hash MD5: 32K
       7A 3D E5 D6 0A 9F 65 E5 45 1E AD FA 96 89 CB B5>)
(   2,<2021-04-29 14:13:36.39 +0400>,<she>,<DPX200>,
      <Start of raw data processing
       efp BC_mod = 2 LB = 1 FT_mod = 6 PKNL = 1 PHC0 = -6454.305 PHC1 = 573.0009 SI = 64K 
       data hash MD5: 64K
       F5 53 10 58 0B C7 34 80 8D 79 E3 3A E5 84 9E 9C>)
(   3,<2021-04-29 14:13:55.81 +0400>,<she>,<DPX200>,
      <pk PHC0 = -10.01577 PHC1 = 0 
       data hash MD5: 64K
       49 E6 44 4F 75 1D A8 0E E9 E7 E3 C1 30 8D 3E 13>)
(   4,<2021-04-29 14:14:01.64 +0400>,<she>,<DPX200>,
      <abs ABSG = 5 
       data hash MD5: 64K
       4A C6 13 E1 0B DC 3D AA 7A 94 59 80 14 C2 76 77>)
$$ ##END=
$$ 
$$ hash MD5
$$ 79 D5 8D 3A A4 3A 31 34 B0 EE 95 60 66 E2 B9 AD
##$RELAX= 
##$RELAX= 
##$RELAX= 
##$RELAX= 
##$RELAX= 
##$RELAX= 
##$RELAX= 
##$RELAX= 
$$ Bruker specific parameters
$$ --------------------------
##$DU= <F:/spectra>
##$EXPNO= 1
##$NAME= <P31>
##$PROCNO= 1
##$TYPE= <nmr>
##$USER= <she>
##$AMP= (0..31)
100 100 100 100 100 100 100 100 100 100 100 100 100 100 100 100 100 100 
100 100 100 100 100 100 100 100 100 100 100 100 100 100 
##$AQSEQ= 0
##$AQ_mod= 1
##$AUNM= <au_zg>
##$AUTOPOS= <>
##$BF1= 81.014009
##$BF2= 200.13
##$BF3= 200.13
##$BF4= 200.13
##$BF5= 200.13
##$BF6= 200.13
##$BF7= 200.13
##$BF8= 200.13
##$BYTORDA= 1
##$CFDGTYP= 0
##$CFRGTYP= 5
##$CHEMSTR= <none>
##$CNST= (0..31)
1 1 145 1 1 1 1 1 1 1 1 1 1 1 1 1 1 1 1 1 1 1 1 1 1 1 1 1 1 1 1 1 
##$CPDPRG= <waltz16>
##$CPDPRG1= <>
##$CPDPRG2= <waltz16>
##$CPDPRG3= <>
##$CPDPRG4= <mlev>
##$CPDPRG5= <mlev>
##$CPDPRG6= <mlev>
##$CPDPRG7= <mlev>
##$CPDPRG8= <mlev>
##$CPDPRGB= <>
##$CPDPRGT= <>
##$D= (0..31)
0 1 0 0 0 0 0 0 0 0 0 0.03 2e-05 3e-06 0 0 0 0 0 0 0 0 0 0 0 0 0 0 0 0 
0 0 
##$DATE= 1619691208
##$DBL= (0..7)
120 120 120 11 120 120 24 19 
##$DBP= (0..7)
150 150 150 150 150 150 150 150 
##$DBP07= 0
##$DBPNAM0= <>
##$DBPNAM1= <>
##$DBPNAM2= <>
$$ [...]
##$SUBNAM3= <"">
##$SUBNAM4= <"">
##$SUBNAM5= <"">
##$SUBNAM6= <"">
##$SUBNAM7= <"">
##$SUBNAM8= <"">
##$SUBNAM9= <"">
##$SW= 501.771253377433
##$SWIBOX= (0..15)
0 1 3 0 0 0 0 0 0 0 0 0 0 0 0 0 
##$SW_h= 40650.406504065
##$TD= 32768
##$TD0= 1
##$TE= 0
##$TE2= 300
##$TE3= 300
##$TEG= 300
##$TL= (0..7)
0 120 53 12 22 120 120 120 
##$TP= (0..7)
150 150 150 150 150 150 150 150 
##$TP07= 0
##$TPNAME0= <>
##$TPNAME1= <>
##$TPNAME2= <>
##$TPNAME3= <>
##$TPNAME4= <>
##$TPNAME5= <>
##$TPNAME6= <>
##$TPNAME7= <>
##$TPOAL= (0..7)
0.5 0.5 0.5 0.5 0.5 0.5 0.5 0.5 
##$TPOFFS= (0..7)
0 0 0 0 0 0 0 0 
##$TUNHIN= 0
##$TUNHOUT= 0
##$TUNXOUT= 0
##$USERA1= <user>
##$USERA2= <user>
##$USERA3= <user>
##$USERA4= <user>
##$USERA5= <user>
##$V9= 5
##$VALIST= <valist>
##$VCLIST= <CCCCCCCCCCCCCCC>
##$VD= 0
##$VDLIST= <DDDDDDDDDDDDDDD>
##$VPLIST= <PPPPPPPPPPPPPPP>
##$VTLIST= <TTTTTTTTTTTTTTT>
##$WBST= 1024
##$WBSW= 4
##$XGAIN= (0..3)
0 0 0 0 
##$XL= 0
##$YL= 0
##$YMAX_a= 7857
##$YMIN_a= -20747
##$ZGOPTNS= <>
##$ZL1= 120
##$ZL2= 120
##$ZL3= 120
##$ZL4= 120
##$ABSF1= 248.5645
##$ABSF2= -253.2056
##$ABSG= 5
##$ABSL= 3
##$ALPHA= 0
##$AQORDER= 0
##$ASSFAC= 0
##$ASSFACI= 0
##$ASSFACX= 0
##$ASSWID= 0
##$AUNMP= <proc_1d>
##$AZFE= 0.1
##$AZFW= 0.5
##$BCFW= 0
##$BC_mod= 2
##$BYTORDP= 0
##$COROFFS= 0
##$CY= -3
##$DATMOD= 1
##$DC= 0
##$DFILT= <>
##$DTYPP= 0
##$F1P= 0
##$F2P= 0
##$FCOR= 1
##$FTSIZE= 65536
##$FT_mod= 6
##$GAMMA= 0
##$GB= 0
##$INTBC= 1
##$INTSCL= 5.30512e-09
##$ISEN= 30
##$LB= 1
##$LEV0= 0
##$LPBIN= 0
##$MAXI= 10000
##$MC2= 0
##$MEAN= 0
##$ME_mod= 0
##$MI= 50
##$NCOEF= 0
##$NC_proc= -2
##$NLEV= 6
##$NOISF1= 182.463
##$NOISF2= 159.3651
##$NSP= 0
##$NTH_PI= 0
##$NZP= 0
##$OFFSET= 248.5645
##$PC= 4
##$PHC0= -6464.321
##$PHC1= 573.0009
##$PH_mod= 1
##$PKNL= yes
##$PPARMOD= 0
##$PSCAL= 0
##$PSIGN= 0
##$REVERSE= no
##$SF= 81.014009
##$SI= 65536
##$SIGF1= 159.3651
##$SIGF2= -187.1042
##$SINO= 113.3802
##$SIOLD= 16384
##$SREGLST= <1H.CDCl3>
##$SSB= 0
##$STSI= 65536
##$STSR= 0
##$SW_p= 40650.406504065
##$SYMM= 0
##$S_DEV= 0
##$TDeff= 32768
##$TDoff= 0
##$TI= <>
##$TILT= no
##$TM1= 0
##$TM2= 0
##$TOPLEV= 0
##$USERP1= <user>
##$USERP2= <user>
##$USERP3= <user>
##$USERP4= <user>
##$USERP5= <user>
##$WDW= 1
##$XDIM= 65536
##$YMAX_p= 376915573
##$YMIN_p= -20065529
$$ End of Bruker specific parameters
$$ ---------------------------------
##NTUPLES= NMR SPECTRUM
##VAR_NAME=  FREQUENCY,     SPECTRUM/REAL,   SPECTRUM/IMAG
##SYMBOL=    X,             R,               I
##VAR_TYPE=  INDEPENDENT,   DEPENDENT,       DEPENDENT
##VAR_FORM=  AFFN,          ASDF,            ASDF
##VAR_DIM=   65536,         65536,           65536
##UNITS=     HZ,            ARBITRARY UNITS, ARBITRARY UNITS
##FACTOR=    0.620285442955139, 1,           1
##FIRST=     20137.2065510759, 0,            0
##LAST=      -20513.1999529892, 0,           0
##MIN=       -20513.1999529892, -20065529,   0
##MAX=       20137.2065510759, 376915573,    0
$$ Real data points
##PAGE= N=1
##DATA TABLE= (X++(R..R)), XYDATA
$$ [...]
35968D39987j42606j99668q4045P2202J02996j5970j55271j71908m8164R9843
$$ 439987 297381 97713 13668 85870 188866 172896 17625 -154283 -202447 -102604
35958a02604J38063L8559r8099j35273k9204J17631J48539K6369j04553q0284
$$ -102604 35459 74018 -24081 -159354 -188558 -70927 77612 103981 -572 -80856
35948h0856P1422J58727P7973n6160q5169j7590K8478J9124J2444J3031l1840
$$ -80856 -9434 149293 227266 171106 85937 68347 96825 115949 128393 141424 109584
35937A09584q8048m0377J10609J94536R3022r2770j84300j42697m9290M3020J22156
$$ 109584 21536 -18841 91768 286304 379326 286556 102256 -40441 -89731 -46711 75445
35926G5445J44964Q1245k625j8923P570r223n9550n8807j4177k7860j09288j22096
$$ 75445 220409 301654 299029 280106 287676 278453 218903 160096 145919 118059 8771 -113325
35914a13325J4615J74706J64121l4572k27465k14826n355J82781J56158k1260
$$ -113325 -98710 75996 240117 205545 -21920 -236746 -242101 -59320 96838 75578
35904G5578j04156k497Q8765K924j05831K847K27041K24639n4738k55284j34207
$$ 75578 -28578 -31075 57690 60614 -45217 -42370 184671 409310 354572 99288 -34919
35893c4919R0488Q5463j35368l02270k67311p8568J73779L65886L24748M0965
$$ -34919 55569 141032 5664 -296606 -563917 -642485 -468706 -102820 221928 262893
35883B62893k02794j54649M1825O0027j08626j66389m542J35311O5388p2436p1510
$$ 262893 60099 -94550 -52725 7302 -101324 -267713 -272255 -136944 -71556 -143992 -215502
35872b15502K4773M0778n0788j24987q9436M3133J93021K44788J24957q1243j79658
$$ -215502 -190729 -149951 -200739 -325726 -415162 -372029 -179008 65780 190737 109494 -70164
35861g0164r9737J6833K5428k9991k2014O0021J21875J09673M1731n5639j48848
$$ -70164 -169901 -153068 -127640 -157631 -179645 -119624 2251 111924 153655 98016 -50832
35850e0832j68470p2036P4790J49378J04534O000n4742m8663j4042J107n245N783
$$ -50832 -219302 -291338 -216548 -67170 37364 43364 -11378 -60041 -74083 -72976 -78221 -72438
35838g2438M9906Q6035P0387J3411m9350r9993j09619l2662R7575J41008K5922
$$ -72438 -22532 63503 133890 147301 97951 -2042 -111661 -144323 -46748 94260 120182
35827A20182j14340j14024k2264p389o2409k6657R8226J07757n4333j51178p124
$$ 120182 5842 -108182 -130446 -137835 -200244 -226901 -128675 -20918 -75251 -226429 -233553
35816b33553J96546J77729l7161j75954j10200L1016J04110J07126P7558R439
$$ -233553 -37007 140722 103561 -72393 -182593 -151577 -47467 59659 137217 146656
35806A46656o9812p2458J8890Q2132P717j28199j41030J0989J47368R5303o9368
$$ 146656 76844 4386 23276 105408 113125 -15074 -156104 -145115 2253 97556 28188
35795B8188j22481j3907O2423k5602j34602p3445Q7489J32441M5003L054N4218
$$ 28188 -94293 -108200 -45777 -71379 -205981 -279426 -191937 -59496 -14493 -11439 42779
35784D2779N0256n7004j04771J1J11723Q9724J8899L1448P2794K2946p4395q8440
$$ 42779 93035 36031 -68740 -68729 42994 132718 151617 183065 255859 278805 204410 115970
35772A15970k0749K2297J4922J7356M3639N6119M7615K0124n4349j45370j27788
$$ 115970 95221 117518 132440 149796 193435 249554 297169 317293 262944 117574 -10214
35761a0214L2245J51276N7532j33547j68449k5796Q2860O3397M5425R6956Q1937
$$ -10214 22031 173307 230839 97292 -71157 -96953 -14093 49304 94729 191685 273622
35750B73622p4837j88228o6849J62852K00166j1329k14930k05427p0811P092K4411
$$ 273622 198785 10557 -56292 106560 306726 295397 80467 -124960 -195771 -188679 -164268
35739a64268Q0314J43348R2444m1681q8097k0904j8053j41575j76645L3801K77047
$$ -164268 -83954 59394 151838 110157 22060 1156 -16897 -158472 -335117 -301316 -24269
35728b4269K40843j9604j64982p0609N1647L8051j5580L142L9134M0767P8404
$$ -24269 216574 196970 31988 -38621 13026 51077 35497 38639 77773 118540 196944
35717A96944J60823J45130k3387j69746j43306m6923n2241j31873j39126l9842
$$ 196944 357767 502897 479510 309764 166458 119535 67294 -64579 -203705 -243547
35707b43547P7873J28877O7101q5017j73670m8587J66052J58024j06205k65723
$$ -243547 -165674 -36797 30304 -54713 -228383 -276970 -110918 47106 -59099 -324822
35697c24822q8527J67611J62091k3248r6735m9104o3075r5352L9405K46601K27081
$$ -324822 -413349 -245738 -83647 -106895 -203630 -252734 -315809 -411161 -371756 -125155 101926
35686A01926k4113j72737n2329J18912J13503m654o1732j8555O7430J34998J07535
$$ 101926 77813 -94924 -147253 -28341 85162 80508 18776 221 67651 202649 310184
35675C10184l7905j60466r9090O6824J09473M246n3858K371K4923l9734m4710
$$ 310184 272279 111813 12723 79547 189020 193266 139408 141779 166702 126968 82258
35664H2258N6455Q6822l5556j19837k1145R6754L1513j14396j01713N9068J33136
$$ 82258 138713 225535 189979 70142 48997 145751 177264 62868 -38845 20223 153359
35653A53359K0416j22805j26220j4330O3021K1565p3390r2427k006Q8156P4643
$$ 153359 173775 50970 -75250 -89580 -26559 -4994 -78384 -170811 -172817 -84661 -10018
35642a0018N847r821J3580j3687o6151l7266M1079J6681j10092j44652q820J13475
$$ -10018 -4171 -13992 -412 -14099 -80250 -117516 -76437 -59756 -169848 -314500 -323320 -209845
35630b09845O4889l2362K5379K03260K80897J54877n7919j82888j47589j0451
$$ -209845 -144956 -177318 -151939 51321 332218 487095 429176 246288 98699 88248
35620H8248R2291N9104o6224j35920p7453K9693P6599M3258l0003r7904j04174
$$ 88248 180539 239643 173419 37499 -39954 -10261 66338 109596 79593 -18311 -122485
35609a22485j1398J24533J87238J30959Q487j20163k09685j89672m1919R9865
$$ -122485 -133883 -9350 177888 308847 317334 197171 -12514 -202186 -244105 -144240
35599a44240Q7835j2690j4903Q0128Q9114j9906n9913L7474Q8435r883p5511M2361
$$ -144240 -56405 -69095 -83998 -3870 85244 65338 5425 42899 131334 121451 45940 88301
35587H8301J74147R3095j05177j46485J614J04605J9545j30645j51708p970J56233
$$ 88301 262448 355543 250366 103881 105495 210100 229645 99000 -52708 -60678 95555
35576I5555J57638l6005k28569j94144K2268J42319L8691j00193p8532L3360P1149
$$ 95555 253193 217188 -11381 -205525 -183257 -40938 -2247 -102440 -180972 -147612 -76463
35565g6463L4166M022k6277o6237l1764Q4391J13622k0493j12691J6544J99135
$$ -76463 -42297 -38275 -64552 -130789 -162553 -78162 35460 14967 -97724 -81180 117955
35554A17955J72824J141n9661J2770L6110j4157q084L2733k6194j21551o5570
$$ 117955 290779 291920 232259 245029 281139 266982 258898 291631 265437 143886 78316
35543G8316Q3728Q1341o8783j10529j897J7083r7551p6296J49539K47106L4463
$$ 78316 162044 243385 174602 64073 62176 79259 -18292 -94588 54951 302057 336520
35532C36520j68358n7835J37255M8537k04075k25804p377J00360m183n3314P8785
$$ 336520 168162 110327 247582 296119 92044 -133760 -141137 -40777 -44960 -98274 -19489
35521a9489J72499P4935n1021m4115l121m3262n6149O8605J87910J11908p7043
$$ -19489 153010 227945 176924 132809 129688 86426 30277 98882 286792 398700 321657
35510C21657j51611q9024n4643r2071p3235M3221J30774J13554O4334K3566p7628
$$ 321657 170046 81022 26379 -65692 -138927 -95706 35068 148622 212956 236522 158894
35499A58894k14372j90275P1088L17648K64979k841j60031j01527j6963j7643
$$ 158894 -55478 -245753 -174665 142983 407962 405121 245090 143563 126600 108957
35489A08957J2472J21254J39347j3650j28481l0541J06293L6117j36926j29829
$$ 108957 121429 242683 382030 368380 239899 209358 315651 351768 214842 85013
35479H5013L3561O7007p4227j10781P2993K18260J16943o5223r0269o977K1685
$$ 85013 118574 185581 111354 573 73566 291826 408769 343546 253277 246300 267985
35468B67985J9581O5422N6654j00228k19979q6021J41142J21241j07696j53184
$$ 267985 287566 352988 409642 309414 89435 3414 144556 265797 158101 4917
35458D917J11266L30149K03131r3850k22920j52924p8434p0394n9818m0579n2222
$$ 4917 116183 446332 649463 555613 332693 179769 101335 30941 -28877 -69456 -121678
35447a21678m3637L9436J01195K8234q5901n4310J01737J72891P7954m0709o2241
$$ -121678 -165315 -125879 -24684 3550 -82351 -136661 -34924 137967 215921 175212 112971
35436A12971m0043n2667o2290n809Q4203J28190R8804K4093m8554o8483k4580
$$ 112971 72928 20261 -42029 -47838 36365 164555 263359 287452 238898 170415 145835
35425A45835J9075l953n9611n9675K692N3466N9752N1875L7117L39k0139K5812
$$ 145835 164910 160957 101346 41671 44363 97829 157581 209456 246573 246912 226773 252585
35413B52585Q9251P3706q712n6235m0680j9818n923L2940O7374O1648Q7143J92835
$$ 252585 341836 415542 406830 350595 309915 290097 284174 317114 384488 446136 533279 726114
35401G26114K44762J60046K01520O28367J064737P57652l39044j263765j199229
$$ 726114 970876 1130922 1332442 1960809 3025546 3783198 3444154 2180389 981160
35392I81160m91589m9201r2480j17660J04442K10393k6000k81165k27988k4374
$$ 981160 489571 440370 347890 230230 334672 545065 519065 237900 9912 -14462
35382a4462K1534p2328j01781l7274K0379N8560R5348N7254p5002j36066j796
$$ -14462 7072 -65256 -167037 -204311 -183932 -125372 -30024 27230 -47772 -183838 -185634
35371a85634J68342J33694n8493j30971J5984J67139J10813o9877j29774j861
$$ -185634 -17292 116402 57909 -73062 -57078 110061 220874 150997 21223 19362
35361A9362J22127O1528j06543j60632m7989N6224K5565m1879j7533M1054K0635
$$ 19362 141489 203017 96474 -64158 -112147 -55923 -30358 -72237 -89770 -48716 -28081
35350b8081k7999N220O2750J9475o1823k3601Q1001N3108q4977q8126R4306K03392
$$ -28081 -56080 -50860 11890 31365 -30458 -54059 26942 80050 -4927 -93053 1253 204645
35338B04645Q3375p6076p0654J732l9786j33139j05666J1479M1697m4367j06980
$$ 204645 288020 211944 141290 143022 103236 -29903 -135569 -124090 -82393 -126760 -233740
35327b33740p0097q41K9957L0554L3003M7568O5435N5998m214p0109o2687Q307
$$ -233740 -303837 -304678 -274721 -244167 -211164 -163596 -98161 -42163 -46377 -116486 -179173 -170866
35315a70866M9783M2089O7014J30871J07361n2046j88865j44114R972P7792R796
$$ -170866 -121083 -78994 -11980 118891 226252 174206 -14659 -158773 -148801 -71009 -61213
35304f1213o1729j9935J02979J79407J24143p647o1456L0092J35004R0580n9338
$$ -61213 -122942 -142877 -39898 139509 263652 256005 194549 224641 359645 450225 390887
35293C90887j38890j14336j03444j25523p1351N3615J02857N9451P2972J49955
$$ 390887 251997 137661 34217 -91306 -162657 -109042 -6185 53266 126238 276193
35283B76193R8153r8738j64922J7989J52524j9882k75377k43193J9851J45436
$$ 276193 374346 275608 110686 128675 281199 261317 -14060 -257253 -237402 -91966
35273i1966J5692j39585j39035k3761J27421K61964K54376K7330k26848k15727
$$ -91966 -76274 -215859 -354894 -378655 -251234 10730 265106 292436 65588 -150139
35263a50139L8699K04732R7060j07385j66415o8771M9208J05031R3979L8272r071
$$ -150139 -111440 93292 190352 82967 -83448 -152219 -103011 2020 95999 134271 125200
35252A25200O220O4383R1000N6026p852n8478n3157L3309J22992O4014j45760
$$ 125200 131420 195803 286803 342829 334977 276499 223342 256651 379643 443657 297897
35241B97897k79246j72310K1990N6583m3626o6153K3178O0853k568l8278P54L079
$$ 297897 18651 -153659 -131669 -75086 -118712 -184865 -161687 -100834 -103402 -141680 -140926 -137847
35229a37847p5159j25685q2882j3311L3358Q3034J12194M8252o5952q8193K846
$$ -137847 -213006 -338691 -421573 -434884 -401526 -318492 -206298 -158046 -223998 -312191 -309345
35218c09345P7518P3842N9315N0077j8080r5343k8849J55630K21951Q2962m8662
$$ -309345 -231827 -157985 -98670 -48593 -66673 -162016 -190865 -35235 186716 269678 221016
35207B21016j6086J7398j27551k86671j78357J31923K93338J65303k4478n1838
$$ 221016 204930 222328 94777 -191894 -370251 -238328 55010 220313 195835 143997
35197A43997J9249K0479m5785n9531N840P0986Q6910N5922l9395j90516k65246
$$ 143997 163246 183725 137940 78409 84249 155235 242145 298067 258672 68156 -197090
35186a97090j18225J63417K86286J16785j18665j32613M6524J72742J56237J09080
$$ -197090 -315315 -151898 134388 251173 132508 -105 46419 219161 375398 484478
35176D84478P0316m3991j97692k13556o9392L8229K2232L6040J48065J64697k7053
$$ 484478 554794 510803 313111 99555 30163 68392 90624 126664 274729 439426 412373
35165D12373k03104j41432O972k2317j62406j55777l803P2631M4610R4997K41593
$$ 412373 209269 67837 74809 52492 -109914 -265691 -269494 -196863 -152253 -57256 184337
35154A84337K71606R2999j26541k23361k04333j13378L8344J65123J44192J2031
$$ 184337 455943 548942 422401 199040 -5293 -118671 -80327 84796 228988 241019
35144B41019o0013j5907L5648K9743J3284j849n6003j01322m2872O6551P0623
$$ 241019 181006 165099 200747 230490 243774 241925 185922 84600 41728 108279 178902
35133A78902l7628j03422o1525k955J7094L8137N4988J7204l3844k0781N761l1984
$$ 178902 141274 37852 -23673 -26628 -9534 28603 83591 100795 66951 46170 51931 19947
35121A9947l7475J00132K17605Q0004j70751j59989J10326K23755J1562j88478
$$ 19947 -17528 82604 300209 380213 209462 49473 159799 383554 395116 206638
35111B06638j09879L2153l2543j66311j11683N2465R0024K4699L7216J05833P4891
$$ 206638 96759 128912 96369 -69942 -181625 -129160 -39136 -14437 22779 128612 203503
35100B03503k9386n2245k293j6090q4349o7178M3016J00371M6779j3323Q694P7661
$$ 203503 174117 121872 119579 103489 19140 -48038 -5022 95349 142128 128805 137499 215160
35088B15160J14726P9689k0185j25716j55974j00255l3944m750J9882N7152O4868
$$ 215160 329886 409575 389390 263674 107700 7445 -26499 -31249 -11367 45785 110653
35077A10653L6394K4377K6607k2174j03172j08145k8026J8584n425o068K7710
$$ 110653 147047 171424 198031 175857 72685 -35460 -63486 -44902 -50327 -56395 -28685
35066b8685j5842j13011n7867J88425L45504J93812j02251k42738j74997l9285
$$ -28685 -44527 -157538 -215405 -26980 318524 512336 410085 167347 -7650 -46935
35056d6935P8432J35323N4577j22816j73885K954J83944J38753k1493n9671j120
$$ -46935 31497 166820 221397 98581 -75304 -72350 111594 250347 228854 169183 168063
35045A68063j9607p9213r123J48840J76834K7756j32119j94246j79695q7371Q3518
$$ 168063 148456 69243 60120 208960 385794 413550 281431 87185 -92510 -179881 -96363
35034i6363K02419J45073K3011L0971J11297M0541j73348k69251j33525M4493
$$ -96363 106056 251129 274140 305111 416408 456949 283601 14350 -119175 -74682
35024g4682P5315j447n7495n2770q415M4116N1657N660N109J10873J91398R8403
$$ -74682 633 -814 -58309 -111079 -119494 -75378 -23721 -18061 -12952 97921 289319 387722
35012C87722o5757q2733L1671P2986J1431J1849Q4104L9887j34318j88148j9533
$$ 387722 321965 239232 270903 343889 355320 367169 451273 491160 356842 168694 149161
35001A49161J26334M6540r9153p4636M9998N5731m6604o4191L7185R3253K0932
$$ 149161 275495 322035 222882 148246 198244 253975 207371 143180 180365 273618 294550
34990B94550p3658q6618m9807k9433j4092L2824Q0112N6129m2398j14169o1345
$$ 294550 220892 134274 84467 55034 40942 73766 153878 210007 167609 53440 -7905
34979g905O9869J17927J8891p9095j1106J47836J65573j4015j82601j59153k1058
$$ -7905 61964 179891 198782 119687 108581 256417 421990 407975 225374 66221 45163
34968D5163M5765R311j5489L2684R0554Q3363J5381o3833j21364j41723r8663
$$ 45163 90928 100239 84750 117434 207988 291351 306732 242899 121535 -20188 -118851
34957a18851K5717J72767K01440L4402j85886k05125J4304J97238J12891q6655
$$ -118851 -93134 79633 281073 315475 129589 -75536 -61232 136006 248897 162242
34947A62242p9844J40228K48186P4436j51120j60845l3449k4924j61628k29793
$$ 162242 82398 222626 470812 545248 394128 233283 199834 174910 13282 -216511
34937b16511j14303O9092J88091K45977K59142J55131p8641k56289j77906P0393
$$ -216511 -330814 -261722 -73631 172346 431488 586619 507978 251689 73783 144176
34927A44176J72689r490k34412j97946N4698K02892R3762q0101q0657P0487J77657
$$ 144176 316865 307375 72963 -124983 -70285 132607 226369 146268 65611 136098 313755
34916C13755J33328j3940j60332k07368r6748J05704K17438J32399l9812j16208
$$ 313755 447083 433143 272811 65443 -31305 74399 291837 424236 384424 268216
34906B68216o3667J6648O4514R8093J13238P1381j4032p5266q0520o2927o6697
$$ 268216 204549 221197 285711 383804 497042 568423 554391 479125 398605 335678 268981
34895B68981j05466j46500j15435J7464J38236R0488q2783j50050k4175R4364
$$ 268981 163515 17015 -98420 -80956 57280 147768 64985 -85065 -109240 -14876
34885a4876L8774n4062K853J02564L0002j31750j04336J21553K51608J39104l4983
$$ -14876 23898 -30164 -27311 75253 105255 -26495 -130831 -9278 242330 381434 346451
34874C46451r6355j02487j27830r1041M9658J44965P3926m4897l0989Q8936J45668
$$ 346451 250096 147609 19779 -71262 -21604 123361 197287 152390 121401 210337 356005
34863C56005P4611l9133j01504q4367q129O3588N3657m0027j24778j20589m0939
$$ 356005 430616 391483 289979 205612 197483 261071 314728 274701 149923 29334 -11605
34852a1605N1162J04459Q6763O394o4656o2419j9915q062k0497j6188k4156p2185
$$ -11605 39557 144016 230779 237173 172517 110098 90183 82121 61624 45436 21280 -50905
34840e0905p2010N1762J75648J30928n296k4331M5158q585j55528j22099J07806
$$ -50905 -122915 -71153 104495 235423 230127 205796 250954 242369 86841 -35258 72548
34829G2548J90878p066j44446K6867K06775L5672k72696k47477Q8091K74103J35207
$$ 72548 263426 256360 111914 138781 345556 381228 108532 -138945 -50854 223249 358456
34818C58456m1882n7573n7833j43928j45810L0683J68862P8284q5998p1215Q9672
$$ 358456 316574 259001 201168 57240 -88570 -57887 110975 189259 103261 32046 121718
34807A21718J62108N3895j15525k05072j57465J2842K03891K58732J27691n1829
$$ 121718 283826 337721 222196 17124 -140341 -127499 76392 335124 462815 410986
34797D10986j22442q7073m2236j6060K0880M9027K0040m8772r2764q9799o3397
$$ 410986 288544 201471 159235 143175 164055 213082 233122 184350 91586 1787 -61610
34786f1610k8867K750O378j4108j0503K8193L8476j0157m0676J3998Q5414O7602
$$ -61610 -90477 -87727 -81349 -95457 -105960 -77767 -39291 -49448 -90124 -76126 9288 76890
34774G6890j0182l0825J7329K5658n0401j15878q1798J3616Q0403R7579R9843
$$ 76890 66708 35883 53212 78870 28469 -87409 -169207 -155591 -75188 22391 122234
34763A22234R5769O0973p141p0800q5309l6341M5001R8542Q4612K4575k2655k6783
$$ 122234 218003 278976 271835 201035 115726 79385 124386 222928 307540 332115 309460 282677
34751B82677j4233k9148p8114j15227q3957J3482R6728R0553K2575j5918r819
$$ 282677 268444 239296 161182 45955 -38002 -24520 72208 162761 185336 169418 159599
34740A59599l9163j25830j58151m8516J09527J47900M6233n6295n0896K9933Q0270
$$ 159599 120436 -5394 -163545 -212061 -102534 45366 91599 35304 -15592 14341 94611
34729I4611K8418j02140j85821j01880R3247J90724J10475K9395R1999J47387
$$ 94611 123029 20889 -164932 -266812 -173565 17159 127634 157029 249028 396415
34719C96415j3k07952j72665P2560J82150L3178j21826j04592m6953n3199J957
$$ 396415 396402 188450 15785 88345 270495 303673 181847 77255 30302 -22897 -20940
34708b0940J52081J76995J833q9656P0741J92294J1555k05692q9187J84497J79553
$$ -20940 131141 308136 309969 220313 291054 483348 494903 289211 200024 384521 564074
34697E64074n8326j15320M5984N7353j46724k01689N984J17839m3204j47816L2884
$$ 564074 505748 390428 436412 493765 347041 145352 151336 269175 225971 78155 111039
34686A11039J91710J8039k46888k06923M5500J22692k7751j15835k3696O3003
$$ 111039 302749 320788 73900 -133023 -87523 35169 7418 -108417 -132113 -69110
34676f9110J2129q2545j03981n5902J3609O8384O9282K0896n073K0806L5728K0261
$$ -69110 -56981 -139526 -243507 -299409 -285800 -217416 -148134 -127238 -132311 -111505 -75777 -55516
34664e5516N2559J32660J18389l3360j38107o1586M6817m311j30392j21082J4994
$$ -55516 -2957 129703 248092 214732 76625 15039 61856 57545 -72847 -193929 -178935
34653a78935R5778P4303O8839J24112J44581N9311q7509j94433j69511q599J34209
$$ -178935 -83157 -8854 59985 184097 328678 387989 300480 106047 -63464 -72063 62146
34642F2146Q5674p3180o8699J31372K04665k3969k48212j32947J40200J47734
$$ 62146 147820 74640 5941 137313 341978 318009 69797 -63150 77050 224784
34632B24784j14171k48856p9777J40495J64379N0278m2889q1120p9823j7171Q4197
$$ 224784 110613 -138243 -218020 -77525 86854 137132 94243 13123 -66700 -83871 326
34621C26J34434Q7274k6171j56621k27211j42000N8027J53041L2971r5780j0371
$$ 326 134760 222034 195863 39242 -187969 -329969 -271942 -118901 -85930 -181710 -192081
34610a92081J53523J08413j01887j55900L8322K18089J77437J1135j05496j23843
$$ -192081 -38558 69855 -32032 -187932 -149610 68479 245916 257051 151555 27712
34600B7712n4191P6199J46718L8898j54077k14903j10452J399O3056J58079K49890
$$ 27712 -26479 49720 196438 235336 81259 -133644 -244096 -242697 -179641 -21562 228328
34589B28328J69964o5200k00543j12574Q902k6639j29427j06778M0818J45952
$$ 228328 398292 333092 132549 19975 28877 2238 -127189 -233967 -193149 -47197
34579d7197R8690n4926j75017j48650q556Q2456L6688l6979k0589J8507j6601
$$ -47197 51493 -3433 -178450 -327100 -335656 -253200 -216512 -253491 -274080 -255573 -272174
34568b72174l5086P5550J86689J10253n2569n9336M6793J0838j62557j91166J933
$$ -272174 -307260 -231710 -45021 65232 12663 -46673 120 10958 -151599 -342765 -340832
34557c40832J60522J22768K5970n862l7759q0102m960J62626J87085n57j65892
$$ -340832 -180310 -57542 -31572 -37434 -75193 -155295 -160255 2371 189456 188899 23007
34546B3007j50507q9927j08246j00797R903R3993P1587P4906J73952K12707J00995
$$ 23007 -127500 -217427 -325673 -426470 -416567 -322574 -250987 -176081 -2129 210578 311573
34535C11573m351L812j0309j20273j37796M0241J74285N2578j40010j28150Q417
$$ 311573 307222 311034 300725 180452 42656 82897 257182 309760 169750 41600 50017
34524E0017K2261o0422l1545J01155J46429P6791L5191M5832k821j12610j58832
$$ 50017 72278 11856 -19689 81466 227895 304686 339877 385709 382888 270278 111446
34513A11446j10312o2067n5970l9376R604N3348O6599L4873n7858j48067j00476
$$ 111446 1134 -60933 -116903 -156279 -146675 -93327 -26728 8145 -49713 -197780 -298256
34502b98256Q9638K15970J21616o3005r4026N1935J64312P4985j59441l21533
$$ -298256 -208618 7352 128968 65963 -28063 23872 188184 263169 103728 -217805
34492b17805k31893N7594K67255J93004k0778q2151J3790J1759j37816j71216
$$ -217805 -449698 -392104 -124849 68155 47377 -34774 -20984 -9225 -147041 -318257
34482c18257L3723K28716J89402L9120j8861j6718n3780o7534P98M1830r155k6272
$$ -318257 -284534 -55818 133584 172704 153843 137125 83345 15811 16609 58439 49284 23012
34470B3012M4626M0809r2396j29563L5767J38198j6310j76021o4524J33543J14163
$$ 23012 67638 108447 16051 -113512 -77745 60453 44143 -131878 -196402 -62859 51304
34459E1304n650M9492J60015L6149j93827j71237M0450O2312j00308o0698K16788
$$ 51304 45654 95146 255161 291310 97483 -73754 -33304 29008 -71300 -131998 84790
34448H4790K86671l1834l24729k31225L7232J05048j1701o0539J2896P8494Q0257
$$ 84790 371461 339627 14898 -216327 -179095 -74047 -85748 -146287 -133391 -54897 25360
34437B5360L8606n9176j75691j66237K1340K08595K04834O1891k7411M973O9361
$$ 25360 63966 4790 -170901 -337138 -315798 -107203 97631 159522 132111 137084 206445
34426B06445Q3037M4971k2610j10777j94683k12501j03889J00120K36390J51707
$$ 206445 289482 334453 311843 201066 6383 -206118 -310007 -209887 26503 178210
34416A78210p4076j66451p150J82142J42348o0655j59983q1024N133j8147p0747
$$ 178210 104134 -62317 -69467 112675 255023 194368 34385 -46639 -41506 -59653 -130400
34405a30400m7080L3957Q1275L5724p6801j42992p5676K9817r724j49829j09404
$$ -130400 -177480 -143523 -62248 -26524 -103325 -246317 -321993 -292176 -301900 -451729 -561133
34394e61133J84753L91026K21431j11207k13717q6723k3946q2722n7472Q2033
$$ -561133 -376380 14646 236077 124870 -88847 -175570 -199516 -282238 -339710 -257677
34384b57677J29420K9535l3666K0090N6501P134l0695j7720k2827k1340Q1570
$$ -257677 -128257 -98722 -132388 -112298 -55797 -48663 -79358 -97078 -119905 -141245 -59675
34373e9675K04953J53803m8477j72468j42068q4266k0881J41586K88010J54912
$$ -59675 145278 299081 250604 78136 -63932 -148198 -169079 -27493 260517 415429
34363D15429j90513l26565q9870J59558R1289j21339j38497K5352J18132Q0106
$$ 415429 224916 -101649 -191519 -31961 59328 -62011 -200508 -175156 -57024 23082
34353B3082N4636Q9225Q7094M277q9422j14013m1460Q2815J27283l861j92524
$$ 23082 77718 166943 254037 258314 168892 54879 13419 96234 223517 219656 27132
34342B7132k03184j2571J32744O1246j05021j66433r7771J6121J20341J60245
$$ 27132 -176052 -188623 -55879 5367 -99654 -266087 -363858 -347737 -227396 -67151
34332f7151Q0501m4369m5028Q4404J43125L4670p7582m6618K7032p436j01040
$$ -67151 13350 -31019 -76047 8357 151482 186152 108570 61952 88984 81548 -19492
34321a9492j21619p4618m0538j0399O1445J34534J42124R3787K7206m8669r7191
$$ -19492 -141111 -215729 -256267 -266666 -205221 -70687 71437 165224 192430 143761 46570
34310D6570o1990R149p703j01318j10870N965Q2117J7582n0794J2299J15335J06847
$$ 46570 -15420 -6271 -13974 -115292 -226162 -220197 -138080 -120498 -171292 -158993 -43658 63189
34298F3189J3673m2269l6979j4928J7715N1702L9629m562O37L9420q733j36596
$$ 63189 76862 34593 -2386 -17314 401 52103 91732 87170 87807 127227 118494 -18102
34286a8102j67943m7797M4585O07l1473O9643J59663Q2589m2737k5601P7153Q5226
$$ -18102 -186045 -233842 -189257 -188650 -220123 -150480 9183 91772 49035 23434 100587 185813
34274A85813k237n8979o1221m7900J9067J39535J60014J791j42371q8442J6198
$$ 185813 183576 124597 63376 15476 34543 174078 334092 335883 193512 105070 121268
34263A21268n9133k01802j27522J10994J75008q060j29578r888J29523M9473j39055
$$ 121268 62135 -139667 -267189 -156195 18813 10753 -118825 -128713 810 50283 -88772
34252h8772j80436m7264Q1762R2061K3603l5399l2805K3681O5681L3363l3060
$$ -88772 -269208 -316472 -234710 -142649 -119046 -154445 -187250 -163569 -97888 -64525 -97585
34241i7585l6736L5870R9150R0887K4021o8823j42406j19112J1354J01535J2261
$$ -97585 -134321 -98451 699 91586 115607 46784 -95622 -214734 -203380 -101845 -89584
34230h9584j47388j34556N8755J65395L8115j28675r6136Q3882J94334J70058
$$ -89584 -236972 -371528 -312773 -147378 -109263 -237938 -334074 -250192 -55858 114200
34220A14200J01442K3287r2455j80619j25347L4660J19172N4711m3012p0492o3057
$$ 114200 215642 238929 146474 -34145 -159492 -124832 -5660 49051 6039 -64453 -127510
34209a27510o0095n723J09581J50891K9953j12011q5437N4190Q6765l0612j11187
$$ -127510 -187605 -193328 -83747 67144 97097 -14914 -100351 -46161 40604 9992 -101195
34198a01195m3860N7525P0506L5439K0510l338m0922l640J01638R3305r9740k44282
$$ -101195 -145055 -87530 -17024 18415 38925 35587 -5335 -8975 92663 185968 86228 -158054
34186a58054j19607J13135J28192p0232j69780l6977J20984J17018K7573q138
$$ -158054 -277661 -164526 -36334 -106566 -276346 -313323 -192339 -75321 -47748 -55886
34176e5886M554J3723L2793N5123K2459m0959k6520N8395O6931l5342q9021j1569
$$ -55886 -51332 -37609 -4816 50307 72766 31807 5287 63682 130613 95271 6250 -5319
34164e319M8686l3502j31313o2601J17121J96331J00629m6445j02317l3502Q4572
$$ -5319 43367 9865 -121448 -184049 -66928 129403 230032 183587 81270 47768 132340
34153A32340J17745j0913j96016k28757n7271J34068J61070M0338r9585j70980
$$ 132340 250085 239172 43156 -185601 -242872 -108804 52266 92604 -6981 -177961
34143a77961j26302M1889K13210K03456J4081j32146r9844j3857j1167j8564N6942
$$ -177961 -304263 -262374 -49164 154292 168373 36227 -63617 -77474 -88641 -107205 -50263
34132e0263J05384r15j44885j26428J1802N7473l4994j08780p2554P798P3894
$$ -50263 55121 54206 -90679 -217107 -205305 -147832 -182826 -291606 -364160 -356362 -282468
34121b82468J36075J61887P8865q0707j73167j13004L9333J55160J34727k3574
$$ -282468 -146393 15494 94359 13652 -159515 -272519 -233186 -78026 56701 33127
34111C3127j71898j16741J18737K48826R4937j22531q2547J42750J82817o0460
$$ 33127 -138771 -255512 -136775 112051 206988 84457 1910 144660 327477 267017
34101B67017k57504j54604O0415P6614p7680j30767r84J22169J03881L7221L5012
$$ 267017 9513 -145091 -84676 -8062 -85742 -216509 -217493 -95324 8557 45778 80790
34090H0790L6507n6852j73012j55438j2690Q2315N6969L8436J16862J69457O3404
$$ 80790 117297 60445 -112567 -268005 -280695 -198380 -141411 -102975 13887 183344 246748
34079B46748q9965q1777O1469J15850J6479o1006j2894L6041k3114j02162j02607
$$ 246748 156783 75006 136475 252325 268804 207798 194904 230945 207831 105669 3062
34068C062q4621j03113o3503Q3195J74790P6495o1794k5314J01081N7083j61178
$$ 3062 -81559 -184672 -248175 -164980 9810 86305 24511 -803 100278 157361 -3817
34057c817k73021j30976Q3729J45444N7096m5859r3497p7970J8931J74187K70419
$$ -3817 -276838 -407814 -324085 -178641 -121545 -167404 -260901 -338871 -319940 -145753 124666
34046A24666K02630K0802j02874n9942O9147J00180l2674j73760j30166N9035
$$ 124666 327296 348098 245224 185282 254429 354609 321935 148175 18009 77044
34036G7044J53550L8247j23133j40028n6590k8091n8566l8602L2366N1325M778
$$ 77044 230594 268841 145708 5680 -50910 -79001 -137567 -176169 -143803 -92478 -87700
34025h7700k0460k756O162K4173J07316J71961N2650k08242l24204j26373J86704
$$ -87700 -108160 -110916 -104754 -80581 26735 198696 251346 43104 -281100 -407473 -220769
34014b20769K90334J23898q9239j47030o4851J6039J1073m0184m1726M1437J29800
$$ -220769 69565 193463 104224 -42806 -107657 -91618 -80545 -120729 -162455 -121018 8782
34003H782J13981l516r5813o2488N2736J27381J00735Q429q4125j28390r7838
$$ 8782 122763 119247 23434 -39054 13682 141063 241798 250227 166102 37712 -60126
33992f0126r373O3915N8057K465j7031R362p964j07001j75578r2387P9239J53658
$$ -60126 -69499 -5584 52473 54938 37907 47269 39305 -67696 -243274 -335661 -256422 -102764
33980a02764P0696m1698p0719m9592l2461J8223J18573J63890P8058l7249n2441
$$ -102764 -32068 -73766 -144485 -194077 -226538 -208315 -89742 74148 152206 114957 62516
33969F2516j8881n3896r9239j3900J35947J35367j4052n5141J10335K21288L6850
$$ 62516 43635 -10261 -109500 -123400 12547 147914 133862 78721 189056 410344 447194
33958D47194k77467l55811j16945J64072K29717J05526k2093n4731m7611q6816
$$ 447194 169727 -186084 -303029 -138957 90760 196286 174193 119462 71851 -14965
33948a4965j59052j58925k7280J46528K07897J13318l1366j04914q3637k2911
$$ -14965 -174017 -332942 -360222 -213694 -5797 107521 76155 -28759 -112396 -135307
33938a35307J2925l73k2679R052P7370P8313j9990r5389m7669L4089J7081m9960
$$ -135307 -122382 -122755 -145434 -136382 -59012 19301 -689 -96078 -143747 -109658 -92577 -142537
33926a42537l0865N0239N7676p694k6797K150k2308p1546j6047J07150J16727
$$ -142537 -173402 -123163 -65487 -73181 -99978 -97828 -120136 -191682 -207729 -100579 16148
33915A6148L284m5949J6005J8465r1233j26199Q361J38429J21578O7206R2621
$$ 16148 19432 -26517 -10512 7953 -83280 -209479 -201118 -62689 58889 126095 218716
33904B18716R7636l1824j96648k41872j72528o4806O4490J69291J43036M552p5611
$$ 218716 316352 284528 87880 -153992 -326520 -391326 -326836 -157545 -14509 -9957 -85568
33893h5568m3161l5306r0178n6011P8565Q0327j11053j89151L8527K86106K17549
$$ -85568 -128729 -164035 -254213 -310224 -231659 -151332 -262385 -451536 -413009 -126903 90646
33882I0646l5831j36076p8240q2577j33730m0641J52973K10836J02207J1921l287
$$ 90646 54815 -81261 -159501 -242078 -375808 -416449 -263476 -52640 49567 61488 58201
33871E8201m6001j04213n9428N0989O8829k513j7344L4427K9411l5375m6744p845
$$ 58201 12200 -92013 -151441 -100452 -31623 -34136 -51480 -17053 12358 -23017 -69761 -77606
33859g7606j9592o2554m0958J811l4862o8794M3480J94893J46165o1925j32756
$$ -77606 -97198 -159752 -200710 -198899 -233761 -302555 -259075 -64182 81983 20058 -112698
33848a12698K9505J93327J75006N2925n1267j30026j57209o0665Q7577R6841l9610
$$ -112698 -83193 110134 285140 338065 286798 156772 -437 -61102 26475 123316 83706
33837H3706j02060N298R9578L0815p7845n2350N7108R1582L6974k378O303O117
$$ 83706 -18354 -13056 86522 117337 39492 -12858 44250 135832 172806 170428 176731 182848
33825A82848k8150o3647p6770o6023j7686P4114J52585J17983n3916k22773j91473
$$ 182848 154698 91051 14281 -51742 -69428 4686 157271 275254 221338 -1435 -192908
33814a92908L7003J97528R3498q8910k3346K32850K73632k9708k96373k14311
$$ -192908 -155905 41623 135121 46211 22865 255715 529347 499639 203266 -11045
33804a1045L86J1857q1646Q415J95911J55081r6686k08242o4257P5545M1492k5134
$$ -11045 -10659 1198 -80448 -72033 123878 278959 182273 -25969 -90226 -14681 26811 1677
33792A677N076M4844J5685q390O714l4194j46982j85761o8174R5499J70822J39551
$$ 1677 6753 51597 67282 58892 65606 31412 -115570 -301331 -369505 -274006 -103184 36367
33780C6367L8698p5944r7187K1647J27688M1577j44107j69015l668J14007O5324
$$ 36367 75065 -879 -98066 -76419 51269 92846 -51261 -220276 -223944 -109937 -44613
33769d4613p81K6063L5334n8857j25191k8596J33997J73292P4684j1664J1709
$$ -44613 -45394 -19331 16003 -42854 -168045 -196641 -62644 110648 185332 173668 185377
33758A85377Q2615P4171m4003j48101j01241M1737P8057m3808j21874o973J58061
$$ 185377 267992 342163 298160 150059 48818 90555 168612 124804 2930 -4043 154018
33747A54018J67391N3673l5996r6419j64408j35817M0336J49490J3359j49248
$$ 154018 321409 375082 339086 242667 78259 -57558 -17222 132268 145627 -3621
33737c621l4656K03022J57535j48745k69443m4844J69069R4547q2397r7662o258
$$ -3621 -38277 164745 322280 173535 -95908 -140752 28317 122864 40467 -57195 -63453
33726f3453J8500j5969k9329l7383m5148J5706J13623J01329j8800n2803N3181
$$ -63453 -44953 -60922 -90251 -127634 -172782 -157076 -43453 57876 39076 -13727 39454
33715C9454R7823k9068j46717q7557M4139R0938R0481J18485R8109k4086r5995
$$ 39454 137277 108209 -38508 -126065 -81926 9012 99493 217978 316087 292001 196006
33704A96006J7253J65174R9199j51495l04082j98108K1417J13456K2047r4267
$$ 196006 213259 378433 477632 326137 22055 -176053 -154636 -41180 -19133 -113400
33694a13400p5296M2245Q2896j3543r9599m6757N7342O4432N531P783O4436P5876
$$ -113400 -188696 -146451 -63555 -77098 -176697 -223454 -166112 -101680 -96149 -88366 -23930 51946
33682E1946M3758L1442P751o8790r7811O874J02050R539j60762j63980k0739M6967
$$ 51946 95704 127146 134897 66107 -31704 -24830 77220 86759 -74003 -237983 -258722 -211755
33670b11755K4074R9321K62115K60720J8737k23648k61532j47663n977J15491
$$ -211755 -187681 -88360 173755 434475 453212 229564 -31968 -179631 -185608 -70117
33660g0117J54225M8152j08235j47092q0768m6682k9084R1908K41597K10024J2939
$$ -70117 84108 132260 24025 -123067 -203835 -250517 -279601 -187693 53904 263928 276867
33649B76867j10888p5728k7958m6089n7632m9518o6321k9673J29495K22858M7904
$$ 276867 165979 90251 62293 16204 -41428 -90946 -157267 -186940 -57445 165413 213317
33638B13317j94878j44704J17562J78489k2914j32338k4420L4724m8097k1992
$$ 213317 18439 -126265 -8703 169786 146872 14534 -9886 24838 -23259 -45251
33628d5251J66160J98595m0581k18991j10028O8704R4037O1843N1245p2737k76158
$$ -45251 120909 319504 278923 59932 -50096 18608 112645 174488 225733 152996 -123162
33617a23162k40202R4666L13275J48968j05466j11966J2030L0405J2623P2995
$$ -123162 -363364 -268698 44577 193545 88079 -23887 -11857 18548 31171 104166
33607A04166P3279n8128q1252J19697K25094q358k78969k03107P1198J55087M9106
$$ 104166 177445 119317 38065 157762 382856 374498 95529 -107578 -36380 118707 167813
33596A67813K6072R9435O3707p5311j22132n4256k0675n2128n3843r616L2010
$$ 167813 193885 293320 357027 281716 159584 105328 84653 32525 -21318 -30934 1076
33585A076P8112J20471P6882m8221j09680n3898o906k8159j9468K8921p590r8335
$$ 1076 79188 199659 276541 228320 118640 64742 57836 29677 10209 39130 31540 -66795
33573f6795o0786N5761r737k14577j84970J28638K82351O4714j38145j4005J64724
$$ -66795 -127581 -71820 -81557 -296134 -481104 -352466 -70115 -5401 -143546 -157551 7173
33562G173Q1296p2875j9633Q3291M06j05381j3151J11996N7687j6937P1755J39498
$$ 7173 88469 15594 -4039 79252 79658 -25723 -38874 73122 130809 113872 185627 325125
33550C25125J2824q5609M6858J92046J39058P6704J55849J68775Q1099K66631
$$ 325125 337949 252340 299198 491244 630302 707006 862855 1031630 1112729 1379360
33540A379360P38519R13581P66878J271442K686379L332948J555567j617355l406815
$$ 1379360 2117879 3031460 3798338 5069780 7756159 11089107 12644674 11027319 7620504
33531G620504k759732j309340p40660q30995o51208k42873j48515k70519j86949
$$ 7620504 4860772 3551432 2810772 1979777 1328569 1085696 937181 666662 479713
33522D79713R684M081p8023J6409R9144q8165k97037j66781J12394J17251p4689
$$ 479713 489397 493478 415455 431864 531008 442843 145806 -20975 91419 208670 133981
33511A33981n2260J90101K48326m487k29627j67972K5530R0631J0318o9261p4101
$$ 133981 81721 271822 520148 515661 286034 118062 143592 234223 244541 175280 101179
33500A01179m0048j1422J3658N4903R3279O5963m8461j65419j79105q8809K7467
$$ 101179 61131 49709 63367 118270 211549 277512 229051 63632 -115473 -204282 -176815
33489a76815J21184J69325J26807j01r2894o2969M087k1171j05663j22802n9841
$$ -176815 -55631 113694 240501 240400 147506 84537 88624 67453 -38210 -161012 -220853
33478b20853m354J2972J7101j000l8370k9393L3342M0702m3367q1378K686O4221
$$ -220853 -225207 -212235 -195134 -196134 -234504 -263897 -230555 -189853 -233220 -314598 -311912 -247691
33466b47691q394p0989L1345J78223J68191L4802n9758q0962n8093M0953J56282
$$ -247691 -256085 -327074 -295729 -117506 50685 85487 25729 -55233 -113326 -72373 83909
33455H3909R1513j44120k25776j4963J49540k611j85568m2979K13369J69363o6222
$$ 83909 175422 31302 -194474 -209437 -59897 -62508 -248076 -291055 -77686 91677 25455
33444B5455q2424R6406J06352n8848o7761R9586J28448k5453q8699k7707p7743
$$ 25455 -56969 39437 145789 86941 19180 118766 247214 221761 133062 105355 27612
33433B7612j95325p1438K39645K88701m2377l21804k33870K4726J71466J99648
$$ 27612 -167713 -239151 494 289195 246818 -74986 -308856 -284130 -112664 86984
33423H6984J54573j2980k02760j74527N1157J73748R4770K5941L9100m7785k27703
$$ 86984 241557 228577 25817 -148710 -97553 76195 170965 196906 236006 188221 -39482
33412c9482k13738N1274K37091J54426J7854K747l0621j62765j86442q81J45711
$$ -39482 -253220 -201946 35145 189571 207425 210172 179551 16786 -169656 -170537 -24826
33401b4826O9451l7392K5143J01901k1889k21644k23072j4883J70100J68132J7355
$$ -24826 44625 7233 32376 134277 112388 -109256 -332328 -347211 -177111 -8979 8376
33390H376j21524r8001O3747J37767p742j61787o4860J44505J21918j09617j94401
$$ 8376 -113148 -211149 -147402 -9635 -17377 -179164 -244024 -99519 22399 -87218 -281619
33379b81619m4771M7697l7408n3694J21617K37948J04513r8074j38881n6238J4112
$$ -281619 -326390 -278693 -316101 -369795 -248178 -10230 94283 -3791 -142672 -198910 -184798
33368a84798M6103K6152p3757j34113O427K23183K15390o822j20701l3216k233
$$ -184798 -138695 -112543 -186300 -320413 -313986 -90803 124587 117765 -2936 -36152 -38385
33357c8385j21997j42936L9338J61067N6504o8706m4248j3052p4957n0697J39283
$$ -38385 -160382 -303318 -263980 -102913 -46409 -115115 -159363 -172415 -247372 -298069 -158786
33346a58786K35680O5189j32101r0791O7007R3392J2623k5232l9927r6988j07095
$$ -158786 76894 142083 9982 -80809 -13802 79590 92213 66981 27054 -69934 -177029
33335a77029j639Q7744M5120k6681j0639K0660j2491k2756N1951Q8977k609r7957
$$ -177029 -178668 -90924 -45804 -72485 -83124 -62464 -74955 -97711 -45760 43217 40608 -57349
33323e7349o2993K9825M7482r11l2845j5949N7482J63158J80994L0196j34241
$$ -57349 -120342 -90517 -43035 -43946 -76791 -92740 -35258 127900 308894 339090 204849
33312B04849r9501M8628M1771j11260j31283L9814J34275J7859j17683j16963
$$ 204849 105348 153976 195747 84487 -46796 -6982 127293 145152 27469 -89494
33302h9494n9993p762R1689J57286J3629k30663k39251Q759J41962r194j63366
$$ -89494 -149487 -157249 -65560 91726 105355 -125308 -364559 -355800 -213838 -223032 -386398
33291c86398r0206N7081R3763Q9148J10635O3475l5143j420J35298J01101j16705
$$ -386398 -476604 -419523 -325760 -236612 -125977 -62502 -97645 -99065 36233 137334 20629
33280B0629j74084L4774J57558p574j58665l4306J40939Q9598m8403l4673L7644
$$ 20629 -153455 -118681 38877 31303 -127362 -161668 -20729 68869 20466 -14207 23437
33269B3437q595o9222J4416J30833J07865O287m7796p5544q6171J1386J56854
$$ 23437 14842 -54380 -39964 90869 198734 205021 157225 81681 -4490 6896 163750
33258A63750J22281p9008j33467M2009J23323n4096j96855q2052O7533L5761j0292
$$ 163750 286031 207023 73556 115565 238888 184792 -12063 -94115 -26582 9179 -1113
33247a113P1022O3186j55981k68761m5613J92188R1729j29305q4344J19162J33447
$$ -1113 69909 133095 -22886 -291647 -337260 -145072 -53343 -182648 -266992 -147830 -14383
33236a4383L070J3407J20213N0731j64445k35237j00837L1774O5199P7511Q3171
$$ -14383 -11313 2094 122307 173038 8593 -226644 -327481 -295707 -230508 -152997 -69826
33225f9826L0614l2917l5303j9709k5401J5508J00294R0918j2439p845J20900
$$ -69826 -39212 -72129 -107432 -127141 -152542 -137034 -36740 54178 41739 33894 154794
33214A54794Q9282j84194l29754r0705K17895J82849q2886j83786n1354Q5923
$$ 154794 244076 59882 -269872 -360577 -142682 40167 -42719 -226505 -277859 -191936
33204a91936J29434J30564O4800p0277j00609O8951K18763J21113j02611k00771
$$ -191936 -62502 68062 132862 62585 -38024 30927 249690 370803 268192 67421
33194F7421j63139j10606l5778P5999Q9787m7696j41656n9711L5137j407k7707
$$ 67421 -95718 -206324 -242102 -166103 -76316 -124012 -265668 -325379 -290242 -291649 -319356
33183c19356Q1004J58530N5802o9706n5789k6239r2078q2255J13482K54530J40423
$$ -319356 -238352 -79822 -24020 -93726 -149515 -175754 -267832 -350087 -236605 17925 158348
33172A58348j9182K4528J23129L2295j37733j47408m2425J3068N9978J60541J60530
$$ 158348 139166 163694 286823 319118 181385 33977 -8448 4620 64598 225139 385669
33161C85669k5488j65078p6486M2502j6354r1247Q397J10893J6625j00905l1522
$$ 385669 360181 195103 118617 161119 144765 53518 61915 172808 189433 88528 57006
33150E7006N2231o5432j93713o9837J40771J30881k0183m7109J9800P333j0488
$$ 57006 109237 43805 -149908 -219745 -78974 51907 31724 -15385 4415 11748 1260
33139A260R4390J60238J1842j55267q5679P9908P2275l2613k3143K4956l8964
$$ 1260 95650 255888 267730 112463 26784 106692 178967 146354 123211 148167 109203
33128A09203p1417Q1879K00244M0544j85474j51029K6617M3426l3358L2900J28566
$$ 109203 37786 119665 319909 360453 174979 23950 50567 93993 60635 93535 222101
33117B22101j541k25574k25547n6803n943n2619K8389J75012J45416L57K061J25724
$$ 222101 220560 -5014 -230561 -287364 -293307 -345926 -317537 -142525 2891 3248 5309 131033
33105A31033J16602m4991j40269r5575j4762O9984J60769J43599k6643j57780
$$ 131033 247635 202644 62375 -33200 -47962 22022 182791 326390 299747 141967
33095A41967j09763l6737p6297p4874Q4334J92751Q1499m7841M267P1856k1130
$$ 141967 32204 -4533 -80830 -155704 -71370 121381 202880 155039 159306 231162 210032
33084B10032j06650l3191J1606q7153o9231J83170K93871K2233k37463j03441
$$ 210032 103382 70191 81797 -5356 -74587 108583 402454 424687 187224 83783
33074H3783J30500M9474j42379o5086J02410N673j70279o5093J39896O6804j30989
$$ 83783 214283 263757 121378 56292 158702 164375 -5904 -70997 68899 135703 4714
33063D714q0819Q8612L1820j18847l7490J22102L3288j29963k6291J61170P6734
$$ 4714 -76105 12507 44327 -74520 -112010 10092 43380 -86583 -112874 48296 125030
33052A25030r4414j35J38702n4211k99448j11932K52656J92003j70614k27676
$$ 125030 30616 30481 169183 114972 -184476 -296408 -43752 148251 -22363 -250039
33042b50039K1689O4782j12371o4449J72289J33500j32862j14635J87140K40419
$$ -250039 -228350 -163568 -275939 -340388 -168099 -34599 -167461 -282096 -94956 145463
33032A45463l4274j49229K7122R1368p0101j05195N4708O2569j15495r7895J66968
$$ 145463 111189 -38040 -10918 80450 10349 -94846 -40138 22431 -93064 -190959 -23991
33021b3991K74648J00439k4587K4507p739j72643j92153j0072J10048Q3363N9601
$$ -23991 250657 351096 326509 351016 343277 170634 -21519 -31591 78457 161820 221421
33010B21421J5477j54688k41081p024K63073J44625j65503j63057O9887M9952
$$ 221421 236898 82210 -158871 -165895 97178 241803 76300 -86757 -16870 33082
33000C3082j90054j89514M8085R3506n2737Q074K32598J80966j14708j75813K7830
$$ 33082 -156972 -346486 -298401 -204895 -257632 -249558 -16960 164006 49298 -126515 -98685
32989i8685N1441j45166j38820J03526J52846m8918j03866M5126M4633j02356
$$ -98685 -47244 -192410 -331230 -227704 -74858 -123776 -227642 -182516 -137883 -240239
32979b40239k0626K41954K32038m1470q9314J41549J70412j05079k23914j2414
$$ -240239 -260865 -18911 213127 171657 82343 223892 394304 289225 65311 52897
32969E2897J58338Q7102j0179m4839j48315k02467J8690K73886J46807j76678
$$ 52897 211235 298337 288158 243319 95004 -107463 -88773 185113 331920 155242
32959A55242j90345J6672k9068k21731o4993L03890K84223p0032j37693J04314
$$ 155242 -35103 -18431 -47499 -269230 -334223 -30333 253890 183858 46165 150479
32949A50479P1356k67456l10532K6792J65180l2118o8905J47486J39008j31746
$$ 150479 221835 -45621 -356153 -329361 -164181 -196299 -265204 -117718 21290 -110456
32939a10456j33648J87542K66390j5797j38766K8573K8279k06659j98892Q9966
$$ -110456 -244104 -56562 209828 194031 55265 83838 112117 -94542 -293434 -203468
32929b03468J43427r3506j01665J78103K29825n789l6956J48100M4284k90846
$$ -203468 -60041 -153547 -255212 -77109 152716 146927 109971 258071 302355 11509
32919A1509k52121J29236J88564r2832m0165L63396L64620j37710l61016o3236
$$ 11509 -240612 -111376 77188 -15644 -55809 307587 672207 534497 173481 110245
32909A10245R8330j09707j22079J89169K17841j20518j48330K27097K54139k18574
$$ 110245 208575 98868 -23211 165958 383799 263281 114951 342048 596187 377613
32899C77613l84010L4886K81140q475j96490N7440J87036r2571k35324O449J08729
$$ 377613 -6397 28489 309629 301154 104664 162104 349140 256569 21245 27694 136423
32888A36423j19994j53668J35229J81491j03262j09984K13795J93272k08283k30692
$$ 136423 16429 -137239 -2010 179481 76219 -33765 180030 373302 165019 -65673
32878f5673J91923K31601k32668l28651J43370L17176o8922j92118K22066L75769
$$ -65673 126250 357851 125183 -203468 -60098 257078 188156 -3962 218104 593873
32868E93873k0206k09937J08564L07362K27408M20923O87093J53481q45034q97499
$$ 593873 573667 363730 472294 779656 1007064 1427987 2115080 2268561 1423527 526028
32858E26028O2529M95520j02978m44438O4734L14385k39559n19256K5280L54374
$$ 526028 588557 1084077 981099 536661 601395 915780 676221 156965 182245 536619
32848E36619q4368l05342J91697M17694r2247l34678J17856K40973l13896m04086
$$ 536619 452251 146909 338606 756300 664053 329375 447231 688204 374308 -29778
32838b9778L18192N69864j13902m39393J19470L10793l18587m26008L93975N85334
$$ -29778 288414 858278 744376 304983 424453 735246 416659 -9349 384626 969960
32828I69960l86516q16767Q2145O65271k475m21995L00751O84493j19168n76962
$$ 969960 583444 -233323 -151178 514093 511618 89623 390374 1074867 955699 378737
32818C78737J54528N04822l03568n50593N47961J100721K61564N2178J254377
$$ 378737 533265 1038087 734519 183926 731887 1832608 2094172 2146350 3400727
32809C400727J394369o17315j906294o08345P17829j29920j038840L1602R92377
$$ 3400727 4795096 4177781 2271487 1663142 2380971 2251051 1212211 1243813 2236190
32800B236190j14304j062590J48521J141614j43497j074700N70384J823138R8004
$$ 2236190 2121886 1059296 1207817 2349431 2205934 1131234 1701618 3524756 3622760
32791C622760j366710N11061K353695N84305j277899R49021L719701K291001K65327
$$ 3622760 2256050 2767111 5120806 5705111 4427212 5376233 9095934 11386935 11652262
32782A1652262K847719N909824L330699L67430N842921J4635092J4841469J2173369
$$ 11652262 14499981 20409805 23740504 24107934 29950855 44585947 59427416 71600785
32774G1600785K7899325O5685614R6181516Q5411939L0136394m1088935r2593935
$$ 71600785 99500110 165185724 261367240 346779179 376915573 335826638 243232703
32767B43232703j02622360p3118623k9506759k782671k036727r538687p578971
$$ 243232703 140610343 67491720 37984961 35202290 33165563 23626876 16047905
32760A6047905N5524R14152m028101m644194k27997J114921j951522k769915J86616
$$ 16047905 16103429 17017581 12989480 8345286 8117289 9232210 7280688 4510773 4697389
32751D697389J277550j039368j846166L42434J109468r66759j780300J54111J064712
$$ 4697389 5974939 4935571 3089405 3431839 4541307 3574548 1794248 1948359 3013071
32742C013071n79367j327529L42109J198544l46440j300109L4695J006628r1890
$$ 3013071 2433704 1106175 1448284 2646828 2300388 1000279 1034974 2041602 1949712
32733A949712r65974k6233O95532k21627q91956j4340O48259r3333n84836K08756
$$ 1949712 983738 957505 1653037 1431410 539454 525114 1173373 1080040 495204 703960
32723G03960O34556k56980p68327P2232N87678k21813p25835R9726O77794n1897
$$ 703960 1338516 1081536 313209 385441 973119 751306 25471 125197 802991 751094
32713G51094n96324J15130O64070l5676o46276m7671N66905J16809l46067J20886
$$ 751094 154770 269900 933970 898294 252018 204347 771252 888061 541994 662880
32703F62880M77025j34892o23747j01889L76483p9688m69885O2822N22505L2886
$$ 662880 1139905 1005013 381266 279377 655860 576172 106287 169109 691614 724500
32693G24500m52761l5918M20791N3293l54174j6234L12748o5250l64352P2813
$$ 724500 271739 235821 656612 709905 355731 339497 652245 586995 222643 295456
32683B95456M11553k3480l91381l15L26099q9726m07725N8111M35528k5375m67548
$$ 295456 707009 683529 292148 291833 617932 528206 120481 178592 614120 588745 121197
32672A21197o4769M03156P6717l65357r0198L00452L8698k99246j2623K84583
$$ 121197 56428 459584 536301 170944 80746 381198 419896 120650 108027 392610
32662C92610r9937m88756p5054N30972M08924q5202j78869q9309k84211l65923
$$ 392610 292673 -196083 -271137 259835 668759 583557 404688 315379 31168 -334755
32652c34755N1710L57479L3367k85905r8K80161p4872m42354j10767L48762J61204
$$ -334755 -283045 74434 107801 -178104 -178202 101959 27087 -415267 -526034 -177272 -16068
32641a6068k13709k8830L23077J53240j49076P9251M19702J50493l56445l12253
$$ -16068 -229777 -258607 64470 217710 68634 147885 567587 718080 361635 49382
32631D9382P3412Q8741j71976j64203P886n8242j60223M7044K38140J3312k66752
$$ 49382 122794 211535 39559 -124644 -116758 -175000 -335223 -288179 -50039 -36727 -303479
32620c03479j30442J35422J09094N0199K57073L40130n544k61654M720K77987
$$ -303479 -433921 -298499 -189405 -139206 117867 457997 452453 190799 195519 473506
32610D73506L1300k87276j34875R3027j09202l24287l6966L12976J62250q2383
$$ 473506 504806 217530 82655 175682 66480 -257807 -294773 18203 180453 98070
32600I8070J26105L40300k8612m74655k39945K80404K36392j68516j47417J98364
$$ 98070 224175 564475 535863 61208 -178737 101667 338059 169543 22126 220490
32590B20490J64429j98824k59379k3565q819j62641k0116K92887K63234k2145
$$ 220490 384919 186095 -73284 -96849 -105668 -268309 -288425 4462 267696 245551
32580B45551p5265M6073n7898k40246p7426K24271J45082j57102j15045J97319
$$ 245551 170286 216359 158461 -81785 -159211 65060 210142 53040 -62005 135314
32570A35314K19324o1860j47095K7611N2822j27445j58608J1792Q8563K8563L9385
$$ 135314 354638 292778 145683 173294 226116 98671 -59937 -48145 40418 68981 108366
32559A08366Q5031j3673j34524o0905O6026J6983o8960J784M4896j05132j66204
$$ 108366 193397 179724 45200 -15705 50321 67304 -1656 128 45024 -60108 -226312
32548b26312P3131K52875N3235j72741k4975J88228L7265j84597L203L39213K65376
$$ -226312 -153181 99694 152929 -19812 -44787 143441 180706 -3891 -688 338525 603901
32537F03901q1597j68337k2130n3852k13393j41688P9386J03528R508Q5926J89290
$$ 603901 522304 353967 331837 277985 64592 -77096 2290 105818 115326 201252 390542
32526C90542L2562j71340p3085J11094r064k26986j18531J31603P4338j40527
$$ 390542 423104 251764 178679 289773 280709 53723 -64808 66795 141133 606
32516F06o3556J73630J15246j29219j01367J10848M5831k31687k43739J3581J07524
$$ 606 -62950 110680 225926 96707 -4660 106188 152019 -79668 -323407 -309826 -202302
32505b02302m921L0810K23781K30238L2481o0343j7500n4898j12783J2943J67261
$$ -202302 -207223 -176413 47368 277606 310087 249744 232244 177346 64563 77506 244767
32494B44767P8080q6056j5836J17078j5660k22083j29909P6556j692j81947l8156
$$ 244767 322847 236791 220955 338033 322373 100290 -29619 46937 45245 -136702 -174858
32483a74858K30883J22274k05115j76712J51814K07065m9200r9238J38496K02244
$$ -174858 56025 178299 -26816 -203528 -51714 155351 106151 6913 145409 347653
32473C47653o904q3643N2942K4469k15293k48545J9117J78381N7787m1054K8386
$$ 347653 340749 257106 310048 334517 119224 -129321 -110204 68177 125964 84910 113296
32462A13296M5420n2056m5907O8854N1865p1946m0460J01479O8297q5535n9989
$$ 113296 158716 106660 60753 129607 181472 109526 69066 170545 238842 153307 93318
32451I3318O9053k6432k39423j63204J23750J47030r1346j01861J78489K51389
$$ 93318 162371 135939 -103484 -266688 -142938 4092 -87254 -189115 -10626 240763
32441B40763l4977k15051m2655J21426O654j33819n7420P1748P7693N9776P2526
$$ 240763 205786 -9265 -51920 69506 76160 -57659 -115079 -43331 34362 94138 166664
32430A66664j3327j61558j35399N8410J36483L8246m73O8650L6855r2543p2377
$$ 166664 153337 -8221 -143620 -85210 51273 89519 89046 157696 194551 102008 29631
32419B9631Q7405R7184o6514j02744N5843J33537L2668l2367J2279J74p3995l7946
$$ 29631 117036 214220 147706 44962 100805 234342 267010 234643 246922 247096 173101 135155
32407A35155M8452l6021j90175j01772J59934K13572K6556o7645j1752p1149k18747
$$ 135155 183607 147586 -42589 -144361 15573 229145 255701 188056 176304 105155 -113592
32396a13592j22414J85413K77685P4716k9580R3295R5991j48869k84562j17772
$$ -113592 -236006 -50593 227092 301808 272228 365523 461514 312645 28083 -89689
32386h9689O1587L3082k8122J3465J4119o5123m0188P4384L5503j15840n7883
$$ -89689 -28102 4980 -23142 -9677 4442 -60681 -100869 -26485 9018 -106822 -164705
32375a64705J85922K17436j2149q3178J22079J94395l5454j76280o545J27575
$$ -164705 21217 238653 226504 143326 265405 459800 424346 248066 241521 369096
32365C69096k2431j63774n2370N8420m7055j13823O4648K06862N5977j37682q4183
$$ 369096 346665 182891 130521 188941 141886 28063 92711 299573 355550 217868 133685
32354A33685L1400n4259j71244n6408J40084J31646j1426n0391O39N487P347O9004
$$ 133685 165085 110826 -60418 -116826 23258 154904 143478 93087 93726 99213 106560 175564
32342A75564O3302p1488j28874J8147J39149J7060j72403j61817k0175L0984p77
$$ 175564 238866 167378 38504 56651 195800 212860 40457 -121360 -141535 -110551 -111328
32331a11328J4320M5249J2549M10R2602J64311P3882r2544j63971j12919J0710
$$ -111328 -97008 -51759 -39210 -38800 53802 218113 291995 199451 35480 -77439 -66729
32320f6729J80166K88325J71283j14114k68501j54698J3769K9723k2642j130L4230
$$ -66729 113437 401762 573045 458931 190430 35732 49501 79224 56582 55452 89682
32309H9682k1140j14913j51609j16796N085K11226L25175J50481j60794k31264
$$ 89682 68542 -46371 -197980 -314776 -309691 -98465 226710 377191 216397 -14867
32299a4867k7361Q0812n9001j37443M6036K13648R4861j12845j08277J6504O460
$$ -14867 -42228 38584 -20417 -157860 -111824 101824 196685 83840 -24437 -7933 -1473
32288a473r2671p0766M1114N3651k6777m2137J2946R303n1214k7644J12724K09909
$$ -1473 -94144 -164910 -123796 -70145 -96922 -139059 -126113 -116810 -168024 -195668 -82944 126965
32276A26965R9834j75710l53796j89020K19965M45522K36994j12668j57978O7089
$$ 126965 226799 51089 -302707 -491727 -271762 173760 410754 298086 140108 207197
32266B07197J57606o563j44358j09119p6920j21509o0706J29273J79942k551j35855
$$ 207197 364803 358240 213882 104763 27843 -93666 -154372 -25099 154843 152292 16437
32255A6437l1818J06080P1885j5299m771L845q2467j23830k5473M7105k9466r7012
$$ 16437 -15381 90699 162584 147285 142514 146359 63892 -59938 -85411 -38306 -67772 -164784
32243a64784j6833O0239k8346j54955j22822K4320J30360J63424J42117L8714
$$ -164784 -181617 -121378 -149724 -304679 -427501 -403181 -272821 -109397 32720 71434
32233G1434p9896m5932J17773J51252l6118j82430p9836J05803J26907J3138p4964
$$ 71434 -8462 -54394 63379 214631 178513 -3917 -83753 22050 148957 162095 87131
32222H7131j17971j48886j02536M1347J47330J27634P8378Q0605O6644J760k3670
$$ 87131 -30840 -179726 -282262 -240915 -93585 34049 112427 193032 259676 261436 237766
32211B37766N992k1950j03419q3786L4709N1232n7530n2539J30292K08858J9182
$$ 237766 243758 221808 118389 34603 69312 120544 63014 10475 140767 349625 368807
32200C68807j84479j34175M3603Q3536n770m4149L781M5349L7722j9415j19794
$$ 368807 184328 50153 93756 177292 171522 127373 131154 176503 214225 194810 75016
32189G5016j76679r3574L4899K0626r1812q3769L3593K9543r0461n3686J65530
$$ 75016 -101663 -195237 -160338 -139712 -231524 -315293 -281700 -252157 -342618 -396304 -230774
32178b30774K45964P3244o5025j5862j5986j79052k11351N6104K96602J97188
$$ -230774 15190 88434 23409 7547 -8439 -187491 -398842 -342738 -46136 151052
32168A51052m9432j12809k8525J2279L9048J20148J22068j3376o1330R3540J82847
$$ 151052 101620 -11189 -39714 -27435 11613 131761 253829 240453 179123 272663 455510
32157D55510O682j79868r8264O7396J4371j53351j61544n6768l8828m2876R0498
$$ 455510 462192 282324 184060 251456 265827 112476 -49068 -105836 -144664 -187540 -97042
32146i7042K36625J84032K4874k8844k9658j28152k18684j26499L4149N4754L867
$$ -97042 139583 323615 348489 319645 289987 161835 -56849 -183348 -149199 -94445 -90578
32135i0578M6102Q5860l0733j47307l2489J73320J50606p8420k03523j07316N2018
$$ -90578 -44476 41384 10651 -136656 -169145 4175 154781 76361 -127162 -234478 -182460
32124a82460J44916J46361K1557j69020j89117N4545K75453J93475k8273o6392
$$ -182460 -37544 108817 130374 -38646 -227763 -173218 102235 295710 267437 201045
32114B01045L8717K2728j06374j23976k6566j0700q7590r0438r257K2765J6128
$$ 201045 239762 262490 156116 32140 5574 -5126 -92716 -183154 -192411 -169646 -153518
32103a53518P5191J32700N3910o6866l3727R4397R2028m5787j14234n1790R485
$$ -153518 -78327 54373 108283 41417 7690 102087 194115 148328 34094 -17696 -8211
32092h211R949J2446K6208J7867L7942J16594J24398l7223k13797j99656n0679
$$ -8211 1738 14184 40392 58259 96201 212795 337193 299970 86173 -113483 -164162
32081a64162L5306K8281K4009K3464j1650j7178L7637K8512r0631j23027N7999
$$ -164162 -128856 -100575 -76566 -53102 -64752 -81930 -44293 -15781 -106412 -229439 -171440
32070a71440K34985J57986o3479j58150r2043K266R1533J66046J20420k1194j9588
$$ -171440 63545 221531 158052 -98 -92141 -89875 1658 167704 288124 266930 247342
32059B47342J62831J80214j28875l58362j50811J63265P2797k71964l25994l5595
$$ 247342 410173 590387 461512 103150 -47661 115604 188401 -83563 -409557 -445152
32049d45152J71722J41956J11364J43699O0255q8769n7009Q9892M3639j59590
$$ -445152 -273430 -131474 -20110 123589 183844 95075 38066 127958 171597 12007
32039A2007j61432Q0358K09826Q4588m3358k7460j2457m7257M372R2867M839j72313
$$ 12007 -149425 -69067 140759 225347 181989 154529 142072 94815 99187 192054 196893 24580
32027B4580j06542J69557K24602o5181k92683j80962K8243O2667K9179Q1929J00767
$$ 24580 -81962 87595 312197 247016 -45667 -226629 -198386 -135719 -106540 -24611 76156
32016G6156k0778j19226n5646L6719K3503j303M6329O1119r324k9682M5994N4850
$$ 76156 55378 -63848 -119494 -82775 -59272 -60575 -14246 46873 37549 7867 53861 108711
32004A08711n5751r6736P734N4819n9350j21546J9659J67096J13114j8661l1440
$$ 108711 52960 -43776 -36042 18777 -40573 -162119 -142460 24636 137750 119089 87649
31993H7649N91p5741j73387j22734J7013O7727K4135L896K0885J7791K0790O8837
$$ 87649 88240 12499 -160888 -283622 -266609 -198882 -174747 -170851 -149966 -132175 -111385 -42548
31981d2548Q3172j0034j06292m6522J34378K32407J31758o4399j59671p5980N7281
$$ -42548 40624 30590 -75702 -122224 12154 244561 376319 311920 152249 76269 133550
31970A33550M3406j22514k12870p5715J25034J40421N947m3200M3416R5364M6571
$$ 133550 176956 54442 -158428 -234143 -109109 31312 37259 -5941 37475 132839 179410
31959A79410K1648P3330Q8701M959r9484j60694j75044r6570Q9717K20498J35315
$$ 179410 201058 274388 363089 368048 268564 107870 -67174 -163744 -74027 146471 281786
31948B81786l1417l1894O3939k4507k58187k73431J5158K31233J16757r3485r3415
$$ 281786 250369 218475 282414 257907 -280 -273711 -258553 -27320 89437 -4048 -97463
31937i7463L9957P0948P578O319P1723R3232M3298l7206j20649j43499l5880J12481
$$ -97463 -57506 13442 21020 27339 99062 192294 235592 198386 77737 -65762 -101642 10839
31925A0839J10880l2281r9280k6296K915p4227o0287J14530K01226N0861r2097
$$ 10839 121719 89438 -9842 -36138 -33223 -107450 -167737 -53207 148019 198880 106783
31914A06783Q426J67243Q9332j34325j92124n1440N5356M1214K9680O2814M4671
$$ 106783 115209 282452 371784 237459 45335 -6105 49251 90465 120145 182959 227630
31903B27630l3867o6152l0578j3945l6609l4329l679j552j5650J3839O6203P4856
$$ 227630 193763 127611 97033 83088 46479 12150 8471 6919 -8731 5108 71311 146167
31891A46167N7567P1612P7618j968j20254j57134j13195r3831j05898m0670J09780
$$ 146167 203734 275346 352964 350996 230742 73608 -39587 -133418 -239316 -279986 -170206
31880a70206J84717Q3900o2345o5645N3201J00212n695j16556p7428M4918O9758
$$ -170206 14511 98411 36066 -29579 23622 123834 118139 1583 -75845 -30927 38831
31869C8831k0113o3139J6052R5370P0330J6718K8610M1861l0627j08321o1892
$$ 38831 18718 -44421 -28369 67001 137331 154049 182659 224520 193893 85572 23680
31858B3680O6036J32475J09639N8442k7163j56896k08088p2930J18364J47700
$$ 23680 89716 222191 331830 390272 363109 206213 -1875 -74805 43559 191259
31848A91259L1880l8098k7058n9367j25124p7323O5361J08527K2349M550J26884
$$ 191259 223139 185041 157983 98616 -26508 -103831 -38470 70057 92406 96956 223840
31837B23840J94485O6354j29825k21042k05621j32590J7476J98003K38839P1717
$$ 223840 418325 484679 354854 133812 -71809 -204399 -186923 11080 249919 321636
31827C21636j36521k00817j37186o6728l5301k7206m0078n5564k6388M9352J17229
$$ 321636 185115 -15702 -152888 -219616 -254917 -282123 -322201 -377765 -404153 -354801 -237572
31816b37572J41415J10031O846j09707q3760J14032K42377R7924j33134j23971
$$ -237572 -96157 13874 20720 -88987 -172747 -58715 183662 281586 148452 24481
31806B4481P0979R9237j06466k24815q4014Q8342Q0691Q305L8831J09342R8514
$$ 24481 95460 194697 88231 -136584 -220598 -132256 -51565 -43260 -4429 104913 203427
31795B03427L2867l3148j17812j75443r2073Q5574J60505R7358N4017N3692m3458
$$ 203427 236294 203146 85334 -90109 -182182 -96608 63897 161255 215272 268964 225506
31784B25506j79192j02703J44530J77369j12473l15855j38422J42071J61083K5302
$$ 225506 46314 -56389 88141 265510 153037 -162818 -301240 -159169 1914 27216
31774B7216K2541J06404O6361n0480p1196l3212m1812j0343J24074J63325k1103
$$ 27216 49757 156161 222522 172042 100846 67634 25822 15479 139553 302878 281775
31763B81775j67551k1627J87009R7899j65647k13866n2454q546r9009k0977K34879
$$ 281775 114224 92597 279606 377505 211858 -2008 -54462 -63008 -162017 -182994 51885
31752E1885K98699M0103k01615j55705J3743N6482Q683J5642N3667L6763P418
$$ 51885 350584 390687 189072 33367 47110 103592 112275 127917 181584 218347 225765
31741B25765L8081P3873J5502j24892k35058k10033l2005J82724K44730R9549
$$ 225765 263846 337719 353221 228329 -6729 -216762 -248767 -66043 178687 278236
31731B78236p5211r5978j6570J325l9286k6007J9345j3986q6564n6589N4512Q0784
$$ 278236 203025 107047 90477 91802 52516 26509 45854 31868 -54696 -111285 -56773 24011
31719B4011o483o2338k1455K7986L5407M5649N5893J7490j6002M9601J41049R2798
$$ 24011 17528 -44810 -66265 -38279 -2872 42777 98670 116160 100158 149759 290808 383606
31707C83606o7124j43760r9610r2628j52334r9762J16590K71649J89605o075j19105
$$ 383606 316482 172722 73112 -19516 -171850 -271612 -155022 116627 306232 300157 181052
31696A81052j54969k00168k04553q3783Q0595J38937J01547R8248J51285J44492
$$ 181052 26083 -174085 -378638 -462421 -381826 -242889 -141342 -43094 108191 252683
31686B52683J6379j37745j82325q9685M9602J24930R7811J1941o7875j02551o8911
$$ 252683 269062 131317 -51008 -140693 -91091 33839 131650 143591 75716 -26835 -95746
31675i5746L4878J37640J19642l7952j84826j69205k5449R3847J16477P9577K2319
$$ -95746 -60868 76772 196414 158462 -26364 -195569 -221018 -127171 -10694 68883 91202
31664I1202k6947j1153P3713J09841J2187j11239j18081p4127j22001j72598j2119
$$ 91202 64255 53102 126815 236656 248843 137604 19523 -54604 -176605 -349203 -361322
31653c61322K81557L48947P0156k20055j99630J1998R7069J349r0085r1050p1595
$$ -361322 -79765 269182 339338 119283 -80347 -68349 28720 30069 -60016 -151066 -222661
31642b22661n5114Q200R3685J13574N6430k6549j21800j97798j37237Q8489K61402
$$ -222661 -277775 -269575 -175890 -62316 -5886 -32435 -154235 -352033 -489270 -400781 -139379
31631a39379J66115o0194r5366P4182J40670o502r9502L4354J61006M1870j43425
$$ -139379 26736 -33458 -128824 -54642 86028 79526 -19976 14378 175384 217254 73829
31620G3829r7211Q8274R6258p1964j22918L521M8545p7158j20673N9304K22549
$$ 73829 -23382 64892 161150 89186 -33732 -30211 18334 -58824 -179497 -120193 102356
31609A02356J35750o5382j39654j15908j39763j52746k3177J45347J39478j1534
$$ 102356 238106 172724 33070 -82838 -222601 -375347 -398524 -253177 -113699 -125233
31599a25233q6632k4163L6883L2650L8949O8357L8201m5911q0895n1283l6131
$$ -125233 -211865 -236028 -199145 -166495 -127546 -59189 -20988 -66899 -147794 -199077 -235208
31588b35208l4460K5865J11482J12133M4346L1419Q1426Q3442K4464O534M3504
$$ -235208 -269668 -243803 -132321 -20188 24158 55577 137003 220445 244909 251443 294947
31577B94947M4117P70q964k027n5123j08090m2685O1413K2288j03613q8360M7140
$$ 294947 339064 339834 330870 328843 273720 165630 122945 184358 206646 103033 14673 61813
31565F1813L4641j54643k05888J6795K10878J04219j37464k09721j01341J9361
$$ 61813 96454 -58189 -264077 -247282 -36404 67815 -69649 -279370 -380711 -361350
31555c61350J08861J87058J78865N9575k3298J3567K6690p6292j26474r97J02343
$$ -361350 -252489 -65431 113434 173009 149711 163278 189968 113676 -12798 -13795 88548
31544H8548q875j47115m3898J59570J16353j39883k25309n205K22698K01431M0180
$$ 88548 79673 -67442 -111340 48230 164583 24700 -200609 -205814 16884 218315 258495
31533B58495m1763l1569l9987p9804p0874J4771J03061R4719j5119r1188m542
$$ 258495 216732 185163 145176 65372 -5502 9269 112330 207049 191930 100742 96200
31522I6200J52224J35517q9765k41493j15705R3122Q3259r4210j39947J4130J25086
$$ 96200 248424 383941 294176 52683 -63022 30100 113359 19149 -120798 -106668 18418
31511A8418L6173j11173j21205j23J07326J03999P075q4201p0327L2494Q4329
$$ 18418 54591 -56582 -177787 -177910 -70584 33415 40490 -43711 -114038 -81544 2785
31500B785J845j08820r2523M0805J44104J20425q744j55920k04749q1836J19515
$$ 2785 4630 -104190 -196713 -155908 -11804 108621 99877 -56043 -260792 -342628 -223113
31489b23113J87399N2222j17718j65549j32208q7821K1482J91543K29923L4747
$$ -223113 -35714 16508 -101210 -266759 -398967 -486788 -465306 -273763 -43840 -9093
31479i093j68652j24036O7791J27378L5132m666N6377P8496L0454J6925L2583
$$ -9093 -177745 -301781 -233990 -106612 -71480 -76146 -19769 58727 89181 106106 138689
31468A38689k4931j07686o4551O2504O9494o1843j22940k6432P0271N1891P294
$$ 138689 113758 6072 -58479 4025 73519 11676 -111264 -137696 -67425 -15534 -8240
31457h240K3998M4342J8092M780L4823L4935l2267r9813j18479j06287n0709P9879
$$ -8240 15758 60100 78192 82972 117795 152730 120463 20650 -97829 -204116 -254825 -174946
31445a74946K04082J78133J2417j26861j58663j56649j50994n5110J44701K97314
$$ -174946 29136 207269 219686 92825 -65838 -222487 -373481 -428591 -283890 13424
31435A3424K68873R6683q7797j79694j30397J5905J11341O1760k4192M291P6024
$$ 13424 282297 378980 291183 111489 -18908 -3003 108338 170098 145906 150197 226221
31424B26221M746j67355j95259k9792Q5083J952j04989m2998J00180J35007O4994
$$ 226221 230967 63612 -131647 -161439 -76356 -74404 -179393 -222391 -122211 12796 77790
31413G7790J3587m964m9990q7501m4436K8719J7666o1987p9594O020Q8444Q3791
$$ 77790 91377 86413 36423 -51078 -95514 -66795 -49129 -111116 -190710 -184690 -96246 -12455
31401a2455M9483P5440J28232R2639m2282j34992q5811n95m0843j51466j15180
$$ -12455 37028 112468 240700 333339 291057 156065 70254 69659 28816 -122650 -237830
31390b37830R4948K22739R4647j16618j61032p0530l0224l5365M8320J69585J44143
$$ -237830 -142882 79857 174504 57886 -103146 -173676 -203900 -239265 -190945 -21360 122783
31379A22783L162k0386J05501J25775q0101k66595j81456N8762J57729N9443l6028
$$ 122783 125945 105559 211060 336835 256734 -9861 -191317 -132555 25174 84617 48589
31368D8589m520N9369L5236m6337p9068m3685j6626l7791m3498L0697J28597J35326
$$ 48589 44069 103438 138674 92337 13269 -30416 -47042 -84833 -128331 -97634 30963 166289
31356A66289M8781j2327R624L5238j444m9191n5201n8385p8813m5001N9474J10661
$$ 166289 215070 202743 212367 247605 246161 196970 141769 83384 4571 -40430 19044 129705
31344A29705L4173n4632m5822k5266r4028j46633n1680P3781L1102j08453j03377
$$ 129705 163878 109246 63424 38158 -55870 -202503 -254183 -180402 -149300 -257753 -361130
31333c61130N0428J06620k4115j34897n8785R4379J38940P0893J6272M1467J02000
$$ -361130 -310702 -204082 -228197 -363094 -421879 -327500 -188560 -117667 -101395 -59928 42072
31322D2072J14161L9598o1210q0053q832L2874j9943p4625m7186L411K0331O3888
$$ 42072 156233 195831 134621 54568 45736 78610 58667 -15958 -63144 -59733 -39402 24486
31310B4486J34657P6556j41706k55189p7420J50326J07190q5624p7415J08612
$$ 24486 159143 235699 93993 -161196 -238616 -88290 18900 -66724 -144139 -35527
31300c5527J29125p1602j73128l7876Q5340K4859n2250m06M1797n2978j39659
$$ -35527 93598 21996 -151132 -189008 -103668 -78809 -131059 -131465 -89668 -142646 -282305
31289b82305n1345J13746J56497O3172l4812o0032k8864R203R414o826N4931J90962
$$ -282305 -333650 -219904 -63407 -235 -35047 -95079 -123943 -114740 -105326 -112152 -57221 133741
31277A33741K05815j7358k55472k21461j2335M5062o8124o6793J04424J67297
$$ 133741 339556 322198 66726 -154735 -167070 -122008 -190132 -256925 -152501 14796
31267A4796J0792j19472o0049K8623J6351L2905J58259K20712J06588l1563o8342
$$ 14796 25588 -93884 -153933 -125310 -108959 -76054 82205 302917 409505 377942 309600
31256C09600j09707k14233k17521m9482P1580j066p1831N0202J97912J27129p0343
$$ 309600 199893 -14340 -231861 -281343 -209763 -210829 -282660 -232458 -34546 92583 22240
31245B2240j32965m0359K5803Q271O051O1403J15956J17026M2611q4326j35309
$$ 22240 -110725 -151084 -125281 -117010 -110959 -49556 66400 183426 226037 141711 6402
31234F402O730K05239J71676r7287k53681j07452R1303P4135l6049P59J13281
$$ 6402 13132 218371 390047 292760 39079 -68373 22930 97065 61016 61775 175056
31223A75056P8390p2769j26565n2674p824l6976k3249Q2722J75161J40740j2038
$$ 175056 253446 180677 54112 1438 -6386 -43362 -66611 16111 191272 332012 319974
31212C19974j55177j42331J9389J15161j5392k01464j55759O3394J16969o7408
$$ 319974 164797 22466 41855 157016 141624 -59840 -215599 -152205 -35236 -102644
31202a02644j79568m3904J31012J54700J18603R3659k7040j83479q6046K42953
$$ -102644 -282212 -326116 -195104 -40404 78199 171858 144818 -38661 -124707 118246
31192A18246L22236n8182m10785k69145R1708J44641n6433r6105M8433Q2185J5803
$$ 118246 440482 382300 -28485 -297630 -205922 -61281 -117714 -213819 -165386 -83201 -67398
31181f7398R3447K18041O3473k77020l42877m1517K07015J43235l281J9319J21448
$$ -67398 26049 244090 307563 30543 -312334 -353851 -146836 -3601 -6882 12437 133885
31170A33885J27468M5399n3679j42220j42335P138J57299J03257o7091q9106K5730
$$ 133885 261353 306752 253073 110853 -31482 -24344 132955 236212 169121 80015 105745
31159A05745J3062j53999j96404k5787Q8798j3378j19064k2448J43677J62068
$$ 105745 118807 -35192 -231596 -257383 -168585 -181963 -301027 -323475 -179798 -17730
31149a7730N8639k2698o1601r7545j01428o3926n5711p9201k1370J38027K37973
$$ -17730 40909 18211 -43390 -140935 -242363 -306289 -362000 -441201 -462571 -324544 -86571
31138h6571J66041K1427n2420m7358j1799N0638J06374O6496o0971j29705o4192
$$ -86571 79470 100897 48477 1119 -10680 39958 146332 212828 151857 22152 -42040
31127d2040J9223q83o5388m4778O0985J39626J22364M0015l7944o8471o2016n7653
$$ -42040 -22817 -23700 -89088 -133866 -72881 66745 189109 229124 191180 122709 60693 3040
31115C040n5070j1482N4998M3197o3760j09048K3268J94494J86895K5855p2255
$$ 3040 -52030 -63512 -8514 34683 -29077 -138125 -114857 79637 266532 292387 220132
31104B20132l4591j083o2857j38958j44058j01739n3756l275L0570L1622N1476
$$ 220132 185541 184458 121601 -17357 -161415 -263154 -316910 -320185 -289615 -257993 -206517
31093b06517J21839J44101L2219r0037m6892P7640M4488j27601j49140P0830K35444
$$ -206517 -84678 59423 91642 1605 -45287 32353 76841 -50760 -199900 -129070 106374
31082A06374R1367j87749k49470l7033J87477K06545N3932j05859j57818q8994
$$ 106374 197741 9992 -239478 -276511 -89034 117511 171443 65584 -92234 -181228
31072a81228M0843J47141J73420J18542K2720o2920j08886j26516j34146j04235
$$ -181228 -140385 6756 180176 298718 321438 258518 149632 23116 -111030 -215265
31062b15265j951J15663J32597M1556k7809k749K8718k0189r6462j19754j02837
$$ -215265 -217216 -101553 31044 72600 44791 42042 70760 50571 -45891 -165645 -268482
31051b68482o5061K9655J44545J46536L3277n159J02118J49952J500j44714q0086
$$ -268482 -333543 -303888 -159343 -12807 20470 15311 117429 267381 268881 124167 44081
31040D4081N1662K1957o4941J6141J57439Q8507j17729j46910Q596M9535q9914
$$ 44081 95743 117700 52759 68900 226339 314846 197117 50207 58803 108338 18424
31029A8424j49125l3274L8619k8611l8166R1261J38320k2897j79317j29252J6558
$$ 18424 -130701 -163975 -125356 -153967 -192133 -100872 37448 14551 -164766 -294018 -277460
31018b77460P3900O4188P4654P5504M2108M3903P5397K0645r9131r3324O2208
$$ -277460 -203560 -139372 -64718 10786 52894 96797 172194 192839 93708 384 62592
31007F2592J33719J9373o2924L7599J26053Q923j50225j08455M0872M3238q0645
$$ 62592 196311 215684 152760 190359 316412 325335 175110 66655 107527 150765 70120
30996G0120r2672N1088J41338N0908j07443j72757j12017J1302J19402J58345
$$ 70120 -22552 28536 169874 220782 113339 -59418 -171435 -160133 -40731 117614
30986A17614J29805P9166K6368l9178q9339q3184o8869j22417j72147o3168J61387
$$ 117614 247419 326585 352953 313775 224436 141252 72383 -50034 -222181 -285349 -123962
30975a23962K48490Q8270j20796j66001q5795j9346J5467M8117L8211j1049J4164
$$ -123962 124528 212798 92002 -73999 -159794 -179140 -163673 -115556 -77345 -88394 -74230
30964g4230J36121J81369M4429j11794j05847k5629n1505j35320j03149K1522
$$ -74230 61891 243260 287689 175895 70048 44419 -7086 -142406 -245555 -224033
30954b24033N6813k2598n4949K8574J10544R8790M6391J7945j0274o0467q3270
$$ -224033 -167220 -189818 -244767 -216193 -105649 -6859 39532 57477 47203 -13264 -96534
30943i6534m0285K4370M9242L7611K8274J8952l0533j14922j45268m6362J09942
$$ -96534 -136819 -112449 -63207 -25596 2678 21630 -8903 -123825 -269093 -315455 -205513
30932b05513J48101J0551j46066j53470m5174L8764O6820Q8432P9781M901m0354
$$ -205513 -57412 -46861 -192927 -346397 -391571 -352807 -285987 -197555 -117774 -112873 -153227
30921a53227L6795J07109p661j83415j24868J39513K37607J6245k17161j71131
$$ -153227 -116432 -9323 -16984 -200399 -325267 -185754 51853 68098 -149063 -320194
30911c20194K4488R6080L6866j608n944l3216k0180R1538J76096R8224n0686r9820
$$ -320194 -295706 -199626 -162760 -164368 -170312 -203528 -223708 -132170 43926 142150 91464 -8356
30899h356o3808n6337n9028Q743R3616R6163O2835Q1471P7951n8791k23346k02357
$$ -8356 -72164 -128501 -187529 -178786 -85170 10993 73828 155299 233250 174459 -48887 -251244
30887b51244j206J56906J45752N3417j0389l6229k6082N0704J66152K12554J17252
$$ -251244 -252450 -95544 50208 103625 93236 57007 30925 81629 247781 460335 577587
30876E77587p6002k41462k58999j16492M5248P1807N801K8504J50659J54033n0175
$$ 577587 501585 260123 1124 -115368 -70120 1687 7488 35992 186651 340684 290509
30865B90509k16770j11166J17943J52954k7460j60731j11520p130K4837J2540
$$ 290509 73739 -37427 80516 233470 206010 45279 -66241 -73371 -48534 -35994
30855c5994N761j0376j9254M3648J56364J91439Q5348o9805j44955j14566n4998
$$ -35994 -30233 -40609 -59863 -16215 140149 331588 416936 347131 202176 87610 32612
30844C2612m9632r9580j09938k871J45094J67272L9219p5792p2741m5231p8686
$$ 32612 -17020 -116600 -226538 -229409 -84315 82957 122176 46384 -26357 -71588 -150274
30833a50274o9826Q3522K50625K29235M9997q3882j00910j02938j38753j39390
$$ -150274 -220100 -136578 114047 343282 393279 309397 208487 105549 -33204 -172594
30823a72594q1608l6484k8880O400R5578J65438J42704M0020o5106r1629k5426
$$ -172594 -254202 -290686 -319566 -313166 -217588 -52150 90554 130574 65468 -26161 -51587
30812e1587L4134l2234j78073k05957m0647J39117J45601K8478m9877n0929k1244
$$ -51587 -17453 -49687 -227760 -433717 -474364 -335247 -189646 -161168 -211045 -261974 -283218
30801b83218M8407J45517J39884l1559j85756j15996Q7413J59947M1241r3943
$$ -283218 -234811 -89294 50590 19031 -166725 -282721 -195308 -35361 5880 -88063
30791h8063j30181j04795m1009P6257J65438J12329k2590o3635P773L7435l9142
$$ -88063 -218244 -323039 -364048 -287791 -122353 -10024 -32614 -96249 -88476 -51041 -90183
30780i0183j14348j03055l7776M0137J13023J17015J4633q2922n0476L2528R335
$$ -90183 -204531 -307586 -345362 -305225 -192202 -75187 -60554 -143476 -193952 -161424 -152089
30769a52089n9483Q434J56437J34805o6733j61315k4891J10403O1611j7012N0674
$$ -152089 -211572 -203138 -46701 88104 21371 -139944 -164835 -54432 7179 -9833 40841
30758D0841J34352L7909j38829j56197j9351O0434J3650k5498J8958N5264j019
$$ 40841 175193 213102 74273 -81924 -101275 -40841 -27191 -52689 -33731 21533 20514
30747B0514r9173j39464r2594j1567K3497j6701n7752J814J28097J56205K2270
$$ 20514 -78659 -218123 -310717 -322284 -298787 -315488 -373240 -371426 -243329 -87124 -64854
30736f4854j10329o2969J01605J66156N5681q9286j24413n8914J9308O6764Q1311
$$ -64854 -175183 -238152 -136547 29609 85290 -3996 -128409 -187323 -168015 -101251 -19940
30725a9940N0502k5862q7533n4536O4776J47072Q2653p6549j54767o1276R2769
$$ -19940 30562 4700 -82833 -137369 -72593 74479 157132 80583 -74184 -135460 -42691
30714d2691J30310J5151j31372j80286j02408L5332J19313P5312l5940o4524K6201
$$ -42691 87619 102770 -28602 -208888 -311296 -275964 -156651 -81339 -117279 -181803 -155602
30703a55602R0741K8226l4766N6655K01795J71464l0891j68576j25065j9101N2734
$$ -155602 -64861 -36635 -71401 -14746 187049 358513 327622 159046 33981 14880 67614
30692F7614J30211J85171P5439j73554k93047j44580N2985O0979k6306K629J00327
$$ 67614 197825 382996 458435 284881 -8166 -152746 -99761 -38782 -65088 -62459 37868
30681C7868Q5788M667L9755J35201N2947j92814k92845j09902J13186J38101N4864
$$ 37868 123656 128323 168078 303279 356226 163412 -129433 -239335 -126149 11952 66816
30670F6816N0446Q7603L6720m5767k3010M4885j1121j49387j45546M0301J65755
$$ 66816 117262 204865 241585 195818 172808 217693 206572 57185 -88361 -48060 117695
30659A17695N8417j33717j71405n5261K7113p289o3204n3481r616J1900K0425
$$ 117695 176112 42395 -129010 -184271 -157158 -164447 -227651 -281132 -290748 -278848 -258423
30648b58423M5139P1775P2049N4102M6528N5810O4752N8542L4876m102n6675j12197
$$ -258423 -213284 -141509 -69460 -15358 31170 86980 151732 210274 245150 241048 184373 72176
30636G2176j38149r7542l652O5395N7302L2227P8729J49990J02819o8908j82789
$$ 72176 -65973 -163515 -167167 -101772 -44470 -12243 66486 216476 319295 250387 67598
30625F7598j30763m4466o4613r1539L1867J96631J50277q8195k13378p5985J18604
$$ 67598 -63165 -107631 -172244 -263783 -231916 -35285 114992 26797 -186581 -262566 -143962
30614a43962J46433O3024L0482N1376M4692K9409N3461N7521k0079r9055q1071
$$ -143962 2471 65495 95977 147353 192045 221454 274915 332436 312357 213302 132231
30603A32231l1601o9757j45743j05143N9840J87267J66842N2118m6823p6115m8784
$$ 132231 100630 30873 -114870 -220013 -160173 27094 193936 246054 199231 123116 74332
30592G4332k5723o6270j35998j20060J638Q1442J1318r0842m5400J12919J89318
$$ 74332 48609 -17661 -153659 -273719 -272081 -190639 -179321 -270163 -315563 -202644 -13326
30581a3326J15674J1929k2386j0896J2685O3774J22215J20384N4627J660o766
$$ -13326 102348 114277 91891 80995 93680 157454 279669 400053 454680 456340 449574
30570D49574k6231q6463j29169r9984l2064K944j4504l5867k828P5419J05724
$$ 449574 423343 336880 207711 107727 75663 78607 64103 28236 25408 100827 206551
30559B06551J9431j01539j00300K7223J07214N1833n801M8512R9389M168j37115
$$ 206551 225982 124443 24143 51366 158580 210413 204612 253124 352513 356681 219566
30548B19566j35753l3754j8034q1036m3123J00041J36501j0183j48907j24993
$$ 219566 83813 50059 32025 -49011 -92134 7907 144408 134225 -14682 -139675
30538a39675k7915O897j100P978J559l4359q358J16369K06011J34581k6211j14501
$$ -139675 -167590 -160693 -161793 -153815 -152256 -186615 -194973 -78604 127407 261988 235777 121276
30526A21276q2715O026Q5903R5944j1101j62290j80436k3176J11304N2916q7274
$$ 121276 38561 44587 130490 226434 215333 53043 -127393 -150569 -39265 13651 -73623
30515g3623j02730j8932j6067r1460n6051J22873K28481J24836l6751o8468k2725
$$ -73623 -176353 -195285 -211352 -302812 -358863 -235990 -7509 117327 80576 12108 -10617
30504a0617n3046j36726j35343n0118n503r935N1048J68676J77359L4750p1027
$$ -10617 -63663 -200389 -335732 -385850 -391353 -401288 -350240 -181564 -4205 30545 -40482
30493d0482p812R3353O7247j9695k3220Q123m8202j13450k7600J20797Q9632j00980
$$ -40482 -48294 45059 112306 92611 69391 77514 29312 -84138 -111738 9059 98691 -2289
30481b289j65442j2095J11727L3476r2639r2432m1210m4400j8815R2739J37470
$$ -2289 -167731 -179826 -68099 -34623 -127262 -219694 -260904 -305304 -324119 -231380 -93910
30470i3910K2001o8085J9581J01148k9562j94732r9046J58284K30000P7263k5244
$$ -93910 -71909 -139994 -120413 -19265 -48827 -243559 -342605 -184321 45679 122942 97698
30459I7698R701r769j33883j64692m1881L7270j0790r353J23208J97458R4848
$$ 97698 107399 97630 -36253 -200945 -242826 -205556 -216346 -225699 -102491 94967 189815
30448A89815j2269K7693P9170k2235j71334j81209q7896l8942k1755O8775J91857
$$ 189815 177546 205239 284409 262174 90840 -90369 -178265 -217207 -238962 -170187 21670
30437B1670K04147Q5453n1837j34954j69480j51411p2714J5700N1763M4701L6195
$$ 21670 225817 311270 259433 124479 -45001 -196412 -269126 -253426 -201663 -156962 -120767
30426a20767L0243K8698O5051J24325J07505k7747j59325j42279j0063P7498O0583
$$ -120767 -90524 -61826 3225 127550 235055 207308 47983 -94296 -104359 -26861 33722
30415C3722L8883R4836J59317J12786k8294j07576l3541P6631M0137j26822k08278
$$ 33722 72605 167441 326758 439544 411250 303674 270133 346764 386901 260079 51801
30404E1801q4800J01547J58501Q8931N869o9279j58065j81030o3604Q3251R6818
$$ 51801 -32999 68548 227049 315980 321849 252570 94505 -86525 -150129 -66878 29940
30393B9940K5363L7015J08364N6308j21587k03132q4666P4656J19011Q0132K1155
$$ 29940 55303 92318 200682 256990 135403 -67729 -152395 -77739 41272 121404 142559
30382A42559p5357j65171j09554Q5755J91015N6686j59155k06943n8601J20719
$$ 142559 67202 -97969 -207523 -121768 69247 125933 -33222 -240165 -298766 -178047
30372a78047J95779J39520o720j41835j55510n0645N5772Q8999P6418M0830k8476
$$ -178047 17732 157252 150532 8697 -146813 -197458 -141686 -52687 23731 64561 36085
30361C6085q0800l9922M0158K9084m5702j9898J13714J60155M2809o4032k3439
$$ 36085 -44715 -84637 -44479 -15395 -61097 -80995 32719 192874 235683 171651 148212
30350A48212O9757R7299R3412Q4004j5998j89046k30176o0281R2932L1401j04578
$$ 148212 217969 315268 408680 492684 476686 287640 57464 -2817 90115 121516 16938
30339A6938r4980r996m5523j43337q6392J05221J78496M4964q5726k1427J52784
$$ 16938 -78042 -88038 -133561 -276898 -363290 -258069 -79573 -34609 -120335 -141762 11022
30328A1022K06940N3027j60636k13221o1837R3560N9883p8603q8932M0313R0461
$$ 11022 217962 270989 110353 -102868 -164705 -71145 -11262 -89865 -178797 -138484 -48023
30317d8023L226q696J45689K32952Q0062j14981j11596k2621q0011k05264j58573
$$ -48023 -44797 -53493 92196 325148 405210 290229 178633 156012 76001 -129263 -287836
30306b87836J9108P3085k3543m1881R9228K13491J60147J5086j04412j60877j21597
$$ -287836 -268728 -195643 -219186 -261067 -161839 51652 211799 226885 122473 -38404 -160001
30295a60001K4361J55697J25365j1634o7711j2108J6508k3035k9497M384l8724
$$ -160001 -135640 20057 145422 133788 66077 53969 70477 47442 17945 22329 -16395
30284a6395j40437j05485J15295K82405J90878l9046j53384j12239o9492q7164
$$ -16395 -156832 -262317 -147022 135383 326261 287215 133831 21592 -47900 -135064
30274a35064o2185N8849J51867Q1518q8155j57388n4926P2426Q2916L8592O2778
$$ -135064 -197249 -138400 13467 94985 6830 -150558 -205484 -133058 -50142 -11550 51228
30263E1228R7335l58j60774j53453L3029J31899J9251q0404K0356J45083N9028
$$ 51228 148563 148205 -12569 -166022 -132993 -1094 18157 -62247 -41891 103192 162220
30252A62220j17451j07222N6981R2184p4903k15872j60622J1577J51652J91965
$$ 162220 44769 -62453 -5472 86712 11809 -204063 -364685 -353108 -201456 -9491
30242i491J16609j9694n5814R5637K57043J82637p7678k32412j53278K709P6178
$$ -9491 107118 87424 31610 127247 384290 566927 489249 256837 103559 106268 182446
30231A82446P4183L2863n5268j26777p2026O5305J01014k3765j64090j96997j45057
$$ 182446 256629 289492 234224 107447 35421 100726 201740 177975 13885 -183112 -328169
30220c28169m3105J14972K42444J82527m4033j96229j20904M9224J02853J6100
$$ -328169 -371274 -256302 -13858 168669 124636 -71593 -192497 -143273 -40420 -24320
30210b4320q7153j18875p1032L0780J33051J78140J65673J27032M4156r9915k04215
$$ -24320 -111473 -230348 -301380 -270600 -137549 40591 206264 333296 377452 277537 73322
30199G3322j38726L2636Q9496l0449j24381k5995J33071J00743j37967l19975
$$ 73322 -65404 -32768 56728 26279 -98102 -124097 8974 109717 -28250 -348225
30189c48225k18612Q4581K83835J97063j9994p9145N1665J24769J5368p5817K6474
$$ -348225 -566837 -482256 -198421 -1358 -21352 -100497 -48832 75937 91305 15488 41962
30178D1962J43795L1430j75154j44120J06068K18838N9230j13399j03155m6271
$$ 41962 185757 217187 42033 -102087 3981 222819 282049 168650 65495 19224
30168A9224q5613j08354n330Q3514J2484r3704m0284J19381J84366J06366k716
$$ 19224 -66389 -174743 -180073 -96559 -84075 -177779 -218063 -98682 85684 192050 189334
30157A89334o5227p2382j5308O9177P2484l2648j08873n1315L9848K0959o9175
$$ 189334 124107 51725 36417 105594 178078 145430 36557 -14758 25090 46049 -23126
30146b3126r4937l8071K8246Q8566J45773J16767m8693j99934j30692J15605K60511
$$ -23126 -118063 -156134 -127888 -39322 106451 223218 174525 -25409 -156101 -40496 220015
30135B20015J39229j03175k11648j18778J7378K8555o2823q1611N4976J90652
$$ 220015 359244 256069 44421 -74357 -56979 -28424 -91247 -172858 -117882 72770
30125G2770J24136q6541j79077o9716K1893o8812j73601n9652J80408K49869Q2913
$$ 72770 196906 110365 -68712 -138428 -116535 -185347 -358948 -418600 -238192 11677 94590
30114I4590q8325q6449J8422R1969J03773N8132n6479j69974j44273K2247J44183
$$ 94590 6265 -80184 -61762 30207 133980 192112 135633 -34341 -178614 -156367 -12184
30103a2184J01736P952N316L0825n1347j85135j93188o6618K6361K2074L6985
$$ -12184 89552 97504 102820 133645 82298 -102837 -296025 -362643 -336282 -314208 -277223
30092b77223J16115J26360P735p2970J6843J30625O3653j13867j82242j32899
$$ -277223 -161108 -34748 -27013 -99983 -83140 47485 111138 -2729 -184971 -317870
30082c17870j31040j72628q6704J10615J84565P5462J0377J02214J49362J1069
$$ -317870 -448910 -621538 -708242 -597627 -413062 -337600 -327223 -225009 -75647 -64578
30072f4578j16500l2613J24354J34696O3102O8765O7321p6851k06458j01712Q6494
$$ -64578 -181078 -213691 -89337 45359 108461 177226 244547 167696 -38762 -140474 -53980
30061e3980M6806j45569j36449R3273J93014N3919k6430R7194J63498K880j41528
$$ -53980 -7174 -152743 -289192 -195919 -2905 51014 24584 121778 285276 288156 146628
30050A46628n2758P6182O122j20990o7252M7663l6404k27188k04640M6084K06591
$$ 146628 93870 170052 176174 55184 -12068 35595 -809 -227997 -432637 -386553 -179962
30039a79962J25885Q483L9097J08581M2470j02412j32563q232J07083P4912l7343
$$ -179962 -54077 -45594 -6497 102084 144554 42142 -90421 -98653 8430 83342 45999
30028D5999n2411P0283J66716R5556m5845n2780Q1288J54233O0469o8089q2518
$$ 45999 -6412 63871 230587 326143 280298 227518 308806 463039 523508 455419 372901
30017C72901j6484J8917m03m4716j03633j35487o3305Q5919J52268M7574j14756
$$ 372901 356417 375334 374931 330215 226582 91095 27790 113709 265977 313551 198795
30006A98795j76311j12263J5784J54953K27660J43691n4844j90517j81159j28313
$$ 198795 22484 -89779 -73995 80958 308618 452309 397465 206948 25789 -102524
29996a02524r4754R268J87780K28637K0691j87291j10967J19494J32931j25923
$$ -102524 -197278 -188010 -230 228407 249098 61807 -49160 70334 203265 77342
29986G7342l24883k39614k6600P7580P4262Q0708Q5634J4210o8959j8675J42781
$$ 77342 -247541 -487155 -513755 -436175 -361913 -281205 -195571 -181361 -250320 -268995 -126214
29975a26214K03614M8142j53729j57043J6644J05217j0099j28499m8811J01981
$$ -126214 77400 125542 -28187 -185230 -168586 -63369 -73468 -201967 -250778 -148797
29965a48797O5609j26296j92260m1511J02315O9563k5263k5850K7718M1487M5794
$$ -148797 -83188 -209484 -401744 -443255 -340940 -271377 -296640 -322490 -294772 -253285 -207491
29954b07491P5835N1273n9692j11897N766J59586J47168j3528j28830q5198O5399
$$ -207491 -131656 -80383 -140075 -251972 -246206 -86620 60548 47020 -81810 -167008 -101609
29943a01609J96193J86462J1991j70860j63007n802N4230m7927q8660M5576J39876
$$ -101609 94584 281046 293037 122177 -40830 -46632 7598 -40329 -128989 -83413 56463
29932E6463L1161q1768J4008J47477N4849j43388j43911J5275M8254n5948m0158
$$ 56463 87624 5856 19864 167341 222190 78802 -65109 -49834 -1580 -57528 -97686
29921i7686J15379J31379p1743k15541j15340N9264J10401Q6811P9892K4920j15481
$$ -97686 17693 149072 77329 -138212 -253552 -194288 -83887 2924 82816 107736 -7745
29910g745j97827j08885M5752J16656J17185J22284J12128M7583k7639p0835j04831
$$ -7745 -205572 -314457 -268705 -152049 -34864 87420 199548 247131 219492 148657 43826
29899D3826j16102l3136J06452J28814k2098j54924q9143Q5588J50141N3575p0119
$$ 43826 -72276 -105412 1040 129854 107756 -47168 -136311 -50723 99418 152993 82874
29888H2874j07565n9017K4210Q9307J00294P4275O2918O6706L6055k1583l7563
$$ 82874 -24691 -83708 -59498 29809 130103 204378 267296 334002 370057 348474 310911
29877C10911j4133l3038q5672m7750R1834J40506j9808k03505j57964N7818J44784
$$ 310911 296778 263740 178068 130318 222152 362658 342850 139345 -18619 39199 183983
29866A83983m441j56519p9786J32581K03783M8556j36351j53773n1632j2485p3705
$$ 183983 179542 23023 -56763 75818 279601 328157 191806 38033 -13599 -26084 -99789
29855i9789q9343K1251J26252P1947p7154j20745k034J29533J29996J7476r3251
$$ -99789 -189132 -167881 -41629 30318 -46836 -167581 -169615 -40082 89914 107390 14139
29844A4139j12576k4268R5744J13019j2926j25645m8636J44541J97897L5115j24555
$$ 14139 -98437 -122705 -26961 86058 73132 -52513 -101149 43392 241289 276404 151849
29833A51849q5998N5293Q7173j2996r7134q7266m3143k4801k1917j6696j2962
$$ 151849 65851 121144 208317 195321 98187 10921 -32222 -57023 -78940 -95636 -108598
29822a08598N212O1155J17597Q8753m9543j99004k21392q2884R5300J50931N6544
$$ -108598 -103386 -42231 75366 164119 114576 -84428 -305820 -388704 -293404 -142473 -85929
29811h5929n0244m3073L4456N6568J6879K2736R2762J02909j3182j37662j32547
$$ -85929 -136173 -179246 -144790 -88222 -71343 -48607 44155 147064 133882 -3780 -136327
29800a36327l2534L3446L8559N0474P1182K5887p9751j17287m516J63869K17566
$$ -136327 -168861 -135415 -96856 -46382 24800 50687 -29064 -146351 -150867 13002 230568
29789B30568J00866q4545j92891j50780J135J30459J10048m0692j37946m4286
$$ 230568 331434 246889 53998 -96782 -95647 34812 144860 104168 -33778 -78064
29779g8064J22498J21603n3829j30218L8256K07675R6907j48592j53118Q5136
$$ -78064 44434 166037 112208 -18010 20246 227921 324828 176236 23118 108254
29769A08254J59218r9579l17215j37208K25296L06076O1392j42274j02549J5128
$$ 108254 267472 167893 -149322 -286530 -61234 244842 306234 163960 61411 76539
29759G6539L4882J686m378j8236o5063q7087o8454o5294o8142o778P7087N1679
$$ 76539 111421 113107 108729 90493 25430 -61657 -130111 -195405 -263547 -270325 -193238 -141559
29747a41559o9520j10609n896J05335J17377R0796P6497J9477p0199o6787L6021
$$ -141559 -211079 -321688 -327584 -222249 -104872 -14076 62421 81898 11699 -55088 -19067
29736a9067N8309n8179j01048P0157K47006J73766m8989j31804l9829K3356r14
$$ -19067 39242 -18937 -119985 -49828 197178 370944 321955 190151 150322 173678 172764
29725A72764K9407J32746J25556n6691k10467j57321K15N0415l4470j13059r5014
$$ 172764 202171 334917 460473 403782 193315 35994 36209 86624 52154 -60905 -155919
29714a55919j8429M8533P9267P6456N7285M3117K5344l2241j19099j46877n5819
$$ -155919 -174348 -125815 -46548 29908 87193 130310 155654 123413 4314 -142563 -198382
29703a98382P2035Q7340k8816j22727p0269M7673N8653m9552j09659k3062R8846
$$ -198382 -126347 -39007 -67823 -190550 -260819 -213146 -154493 -204045 -313704 -336766 -237920
29692b37920J11204M3170J5730L4022Q891n4672n3223K5308O2331p86o7734m1636
$$ -237920 -126716 -83546 -67816 -33794 -24903 -79575 -132798 -107490 -45159 -45945 -113679 -155315
29680a55315L8765Q1292O2259O609o2471r6549l7110P9617J22215L5198p1818
$$ -155315 -116550 -35258 27001 33610 -28861 -125410 -162520 -82903 39312 74510 2692
29669B692p0667K8283J22333J35503M3115j20125k25213j47623L2225P6366o8407
$$ 2692 -67975 -39692 82641 218144 261259 141134 -84079 -231702 -199477 -123111 -191518
29658a91518j50112J6538K34871K06284j1652j08573j3496L2582q5199j62348
$$ -191518 -341630 -325092 -90221 116063 104411 -4162 -17658 14924 -70275 -232623
29648b32623l7058J22650Q4981p8431j14297K3502J27076N6132q0796j08229j5099
$$ -232623 -269681 -147031 -62050 -140481 -254778 -231276 -104200 -48068 -128864 -237093 -252192
29637b52192P2420Q2335P3438J14150J47391M9927j62035k75624j22375J69912
$$ -252192 -179772 -97437 -23999 90151 237542 287469 125434 -150190 -272565 -102653
29627a02653K97173J53199n8759j28422r3457r1613j07665m0829O4948O5504k6533
$$ -102653 194520 347719 288960 160538 67081 -24532 -132197 -173026 -108078 -42574 -69107
29616f9107l2175J07039K15000J36310m5764j53390j49823j06195m1729M9259
$$ -69107 -101282 5757 220757 357067 311303 157913 8090 -98105 -139834 -90575
29606i0575Q7347j616j20829j00452M3797J20484M7354m9529o3294m7519m9140
$$ -90575 -3228 -4844 -125673 -226125 -182328 -61844 -14490 -64019 -127313 -174832 -223972
29595b23972J2229J63220K38156J01527j09012j60220o0058l079l4010j0121R7297
$$ -223972 -211743 -48523 189633 291160 182148 21928 -38130 -41209 -75219 -85340 11957
29584A1957J18723j8530j33957o3525Q7696J18464K8410k8106N03K9263K1723
$$ 11957 130680 112150 -21807 -85332 2364 120828 149238 121132 121635 150898 172621
29573A72621L5729P3812L8611j06320k34227j89675J8195K11243K19479M0629
$$ 172621 208350 282162 320773 214453 -19774 -209449 -191254 19989 239468 280097
29563B80097j66527k38535j59917n1689r228M063O5938J46589J36408K3030n2101
$$ 280097 113570 -124965 -284882 -336571 -345799 -341736 -275798 -129209 7199 30229 -21872
29552b1872K8923J82271K05581L3118j73614k24968j26539l2848j7341K742R1741
$$ -21872 7051 189322 394903 428021 254407 29439 -97100 -129948 -147289 -144547 -52806
$$ [...]
##END NTUPLES=NMR SPECTRUM
##END=
