##TITLE=31Pdec_LY-7.70+TMF
 D2O, 24 sc
 2.3.2020
##JCAMPDX= 6.0         $$ Bruker NMR JCAMP-DX V2.0
##DATA TYPE= NMR SPECTRUM
##DATA CLASS= NTUPLES
##ORIGIN= UXNMR, Bruker Analytische Messtechnik GmbH
##OWNER= root
$$ XWIN-NMR		Version 3.5
$$ Mon Mar  2 16:11:13 2020 Russian Standard Time (UT+4h)  she@DPX200
##.OBSERVE FREQUENCY= 81.013821
##.OBSERVE NUCLEUS= ^31P
##.ACQUISITION MODE= SIMULTANEOUS
##.ACQUISITION SCHEME= undefined
##.AVERAGES= 24
##.DIGITISER RES= 17
##SPECTROMETER/DATA SYSTEM= spect
##.PULSE SEQUENCE= zgpg30
##.SOLVENT NAME= D2O
##.SHIFT REFERENCE= (INTERNAL, D2O, 0, 182.463)
##AUDIT TRAIL= $$ (NUMBER, WHEN, WHO, WHERE, WHAT)
$$ ##TITLE= Audit trail, XWIN-NMR		Version 3.5
$$ ##JCAMPDX= 5.01
$$ ##ORIGIN= Bruker BioSpin GmbH
$$ ##OWNER= she
$$ F:/spectra/data/she/nmr/P31/1/pdata/1/auditp.txt
$$ ##AUDIT TRAIL=  $$ (NUMBER, WHEN, WHO, WHERE, WHAT)
(   1,<2020-03-02 16:09:33.92 +0400>,<she>,<DPX200>,
      <created by zg, POWCHK disabled, PULCHK disabled
       configuration hash MD5:
       00 E9 B6 7A A2 85 ED C7 34 08 36 98 17 FE 4E 26
       data hash MD5: 32K
       B3 4A 19 45 46 9B A0 80 D9 80 11 E9 FE 4D D4 89>)
(   2,<2020-03-02 16:09:36.14 +0400>,<she>,<DPX200>,
      <Start of raw data processing
       efp BC_mod = 2 LB = 1 FT_mod = 6 PKNL = 1 PHC0 = -1464.465 PHC1 = 359.6017 SI = 64K 
       data hash MD5: 64K
       DC F5 6B B2 33 D0 4C 95 1B 74 40 20 6F 24 EF DC>)
(   3,<2020-03-02 16:10:03.42 +0400>,<she>,<DPX200>,
      <pk PHC0 = 3.8 PHC1 = 0 
       data hash MD5: 64K
       18 EF B2 F2 9C 06 43 E4 9F 8C 04 D0 D4 2E F5 55>)
(   4,<2020-03-02 16:10:20.40 +0400>,<she>,<DPX200>,
      <pk PHC0 = -5.496551 PHC1 = 0 
       data hash MD5: 64K
       0A AB 17 74 BB 8A 5A 2B 8B A3 8E B1 07 73 75 99>)
(   5,<2020-03-02 16:10:33.28 +0400>,<she>,<DPX200>,
      <pk PHC0 = 2.6 PHC1 = 0 
       data hash MD5: 64K
       0C A5 59 A2 56 F8 71 37 F7 25 8E A9 35 80 7E AE>)
$$ ##END=
$$ 
$$ hash MD5
$$ 93 19 B5 A6 D8 62 40 CC 57 DD D4 AC 3E 13 1A B2
##$RELAX= 
##$RELAX= 
##$RELAX= 
##$RELAX= 
##$RELAX= 
##$RELAX= 
##$RELAX= 
##$RELAX= 
$$ Bruker specific parameters
$$ --------------------------
##$DU= <F:/spectra>
##$EXPNO= 1
##$NAME= <P31>
##$PROCNO= 1
##$TYPE= <nmr>
##$USER= <she>
##$AMP= (0..31)
100 100 100 100 100 100 100 100 100 100 100 100 100 100 100 100 100 100 
100 100 100 100 100 100 100 100 100 100 100 100 100 100 
##$AQSEQ= 0
##$AQ_mod= 1
##$AUNM= <au_zg>
##$AUTOPOS= <>
##$BF1= 81.014009
##$BF2= 200.13
##$BF3= 200.13
##$BF4= 200.13
##$BF5= 200.13
##$BF6= 200.13
##$BF7= 200.13
##$BF8= 200.13
##$BYTORDA= 1
##$CFDGTYP= 0
##$CFRGTYP= 5
##$CHEMSTR= <none>
##$CNST= (0..31)
1 1 145 1 1 1 1 1 1 1 1 1 1 1 1 1 1 1 1 1 1 1 1 1 1 1 1 1 1 1 1 1 
##$CPDPRG= <waltz16>
##$CPDPRG1= <>
##$CPDPRG2= <waltz16>
##$CPDPRG3= <>
##$CPDPRG4= <mlev>
##$CPDPRG5= <mlev>
##$CPDPRG6= <mlev>
##$CPDPRG7= <mlev>
##$CPDPRG8= <mlev>
##$CPDPRGB= <>
##$CPDPRGT= <>
##$D= (0..31)
0 1 0 0 0 0 0 0 0 0 0 0.03 2e-05 3e-06 0 0 0 0 0 0 0 0 0 0 0 0 0 0 0 0 
0 0 
$$ [...]
##$SUBNAM2= <"">
##$SUBNAM3= <"">
##$SUBNAM4= <"">
##$SUBNAM5= <"">
##$SUBNAM6= <"">
##$SUBNAM7= <"">
##$SUBNAM8= <"">
##$SUBNAM9= <"">
##$SW= 369.568048894756
##$SWIBOX= (0..15)
0 1 3 0 0 0 0 0 0 0 0 0 0 0 0 0 
##$SW_h= 29940.119760479
##$TD= 32768
##$TD0= 1
##$TE= 0
##$TE2= 300
##$TE3= 300
##$TEG= 300
##$TL= (0..7)
0 120 53 12 22 120 120 120 
##$TP= (0..7)
150 150 150 150 150 150 150 150 
##$TP07= 0
##$TPNAME0= <>
##$TPNAME1= <>
##$TPNAME2= <>
##$TPNAME3= <>
##$TPNAME4= <>
##$TPNAME5= <>
##$TPNAME6= <>
##$TPNAME7= <>
##$TPOAL= (0..7)
0.5 0.5 0.5 0.5 0.5 0.5 0.5 0.5 
##$TPOFFS= (0..7)
0 0 0 0 0 0 0 0 
##$TUNHIN= 0
##$TUNHOUT= 0
##$TUNXOUT= 0
##$USERA1= <user>
##$USERA2= <user>
##$USERA3= <user>
##$USERA4= <user>
##$USERA5= <user>
##$V9= 5
##$VALIST= <valist>
##$VCLIST= <CCCCCCCCCCCCCCC>
##$VD= 0
##$VDLIST= <DDDDDDDDDDDDDDD>
##$VPLIST= <PPPPPPPPPPPPPPP>
##$VTLIST= <TTTTTTTTTTTTTTT>
##$WBST= 1024
##$WBSW= 4
##$XGAIN= (0..3)
0 0 0 0 
##$XL= 0
##$YL= 0
##$YMAX_a= 54202
##$YMIN_a= -56354
##$ZGOPTNS= <>
##$ZL1= 120
##$ZL2= 120
##$ZL3= 120
##$ZL4= 120
##$ABSF1= 0
##$ABSF2= 0
##$ABSG= 0
##$ABSL= 0
##$ALPHA= 0
##$AQORDER= 0
##$ASSFAC= 0
##$ASSFACI= 0
##$ASSFACX= 0
##$ASSWID= 0
##$AUNMP= <proc_1d>
##$AZFE= 0.1
##$AZFW= 0.5
##$BCFW= 0
##$BC_mod= 2
##$BYTORDP= 0
##$COROFFS= 0
##$CY= -3
##$DATMOD= 1
##$DC= 0
##$DFILT= <>
##$DTYPP= 0
##$F1P= 0
##$F2P= 0
##$FCOR= 1
##$FTSIZE= 65536
##$FT_mod= 6
##$GAMMA= 0
##$GB= 0
##$INTBC= 1
##$INTSCL= 5.30512e-09
##$ISEN= 30
##$LB= 1
##$LEV0= 0
##$LPBIN= 0
##$MAXI= 10000
##$MC2= 0
##$MEAN= 0
##$ME_mod= 0
##$MI= 50
##$NCOEF= 0
##$NC_proc= -2
##$NLEV= 6
##$NOISF1= 182.463
##$NOISF2= 159.3651
##$NSP= 0
##$NTH_PI= 0
##$NZP= 0
##$OFFSET= 182.463
##$PC= 4
##$PHC0= -1463.562
##$PHC1= 359.6017
##$PH_mod= 1
##$PKNL= yes
##$PPARMOD= 0
##$PSCAL= 0
##$PSIGN= 0
##$REVERSE= no
##$SF= 81.0140089999434
##$SI= 65536
##$SIGF1= 159.3651
##$SIGF2= -187.1042
##$SINO= 113.3802
##$SIOLD= 16384
##$SREGLST= <1H.CDCl3>
##$SSB= 0
##$STSI= 65536
##$STSR= 0
##$SW_p= 29940.119760479
##$SYMM= 0
##$S_DEV= 0
##$TDeff= 32768
##$TDoff= 0
##$TI= <>
##$TILT= no
##$TM1= 0
##$TM2= 0
##$TOPLEV= 0
##$USERP1= <user>
##$USERP2= <user>
##$USERP3= <user>
##$USERP4= <user>
##$USERP5= <user>
##$WDW= 1
##$XDIM= 65536
##$YMAX_p= 435780558
##$YMIN_p= -1584529
$$ End of Bruker specific parameters
$$ ---------------------------------
##NTUPLES= NMR SPECTRUM
##VAR_NAME=  FREQUENCY,     SPECTRUM/REAL,   SPECTRUM/IMAG
##SYMBOL=    X,             R,               I
##VAR_TYPE=  INDEPENDENT,   DEPENDENT,       DEPENDENT
##VAR_FORM=  AFFN,          ASDF,            ASDF
##VAR_DIM=   65536,         65536,           65536
##UNITS=     HZ,            ARBITRARY UNITS, ARBITRARY UNITS
##FACTOR=    0.456856943014862, 1,           1
##FIRST=     14782.0589164792, 0,            0
##LAST=      -15158.0608439998, 0,           0
##MIN=       -15158.0608439998, -1584529,    0
##MAX=       14782.0589164792, 435780558,    0
$$ Real data points
##PAGE= N=1
##DATA TABLE= (X++(R..R)), XYDATA
$$ [...]
$$ plain form
37212 13666 -140186 -228710 -193163 -40455 123674 169256 86328 8793 55509 191265 286356
37201 286356 270516 183237 111525 122008 217787 323230 347428 290240 238320 237913 243566 219021
37189 219021 194278 174500 97659 -42591 -132696 -89622 15115 75565 97694 118553 86745
37178 86745 -36190 -145594 -121740 -18086 33413 34113 68767 116092 101352 80003 156472
37167 156472 260996 240333 149828 195541 369160 419179 254676 100453 126867 184074 80449
37156 80449 -95221 -146225 -97647 -118830 -218456 -244743 -144699 -27224 20978 24226 20202
37145 20202 -813 -49285 -115814 -191873 -250639 -242997 -173127 -120745 -118523 -81529 51773 188189
37133 188189 203808 129644 82468 69154 12179 -63807 -39090 98172 209148 202094 145215
$$ packed form
37212A3666j53852q8524L5547J52708J64129M5582q2928p7535M6716J35756R5091
37201B86356j5840q7279p1712J0483R5779J05443K4198n7188n1920m07N653k4545
37189B19021k4743j9778p6841j40250r0105M3074J04737O0450K2129K0859l1808
37178H6745j22935j09404K3854J03654N1499P00L4654M7325j4740k1349P6469
37167A56472J04524k0663r0505M5713J73619N0019j64503j54223K6414N7207j03625
37156H0449j75670n1004M8578k1183r9626k6287J00044J17475M8202L248m024
37145B0202k1015m8472o6529p6059n8766P642O9870N2382K222L6994J33302J36416
37133A88189J5619p4164m7176j3314n6975p5986K4717J37262J10976p054n6879
$$ plain form
37122 145215 134665 162553 175980 173054 170179 143710 74741 6574 -1614 52695 131762 211538
37110 211538 274850 282614 207190 87382 7407 13967 75875 128071 139136 131150 141272 169433
37098 169433 170595 109011 16466 -26228 20649 101995 129974 93877 73797 132669 229358 273051
37086 273051 241370 196849 193371 220266 245620 258281 249616 212484 183100 217978 292689 298008
37074 298008 193591 90948 106542 200558 253641 240322 217596 198918 168215 173370 257696
37063 257696 327374 253309 98828 63773 177248 237917 124432 -21588 -25045 77789 154676
37052 154676 192565 239865 248064 152251 43061 75985 227989 304485 200257 22616 -69674
37041 -69674 -41295 39664 106593 129405 98393 21525 -72726 -143768 -151544 -81845 26527 106036
$$ packed form
37122A45215j0550K7888J3427k926k875k6469o8969o8167q188N4309P9067P9776
37110B11538O3312P764p5424j19808p9975O560O1908N2196J1065p986J0122K8161
37098A69433J162o1584r2545m2694M6877Q1346K7979l6097k0080N8872R6689M3693
37086B73051l1681m4521l478K6895K5354J2661q665l7132k9384L4878P4711N319
37074B98008j04417j02643J5594R4016N3083j3319k2726j8678l0703N155Q4326
37063B57696O9678p4065j54481l5055J13475O0669j13485j46020l457J02834P6887
37052A54676L7889M7300Q199r5813j09190L2924J52004P6496j04228j77641r2290
37041f9674K8379Q0959O6929K2812l1012p6868r4251p1042p776O9699J08372P9509
$$ plain form
37029 106036 128376 117970 89249 24674 -59412 -86777 -9376 120723 209145 212936 150297
37018 150297 67333 24310 57492 121683 130023 77731 51762 88939 121680 111567 123019 185666
37006 185666 198242 83758 -53949 -64311 27546 76880 52483 60185 145429 220665 213168
36995 213168 164950 147373 168399 204312 252751 313842 362126 363788 300599 180867 52506
36984 52506 -15009 2899 58790 101342 133869 172385 199104 206629 230959 278376 276405 172247
36972 172247 31528 -37536 -15085 44847 104207 138206 106082 20077 -14825 64411 159999
36961 159999 145490 63587 56538 137601 182290 135064 75799 71501 99873 138436 197884 241209
36949 241209 197740 93159 44628 85473 112215 55246 -14050 -12116 26550 29849 14529 39981
$$ packed form
37029A06036K2340j0406k8721o4575q4086k7365P7401J30099Q8422L791o2639
37018A50297q2964m3023L3182O4191Q340n2292k5969L7177L2741j0113J1452O2647
37006A85666J2576j14484j37707j0362R1857M9334k4397P702Q5244P5236p497
36995B13168m8218j7577K1026L5913M8439O1091M8284J662o3189j19732j28361
36984E2506o7515J7908N5891M2552L2527L8516K6719P525K4330M7417j971j04158
36972A72247j40719o9064K2451N9932N9360L3999l2124q6005l4902P9236R5588
36961A59999j4509q1903p049Q1063M4689m7226n9265m298K8372L8563N9448M3325
36949B41209m3469j04581m8531M0845K6742n6969o9296J934L8666L299j5320K5452
$$ plain form
36937 39981 90616 94028 32869 -31532 -41182 433 53692 97414 146984 217939 278915 271843
36925 271843 196810 137650 164913 249037 313992 334793 324941 274220 177084 88380 66911 88447
36913 88447 94880 98385 145371 207809 218863 199950 235646 319733 341026 244388 108064 35038
36901 35038 49592 118096 190050 201192 114784 -19673 -112273 -141404 -153036 -162539 -136438 -67066
36889 -67066 11747 77831 121524 118255 76067 70158 138612 195212 157777 100982 135176 190376
36877 190376 107608 -80456 -167133 -81172 28046 51424 58581 110997 139430 103828 94410
36866 94410 160191 193815 104194 -34640 -117502 -154533 -172783 -113803 37170 147157 109364
36855 109364 21095 42304 159406 231286 203271 141490 108014 121927 194782 294736 324468
$$ packed form
36937C9981N0635L412o1159o4401r650M1615N3259M3722M9570P0955O0976p072
36925B71843p5033n9160K7263Q4124O4955K0801r852n0721r7136q8704k1469K1536
36913H8447O433L505M6986O2438J1054j8913L5696Q4087K1293r6638j36324p3026
36901C5038J4554O8504P1954J1142q6408j34457r2600k9131j1632r503K6101O9372
36889f7066P8813O6084M3693l269m2188n909O8454N6600l7435n6795L4194N5200
36877A90376q2768j88064q6677Q5961J09218K3378P157N2416K8433l5602r418
36866I4410O5781L3624q9621j38834q2862l7031j8250N8980J50973J09987l7793
36855A09364q8269K1209J17102P1880k8015o1781l3476J3913P2855R9954K9732
$$ plain form
36844 324468 238348 133949 131441 212365 269013 258158 211791 149141 74381 19820 9798
36833 9798 22648 46081 103250 168694 155779 63949 26490 109113 176811 95661 -35803 -18266
36821 -18266 158621 325857 387103 395109 400999 387049 351356 326212 306783 270285 252120 289084
36809 289084 306654 191980 -22822 -174720 -177987 -106852 -56859 -31356 6952 61187 111329
36798 111329 141931 142678 121683 108166 105436 78868 36487 58828 176840 288200 288167 217709
36786 217709 174408 146931 73534 5910 51090 175347 230784 176083 112902 93450 56296
36775 56296 -13250 -21967 66665 145497 122525 53686 32191 41719 14481 -35979 -39888 7812
36763 7812 38384 13132 -25012 -10468 69410 168732 237529 263636 250721 178478 36098 -104285
$$ packed form
36844C24468q6120j04399k508Q0924N6648j0855m6367o2650p4760n4561j0022
36833I798J2850K3433N7169O5444j2915r1830l7459Q2623O7698q1150j31464J7537
36821a8266J76887J67236O1246Q006N890j3950l5693k5144j9429l6498j8165L6964
36809B89084J7570j14674k14802j51898l267P1135M9993K5503L8308N4235N0142
36798A11329L0602P47k0995j3517k730k6568m2381K2341J18012J11360l3p0458
36786B17709m3301k7477p3397o7624M5180J24257N5437n4701o3181j9452l7154
36775E6296o9546q717Q8632P8832k2972o8839k1495R528k7238n0460l909M7700
36763G812L0572k5252l8144J4544P9878R9322O8797K6107j2915p2243j42380j40383
$$ plain form
36751 -104285 -123652 -3375 132957 176439 161631 177245 227165 265581 296982 338792 348601
36740 348601 300185 270573 324827 369891 271109 79392 -15462 53205 168728 235647 286135
36729 286135 353373 385490 340346 257475 192493 166605 195204 268812 301428 209838 51629
36718 51629 -32087 -14598 4792 -10043 16746 106869 170260 162758 153265 174940 155195 65456
36706 65456 -888 14248 29241 -30237 -100902 -100929 -69252 -75891 -89881 -53646 -11694 -47124
36694 -47124 -141284 -197087 -164619 -70800 28619 66793 -1844 -125320 -177523 -116041 -40789
36683 -40789 -40962 -81165 -107647 -151321 -225681 -239500 -145079 -73420 -160572 -311184 -314676 -161349
36671 -161349 -55342 -103691 -169102 -85033 124221 311110 385199 345833 212892 15906
$$ packed form
36751a04285j9367J20277J36332M3482j4808J5614M9920L8416L1401M1810R809
36740C48601m8416k9612N4254M5064r8782j91717r4854O8667J15523O6919N0488
36729B86135O7238L2117m5144q2871o4982k5888K8599P3608L2616r1590j58209
36718E1629q3716J7489J9390j4835K6789R0123O3391p502r493K1675j9745q9739
36706F5456o6344J5136J4993n9478p0665k7L1677o639j3990L6235M1952l5430
36694d7124r4160n5803L2468R3819R9419L8174o8637j23476n2203O1482P5252
36683d0789j73m0203k6482m3674p4360j3819R4421P1659q7152j50612l492J53327
36671a61349J06007m8349o5411Q4069K09254J86889P4089l9366j32941j96986
$$ plain form
36661 15906 -177720 -291537 -298349 -227206 -126940 -37994 20740 58235 98076 151870 209484
36650 209484 248757 244956 184756 90494 19245 13762 56873 90073 72287 9739 -59980 -96610
36638 -96610 -76913 -3003 101558 199246 243488 200015 86830 -24302 -76809 -85940 -96389
36627 -96389 -107782 -88861 -43999 -6414 21240 56709 81218 62502 23468 9777 605 -54469
36615 -54469 -115909 -85904 27010 99946 86505 83309 146560 180209 105580 20894 58683 169927
36603 169927 197087 113649 44055 60342 98011 91727 74159 92481 113358 74886 -8685 -50087
36591 -50087 5634 105113 132223 38557 -84345 -96474 26268 161952 186054 93867 -37761
36580 -37761 -148727 -216404 -231311 -203179 -160287 -108854 -28250 70652 135634 152569 173108
$$ packed form
36661A5906j93626j13817o812P1143J00266Q8946N8734L7495L9841N3794N7614
36650B09484L9273l801o0200r4262p1249n483M3111L3200j7786o2548o9719l6630
36638i6610J9697P3910J04561R7688M4242m3473j13185j11132n2507r131j0449
36627i6389j1393J8921M4862L7585K7654L5469K4509j8716l9034j3691r172n5074
36615e4469o1440L0005J12914P2936j3441l196O3251L3649p4629q4686L7789J11244
36603A69927K7160q3438o9594J6287L7669o284j7568J8322K0877l8472q3571m1402
36591e0087N5721R9479K7110r3666j22902j2129J22742J35684K4102r2187j31628
36580c7761j10966o7677j4907K8132M2892N1433Q0604R8902O4982J6935K0539
$$ plain form
36569 173108 222012 245011 206168 169154 204132 267701 264392 192270 137117 141868 170367 193516
36557 193516 222208 242139 198493 82926 -22307 -36244 14532 31501 -17729 -45886 38032
36546 38032 188252 256622 171940 17800 -97401 -168572 -228473 -238833 -158539 -60847 -43300
36535 -43300 -54945 27244 160770 162126 1547 -119133 -63599 40909 18968 -92053 -140875
36524 -140875 -106724 -89402 -127265 -163802 -150556 -78405 43689 157938 177324 117610 116928
36513 116928 228788 304252 202483 12278 -80891 -52299 -2727 43382 120669 173223 122343
36502 122343 44197 80326 191977 205849 102250 49090 120887 186416 135270 34712 -18215
36491 -18215 -44429 -94073 -140112 -147595 -140957 -127415 -56783 71254 162471 166678 164686 234701
$$ packed form
36569A73108M8904K2999l8843l7014L4978O3569l309p2122n5153M751K8499K3149
36557A93516K8692J9931m3646j15567j05233j3937N0776J6969m9230k8157Q3918
36546C8032J50220O8370q4682j54140j15201p1171n9901j0360Q0294R7692J7547
36535d3300j1645Q2189J33526J356j60579j20680N5534J04508k1941j11021m8822
36524a40875L4151J7322l7863l6537J3246P2151J22094J14249J9386n9714o82
36513A16928J11860P5464j01769j90205r3169K8592M9572M6109P7287N2554n0880
36502A22343p8146L6129J11651J3872j03599n3160P1797O5529n1146j00558n2927
36491a8215k6214m9644m6039p483O638J3542P0632J28037R1217M207j992P0015
$$ plain form
36479 234701 318301 308736 204396 88795 13648 -16676 8652 91967 181724 209696 165194
36468 165194 94076 44191 40688 83376 133480 130432 54186 -49841 -126557 -161383 -157330 -103682
36456 -103682 -3295 95422 132026 93426 19861 -40522 -66407 -57067 -11715 64416 131351
36445 131351 127411 51384 4831 80463 213807 240804 127246 35126 104451 272334 389847
36434 389847 418625 403934 343437 222326 119533 128894 199580 190392 68724 -68287 -151906
36423 -151906 -190041 -172475 -72675 46551 67411 -15974 -83394 -63922 -11594 14346 27276
36412 27276 42123 36155 12256 2488 -11018 -73761 -142995 -114293 8948 93811 62188 -20800
36400 -20800 -79607 -122483 -151592 -109919 3197 74744 27317 -59876 -65966 6360 62968 58173
$$ packed form
36479B34701Q3600r565j04340j15601p5147l0324K5328Q3315Q9757K7972m4502
36468A65194p1118m9885l503M2688N0104l048p6246j04027p6716l4826M053N3648
36456a03682J00387R8717L6604l8600p3565o0383k5885R340M5352P6131O6935
36445A31351l940p6027m6553P5632J33344K6997j13558r2120O9325J67883J17513
36434C89847K8778j4691o0497j21111j02793R361P0686r188j21668j37011q3619
36423a51906l8135J7566R9800J19226K0860q3385o7420J9472N2328K5940J2930
36412B7276J4847n968k3899r768j3506o2743o9234K8702J23241Q4863l1623q2988
36400b0800n8807m2876k9109M1673J13116P1547m7427q7193o090P2326N6608m795
$$ plain form
36388 58173 22842 -9652 -38745 -74576 -115043 -129475 -68675 62912 158025 106427 -53111
36377 -53111 -164535 -150506 -90665 -84588 -123629 -132543 -69960 39812 124352 112033 16900 -52324
36365 -52324 -37465 -30894 -123798 -219534 -156608 23774 123252 88256 58076 92157 75547 -37726
36353 -37726 -107082 -39775 46374 19678 -68468 -108769 -105841 -95145 -29501 111818 223984
36342 223984 225434 196288 235904 289138 249947 140840 55753 13374 -6897 25135 115228
36331 115228 166577 106309 11078 -12335 13972 15822 5711 17836 3547 -70598 -116648 -61942
36319 -61942 4233 -23395 -69463 -3130 122708 151373 85304 70381 144378 190216 137742
36308 137742 44916 -28073 -77783 -85053 -18234 84496 149756 176521 203396 201148 119873 9290
$$ packed form
36388E8173l5331l2494k9093l5831m0467j4432O0800J31587R5113n1598j59538
36377e3111j11424J4029N9841O077l9041q914O2583J09772Q4540j2319r5133o9224
36365e2324J4859O571r2904r5736O2926J80382R9478l4996l0180L4081j6610j13273
36353c7726o9356O7307Q6149k6696q8146m0301K928J0696O5644J41319J12166
36342B23984J450k9146L9616N3234l9191j09107q5087m2379k0271L2032R0093
36331A15228N1349o0268r5231k3413K6307J850j0111J2125j4289p4145m6050N4706
36319f1942O6175k7628m6068O6333J25838K8665o6069j4923P3997M5838n2474
36308A37742r2826p2989m9710p270O6819J02730O5260K6765K6875k248q1275j10583
$$ plain form
36296 9290 -39568 -42421 -78162 -131192 -120341 -54769 -9588 29083 134436 270329 319218 275672
36284 275672 243590 234594 146713 -27930 -150281 -144553 -106550 -134510 -184740 -167595 -77320
36273 -77320 39177 150589 226914 241638 224480 228368 225537 137341 -14436 -104649 -87310
36262 -87310 -58933 -87631 -99319 -11695 117480 170200 133521 96642 112333 130048 66571
36251 66571 -85109 -222096 -221475 -82218 58042 87526 52506 61962 118367 141151 114905
36240 114905 96630 97843 79460 54111 74052 120150 121806 87711 96240 154096 190456 194951
36228 194951 224397 261585 219602 118618 101239 213479 318886 309470 265649 306121 392507
36217 392507 400670 310342 212411 170844 167483 160361 132569 94990 69581 51377 -6888 -120719
$$ packed form
36296I290m8858k853l5741n3030J0851O5572M5181L8671J05353J35893M8889m3546
36284B75672l2082q996q7881j74643j22351N728L8003k7960n0230J7145R0275
36273g7320J16497J11412P6325J4724j7158L888k831q8196j51777r0213J7339
36262h7310K8377k8698j1688Q7624J29175N2720l6679l6879J5691J7715o3477
36251F6571j51680j36987O21J39257J40260K9484l5020R456N6405K2784k6246
36240A14905j8275J213j8383k5349J9941M6098J656l4095Q529N7856L6360M495
36228A94951K9446L7188m1983j00984j7379J12240J05407r416m3821M0472Q6386
36217C92507Q163r0328r7931m1567l361p122k7792l7579k5409j8204n8265j13831
$$ plain form
36205 -120719 -200563 -142218 6178 73438 -11631 -130720 -149064 -73290 19206 107234 201238
36194 201238 265229 251731 182414 134080 160132 245878 310907 258362 78730 -100207 -141663
36183 -141663 -73786 -43807 -100542 -141639 -100242 -49992 -60125 -63909 33502 192802 277941
36172 277941 214228 47747 -114652 -183105 -146767 -89491 -97875 -142678 -120427 -21926 36960
36161 36960 -14549 -100375 -119747 -83341 -62110 -71450 -74225 -48637 1065 61079 101642 98678
36149 98678 78881 87296 106380 85730 54973 101222 210749 249850 152300 16795 -43638
36138 -43638 -46165 -59811 -79453 -67181 -46595 -66212 -116533 -154098 -167088 -163383 -136461 -85631
36126 -85631 -25191 52629 163334 259051 255507 166351 122830 206140 335118 375123 293388
$$ packed form
36205a20719p9844N8345J48396O7260q5069j19089j8344P5774R2496Q8028R4004
36194B01238O3991j3498o9317m8334K6052Q5746O5029n2545j79632j78937m1456
36183a41663O7877K9979n6735m1097M1397N0250j0133l784R7411J59300Q5139
36172B77941o3713j66481j62399o8453L6338N7276q384m4803K2251R8501N8886
36161C6960n1509q5826j9372L6406K1231r340k775K5588M9702O0014M0563k964
36149I8678j9797Q415J9084k0650l0757M6249J09527L9101r7550j35505o0433
36138d3638k527j3646j9642J2272K0586j9617n0321l7565j2990L705K6922N0830
36126h5631O0440P7820J10705R5717l544q9156m3521Q3310J28978M0005q1735
$$ plain form
36115 293388 158555 48997 6513 26084 57660 62865 69989 106986 105275 -15633 -177365
36104 -177365 -200764 -56616 87869 110754 74707 75362 105232 136837 189730 233694 173137
36093 173137 20019 -59815 27701 167094 217243 192773 160854 108099 31838 17841 92361
36082 92361 135330 79129 48144 143166 233986 156048 -10889 -66871 3778 62856 75926
36071 75926 121431 188312 176322 85913 27359 46413 92162 134315 162765 105952 -86698
36060 -86698 -305202 -383235 -325124 -276334 -290987 -290470 -237867 -185812 -148505 -84150 -14554 -13649
36048 -13649 -63605 -62475 10161 67669 69229 68654 93649 98778 61358 19920 3137 9850 52173
36035 52173 126608 165895 120512 55060 54816 81149 44813 -27084 -42078 -12853 -15755 -21049
$$ packed form
36115B93388j34833j09558m2484J9571L1576N205P124L6997j711j20908j61732
36104a77365k3399J44148J44485K2885l6047O55K9870L1605N2893M3964o0557
36093A73137j53118p9834Q7516J39393N0149k4470l1919n2755p6261j3997P4520
36082I2361M2969n6201l0985R5022R0820p7938j66937n5982P0649N9078J3070
36071G5926M5505O6881j1990r0409n8554J9054M5749M2153K8450n6813j92650
36060h6698k18504p8033N8111M8790j4653N17N2603N2055L7307O4355O9596R05
36048a3649m9956J130P2636N7508J560n75K4995N129l7420m1438j6783O713M2323
36035E2173P4435L9287m5383o5452k44K6333l6336p1897j4994K9225k902n294
$$ plain form
36023 -21049 56407 169829 202709 201516 324366 539767 608112 428569 194691 112796 149834
36012 149834 167459 142662 130388 134024 134565 153521 186684 161459 48791 -61820 -78778 -26825
36000 -26825 19960 50034 90181 133439 154460 148090 113158 52313 11307 47986 137383 182484
35988 182484 143783 82771 59650 71799 108485 170522 213516 172176 72081 20669 56041
35977 56041 101488 99384 85225 90635 80607 40359 28393 83477 156464 184691 165748 122464
35965 122464 66786 26518 33855 66735 77122 82401 134697 197901 173327 66598 3147 39715
35953 39715 80314 29098 -80253 -156824 -158284 -88262 14953 62985 -911 -87150 -53032
35942 -53032 70068 90995 -63206 -242789 -303943 -277648 -236942 -166617 -69079 -41088 -116871
$$ packed form
36023b1049P7456J13422L2880j193J22850K15401O8345j79543k33878q1895L7038
36012A49834J7625k4797j2274L636N41J8956L3163k5225j12668j10611j6958N1953
36000b6825M6785L0074M0147M3258K1021o370l4932o0845m1006L6679Q9397M5101
35988A82484l8701o1012k3121J2149L6686O2037M2994m1340j00095n1412L5372
35977E6041M5447k104j4159N410j0028m0248j1966N5084P2987K8227j8943m3284
35965A22464n5678m0268P337L2880J0387N279N2296O3204k4574j06729o3451L6568
35953C9715M0599n1216j09351p6571j460P0022J03215M8032o3896q6239L4118
35942e3032J23100K0927j54201j79583o1154K6295M0706P0325R7538K7991p5783
$$ plain form
35931 -116871 -167959 -89904 30077 61455 30956 36514 67297 59487 42215 73267 101671 50068
35919 50068 -21830 9050 129602 211667 208526 190173 193611 172455 105156 38881 6363 -9691
35907 -9691 -13887 19216 81958 121716 115150 104346 134605 183483 173384 60137 -88742 -132308
35895 -132308 -12953 152406 206408 153260 132141 205571 301742 371753 445240 484354 357173
35884 357173 61476 -171288 -132325 106171 313972 386690 372433 306508 184856 60998
35874 60998 19356 57067 96282 95344 60954 -11018 -109869 -161752 -105782 8906 86324 106460
35862 106460 104280 79432 24941 -2778 49649 133206 166583 166900 203224 259545 264320 227670
35850 227670 221208 234918 185354 71174 -8515 -16195 -36286 -126088 -206393 -168518 -27230
$$ packed form
35931a16871n1088P8055J19981L1378l0499N558L0783p810j7272L1052K8404n1603
35919E0068p1898L0880J20552Q2065l141j8353L438k1156o7299o6275l2518j6054
35907i691m196L3103O2742L9758o566j0804L0259M8878j0099j13247j48879m3566
35895a32308J19355J65359N4002n3148k1119P3430R6171P0011P3487L9114j27181
35884C57173k95697k32764L8963K38496K07801P2718j4257o5925j21652j23858
35874F0998m1642L7711L9215r38l4390p1972r8851n1883N5970J14688P7418K0136
35862A06460k180k4848n4491k7719N2427Q3557L3377L17L6324N6321M775l6650
35850B27670o462J3710m9564j14180p9689p680k0091q9802q0305L7875J41288
$$ plain form
35839 -27230 99511 133322 105937 93154 112805 107658 30354 -78748 -133172 -109248 -61160
35828 -61160 -26042 17883 79112 111269 79965 11148 -54095 -84594 -23050 170975 399171
35817 399171 465638 323359 173729 212870 365185 393303 213089 -29508 -164171 -159092
35807 -159092 -85036 -16332 15412 22751 25299 2826 -71530 -143403 -108927 27977 125985 90221
35795 90221 -11874 -79597 -109791 -117802 -53478 89061 190073 165020 109958 149250 233520
35784 233520 243804 211009 254415 357916 388362 311573 226358 194204 179131 148216 106020
35773 106020 47641 -8450 16543 140844 223200 136158 -17854 -37718 74353 138084 97188
35762 97188 78058 132953 147038 62307 -4334 42909 129683 158366 163457 209239 244610 181591
$$ packed form
35839b7230J26741L3811k7385j2783J9651n147p7304j09102n4424K3924M8088
35828f1160L5118M3925O1229L2157l1304o8817o5243l0499O1544J94025K28196
35817C99171O6467j42279j49630L9141J52315K8118j80214k42597j34663N079
35807a59092P4056O8704L1744P339K548k2473p4356p1873L4476J36904R8008l5764
35795I0221j02095o7723l0194q011O4324J42539J01012k5053n5062L9292Q4270
35784B33520J0284l2795M3406J03501L0446p6789q5215l2154j5073l0915m2196
35773A06020n8379n6091K4993J24301Q2356q7042j54012j9864J12071O3731m0896
35762I7188j9130N4895J4085q4731o6641M7243Q6774K8683N091M5782L5371o3019
$$ plain form
35750 181591 51614 -22417 19860 119617 176015 139471 47547 -11574 11407 77584 121949
35739 121949 134449 135453 112043 48078 -14176 -18832 20088 48681 56824 64702 67735 67920 107091
35726 107091 184982 205829 106398 -24730 -65279 -30027 -1413 34769 130580 215101 171008
35715 171008 42179 -11523 44080 89839 63925 32748 42823 61065 76054 106212 95547
35704 95547 -41725 -249171 -349900 -272867 -129156 -42137 -24022 -31117 -20663 49144 161957
35693 161957 208240 128984 45445 96110 207050 211569 138350 153422 252766 267469 169606
35682 169606 107564 117435 75206 -16916 17789 207047 330703 256979 123991 66968 18666
35671 18666 -78357 -111771 -23095 35863 -42239 -111533 -13906 151733 200846 147687 124801
$$ packed form
35750A81591j29977p4031M2277R9757N6398l6544r1924n9121K2981O6177M4365
35739A21949J2500J004k3410o3965o2254m656L8920K8593Q143P878L033J85L9171
35726A07091P7891K0847r9431j31128m0549L5252K8614L6182R5811Q4521m4093
35715A71008j28829n3702N5603M5759k5914l1177J0075J8242J4989L0158j0665
35704I5547j37272k07446j00729P7033J43711Q7019J8115p095J0454O9807J12813
35693A61957M6283p9256q3539N0665J10940M519p3219J5072R9344J4703r7863
35682A69606o2042R871m2229r2122L4705J89258J23656p3724j32988n7023m8302
35671A8666r7023l3414Q8676N8958p8102o9294R7627J65639M9113n3159k2886
$$ plain form
35660 124801 157249 199410 263495 336212 302428 129594 -5457 44055 160898 159388 84090
35649 84090 101086 198300 217510 116478 -2793 -74212 -98953 -55678 52426 122307 82559
35638 82559 30407 80081 161724 149059 99207 159561 300878 360568 313214 279153 278504 198155
35626 198155 26934 -79005 -23002 99419 156499 143074 129554 146828 176909 195486 191232
35615 191232 179581 195294 241339 278241 296939 340744 409595 424873 352458 267776 223232
35604 223232 158956 40076 -37638 -3691 42603 -8201 -79509 -41113 58213 79774 40119
35593 40119 62714 135759 131875 50157 29474 109696 170204 134433 66644 30985 7309 -14366
35581 -14366 7874 76582 137702 176385 216198 215990 101350 -77540 -154679 -61989 77818
$$ packed form
35660A24801L2448M2161O4085P2717l3784j72834j35051M9512J16843j510p5298
35649H4090J6996R7214J9210j01032j19271p1419k4741M3275J08104O9881l9748
35638H2559n2152M9674Q1643j2665m9852O0354J41317N9690m7354l4061o49q0349
35626A98155j71221j05939N6003J22421N7080j3425j3520J7274L0081J8577m254
35615A91232j1651J5713M6045L6902J8698M3805O8851J5278p2415q4682m4544
35604B23232o4276j18880p7714L3947M6294n0804p1308L8396R9326K1561l9655
35593D0119K2595P3045l884q1718k0683Q0222O0508l5771o7789l5659k3676k1675
35581a4366K2240O8708O1120L8683L9813k08j14640j78890p7139R2690J39807
$$ plain form
35570 77818 123069 83819 68286 131718 230620 286922 267616 217188 204340 227836 225586 198737
35558 198737 233757 340302 380448 270650 150131 196128 346844 383406 250115 117008
35548 117008 127395 242317 351418 399996 379598 303666 217115 152658 84598 -5995 -65657
35537 -65657 -54173 -29432 -38900 -9388 114480 209469 133100 -23577 -50993 53848 106594
35526 106594 66367 94727 242408 323548 202275 2590 -90961 -82831 -87099 -121607 -115441
35515 -115441 -49026 23715 57997 57357 58022 101200 185163 245534 232452 185242 164307 151118
35503 151118 109548 94448 169785 260155 239017 142260 121969 188105 181313 36048 -107842
35492 -107842 -118826 -45335 -1702 -12167 -39914 -63459 -63979 -27438 6118 -11810 -34708 20688
$$ packed form
35570G7818M5251l9250j5533O3432R8902N6302j9306n0428j2848K3496k250k6849
35558A98737L5020J06545M0146j09798j20519M5997J50716L6562j33291j33107
35548A17008J0387J14922J09101M8578k0398p5932q6551o4457o8060r0593n9662
35537f5657J1484K4741r468K9512J23868R4989p6369j56677k7416J04841N2746
35526A06594m0227K8360J47681Q1140j21273j99685r3551Q130m268l4508O166
35515a15441O6415P2741L4282o40O65M3178Q3963O0371j3082m7210k0935j3189
35503A51118m1570j5100P5337R0370k1138r6757k0291O6136o792j45265j43890
35492a07842j0984P3491M3633j0465k7747k3545n20L6541L3556j7928k2898N5396
$$ plain form
35480 20688 111675 109932 17862 -18426 55063 124699 124119 145290 247590 324095 277630 195531
35468 195531 219323 338163 430403 434973 376889 282452 160964 33488 -76049 -140521 -106865
35457 -106865 47601 222443 265831 173651 105072 155470 233304 223671 152521 100469 55451
35446 55451 -41637 -165823 -219596 -154475 -27413 50980 15365 -76413 -84693 36816 150128
35435 150128 109957 -18933 -57101 13713 43357 -21148 -54490 21230 108704 100779 20339
35424 20339 -69855 -149926 -173535 -70394 105545 177874 82290 -36119 -39821 25932 59799
35413 59799 65286 83919 92756 72712 72960 116315 141221 114147 93792 117009 136919 135638 167683
35400 167683 226978 214822 113971 43673 61481 71259 17229 -6764 47720 63084 -30577
$$ packed form
35480B0688R0987j743r2070l6288P3489O9636n80K1171J02300P6505m6465q2099
35468A95531K3792J18840R2240M570n8084r4437j21488j27476j09537o4472L3656
35457a06865J54466J74842M3388r2180o8579N0398P7834r633p1150n2052m5018
35446E5451r7088j24186n3773O5121J27062P8393l5615r1778q280J21509J13312
35435A50128m0171j28890l8168P0814K9644o4505l3342P5720Q7474p925q0440
35424B0339r0194q0071k3609J03141J75939P2329r5584j18409l702O5753L3867
35413E9799N487J8633Q837k0044K48M3355K4906k7074k0355K3217J9910j281L2045
35400A67683N9295j2156j00851p0298J7808R778n4030k3993N4484J5364r3661
$$ plain form
35389 -30577 -97846 -18225 98889 102986 57431 99675 171095 114044 -42521 -119301 -67001
35378 -67001 -8307 -20311 -56110 -76048 -94365 -89289 -5922 137771 255381 304360 307269 279235
35366 279235 220418 158516 120708 90498 55236 47639 75606 78470 31167 16652 99519 198332
35354 198332 192450 100311 39975 50428 57360 -1674 -100625 -163331 -129821 -9577 103336
35343 103336 113182 35957 -32549 -60139 -93881 -137093 -140830 -124552 -149565 -158689 -34110 149072
35331 149072 156169 -38005 -156379 -27361 154471 152524 47369 49385 142937 169661 123255
35320 123255 106238 101001 31825 -29135 40986 174376 195324 97859 30819 48203 75805
35309 75805 90212 136916 195757 203726 184839 200838 215183 159456 80782 67744 91593 78445
$$ packed form
35389c0577o7269P9621J17114M097m5555M2244P1420n7051j56565p6780N2300
35378f7001N8694j2004l5799j9938j8317N076Q3367J43693J17610M8979K909k8034
35366B79235n8817o1902l7808l0210l5262p597K7967K864m7303j4515Q2867R8813
35354A98332n882r2139o0336J0453O932n9034r8951o2706L3510J20244J12913
35343A03336R846p7225o8506k7590l3742m3212l737J6278k5013r124J24579J83182
35331A49072P097j94174j18374J29018J81832j947j05155K016R3552K6724m6406
35320A23255j7017n237o9176o0960P0121J33390K0948r7465o7040J7384K7602
35309G5805J4407M6704N8841P969j8887J5999J4345n5727p8674j3038K3849j3148
$$ plain form
35297 78445 67269 129116 204432 196321 151413 168491 204422 157634 66114 28535 8961 -76852
35285 -76852 -163874 -143724 -87588 -131521 -212535 -165261 -20263 50979 38292 70199 124836
35274 124836 51280 -119250 -166654 -22494 136006 174646 149352 122580 62431 -18496 -28974
35263 -28974 40810 101017 129538 179829 216756 141416 -10988 -98055 -105226 -154077 -266970
35252 -266970 -324280 -267558 -156914 -34140 81640 99184 -27469 -136658 -59150 78058
35242 78058 31486 -134054 -137691 29551 91367 -16427 -40651 115116 218740 149103 112253
35231 112253 231614 296540 154011 13298 90738 242585 236285 135328 122534 159747 122601
35220 122601 89653 194547 333923 313243 171036 87153 68840 -3301 -97296 -69641 57025
$$ packed form
35297G8445j1176O1847P5316q111m4908J7078L5931m6788r1520l7579j9574q5813
35285g6852q7022K0150N6136m3933q1014M7274J44998P1242j2687L1907N4637
35274A24836p3556j70530m7404J44160J58500L8640k5294k6772o0149q0927j0478
35263b8974O9784O0207K8521N0291L6927p5340j52404q7067p171m8851j12893
35252b66970n7310N6722J10644J22774J15780J7544j26653j09189P7508J37208
35242G8058m6572j65540l637J67242O1816j07794k4224J55767J03624o9637l6850
35231A12253J19361O4926j42529j40713P7440J51847o300j00957j2794L7213l7146
35220A22601l2948J04894J39376k0680j42207q3883j8313p2141r3995K7655J26666
$$ plain form
35209 57025 105388 24169 -55043 -42981 10216 50600 90899 127465 116807 55128 -8417 -35831
35197 -35831 -11496 75752 190353 235727 159500 33516 -33734 -18275 33904 78078 78263 15218
35185 15218 -64809 -83043 -46205 -44003 -99232 -130184 -100803 -85148 -129447 -173634 -170566 -161387
35173 -161387 -168308 -131647 -20333 102465 175655 196257 155177 49465 -23096 59077 243097
35162 243097 350211 342520 342376 363877 270487 63658 -46920 34201 147020 174972 221029
35151 221029 336713 349229 161281 -21443 7366 136171 156382 107344 145977 237143 239629
35140 239629 175994 165291 187186 144165 70031 64696 106922 124397 154373 247828 318415 274700
35128 274700 195505 189188 195924 119281 28276 27642 54158 10720 -27251 42197 129182 110836
$$ packed form
35209E7025M8363q1219p9212J2062N3197M0384M0299L6566j0658o1679o3545k7414
35197c5831K4335Q7248J14601M5374p6227j25984o7250J5459N2179M4174J85o3045
35185A5218q0027j8234L6838K202n5229l0952K9381J5655m4299m4187L068R179
35173a61387o921L6661J11314J22798P3190K0602m1080j05712p2561Q2173J84020
35162B43097J07114p691j44K1501r3390k06829j10578Q1121J12819K7952M6057
35151B21029J15684J2516j87948j82724K8809J28805K0211m9038L8633R1166K486
35140B39629o3635j0703K1895m3021p4134n335M2226J7475K9976R3455P0587m3715
35128B74700p9195o317O736p6643r1005o34K6516m3438l7971O9448Q6985j8346
$$ plain form
35116 110836 70089 122627 143186 -47075 -330612 -435502 -345422 -259988 -212929 -60668 170972
35105 170972 261266 149298 25321 18431 46837 27172 -2069 -16699 -55017 -87606 -32380
35094 -32380 74424 109641 73083 70877 94355 34283 -78895 -85415 20924 53570 -66854
35083 -66854 -193299 -205853 -180717 -215116 -260282 -230781 -145204 -72149 -39926 -52162 -95971
35072 -95971 -109108 -38222 66410 117557 128944 162634 179608 102687 -2911 3605 100217
35061 100217 121989 30411 -28511 33114 125859 153844 142553 143228 150657 163906 207487 261187
35049 261187 279491 285564 327096 354086 282054 160423 118379 152257 138774 61258 39800
35038 39800 114937 182463 182898 185420 231545 250968 192984 108839 50145 3121 -35139 -27158
$$ packed form
35116A10836m0747N2538K0559j90261k83537j04890R0080Q5434M7059J52261K31640
35105A70972R0294j11968j23977o890K8406j9665k9241j4630l8318l2589N5226
35094c2380J06804L5217l6558k206K3478o0072j13178o520J06339L2646j20424
35083f6854j26445j2554K5136l4399m5166K9501Q5577P3055L2223j2236m3809
35072i5971j3137P0886J04632N1147J1387L3690J6974p6921j05598O516R6612
35061A00217K1772r1578n8922O1625R2745K7985j1291O75P429J3249M3581N3700
35049B61187J8304O073M1532K6990p2032j21631m2044L3878j3483p7516k1458
35038C9800P5137O7526M35K522M6125J9423n7984q4145n8694m7024l8260P981
$$ plain form
35026 -27158 22968 59283 67881 87180 119795 130532 125849 138274 150456 133431 125741 166655
35014 166655 196022 138070 34142 -26826 -43561 -43625 18194 150716 218056 122074 -5649
35003 -5649 7206 98438 111507 100303 219050 389779 386290 213804 100779 124407 146403
34992 146403 123105 166097 262509 243044 86777 -28618 -39214 -74173 -162404 -152485 -10281
34981 -10281 84878 41147 -9437 31210 89916 130934 235823 376542 376847 211911 86618
34970 86618 103564 118511 45726 29034 158557 279890 252987 163042 111964 35294 -104450
34959 -104450 -170616 -78412 38935 60101 70028 160251 239115 211560 152644 135367 81813
34948 81813 -46793 -112152 -29230 58142 15023 -56119 -10225 93736 128263 114419 122393
$$ packed form
35026b7158N0126L6315Q598J9299L2615J0737m683J2425J2182j7025p690M0914
35014A66655K9367n7952j03928o0968j6735o4O1819J32522O7340r5982j27723
35003e649J2855R1232J3069j1204J18747J70729l489j72486j13025K3628K1996
34992A46403k3298M2992R6412j9465j56267j15395j0596l4959q8231R919J42204
34981a0281R5159m3731n0584M0647N8706M1018J04889J40719L05j64936j25293
34970H6618J6946J4947p2785j6692J29523J21333k6903q9945n1078p6670j39744
34959a04450o6166R2204J17347K1166R927R0223P8864k7555n8916j7277n3554
34948H1813j28606o5359Q2922Q7372m3119p1142M5894J03961L4527j3844P974
$$ plain form
34937 122393 114220 58151 39808 94145 95651 -18085 -94620 -17977 72006 10348 -114280
34926 -114280 -121617 -30454 20122 7339 -10830 -40180 -79012 -33033 126113 252020 237320
34915 237320 190302 235225 297601 264203 193217 179305 170598 109505 92456 193316 290394
34904 290394 269275 232693 302668 384382 346233 266040 268070 281853 204268 135908 198016 270075
34892 270075 181086 20199 -20431 20599 -17802 -102172 -92174 -36370 -76478 -148451 -88911
34881 -88911 34392 13753 -127927 -171356 -79161 -35085 -108452 -168283 -146227 -116875 -92985
34870 -92985 8900 167596 248319 222107 190694 182355 124383 22339 -34583 -50300 -108839
34859 -108839 -186887 -173092 -70852 9406 52792 140004 249187 254827 136941 16144 -27663
$$ packed form
34937A22393q173n6069j8343N4337J506j13736p6535P6643Q9983o1658j24628
34926a14280p337R1163N0576j2783j8169k9350l8832M5979J59146J25907j4700
34915B37320m7018M4923O2376l3398p0986j3912q707o1093j7049J00860R7078
34904B90394k1119l6582O9975Q1714l8149q0193K030J3783p7585o8360O2108P2059
34892B70075q8989j60887m0630M1030l8401q4370R998N5804m0108p1973N9540
34881h8911J23303k0639j41680m3429R2195M4076p3367n9831K2056K9352K3890
34870i2985J01885J58696Q0723k6212l1413q339n7972j02044n6922j5717n8539
34859a08839p8048J3795J02240Q0258M3386Q7212J09183N640j17886j20797m3807
$$ plain form
34848 -27663 -16632 27727 89441 91595 -6433 -82887 -2508 150359 178654 74932 13637
34837 13637 65804 129312 137763 139152 157653 156826 149343 182547 218043 178587 100768 92498 161677
34824 161677 228244 265492 285663 243365 109452 -21941 -58733 -67140 -136843 -184044 -80730
34813 -80730 109225 225944 257012 278961 260306 157217 100651 220555 368769 304924 96973
34802 96973 36084 186173 321636 308018 247437 223395 180391 101649 62857 67411 38801
34791 38801 -9074 4434 48171 32569 1529 43984 74004 -37532 -170787 -97144 124866
34780 124866 215285 122371 69497 134944 134634 -10617 -123784 -88770 -23315 -24405 -5628 100474
34768 100474 210955 258283 277510 265925 171600 65000 91845 215831 244217 140533 64286
$$ packed form
34848b7663J1031M4359O1714K154r8028p6454Q0379J52867K8295j03722o1295
34837A3637N2167O3508Q451J389J8501q27p483L3204L5496l9456p7819q270O9179
34824A61677O6567L7248K0171m2298j33913j31393l6792q407o9703m7201J03314
34813h0730J89955J16719L1068K1949j8655j03089n6566J19904J48214o3845k07951
34802I6973o0889J50089J35463j3618o0581k4042m3004p8742l8792M554k8610
34791C8801m7875J3508M3737j5602l1040M2455L0020j11536j33255P3643K22010
34780A24866R0419r2914n2874O5447l10j45251j13167L5014O5455j090J8777J06102
34768A00474J10481M7328J9227j1585r4325j06600K6845J23986K8386j03684p6247
$$ plain form
34757 64286 74412 60659 4365 29435 144644 207045 188449 207353 262910 228016 138737
34746 138737 175198 311038 316262 167173 99372 172778 157600 -30316 -158334 -93116 -19485
34735 -19485 -63995 -60201 98281 213217 133803 43495 136167 283578 290544 229510 248091
34724 248091 265523 139980 -39754 -92533 -35756 -14639 -62705 -113580 -126479 -59019 134773
34713 134773 360207 418727 302793 238204 311391 310782 102381 -105384 -88769 38775 44962
34702 44962 -50877 -77199 -20457 6470 -11553 -5496 36113 94893 185725 275793 275688 206100
34690 206100 203938 275580 253403 98381 7782 95733 213553 228915 225614 267510 234831
34679 234831 84097 7109 121406 249603 218822 137215 159588 224883 247412 315730 464645
$$ packed form
34757F4286J0126j3753n6294K5070J15209O2401j8596J8904N5557l4894q9279
34746A38737L6461J35840N224j49089o7801P3406j5178j87916j28018O5218P3631
34735a9485m4510L794J58482J14936p9414r0308R2672J47411O966o1034J8581
34724B48091J7432j25543j79734n2779N6777K1117m8066n0875j2899O7460J93792
34713A34773K25434N8520j15934o4589P3187o09k08401k07765J6615J27544O187
34702D4962r5839k6322N6742K6927j8023O057M1609N8780R0832R0068j05o9588
34690B06100k162P1642k2177j55022r0599Q7951J17820J5362l301M1896l2679
34679B34831j50734p6988J14297J28197l0781q1607K2373O5295K2529O8318J48915
$$ plain form
34668 464645 502535 318233 113460 72928 61270 -69314 -134746 82229 409470 513453
34658 513453 382674 257376 230491 233308 274943 386560 452804 383456 320776 406490 497037
34647 497037 393552 196187 131931 181786 182936 152491 194102 221392 98763 -62470 -64004
34636 -64004 41503 81975 106155 262830 459655 490313 408887 430421 533036 504195 328542
34625 328542 193887 149910 82075 -6523 1880 78891 84870 38786 74989 169126 188109 171301
34613 171301 272253 450902 509894 417182 320076 262208 157258 25366 -7955 62880 138289
34602 138289 221480 374974 517181 509199 398070 332501 298959 194567 89391 136193 274044
34591 274044 306300 231813 215576 264671 222821 76806 -6256 44394 126216 158935 146466
$$ packed form
34668D64645L7890j84302k04773m0532j1658j30584o5432K16975L27241J03983
34658E13453j30779j25298k6885K817M1635J11617O6244o9348o2680Q5714R0547
34647D97037j03485j97365o4256M9855J150l0445M1611K7290j22629j61233j534
34636f4004J05507M0472K4180J56675J96825L0658q1426K1534J02615k8841j75653
34625C28542j34655m3977o7835q8598Q403P7011N979m6084L6203R4137J8983j6808
34613A71301J00952J78649N8992r2712r7106n7868j04950j31892l3321P0835P5409
34602A38289Q3191J53494J42207p982j11129o5569l3542j04392j05176M6802J37851
34591B74044L2256p4487j6237M9095m1850j46015q3062N0650Q1822L2719j2469
$$ plain form
34580 146466 74150 -53667 -126186 -70878 -1983 -28975 -42166 86848 242902 267737 260298
34569 260298 375590 486570 391700 215385 222611 350184 322897 151525 100439 207246
34559 207246 247775 164689 134052 199934 218209 173345 191342 234023 136942 -47460 -98868
34548 -98868 -15824 1890 -58828 -26851 77589 63864 -29266 40886 270325 384363 303603
34537 303603 238392 273611 259768 176655 203144 344673 378620 256769 188309 243257 250784
34526 250784 171850 186398 315830 342919 213142 141173 212404 252692 201674 233822 385648
34515 385648 440615 321721 234312 279982 285887 159488 63997 99620 147890 159424 249990
34504 249990 388217 351218 129767 17200 148054 301639 307533 284190 321849 296044 169890
$$ packed form
34580A46466p2316j27817p2519N5308O8895k6992j3191J29014J56054K4835p439
34569B60298J15292J10980r4870j76315P226J27573k7287j71372n1086J06807
34559B07246M0529q3086l0637O5882J8275m4864J7997M2681r7081j84402n1408
34548i8868Q3044J7714o0718L1977J04440j3725r3130P0152K29439J14038q0760
34537C03603o5211L5219j3843q3113K6489J41529L3947j21851o8460N4948P527
34526B50784p8934J4548J29432K7089j29777p1969P1231M0288n1018L2148J51826
34515C85648N4967j18894q7409M5670N905j26399r5491L5623M8270J1534R0566
34504B49990J38227l6999k21451j12567J30854J53585N894k3343L7659k5805j26154
$$ plain form
34493 169890 129975 243547 314417 243691 198877 270237 305342 240866 242985 355277 368670
34482 368670 213972 122397 216901 302982 245042 188355 225513 210840 93973 66383 185593
34471 185593 230822 123454 97819 250630 329477 196916 93550 189058 277844 188494 96667
34460 96667 151582 186625 90850 72292 246719 359576 240953 145660 294956 464147 398468
34449 398468 272825 340095 457960 379151 217190 214708 307134 301613 247347 268064 268300 150868
34437 150868 80891 199555 325402 263114 147151 162174 205491 151098 144595 289110 352282
34426 352282 160188 -28414 61415 235956 186105 30493 52312 160307 92030 -62875
34416 -62875 -21693 179150 280292 260962 286839 339323 292610 221204 259997 306868 214707
$$ packed form
34493A69890l9915J13572P0870p0726m4814P1360L5105o4476K119J12292J3393
34482C68670j54698r1575R4504Q6081n7940n6687L7158j4673j16867k7590J19210
34471A85593M5229j07368k5635J52811P8847j32561j03366R5508Q8786q9350r1827
34460I6667N4915L5043r5775j8558J74427J12857j18623r5293J49296J69191o5679
34449C98468j25643O7270J17865p8809j61961k482R2426n521n4266K0717K36j17432
34437A50868o9977J18664J25847o2288j15963J5023M3317n4393o503J44515O3172
34426C52282j92094j88602Q9829J74541m9851j55612K1819J07995o8277j54905
34416f2875M1182K00843J01142j9330K5877N2484m6713p1406L8793M6871r2161
$$ plain form
34405 214707 108040 163720 270530 255045 226419 330089 399384 255322 113159 251506
34395 251506 496591 496637 312967 263003 347986 325195 210276 219532 316843 289673 193824 269055
34383 269055 476669 552323 466078 425966 476734 476467 416175 405317 406455 316545 219870 243118
34371 243118 287022 221080 177372 304822 422369 303758 121836 192713 442897 555579
34361 555579 494179 451904 427532 290157 138470 165253 279675 268495 196138 244615 321755
34350 321755 251079 173574 311470 507371 468287 302383 329536 514303 577805 521213 539277
34339 539277 564933 411407 220612 251341 370974 289554 139311 254070 521401 556028
34329 556028 398038 418406 619860 661945 521680 497860 592814 518076 300620 260482 385830
$$ packed form
34405B14707j06667N5680J06810j5485k8626J03670O9295j44062j42163J38347
34395B51506K45085M6j83670m9964Q4983k2791j14919R256R7311k7170r5849P5231
34383B69055K07614P5654q6245m0112N0768k67o0292j0858J138q9910r6675K3248
34371B43118M3904o5942m3708J27450J17547j18611j81922P0877K50184J12682
34361E55579o1400m2275k4372j37375j51687K6783J14422j1180p2357M8477P7140
34350C21755p0676p7505J37896J95901l9084j65904K7153J84767O3502n6592J8064
34339E39277K5656j53526j90795L0729J19633q1420j50243J14759K67331L4627
34329E56028j57990K0368K01454M2085j40265k3820R4954p4738k17456m0138J25348
$$ plain form
34318 385830 351562 170470 198071 454104 561292 417003 320927 371611 336833 198255
34308 198255 228444 432993 490872 344338 293549 423927 489577 431369 452589 524424 392460
34297 392460 132770 110914 322708 374476 184288 86035 165789 139588 -14975 30097 287208
34286 287208 368567 217352 244511 548368 679033 421025 159696 195503 304663 265621
34276 265621 242463 352409 393067 281472 255770 388297 401579 201180 85058 199058
34266 199058 289874 214563 190295 330137 429664 401949 423764 496382 393405 182750 226101
34255 226101 513958 607069 396832 287539 444049 523120 366079 282941 402781 416941
34245 416941 233558 208872 443084 528639 302547 163778 324202 441260 335287 354684
$$ packed form
34318C85830l4268j81092K7601K56033J07188j44289r6076N0684l4778j38578
34308A98255L0189K04549N7879j46534n0789J30378O5650n8208K1220P1835j31964
34297C92460k59690k1856K11794N1768j90188r8253P9754k6201j54563M5072K57111
34286B87208Q1359j51215K7159L03857J30665k58008k61329L5807J09160l9042
34276B65621k3158J09946M0658j11595k5702J32527J3282k00399j16122J14000
34266A99058R0816p5311k4268J39842R9527k7715K1815P2618j02977k10655M3351
34255B26101K87857R3111k10237j09293J56510P9071j57041q3138J19840J4160
34245D16941j83383k4686K34212Q5555k26092j38769J60424J17058j05973J9397
$$ plain form
34235 354684 641894 752010 438644 135703 199233 329836 219093 119564 272949 393573
34225 393573 237662 105668 272560 475865 453064 425339 570139 589676 297334 60329
34215 60329 156428 260803 83907 -56489 162488 455150 468298 400880 531231 647024
34205 647024 504025 352737 456520 569057 427400 281647 404544 555084 453144 312976
34195 312976 400154 538037 535275 596661 836403 921553 675557 470615 546139 554146 282311
34184 282311 157556 462184 732220 565165 350923 519992 731517 548582 289875 424854
34174 424854 697427 647231 469964 565147 729779 590530 364966 424395 563580 453876
34164 453876 345841 569653 817271 677229 405185 418366 525461 409904 342727 624456
$$ packed form
34235C54684K87210J10116l13366l02941O3530J30603j10743r9529J53385J20624
34225C93573j55911j31994J66892K03305k2801k7725J44800J9537k92342k37005
34215F0329R6099J04375j76896j40396K18977K92662J3148o7418J30351J15793
34205F47024j42999j51288J03783J12537j41657j45753J22897J50540j01940j40168
34195C12976Q7178J37883k762O1386K39742Q5150k45996k04942P5524Q007k71835
34184B82311j24755L04628K70036j67055k14242J69069K11525j82935k58707J34979
34174D24854K72573n0196j77267R5183J64632j39249k25564N9429J39185j09704
34164D53876j08035K23812K47618j40042k72044J3181J07095j15557o7177K81729
$$ plain form
34154 624456 862159 630161 311009 423538 658811 486359 185452 314124 638107 574790
34144 574790 273192 271343 473325 434557 289726 438752 668576 532037 251296 321747
34134 321747 577499 560087 428213 580232 782810 619852 385703 561287 832083 628120
34124 628120 210648 193420 413057 332812 137633 327041 633260 479702 130852 238325
34114 238325 614268 617809 393283 534629 873853 819612 563472 714521 1060695 950811
34104 950811 590831 672430 1014642 894026 446863 400054 667080 580347 278704 459374
34094 459374 953802 973443 604166 628830 1014267 1017361 664759 667768 975418 884685 497086
34083 497086 579384 1054924 1131720 847495 952440 1336918 1173540 582677 515550 971575
$$ packed form
34154F24456K37703k31998l19152J12529K35273j72452l00907J28672L23983o3317
34144E74790l01598j849K01982l8768j44831J49026K29824j36539k80741P0451
34134C21747K55752j7412j31874J52019K02578j62958k34149J75584K70796k03963
34124F28120m17472j7228K19637q0245j95179J89408L06219j53558l48850J07473
34114B38325L75943L541k24526J41346L39224n4241k56140J51049L46174j09884
34104I50811l59980Q1599L42212j20616m47163m6809K67026q6733l01643J80670
34094D59374M94428J9641l69277K4664L85437L094l52602L009L07650r0733l87599
34083D97086Q2298M75540P6796k84225J04945L84478j63378n90863o7127M56025
$$ plain form
34073 971575 1000625 529130 477821 949249 1024109 548311 409883 797364 873332 457286
34063 457286 367080 787657 937323 649103 655987 1030998 994714 541007 568913 1121657
34053 1121657 1213127 695818 547185 988805 1113442 721116 698559 1196324 1275598 771922
34043 771922 648831 1087889 1125637 608727 553321 1112242 1199847 626165 527865 1135703
34033 1135703 1252022 568150 323766 959051 1301882 854992 686005 1223273 1391839
34024 1391839 817148 650007 1284660 1522761 957532 864703 1700392 2084818 1388077 936754
34014 936754 1457638 1730962 1061040 669824 1273128 1665881 1124776 830463 1467740 1819321
34004 1819321 1207872 892774 1545679 1835925 1063262 632655 1317055 1690927 947941
$$ packed form
34073I71575K9050m71495n1309M71428P4860m75798j38428L87481P5968m16046
34063D57286r0206M20577J49666k88220O884L75011l6284m53707K7906N52744
34053A121657R1470n17309j48633M41620J24637l92326k2557M97765P9274n03676
34043G71922j23091M39058L7748n16910n5406N58921Q7605n73682r8300O07838
34033A135703J16319o83872k44384O35285L42831m46890j68987N37268J68566
34024A391839n74691j67141O34653K38101n65229r2829Q35689L84426o96741m51323
34014I36754N20884K73324o69922l91216O03304L92753n41105k94313O37277L51581
34004A819321o11449l15098O52905K90246p72663m30607O84400L73872p42986
$$ plain form
33995 947941 555560 1355287 1821045 1063095 686506 1676829 2374372 1655550 1140188 2004365
33985 2004365 2642679 1858456 1284080 2147329 2778975 1931930 1355740 2351256 3082450
33976 3082450 2173810 1550892 2674506 3500951 2421561 1566933 2737820 3808338 2856771
33967 2856771 2000973 3197958 4228644 3068945 2129540 3634363 5033854 3850075
33959 3850075 2681380 4196474 5736431 4508922 3368491 5321651 7258268 5814048
33951 5814048 4292706 6473047 8945798 7618557 6148364 9021617 12247484 10870510
33943 10870510 9400833 13562647 18441958 17734373 17574543 26099621 36936874 41087560
33935 41087560 46982591 66278472 88775800 102941952 136146390 229807498 361414321
$$ packed form
33995I47941l92381P99727M65758p57950l76589R90323O97543p18822n15362Q64177
33985B004365O38314p84223n74376Q63249O31646q47045n76190R95516P31194
33976C082450r08640o22918J123614Q26445j079390q54628J170887J070518r51567
33967B856771q55798J196985J030686j159699r39405J504823J399491j183779
33959C850075j168695J515094J539957j227509j140431J953160J936617j444220
33951E814048j521342K180341K472751j327241j470193K873253L225867j376974
33943A0870510j469677M161814M879311p07585j59830Q525078J0837253M150686
33935D1087560N895031J9295881K2497328J4166152L3204438R3661108J31606823
$$ plain form
33928 361414321 435780558 386477475 257358205 148714892 104471261 91225668 72100680
33921 72100680 51756050 44737201 43141627 34622492 24872251 23260240 24387790 19735001
33913 19735001 13515403 13042155 14707301 11959979 7762176 7832357 9490391 7528133
33905 7528133 4325600 4655597 6385233 5097246 2684780 3180558 4749972 3533594
33897 3533594 1249329 1683348 3365106 2640519 686819 908763 2339483 1865530 356687
33888 356687 667351 1926668 1428256 34605 364476 1591287 1148319 -221056 -13420
33879 -13420 1139853 845487 -343910 -150707 913807 653870 -468633 -333885 648900
33870 648900 438157 -602540 -498624 455587 398884 -398732 -203654 640467 401141 -571006
$$ packed form
33928C61414321P4366237m9303083j29119270j08643313m4243631j3245593j9124988
33921G2100680k0344630p018849j595574q519135r750241j612011J127550m652789
33913A9735001o219598m73248J665146k747322m197803P0181J658034j962258
33905G528133l202533L29997J729636j287987k412466M95778J569414j216378
33897C533594k284265M34019J681758p24587j953700K21944J430720m73953j508843
33888C56687L10664J259317m98412j393651L29871J226811m42968j369375K07636
33879a3420J153273k94366j189397J93203J064514k59937j122503J34748R82785
33870F48900k10743j040697J03916R54211n6703p97616J95078Q44121k39326r72147
$$ plain form
33860 -571006 -514566 305829 200375 -580193 -393464 488529 386615 -494556 -477359 331829
33850 331829 319547 -469799 -496209 237825 274452 -395925 -388289 288984 277431 -431632 -528067
33839 -528067 3430 -77328 -719549 -656144 53410 97778 -515138 -474008 253401 342945
33829 342945 -315301 -412338 272783 527480 59929 -85430 309130 268489 -323877 -440835
33819 -440835 55398 151330 -295270 -288075 298702 430562 -93392 -295054 56222 75083
33809 75083 -399706 -477522 -30307 14296 -487480 -580697 -69093 105522 -305136 -410981
33799 -410981 48469 221756 -161466 -299747 56862 134753 -283383 -409630 -14649 124090
33789 124090 -234301 -339972 35097 148509 -225121 -357600 -36547 21194 -357301 -416097
$$ packed form
33860e71006N6440Q20395j05454p80568J86729Q81993j01914q81171J7197Q09188
33850C31829j2282p89346k6410P34034L6627o70377P636O77273j1553p09063r6435
33839e28067N31497q0758o42221O3405P09554M4368o12916M1130P27409Q9544
33829C42945o58246r7037O85121K54697m67551j45359L94560m0641n92366j16958
33819d40835M96233R5932m46600P195N86777J31860n23954k01662L51276J8861
33809G5083m74789p7816M47215M4603n01776r3217N11604J74615m10658j05845
33799d10981M59450J73287l83222j38281L56609P7891m18136j26247L94981J38739
33789A24090l58391j05671L75069J13412l73630j32479L21053N7741l78495n8796
$$ plain form
33779 -416097 4918 70483 -446681 -662183 -205266 119648 -139926 -323494 -18411 194986
33769 194986 -28020 -141947 109125 134860 -287180 -492681 -202677 -74573 -411822 -562463
33759 -562463 -189280 87094 -92432 -178893 109147 173765 -268258 -562199 -330047 -154731
33749 -154731 -409236 -551386 -249771 -78172 -393213 -616645 -339922 -81075 -240408 -347708
33739 -347708 -56860 136315 -115000 -300295 -45693 163404 -43645 -201107 35556 185201
33729 185201 -85685 -253582 58524 324703 121092 -60788 207504 432960 149063 -172533
33719 -172533 -15584 220909 27639 -248374 -122142 90559 -69910 -306083 -179639 24058
33709 24058 -115321 -320328 -183108 30373 -73079 -245001 -130693 5034 -169029 -345135
$$ packed form
33779d16097M21015O5565n17164k15502M56917L24914k59574j83568L05083K13397
33769A94986k23006j13927K51072K5735m22040k05501K90004J28104l37249j50641
33759e62463L73183K76374j79526q6461K88040O4618m42023k93941K32152J75316
33749a54731k54505j42150L01615J71599l15041k23432K76723K58847j59333j07300
33739c47708K90848J93175k51315j85295K54602K09097k07049j57462K36663J49645
33729A85201k70886j67897L12106K66179k03611j81880K68292K25456k83897l21596
33719a72533J56949K36493j93270k76013J26232K12701j60469k36173J26444K03697
33709B4058j39379k05007J37220K13481j03452j71922J14308J35727j74063j76106
$$ plain form
33699 -345135 -157174 97357 30559 -106810 29047 178765 34390 -94466 113309 298818
33689 298818 69175 -232489 -142005 93690 41717 -101788 26247 200182 66567 -134149
33679 -134149 -44520 98651 -45561 -216075 -65437 112642 -81611 -368289 -288855 -36463
33669 -36463 -43459 -190281 -162316 -137773 -368411 -528498 -253186 106728 39909 -242450 -254896
33658 -254896 -135727 -282062 -494137 -335733 -4859 -11 -216123 -196345 -9047 -56833
33648 -56833 -256075 -212400 -7408 -33515 -223900 -189298 36616 86233 -62520 -140185 -140646
33637 -140646 -214057 -223664 -8474 163444 4119 -216654 -114579 105345 32571 -192301
33627 -192301 -186834 -68327 -174154 -348248 -236337 -5356 -36646 -187847 -101080 48828
$$ packed form
33699c45135J87961K54531o6798j37369J35857J49718j44375j28856K07775J85509
33689B98818k29643l01664R0484K35695n1973j43505J28035J73935j33615k00716
33679a34149Q9629J43171j44212j70514J50638J78079j94253k86678P9434K52392
33669c6463o996j46822K7965K4543k30638j60087K75312L59914o6819k82359j2446
33658b54896J19169j46335k12075J58404L30874M848k16112J9778J87298m7786
33648e6833j99242M3675K04992k6107j90385L4602K25914M9617j48753p7665m61
33637a40646p3411r607K15190J71918j59325k20773J02075K19924p2774k24872
33627a92301N467J18507j05827j74094J11911K30981l1290j51201Q6767J49908
$$ plain form
33617 48828 -114767 -382722 -307975 -67288 -139041 -370957 -245613 127515 185615 -70626
33607 -70626 -136452 20704 -50678 -359389 -414992 -121145 96646 92203 148637 296419 241501
33596 241501 16496 -21592 125597 115864 -37260 1870 179154 107849 -171333 -234514 -76776
33585 -76776 -103951 -309915 -254317 84774 232719 84246 58618 264901 295203 22422
33575 22422 -147088 -19784 92184 25727 32469 185230 180804 -52757 -184822 -115679 -155467
33564 -155467 -378417 -429248 -183309 14128 -19327 -30657 100286 117712 -67183 -173410
33554 -173410 -106188 -139300 -329981 -337697 -61087 118068 -22463 -206727 -208452 -198596 -300238
33543 -300238 -326391 -213160 -203543 -357656 -383045 -182635 -61787 -160747 -200037 -30453 86030
$$ packed form
33617D8828j63595k67955P4747K40687p1753k31916J25344L73128N8100k56241
33607g0626o5826J57156p1382l08711n5603K93847K17791m443N6434J47782n4918
33596B41501k25005l8088J47189r733j53124L9130J77284p1305k79182o3181J57738
33585g6776k7175k05964N5598L39091J47945j48473k5628K06283L0302k72781
33575B2422j69510J27304J11968o6457O742J52761m426k33561j32065O9143l9788
33564a55467k22950n0831K45939J97437l3455j1330J30943J7426j84895j06227
33554a73410O7222l3112j90681p716K76610J79155j40531j84264j725R856j01642
33543c00238k6153J13231R617j54113k5389K00410J20848r8960l9290J69584J16483
$$ plain form
33532 86030 -663 -42403 100918 173798 24930 -92855 -7813 56299 -64703 -163613 -86939
33521 -86939 -26425 -110217 -141200 -12537 52676 -58053 -106742 27226 83140 -97096 -256284
33510 -256284 -182940 -66812 -105186 -159783 -93277 -56527 -159903 -232823 -170214 -147849 -259152
33499 -259152 -321136 -255770 -255527 -364040 -335618 -128498 -63796 -251463 -351143 -176597 -31824
33488 -31824 -134847 -216813 -54958 82970 -72784 -302942 -305491 -192461 -184318 -189696 -80100
33477 -80100 -20310 -145794 -258331 -193983 -132129 -200734 -171225 91533 286701 178854 34992
33466 34992 140970 283871 173661 963 80678 271687 254125 99121 72340 124909
33456 124909 53046 -68439 -62666 -33878 -144011 -241031 -138377 -23363 -145652 -334691
$$ packed form
33532H6030q6693m1740J43321P2880j48868j17785Q5042O4112j21002r8910P6674
33521h6939O0514q3792l0983J28663O5213j10729m8689J33968N5914j80236j59188
33510b56284P3344J16128l8374n4597O6506L6750j03376p2920O2609K2365j11303
33499b59152o1984O5366K43j08513K8422K07120O4702j87667r9680J74546J44773
33488c1824j03023q1966J61855J37928j55754k30158k549J13030Q143n378J09596
33477h0100N9790j25484j12537O4348O1854o8605K9509K62758J95168j07847j43862
33466C4992J05978J42901j10210j72698P9715J91009j7562j55004k6781N2569
33456A24909p1863j21485N773K8788j10133r7020J02654J15014j22289j89039
$$ plain form
33446 -334691 -283580 -92780 -63265 -148815 -93896 50947 30426 -129143 -190910 -157854 -220989
33435 -220989 -350202 -344498 -211865 -127464 -101712 -37093 -2156 -97563 -170772 -24486 204698
33424 204698 233482 86773 10086 34642 -8994 -130668 -185878 -174049 -207688 -248788 -177156
33413 -177156 -53381 -34064 -99894 -122494 -106960 -129137 -150464 -124952 -145023 -254467 -292387
33402 -292387 -157462 -23256 -43010 -74742 24437 89052 -50538 -212341 -166059 -47805
33392 -47805 -93405 -192171 -113097 37475 10802 -116806 -100100 17126 26000 -23341 47250
33381 47250 136940 29927 -162980 -163617 -9125 52974 28154 95264 188138 113025 -27619
33370 -27619 4489 104627 -6229 -224958 -196326 51074 129141 -51599 -170530 -84197
$$ packed form
33446c34691N1111J90800K9515q5550N4919J44843k0521j59569o1767L3056o3135
33435b20989j29213N704J32633Q4401K5752O4619L4937r5407p3209J46286K29184
33424B04698K8784j46709p6687K4556m3636j21674n5210J1829l3639m1100P1632
33413a77156J23775J9317o5830k2600J5534k2177k1327K5512k0071j09444l7920
33402b92387J34925J34206j9754l1732R9179O4615j39590j61803M6282J18254
33392d7805m5600r8766P9074J50572k6673j27608J6706J17226Q874m9341P0591
33381D7250Q9690j07013j92907o37J54492O2099k4820O7110R2874p5113j40644
33370b7619L2108J00138j10856k18729K8632K47400P8067j80740j18931Q6333
$$ plain form
33360 -84197 -20869 -107316 -171719 -127227 -124862 -209821 -216796 -115867 -95617 -200825 -236303 -125535
33348 -125535 -32434 -41581 -38866 13551 -2595 -95565 -118532 -51157 -38242 -105813 -124872 -81022
33336 -81022 -87075 -118746 -43769 86133 93822 21500 75725 229334 241800 95742 40068
33325 40068 154436 238293 193122 157598 194041 186712 120598 122143 160970 57140 -151540
33314 -151540 -205474 -59762 35201 -25602 -47879 65770 128488 20289 -102859 -101145 -58055
33303 -58055 -61140 -51829 -9881 -20039 -61052 -1168 121705 108748 -40714 -93636 14127
33292 14127 72071 -10460 -48991 47632 92427 -35332 -171585 -164460 -106920 -105817 -83971 23250
33280 23250 117926 133971 149140 178947 101973 -88518 -204670 -155037 -73933 -55626 -16510
$$ packed form
33360h4197O3328q6447o4403M4492K365q4959o975J00929K0250j05208l5478J10768
33348a25535R3101r147K715N2417j6146r2970k2967O7375J2915o7571j9059M3850
33336h1022o053l1671P4977J29902P689p2322N4225J53609J2466j46058n5674
33325D0068J14368Q3857m5171l5524L6443p329o6114J545L8827j03830k08680
33314a51540n3934J45712R4963o0803k2277J13649O2718j08199j23148J714M3090
33303e8055l085R311M1948j0158m1013N9884J22873j2957j49462n2922J07763
33292A4127N7944q2531l8531R6623M4795j27759j36253P125N7540J103K1846J07221
33280B3250R4676J6045J5169K9807p6974j90491j16152M9633Q1104J8307L9116
$$ plain form
33269 -16510 69525 68640 -51244 -112672 -14707 112408 154580 173731 212066 185130 80939
33258 80939 23198 38066 6709 -67116 -17706 162121 251251 160993 78060 132342 211955
33247 211955 227884 263921 332789 285880 110883 20906 95603 130938 3751 -115626 -85367
33236 -85367 -26763 -51901 -49517 57361 117780 24685 -78024 -62478 -40183 -118598 -181773
33225 -181773 -121735 -58094 -118977 -209785 -190907 -97178 -23771 14791 -7546 -139753 -270602
33214 -270602 -191192 55446 170779 52406 -66707 -45690 -43263 -143244 -154849 5389 105171
33203 105171 9281 -61510 53481 139213 180 -173163 -158487 -103220 -224388 -392708
33193 -392708 -375497 -248219 -215035 -240633 -190774 -125963 -140836 -128133 -7617 41109 -113816
$$ packed form
33269a6510Q6035q85j19884o1428R7965J27115M2172J9151L8335k6936j04191
33258H0939n7741J4868l1357p3825M9410J79827Q9130r0258q2933N4282P9613
33247B11955J5929L6037O8868m6909j74997q9977P4697L5335j27187j19377L0259
33236h5367N8604k5138K384J06878O0419r3095j02709J5546K2295p8415o3175
33225a81773O0038O3641o0883r0808J8878R3729P3407L8562k2337j32207j30849
33214b70602P9410K46638J15333j18373j19113K1017K427r9981j1605J60238R9782
33203A05171r5890p0791J14991Q5732j39033j73343J4676N5267j21168j68320
33193c92708J7211J27278L3184k5598M9859O4811j4873J2703J20516M8726j54925
$$ plain form
33182 -113816 -257395 -162677 18184 38542 -17363 35058 70308 -109780 -330485 -272355 3048
33171 3048 173169 175535 202460 282525 272436 191764 182887 192801 50607 -186977 -296931 -242414
33159 -242414 -160966 -82244 32573 64012 -121173 -371913 -419242 -271381 -141100 -74566
33149 -74566 23518 91186 -11243 -185474 -203400 -88561 -67365 -185264 -284891 -313967 -340033
33138 -340033 -314158 -142287 55362 74152 -32895 -53443 7180 -23197 -118153 -93262 22258
33127 22258 11047 -144689 -242458 -224957 -234818 -301829 -300695 -228652 -211241 -228979 -149543 -25961
33115 -25961 -40711 -156332 -154772 -31852 -11204 -138994 -203923 -107758 6055 44112 75319
33104 75319 106542 50233 -41801 -16448 71588 4173 -200926 -260535 -65832 161472 232650
$$ packed form
33182a13816j43579R4718J80861K0358n5905N2421L5250j80088k20705N8130K75403
33171C048J70121K366K6925Q0065j0089q0672q877R914j42194k37584j09954N4517
33159b42414Q1448P8722J14817L1439j85185k50740m7329J47861J30281O6534
33149g4566R8084O7668j02429j74231j7926J14839K1196j17899r9627k9076k6066
33138c40033K5875J71871J97649J8790j07047k0548O0623l0377r4956K4891J15520
33127B2258j1211j55736r7769J7501r861o7011J134P2043J7411j7738P9436J23582
33115b5961j4750j15621J560J22920K0648j27790o4929R6165J13813L8057L1207
33104G5319L1223n6309r2034K5353Q8036o7415k05099n9609J94703K27304P1178
$$ plain form
33093 232650 210927 185382 123834 46319 64487 151389 135201 6475 -31058 103860 246848
33082 246848 279781 283212 315117 297977 216204 179990 208228 181679 78567 19455 25605 -16149
33070 -16149 -98374 -66409 97726 226017 246263 245250 217592 51900 -182468 -249862 -120762
33059 -120762 -21215 -44934 -44632 16975 -31143 -204039 -264101 -136374 -63653 -173955 -246104
33048 -246104 -114670 26540 -33359 -175990 -202820 -164615 -185247 -192853 -83812 45971 70631
33037 70631 54103 92288 120641 75960 60022 147575 220049 176797 114682 112468 50622 -148366
33025 -148366 -311901 -274255 -146717 -104608 -96178 -3316 90920 57089 -11311 52306 190191
33014 190191 225773 166427 160392 230689 272444 250656 207114 135379 23199 -48852 -10244
$$ packed form
33093B32650k1723k5545o1548p7515J8168Q6902j6188j28726l7533J34918J42988
33082B46848L2933L431L1905j7140q1773l6214K8238k6549j03112n9112O150m1754
33070a6149q2225L1965J64135J28291K0246j013k7658j65692k34368o7394J29100
33059a20762R9547k3719L02O1607m8118j72896o0062J27727P2721j10302p2149
33048b46104J31434J41210n9899j42631k6830L8205k0632p606J09041J29783K4660
33037G0631j6528L8185K8353m4681j5938Q7553P2474m3252o2115k214o1846j98988
33025a48366j63535L7646J27538M2109Q430R2862R4236l3831o8400O3617J37885
33014A90191L5582n9346o035P0297M1755k1788m3542p1735j12180p2051L8608
$$ plain form
33003 -10244 68068 81548 45989 21543 -6612 -44857 -13937 107335 189045 140245 58957
32992 58957 53864 65998 21965 5679 96545 183477 136441 35528 31142 91553 89209 36520
32980 36520 36302 79706 78585 29141 -16643 -64664 -119458 -106443 3138 92766 65142 -11208
32968 -11208 -55655 -128014 -264937 -324713 -199504 -42538 -60556 -196979 -251393 -210785 -216167
32957 -216167 -272866 -244043 -102742 29180 80352 83941 56033 -9517 -53959 -23262 7016
32946 7016 -71066 -212659 -277421 -230240 -146588 -67766 12183 68856 89697 135739 237761
32935 237761 304711 259608 174683 136342 84483 -51205 -161703 -97785 77069 163187 100204
32924 100204 -5707 -74046 -100089 -65354 34724 113420 89159 13900 -18687 -18498 -26775 -3973
$$ packed form
33003a0244P8312J3480l5559k4446k8155l8245L0920J21272Q1710m8800q1288
32992E8957n093J2134m4033j6286R0866Q6932m7036j00913m386O0411k344n2689
32980C6520k18M3404j121m9444m5784m8021n4794J3015J09581Q9628k7624p6350
32968a1208m4447p2359j36923n9776J25209J56966j8018j36423n4414M0608n382
32957b16167n6699K8823J41301J31922N1172L589k7908o5550m4442L0697L0278
32946G016p8082j41593o4762M7181Q3652P8822P9949N6673K0841M6042J02022
32935B37761O6950m5103q4925l8341n1859j35688j10498O3918J74854Q6118o2983
32924A00204j05911o8339k6043L4735J00078P8696k4261p5259l2587J89q277K2802
$$ plain form
32912 -3973 57466 23594 -189950 -414334 -417857 -226303 -55866 4154 36593 79709 75272
32901 75272 11032 -60632 -122090 -165065 -124402 14361 118576 78609 -13403 -20534 9994
32890 9994 -37150 -115455 -118196 -99265 -155376 -194867 -88541 44309 -4451 -156402 -149311 20520
32878 20520 93228 -9860 -75467 8864 73502 -14909 -135286 -143775 -87536 -54067 -11560
32867 -11560 68560 107400 64771 38098 97626 155286 107982 1641 -43628 15745 138917
32856 138917 260571 312132 265428 185097 158945 171753 136674 35760 -77503 -187132 -297222
32845 -297222 -337059 -236615 -80199 -26127 -81203 -112478 -68216 -12377 51367 192968 374026
32834 374026 445933 372596 282215 255212 229242 161283 116785 136723 164464 164329 178911 216862
$$ packed form
32912c973O1439l3872k13544k24384l523J91554J70437O0020L2439M3116m437
32901G5272o4240p1664o1458m2975M0663J38763J04215l9967r2012p131L0528
32890I994m7144p8305k741J8931n6111l9491J06326J32850m8760j51951P091J69831
32878B0520P2708j03088o5607Q4331O4638q8411j20377q489N6239L3469M2507
32867a1560Q0120L8840m2629k6673N9528N7660m7304j06341m5269N9373J23172
32856A38917J21654N1561m6704q0331k6152J2808l5079j00914j13263j09629j10090
32845b97222l9837J00444J56416N4072n5076l1275M4262N5839O3744J41601J81058
32834C74026P1907p3337r0381k7003k5970o7959m4498J9938K7741j35J4582L7951
$$ plain form
32822 216862 210933 136031 55276 14900 1446 17832 86171 168589 201717 200140 202113 147796
32810 147796 -28724 -217054 -230507 -83998 21029 -1644 -31254 30650 134775 219154
32800 219154 281776 287636 190005 70915 66598 130418 82100 -77972 -140217 -26288 88858
32789 88858 82061 63130 130237 176269 93720 -25076 -56826 -47630 -82265 -105588 -41315 42627
32777 42627 54241 47638 103767 141115 35393 -120973 -64474 307910 762696 929756 652614
32766 652614 141525 -218651 -235433 -66219 20262 -37216 -113936 -153700 -213403 -275899 -231352
32755 -231352 -87971 -12883 -91651 -204117 -209891 -115203 7786 124804 195096 160903 55337
32744 55337 1709 44074 91696 77649 51481 70024 115174 156579 181299 146305 29421
$$ packed form
32822B16862n929p4902q0755m0376j3454J6386O8339Q2418L3128j577J973n4317
32810A47796j76520j88330j3453J46509J05027k2673k9610O1904J04125Q4379
32800B19154O2622N860r7631j19090m317O3820m8318j60072o2245J13929J15146
32789H8858o797j8931O7107M6032q2549j18796l1750R196l4635k3323O4273Q3942
32777D2627J1614o603N6129L7348j05722j56366N6499L72384M54786J67060k77142
32766F52614n11089l60176j6782J69214Q6481n7478p6720l9764n9703o2496M4547
32755b31352J43381P5088p8768j12466n774R4688J22989J17018P0292l4193j05566
32744E5337n3628M2365M7622j4047k6168J8543M5150M1405K4720l4994j16884
$$ plain form
32733 29421 -73244 -49794 36083 28535 -58499 -67309 17639 45441 -14689 -15144 86234 140201
32721 140201 86081 64272 144930 192232 124061 69421 125160 177372 114617 13256 -34973
32710 -34973 -76749 -135038 -102858 46235 148138 109974 75533 160696 236892 170018 69610
32699 69610 85211 138426 83474 -25111 -50012 -17208 -30822 -70713 -76890 -106588 -208650
32688 -208650 -271711 -197807 -98359 -114981 -172639 -119133 10674 79729 84222 97673 89963 6659
32676 6659 -77335 -80343 -76735 -142845 -170576 -48817 100346 100374 13572 9954 57966 13782 -72286
32663 -72286 -20627 158122 273367 253985 196983 147729 64852 -18623 -19922 25591 19827 -7917
32651 -7917 40195 130477 158337 154046 215550 289425 241745 103931 26267 26497 4518 -36220
$$ packed form
32733B9421j02665K3450Q5877p548q7034q810Q4948K7802o0130m55J01378N3967
32721A40201n4120k1809Q0658M7302o8171n4640N5739N2212o2755j01361m8229
32710c4973m1776n8289L2180J49093J01903l8164l4441Q5163P6196o6874j00408
32699F9610J5601N3215n4952j08585k4901L2804j3614l9891o177k9698j02062
32688b08650o3061P3904R9448j6622n7658N3506J29807O9055M493J3451p710q3304
32676F659q3994l008L608o6110k7731J21759J49163K8q6802l618M8012m4184q6068
32663g2286N1659J78749J15245j9382n7002m9254q2877q3475j299M5513n764k7744
32651g917M8112R0282K7860m291O1504P3875m7680j37814p7664K30k1979m0738
$$ plain form
32639 -36220 -8790 55996 55385 19467 41648 58846 -48942 -191831 -177140 -46977 -18201
32628 -18201 -105161 -112898 -14850 -9573 -146283 -214518 -104781 13663 -4208 -64609 -57245 -46691
32616 -46691 -89537 -76835 72860 234751 251901 156691 87888 100155 157609 206804 178299
32605 178299 31659 -140857 -184004 -102706 -68686 -152714 -218220 -157039 -62041 -62285 -131808
32594 -131808 -171633 -160755 -124797 -61586 11923 35282 1816 -13882 16851 27689 -9107
32583 -9107 -14728 64462 161665 189657 143027 54863 -47697 -106736 -66000 17105 8115 -110609
32571 -110609 -198606 -154256 -33729 71349 148819 204784 212560 186561 195456 242781 241007 155212
32559 155212 62584 22227 2839 -11226 31963 134831 200731 173096 119741 114185 135184
$$ packed form
32639c6220K7430O4786o11l5918K2181J7198j07788j42889J4691J30163K8776
32628a8201q6960p737R8048N277j36710o8235J09737J18444j7871o0401P364J0554
32616d6691m2846J2702J49695J61891J7150r5210o8803J2267N7454M9195k8505
32605A78299j46640j72516m3147Q1298L4020q4028o5506O1181R4998k44o9523
32594a31808l9825J0878L5958O3211P3509K3359l3466j5698L0733J0838l6796
32583i107n621P9190R7203K7992m6630q8164j02560n9039M0736Q3105q990j18724
32571a10609q7997M4350J20527J05078P7470N5965P776k5999Q895M7325j774q5795
32559A55212r2628m0357j9388j4065M3189J02868O5900k7635n3355n556K0999
$$ plain form
32548 135184 145963 170305 223057 258031 246908 223589 199403 127446 5019 -79800 -61767
32537 -61767 18815 92099 141168 172231 180052 175719 178322 162853 91414 -2835 -50346 -56486
32525 -56486 -78973 -108501 -88084 -37669 -28114 -39615 10921 103498 129955 84392 80017 153584
32513 153584 208186 181964 129440 106923 111473 144371 196202 179596 39932 -85933 -15283
32502 -15283 187581 281584 209425 141485 143555 82570 -72715 -148881 -80148 -48307 -160801
32491 -160801 -243163 -132487 44852 85101 9798 -36969 -30715 -17230 33893 142259 207757
32480 207757 157285 85460 98367 136822 102046 36769 34521 79829 111180 131449 143785 108472
32468 108472 64896 133211 283196 296549 101743 -65906 -19950 79438 14373 -107183 -44701
$$ packed form
32548A35184J0779K4342N2752L4974j1123k3319k4186p1957j22427q4819J8033
32537f1767Q0582P3284M9069L1063P821m333K603j5469p1439r4249m7511o140
32525e6486k2487k9528K0417N0415R555j1501N0536R2577K6457m5563m375P3567
32513A53584N4602k6222n2524k2517M550L2898N1831j6606j39664j25865P0650
32502a5283K02864R4003p2159o7940K070o0985j55285p6166O8733L1841j12494
32491a60801q2362J10676J77339M0249p5303m6767O254J3485N1123J08366O5498
32480B07757n0472p1825J2907L8455l4776o5277k248M5308L1351K0269J2336l5313
32468A08472m3576O8315J49985J3353j94806j67649M5956R9388o5065j21556O2482
$$ plain form
32457 -44701 147364 202498 75708 -10659 62441 161130 140671 24353 -89135 -135001 -86719
32446 -86719 20159 82020 51157 15425 50382 81816 24644 -48479 -36738 -3289 -55828
32435 -55828 -131114 -96021 18431 85724 108081 159508 178742 54519 -129755 -176892 -79262
32424 -79262 -8937 -15813 26962 162381 265936 264103 229387 207650 143650 40469 17629
32413 17629 133094 285829 360294 351321 300408 222211 136980 77517 34476 -21130 -60243
32402 -60243 -34441 21051 28818 -3668 -10356 3624 -18446 -58325 -46963 2638 18427 5659
32390 5659 25290 59713 44767 12367 44060 100378 67565 -30574 -49706 30497 63892 -18928
32378 -18928 -101002 -77831 -11599 -7098 -58091 -95675 -92325 -53446 13761 76449 93324 81110
$$ packed form
32457d4701J92065N5134j26790q6367P3100R8689k0459j16318j13488m5866M8282
32446h6719J06878O1861l0863l5732L4957L1434n7172p3123J1741L3449n2539
32435e5828p5286L5093J14452O7293K2357N1427J9234j24223j84274m7137R7630
32424g9262P0325o876M2775J35419J03555j833l4716k1737o4000j03181k2840
32413A7629J15465J52735P4465q973n0913p8197q5231n9463m3041n5606l9113
32402f0243K5802N5492P767l2486o688J3980k2070l9879J1362M9601J5789j2768
32390E659J9631L4423j4946l2400L1693N6318l2813r8139j9132Q0203L3395q2820
32378a8928q2074K3171O6232M501n0993l7584L350L8879O7207O2688J6875j2214
$$ plain form
32366 81110 90499 110633 86581 31576 17199 45836 44768 1829 -8001 41270 71981 22098
32354 22098 -71159 -141484 -168965 -156997 -102868 -17455 73932 155455 209564 210126 171337 151048
32342 151048 147391 69238 -105809 -235681 -196886 -79900 -57470 -129564 -160468 -111144 -60104
32331 -60104 -34151 4564 32531 1481 -26089 44511 154033 166521 101710 87981 112356
32320 112356 50037 -61030 -29608 166315 313018 284710 202219 185310 173341 102205 51040
32309 51040 81537 109453 67452 35368 78382 107855 42682 -25796 23314 141318 192935
32298 192935 150574 80776 16265 -39541 -49327 1227 33113 -37479 -171763 -247010 -199775
32287 -199775 -81191 5578 -1751 -63280 -69895 18604 99525 66921 -21607 -34306 19287 13232
$$ packed form
32366H1110R389K0134k4052n5005j4377K8637j068m2939r830M9271L0711m9883
32354B2098r3257p0325k7481J1968N4129Q5413R1387Q1523N4109N62l8789k0289
32342A51048l657p8153j75047j29872L8795J16986K2430p2094l0904M9324N1040
32331f0104K5953L8715K7967l1050k7570P0600J09522J2488o4811j3729K4375
32320A12356o2319j11067L1422J95923J46703k8308q2491j6909j1969p1136n1165
32309E1040L0497K7916m2001l2084M3014K9473o5173o8478M9110J18004N1617
32298A92935m2361o9798o4511n5806r786N0554L1886p0592j34284p5247M7235
32287a99775J18584Q6769p329o1529o615Q8499Q0921l2604q8528j2699N3593o055
$$ plain form
32275 13232 -73547 -128715 -100884 -49931 6857 112557 209971 163346 -8528 -115882 -76106
32264 -76106 -13078 -11840 12924 107047 149224 63194 -33857 -35626 -20663 -73812 -109192 -40852
32252 -40852 29348 -18651 -100413 -67398 41792 86019 65234 79817 112678 52948 -90036
32241 -90036 -173884 -123476 -6009 91756 146479 164498 161527 167764 181803 147055 37833 -74582
32229 -74582 -106602 -65195 -10983 17923 -8034 -114696 -244821 -264971 -140346 -20843 -56793
32218 -56793 -200323 -286105 -245134 -141624 -51914 -1233 15036 20690 41110 57758 28314
32207 28314 -29402 -51203 -38182 -49772 -69088 -10918 101785 127116 30273 -44088 -7127
32196 -7127 34776 -22242 -110228 -138056 -144368 -166085 -120003 24306 110179 15974 -123391 -109698
$$ packed form
32275A3232q6779n5168K7831N0953N6788J05700R7414m6625j71874j07354L9776
32264g6106O3028J238K4764R4123M2177q6030r7051j769J4963n3149l5380O8340
32252d0852P0200m7999q1762L3015J09190M4227k0785J4583L2861n9730j42984
32241i0036q3848N0408J17467R7765N4723J8019k971O237J4039l4748j09222j12415
32229g4582l2020M1407N4212K8906k5957j06662j30125k0150J24625J19503l5950
32218e6793j43530q5782M0971J03510Q9710N0681J6269N654K0420J6648k9444
32207B8314n7716k1801J3021j1590j9316N8170J12703K5331r6843p4361L6961
32196g127M1903n7018q7986k7828o312k1717M6082J44309Q5873r4205j39365J3693
$$ plain form
32184 -109698 22591 102941 110361 147503 207828 185435 73405 -36704 -111401 -159152 -116413
32173 -116413 60670 236309 224861 61358 -39642 17160 124013 176812 191175 197349 172429
32162 172429 107124 29058 -48184 -110142 -104628 -18647 54613 35645 -13556 -4583 7412 -78168
32150 -78168 -203845 -226605 -154791 -128381 -178620 -189409 -105073 -6251 45431 87762 152368
32139 152368 208607 241229 272112 286057 238229 146198 77757 43609 -5899 -79573 -127136
32128 -127136 -115918 -54838 34008 105314 103593 55232 72577 182460 245518 155347 15368
32117 15368 -17361 36632 60962 61475 123670 225610 273948 264613 235147 132240 -82633 -270680
32105 -270680 -270819 -156844 -121900 -165890 -137091 -36954 -16664 -82611 -76554 30493 85774
$$ packed form
32184a09698J32289Q0350P420L7142O0325k2393j12030j10109p4697m7751M2739
32173a16413J77083J75639j1448j63503j01000N6802J06853N2799J4363O174k4920
32162A72429o5305p8066p7242o1958N514Q5981P3260j8968m9201Q973J1995q5580
32150g8168j25677k2760P1814K6410n0239j0789Q4336R8822N1682M2331O4606
32139A52368N6239L2622L0883J3945m7828r2031o8441l4148m9508p3674m7563
32128a27136J1218O1080Q8846P1306j721m8361J7345J09883O3058r0171j39979
32117A5368l2729N3993K4330N13O2195J01940M8338r335k9466j02907k14873j88047
32105b70680j39J13975L4944m3990K8799J00137K0290o5947O057J07047N5281
$$ plain form
32094 85774 36736 15641 85536 138693 116103 103026 130908 100771 -11930 -78784 -29601
32083 -29601 47635 91916 157452 240394 224957 99745 26559 80418 111203 -8336 -170905
32072 -170905 -210768 -145019 -100261 -114843 -134481 -109428 -10194 152641 266872 204581 24311
32061 24311 -59784 29606 133888 119217 54606 37368 26885 -23837 -37673 49276 162436
32050 162436 225393 278616 340383 307198 139335 -3471 20310 106088 66086 -85201 -184111
32039 -184111 -171925 -122970 -81159 -32119 2161 -17162 -62709 -92300 -140623 -251704 -369400
32028 -369400 -403034 -354643 -280372 -180333 -33938 105965 165923 162999 164048 168389 126194
32017 126194 46981 2973 38781 137459 250053 313405 281862 189202 134974 171411 253675
$$ packed form
32094H5774m9038k1095O9895N3157k2590j3077K7882l0137j12701o6854M9183
32083b9601P7236M4281O5536Q2942j5437j25212p3186N3859L0785j19539j62569
32072a70905l9863O5749M4758j4582j9638K5053R9234J62835J14231o2291j80270
32061B4311q4095Q9390J04282j4671o4611j7238j0483n0722j3836Q6949J13160
32050A62436O2957N3223O1767l3185j67863j42806K3781Q5778m0002j51287r8910
32039a84111J2186M8955M1811M9040L4280j9323m5547k9591m8323j11081j17696
32028c69400l3634M8391P4271J00039J46395J39903N9958k924J049M341m2195
32017A26194p9213m4008L5808R8678J12594O3352l1543r2660n4228L6437Q2264
$$ plain form
32006 253675 322478 359738 339792 227043 66493 -26164 -19367 -11385 -70091 -137336 -151472
31995 -151472 -144294 -143133 -101978 -20086 -4213 -101827 -184191 -119624 29902 111201 97881 75507
31983 75507 73284 47825 4866 15568 106164 205844 215907 110730 -13969 -11184 137712
31972 137712 247712 148600 -50158 -79387 102969 247805 185054 40561 -11180 3564
31962 3564 -6125 -3301 63246 107972 43567 -61914 -120878 -188380 -326192 -434304 -395151 -276251
31950 -276251 -218186 -223090 -215547 -202118 -203151 -143510 9441 116558 66841 -11822 48113 158010
31938 158010 114585 -52257 -129534 -65691 -10558 -34926 -56429 -49057 -97263 -212242 -289581
31927 -289581 -280066 -236567 -179943 -81780 15480 26113 -24135 -26622 25641 35500 -17585 -47168
$$ packed form
32006B53675O8803L7260j9946j12749j60550r2657O797P982n8706o7245j4136
31995a51472P178J161M1155Q1892J5873r7614q2364O4567J49526Q1299j3320k2374
31983G5507k223k5459m2959J0702R0596R9680J0063j05177j24699K785J48896
31972A37712J10000r9112j98758k9229J82356J44836o2751j44493n1741J4744
31962C564r689K824O6547M4726o4405j05481n8964o7502j37812j08112L9153J18900
31950b76251N8065m904P543J3429j033N9641J52951J07117m9717p8663N9935J09897
31938A58010m3425j66842p7277O3843N5133k4368k1503P372m8206j14979p7339
31927b89581R515M3499N6624R8163R7260J0633n0248k487N2263R859n3085k9583
$$ plain form
31915 -47168 -12045 42389 87479 121231 99187 -4301 -101827 -106869 -89172 -151373 -220119 -165547
31903 -165547 -68464 -122164 -292423 -340770 -204702 -90151 -130002 -204331 -188776 -147469 -160508
31892 -160508 -160934 -78505 15056 35211 30197 80741 159822 192600 170735 133378 112665 142644
31880 142644 234416 316142 298830 215974 182444 212519 219111 195814 228849 304319 289743 160140
31868 160140 61641 80950 125814 113125 101464 141851 164166 121439 92260 122345 110468
31857 110468 -18564 -157246 -167222 -78906 -10327 14893 43093 73956 91185 130847 205533
31846 205533 236739 170177 79539 48999 37534 -22570 -77832 -41769 37078 45960 5238 39600
31834 39600 159456 217441 113485 -71024 -191315 -208803 -187187 -172977 -146938 -88726 -38103
$$ packed form
31915d7168L5123N4434M5090L3752k2044j03488r7526n042J7697o2201o8746N4572
31903a65547R7083n3700j70259m8347J36068J14551l9851p4329J5555M1307j3039
31892a60508m26Q2429R3561K0155n014N0544P9081L2778k1865l7357k0713K9979
31880A42644R1772Q1726j7312q2856l3530L0075O592k3297L3035P5470j4576j29603
31868A60140r8499J9309M4864j2689j1661M0387K2315m2727k9179L0085j1877
31857A10468j29032j38682r976Q8316O8579K5220K8200L0863J7229L9662P4686
31846B05533L1206o6562r0638l0540j1465o0104n5262L6063P8847Q882m0722L4362
31834C9600J19856N7985j03956j84509j20291j7488K1616J4210K6039N8212N0623
$$ plain form
31823 -38103 -55144 -128885 -170075 -116689 -9489 69500 92344 75498 25566 -39896 -65563
31812 -65563 -31093 -1005 -10012 39124 232979 452242 486410 333963 212705 245384 306402
31801 306402 238266 65971 -84049 -152980 -155300 -116713 -78812 -81438 -89515 -25520 87795
31790 87795 120920 18198 -117931 -168420 -123754 -32242 69381 136402 139154 139747 227266 350157
31778 350157 354340 224665 128919 164112 225472 205328 151635 126030 71104 -49485 -124286
31767 -124286 -54670 75072 130583 124183 136390 141438 69469 -28679 -33497 67130 179308
31756 179308 241917 256476 222239 145762 79903 66749 79035 83524 102534 145179 152246 89299
31744 89299 22997 24245 66132 94152 119438 161982 182774 158562 146932 193505 251244 268634
$$ packed form
31823c8103j7041p3741m1190N3386J07200P8989K2844j6846m9932o5462k5667
31812f5563L4470L0088r007M9136J93855K19263L4168j52447j21258L2679O1018
31801C06402o8136j72295j50020o8931k320L8587L7901k626q077O3995J13315
31790H7795L3125j02722j36129n0489M4666R1512J01623O7021K752N93Q7519J22891
31778C50157M183j29675r5746L5193O1360k0144n3693k5605n4926j20589p4801
31767a24286O9616J29742N5511o400J2207N048p1969r8148m818J00627J12178
31756A79308O2609J4559l4237p6477o5859j3154J2286M489J9010M2645P067o2947
31744H9299o6302J248M1887K8020K5286M2544K0792k4212j1630M6573N7739J7390
$$ plain form
31732 268634 272046 283108 250584 151167 62843 51871 85222 133931 240498 387765 438598
31721 438598 331858 208590 203751 242639 204462 157394 230223 347975 318590 136571 -8441
31710 -8441 -10605 50410 85355 102919 124032 131039 126970 137309 144158 111414 68434 80109 144819
31697 144819 197310 191726 123973 18106 -56813 -32048 38526 2951 -166117 -295710 -257299
31686 -257299 -148504 -105595 -85640 3024 102775 136238 194915 367567 498784 381939 110392
31675 110392 -39384 -20619 -25524 -110343 -116582 12001 130732 171794 241144 353032 340288
31664 340288 155997 20325 106340 280147 325844 263098 254609 319103 328690 232016 118219
31653 118219 75448 97722 127367 119958 74955 37523 48830 84337 84617 47263 24288 26749
$$ packed form
31732B68634L412J1062l2524r9417q8324j0972L3351M8709J06567J47267N0833
31721D38598j06740j23268m839L8888l8177m7068P2829J17752k9385j82019j45012
31710h441k164O1015L4945J7564K1113P007m069J0339O849l2744m2980J1675O4710
31697A44819N2491n584o7753j05867p4919K4765P0574l5575j69068j29593L8411
31686b57299J08795M2909J9955Q8664R9751L3463N8677J72652J31217j16845k71547
31675A10392j49776J8765m905q4819o239J28583J18731M1062O9350J11888j2744
31664C40288j84291j35672Q6015J73807M5697o2746q489O4494R587r6674j13797
31653A18219m2771K2274K9645p409m5003l7432J1307L5507K80l7354k2975K461
$$ plain form
31641 26749 8466 -46264 -95309 -109996 -103441 -86801 -69611 -92127 -172223 -234563 -189052 -67080
31629 -67080 22957 59652 111494 188315 221802 198156 176017 157821 81833 -27731 -41705
31618 -41705 87918 239320 280635 225146 168796 150141 130890 69134 -25193 -87019 -56009
31607 -56009 36259 86274 66975 74564 155937 199851 120319 33636 82628 180873 138103 -25934
31595 -25934 -115633 -65972 13626 74177 165170 249058 229162 169487 227746 351539 319999
31584 319999 128135 29160 114931 164278 34939 -97566 -65083 10932 -25709 -75421 12680
31573 12680 148956 167625 121929 164623 258452 248955 136914 57625 56545 78511 113774 176075
31561 176075 200820 133763 57066 70856 121884 104528 50275 50266 67796 6428 -98114 -132583
$$ packed form
31641B6749j8283n4730m9045j4687O555J6640J7190k2516q0096o2340M5511J21972
31629f7080R0037L6695N1842P6821L3487k3646k2139j8196p5988j09564j3974
31618d1705J29623J51402M1315n5489n6350j8655j9251o1756r4327o1826L1010
31607e6009R2268N0015j9299P589Q1373M3914p9532q6683M8992R8245m2770j64037
31595b5934q9699M9661P9598O0551R0993Q3888j9896n9675N8259J23793l1540
31584C19999j91864r8975Q5771M9347j29339j32505L2483P6015l6641m9712Q8101
31573A2680J36276J8669m5696M2694R3829r497j12041p9289j080K1966L5263O2301
31561A76075K4745o7057p6697J3790N1028j7356n4253rJ7530o1368j04542l4469
$$ plain form
31549 -132583 -102192 -98236 -112608 -59194 46441 95897 66506 46159 87598 161162 232090
31538 232090 270914 223960 92118 -5563 29281 121981 140945 107286 137480 226231 255739
31527 255739 198625 145845 136888 119163 84483 95590 148682 137380 -5143 -213664 -358911
31516 -358911 -347907 -181341 15922 67730 -60671 -200193 -205506 -157454 -198088 -261558 -179280
31505 -179280 -3230 24191 -153270 -297753 -227690 -69027 -31957 -102310 -113107 -17746 72952
31494 72952 81652 47744 19762 -18374 -75873 -90643 -6364 112154 118567 -29132 -181060
31483 -181060 -162777 2650 131626 124733 54992 -2809 -84309 -210185 -289672 -259888 -208935
31472 -208935 -235170 -279415 -233015 -129957 -83536 -98139 -97740 -89095 -135457 -200322 -176386 -58953
$$ packed form
31549a32583L0391L956j4372N3414J05635M9456k9391k0347M1439P3564P0928
31538B32090L8824m6954j31842r7681L4844R2700J8964l3659L0194Q8751K9508
31527B55739n7114n2780q957j7725l4680J1107N3092j1302j42523k08521j45247
31516c58911J1004J66566J97263N1808j28401j39522n313M8052m0634o3470Q2278
31505a79280J76050K7421j77461j44483P0063J58663L7070p0353j0797R5361R0698
31494G2952Q700l3908k7982l8136n7499j4770Q4279J18518O413j47699j51928
31483a81060J8283J65427J28976o893o9741n7801q1500j25876p9487K9784N0953
31472b08935k6235m4245M6400J03058M6421j4603L99Q645m6362o4865K3936J17433
$$ plain form
31460 -58953 48359 87286 76790 21136 -74181 -123869 -50926 67893 95616 46268 35935
31449 35935 53360 -16904 -142136 -137786 33821 175863 154454 89358 133772 234960 255849
31438 255849 202638 178325 197579 190903 139490 85852 46305 10992 60 33167 66164 34353
31426 34353 -52696 -117339 -106658 -39862 24723 41244 7947 -35497 -54080 -55668 -55768 -23718
31414 -23718 77699 203634 247377 166061 30542 -65633 -95924 -87569 -72326 -70128 -82347
31403 -82347 -88980 -80951 -86450 -127592 -168792 -158137 -105471 -68768 -76920 -110585 -136453 -118658
31391 -118658 -35119 70121 103786 47174 -5906 1246 -3076 -66892 -88362 12063 103566
31380 103566 27245 -111460 -67479 158805 311639 267442 177887 171807 168722 93590 41558
$$ packed form
31460e8953J07312L8927j0496n5654r5317m9688P2943J18819K7723m9348j0333
31449C5935J7425p0264j25232M350J71607J42042k1409o5096M4414J01188K0889
31438B55849n3211k4313J9254o676n1413n3638l9547l5313j0932L3107L2997l1811
31426C4353q7049o4643J0681O6796O4585J6521l3297m3444j8583j588j00L2050
31414b3718J01417J25935M3743q1316j35519r6175l0291Q355J5243K198j2219
31403h2347o633Q029n499m1142m1200J0655N2666L6703q152l3665k5868J7795
31391a18658Q3539J05240L3665n6612n3080P152m322o3816k1470J00425R1503
31380A03566p6321j38705M3981K26284J52834m4197q9555o080l085p5132n2032
$$ plain form
31369 41558 77964 71353 -93386 -284003 -293799 -146658 -48627 -94482 -183914 -201677 -146053
31358 -146053 -80303 -49210 -45173 -9825 104538 246902 298471 223779 117219 63986 45470
31347 45470 27954 39550 90796 118729 88583 59547 73516 77484 41134 44245 139527 227273
31335 227273 192525 86378 37134 46760 18722 -54656 -78050 -13539 70378 110467 105014 60655
31323 60655 -18669 -86108 -83619 -26597 16776 28337 46300 71511 51031 -28140 -100254 -103366
31311 -103366 -49750 12004 66017 131195 214217 284766 298808 240333 135361 27242 -43640
31300 -43640 -32716 89211 270698 383170 359990 294652 312325 377621 348878 211609 115674
31289 115674 153061 236566 252591 208746 161408 111634 53690 29832 57721 87464 94179 119278
$$ packed form
31369D1558L6406o611j64739j90617r796J47141R8031m5855q9432j7763N5624
31358a46053O5750L1093M037L5348J14363J42364N1569p4692j06560n3233j8516
31347D5470j7516J1596N1246K7933l0146k9036J3969L968l6350L111R5282Q7746
31335B27273l4748j06147m9244R626k8038p3378k3394O4511Q3917M0089n453m4359
31323F0655p9324o7439K489N7022M3373J1561J7963K5211k0480p9171p2114l112
31311a03366N3616O1754N4013O5178Q3022P0549J4042n8475j04972j08119p0882
31300d3640J0924J21927J81487J12472k3180o5338J7673O5296k8743j37269r5935
31289A15674L7387Q3505J6025m3845m7338m9774n7944k3858K7889K9743O715K5099
$$ plain form
31277 119278 160113 131714 14825 -74929 -56559 -6649 -13691 -32570 -4018 5277 -67727 -119785
31265 -119785 -20923 160611 249158 221124 196633 211768 183810 95402 40696 71364 140929
31254 140929 215547 304501 368003 330898 213545 127584 115794 106746 47503 -29282 -87749
31243 -87749 -125998 -114843 -19184 95949 107428 21463 -6735 103070 233944 249135 180852
31232 180852 143337 147080 120354 64340 57964 111003 124215 34362 -76705 -78854 33955 132614
31220 132614 117388 35166 -3083 22745 33903 -18320 -93456 -141216 -164130 -174653 -161058
31209 -161058 -129813 -111833 -91356 -9669 115045 165999 94543 13423 32582 93129 79700
31198 79700 18221 22558 99677 158088 178631 221076 269002 228587 107391 47340 124805 232497
$$ packed form
31277A19278M0835k8399j16889q9754J8370M9910p042j8879K8552R295p3004n2058
31265a19785R8862J81534Q8547k8034k4491J5135k7958q8408n4706L0668O9565
31254A40929P4618Q8954O3502l7105j17353q5961j1790r048n9243p6785n8467
31243h7749l8249J1155R5659J15133J1479q5965k8198J09805J30874J5191o8283
31232A80852l7515L743k6726n6014o376N3039J3212q9853j11067k149J12809R8659
31220A32614j5226q2222l8249K5828J1158n2223p5136m7760k2914j0523J3595
31209a61058L1245J7980K0477Q1687J24714N0954p1456q1120J9159O0547j3429
31198G9700o1479M337P7119N8411K0543M2445M7926m0415j21196o0051P7465J07692
$$ plain form
31186 232497 220478 68742 -126039 -254996 -249644 -115184 39853 80793 3412 -50498 20727
31175 20727 144316 182303 117315 56677 82283 167427 238273 258169 232121 167862 72393
31164 72393 -18773 -50721 -12923 34680 39402 35271 86839 173561 213550 198397 199837 225236
31152 225236 191548 94434 70431 198298 356533 397145 359746 374138 433350 422618 322401
31141 322401 223382 167741 126064 114084 182949 295762 351692 333348 300014 243257 96804
31130 96804 -102871 -218696 -204918 -157326 -138344 -93452 5942 69269 13033 -115133 -204239
31119 -204239 -197075 -97927 53862 174445 178315 77619 -21128 -45807 -22854 -3690 -4895
31108 -4895 -33588 -88466 -118929 -66298 36810 89181 57833 12705 14336 48203 78694 87671
$$ packed form
31186B32497j2019j51736j94781j28957N352J34460J55037M0940p7381n3910P1225
31175B0727J23589L7987o4988o0638K5606Q5144P0846J9896k6048o4259r5469
31164G2393r1166l1948L7798M7603M722m131N1568Q6722L9989j5153J440K5399
31152B25236l3688r7114k4003J27867J58235M0612l7399J4392N9212j0732j00217
31141C22401r9019n5641m1677j1980O8865J12813N5930j8344l3334n6757j46453
31130I6804j99675j15825J3778M7592J8982M4892R9394O3327n6236j28166q9106
31119b04239P164R9148J51789J20583L870j00696r8747k4679K2953J9164j205
31108d895k8693n4878l0463N2631J03108N2371l1348m5128J631L3867L0491Q977
$$ plain form
31096 87671 57170 -4689 -28233 38948 132428 146552 88386 51172 65748 99110 159052 252008
31084 252008 278956 154644 3377 28235 192005 258217 164786 97769 140071 131326 -5395
31073 -5395 -76514 61017 231891 216695 99234 96808 194437 206302 103353 28739 42024
31062 42024 77265 123479 230747 343801 328672 184521 63463 55197 91926 88234 48777
31051 48777 12242 -6562 -948 14585 -21504 -140436 -251050 -224864 -70760 70056 103376
31040 103376 65036 23885 -4158 -27090 -39161 -39763 -44459 -66158 -112022 -182450 -244273 -240487
31028 -240487 -165840 -91371 -71922 -78148 -63164 -34711 -10869 22450 49317 5304 -98698
31017 -98698 -126417 2533 162737 181136 79719 19937 51820 72710 22340 -31151 -22926
$$ packed form
31096H7671l0501o1859k3544O7181R3480J4124n8166l7214J4576L3362N9942R2956
31084B52008K6948j24312j51267K4858J63770O6212r3431o7017M2302q745j36721
31073e395p1119J37531J70874j5196j17461k426R7629J1865j02949p4614J3285
31062D2024L5241M6214J07268J13054j5129j44151j21058q266L6729l692l9457
31051D8777l6535j8804N614J5533l6089j18932j10614K6186J54104J40816L3320
31040A03376l8340m1151k8043k2932j2071o02m696k1699m5864p0428o1823L786
31028b40487P4647P4469J9449o226J4984K8453K3842L3319K6867m4013j04002
31017i8698k7719J28950J60204J8399j01417n9782L1883K0890n0370n3491Q225
$$ plain form
31006 -22926 8916 -7856 -87540 -182861 -223203 -170005 -83515 -89516 -208337 -274316 -124959
30995 -124959 175985 411654 465663 388699 258256 112649 4490 -22812 -14851 -40243 -53856
30984 -53856 41352 203531 274430 207033 117616 81135 35303 -54121 -92028 -15250 72813
30973 72813 45136 -62300 -121835 -105817 -90940 -108642 -103092 -37333 43552 74301 44988 -651
30961 -651 -13507 23854 90740 147919 162811 120143 28313 -68931 -109289 -70820 -306 45099
30949 45099 63151 77158 68970 -389 -111030 -184326 -173298 -110332 -54671 -26758 -5286 35098
30937 35098 92782 136416 135875 96420 44775 -12571 -79626 -125412 -109779 -62420 -60350 -104312
30925 -104312 -103982 -23176 57488 79378 103021 183652 249278 212382 124321 99495 145826 187399
$$ packed form
31006b2926L1842j6772p9684r5321m0342N3198Q6490o001j18821o5979J49357
30995a24959L00944K35669N4009p6964j30443j45607j08159k7302P961k5392j3613
30984e3856R5208J62179P0899o7397q9417l6481m5832q9424l7907P6778Q8063
30973G2813k7677j07436n9535J6018J4877j7702N550O5759Q0885L0749k9313m5639
30961f51j2856L7361O6886N7179J4892m2668r1830r7244m0358L8469P0514M5405
30949D5099J8052J4007q188o9359j10641p3296J1028O2966N5661K7913K1472M0384
30937C5098N7684M3634n41l9455n1645n7346o7055m5786J5633M7359K070m3962
30925a04312L30Q0806Q0664K1890K3643Q0631O5626l6896q8061k4826M6331M1573
$$ plain form
30913 187399 203859 230752 264324 274747 270484 252427 170376 34709 -15025 102875 238730
30902 238730 199015 41952 -11929 80040 152590 131992 132140 214971 274375 231905 160595 130430
30890 130430 95280 19330 -33410 -22559 -9311 -30396 -25136 31683 53984 -11687 -85796 -84937
30878 -84937 -39919 -7019 23582 52984 28800 -38560 -37085 73309 167571 140976 71678 78890
30866 78890 124888 92490 -22082 -125044 -168991 -161855 -94924 18331 86536 42992 -37895
30855 -37895 -35494 45375 99141 74555 4883 -75050 -139545 -139299 -63784 -3141 -42790 -127194
30843 -127194 -138213 -81761 -71953 -133510 -147308 -24498 164277 277511 252425 132135 2265
30832 2265 -63894 -43275 14201 24954 -36474 -97979 -67186 51306 137972 82543 -75431
$$ packed form
30913A87399J6460K6893L3572J0423m263j8057q2051j35667m9734J17900J35855
30902B38730l9715j57063n3881R1969P2550k0598J48Q2831N9404m2470p1310l0165
30890A30430l5150p5950n2740J0851J3248k1085N260N6819K2301o5671p4109Q59
30878h4937M5018L2900L0601K9402k4184o7360J475J10394R4262k6595o9298P212
30866G8890M5998l2398j14572j02962m3947P136O6931J13255O8205m3544q0887
30855c7895K401Q0869N3766k4586o9672p9933o4495K46P5515O0643l9649q4404
30843a27194j1019N6452R808o1557j3798J22810J88775J13234k5086j20290j29870
30832B265o6159K0619N7476J0753o1428o1505L0793J18492Q6666n5429j57974
$$ plain form
30821 -75431 -170739 -102463 44756 119004 92446 50662 26102 -38331 -153626 -234323 -223000
30810 -223000 -163160 -103784 -29135 64059 114679 87652 37150 18781 12646 -12112 -34908 -40785
30798 -40785 -58402 -86021 -67294 -823 19119 -59740 -160110 -193486 -168054 -106915 25289
30787 25289 215563 334157 293103 180195 116908 80391 -595 -73026 -47809 13796 -19553
30776 -19553 -126321 -163892 -98493 -30899 551 70012 196707 284330 270178 207661 159104
30765 159104 118037 78547 80734 139915 206245 228931 201058 130874 34879 -38706 -49717 -27539
30753 -27539 -26264 -34250 -4230 50524 79846 92311 127101 155438 126032 89394 142345 250728
30741 250728 273739 187117 133300 199283 283103 255752 140314 45984 18323 40230 100916
$$ packed form
30821g5431r5308O8276J47219P4248k6558m1784k4560o4433j15295q0697J1323
30810b23000N9840N9376P4649R3194N0620k7027n0502j8369o135k4758k2796n877
30798d0785j7617k7619J8727O6471J9942p8859j00370l3376K5432O1139J32204
30787B5289J90274J18594m1054j12908o3287l6517q0986p2431K5217O1605l3349
30776a9553j06768l7571O5399O7594L1450O9461J26695Q7623j4152o2517m8557
30765A59104m1067l9490K187N9181O6330K2686k7873p0184r5995p3585j1011K2178
30753b7539J275p986L0020N4754K9322J2465L4790K8337k9406l6638N2951J08383
30741B50728K3011q6622n3817O5983Q3820k7351j15438r4330k7661K1907O0686
$$ plain form
30730 100916 173235 183818 96909 -9025 -25648 47112 107747 79336 -20603 -122191 -173659
30719 -173659 -173910 -157263 -145292 -120261 -65522 -9863 15627 44146 124281 211099 197910 77850
30707 77850 -20596 -6740 49918 40836 -10346 3531 88776 125130 39942 -80703 -106793 -38233
30695 -38233 5417 -43149 -111291 -101717 -35454 -11148 -50627 -73828 -35659 867 -34258 -118232
30683 -118232 -183761 -200631 -160721 -55755 67288 105016 32532 -30676 18781 112534 125480
30672 125480 79724 94915 178409 221735 195915 190337 233867 227245 108432 -36476 -94442
30661 -94442 -66410 -27156 -19077 -40627 -81006 -120428 -138834 -147986 -173848 -206363 -218535 -218264
30649 -218264 -209500 -131298 57547 248946 272325 124177 -21440 -57031 -51956 -70763 -40013
$$ packed form
30730A00916P2319J0583q6909j05934j6623P2760O0635k8411r9939j01588n1468
30719a73659k51J6647J1971K5031N4739N5659K5490K8519Q0135Q6818j3189j20060
30707G7850r8446J3856N6658r082n1182J3877Q5245L6354q5188j20645k6090O8560
30695c8233M3650m8566o8142R574O6263K4306l9479k3201L8169L6526l5125q3974
30683a18232o5529j6870L9910J04966J23043L7728p2484o3208M9457R3753J2946
30672A25480m5756J5191Q3494M3326k5820n578M3530o622j18813j44908n7966
30661i4442K8032L9254Q079k1550m0379l9422j8406r152k5862l2515j2172K71
30649b18264Q764P8202J88845J91399K3379j48148j45617l5591N075j8807L0750
$$ plain form
30638 -40013 101569 247763 253211 142060 63335 80888 118271 93760 18352 -43140 -50148
$$ packed form
30638d0013J41582J46194N448j11151p8725J7553L7383k4511p5408o1492p008
$$ [...]
##END NTUPLES=NMR SPECTRUM
##END=
