##TITLE=31Pdec_LY-7.1.Dix.1.B
 CD3CN, 24 sc
 5.04.2021
##JCAMPDX= 6.0         $$ Bruker NMR JCAMP-DX V2.0
##DATA TYPE= NMR SPECTRUM
##DATA CLASS= NTUPLES
##ORIGIN= UXNMR, Bruker Analytische Messtechnik GmbH
##OWNER= root
$$ XWIN-NMR		Version 3.5
$$ Mon Apr  5 11:38:59 2021 Russian Standard Time (UT+4h)  she@DPX200
##.OBSERVE FREQUENCY= 81.013821
##.OBSERVE NUCLEUS= ^31P
##.ACQUISITION MODE= SIMULTANEOUS
##.ACQUISITION SCHEME= undefined
##.AVERAGES= 24
##.DIGITISER RES= 16
##SPECTROMETER/DATA SYSTEM= spect
##.PULSE SEQUENCE= zgpg30
##.SOLVENT NAME= CDCl3
##.SHIFT REFERENCE= (INTERNAL, CDCl3, 0, 248.564)
##AUDIT TRAIL= $$ (NUMBER, WHEN, WHO, WHERE, WHAT)
$$ ##TITLE= Audit trail, XWIN-NMR		Version 3.5
$$ ##JCAMPDX= 5.01
$$ ##ORIGIN= Bruker BioSpin GmbH
$$ ##OWNER= she
$$ F:/spectra/data/she/nmr/P31/1/pdata/1/auditp.txt
$$ ##AUDIT TRAIL=  $$ (NUMBER, WHEN, WHO, WHERE, WHAT)
(   1,<2021-04-05 11:37:16.51 +0400>,<she>,<DPX200>,
      <created by zg, POWCHK disabled, PULCHK disabled
       configuration hash MD5:
       00 E9 B6 7A A2 85 ED C7 34 08 36 98 17 FE 4E 26
       data hash MD5: 32K
       DD B7 A3 6F 76 F4 D3 22 42 B1 68 30 D5 6D 40 F9>)
(   2,<2021-04-05 11:37:35.89 +0400>,<she>,<DPX200>,
      <Start of raw data processing
       efp BC_mod = 2 LB = 1 FT_mod = 6 PKNL = 1 PHC0 = -4462.108 PHC1 = 283.0011 SI = 64K 
       data hash MD5: 64K
       E6 D1 F8 7C 58 BA B3 1A 26 28 37 48 B0 82 65 AC>)
(   3,<2021-04-05 11:38:13.48 +0400>,<she>,<DPX200>,
      <pk PHC0 = -47.73438 PHC1 = -38.4 
       data hash MD5: 64K
       1B AB 1D D9 62 D9 B5 92 69 E0 0A E8 FD 93 84 FB>)
(   4,<2021-04-05 11:38:17.51 +0400>,<she>,<DPX200>,
      <abs ABSG = 5 
       data hash MD5: 64K
       90 31 8F 90 04 2E C5 E7 F3 2B 01 3C 5F 15 4B F5>)
$$ ##END=
$$ 
$$ hash MD5
$$ 3F 5E AA FB 40 7E EF C6 26 55 F2 AA 66 54 36 35
##$RELAX= 
##$RELAX= 
##$RELAX= 
##$RELAX= 
##$RELAX= 
##$RELAX= 
##$RELAX= 
##$RELAX= 
$$ Bruker specific parameters
$$ --------------------------
##$DU= <F:/spectra>
##$EXPNO= 1
##$NAME= <P31>
##$PROCNO= 1
##$TYPE= <nmr>
##$USER= <she>
##$AMP= (0..31)
100 100 100 100 100 100 100 100 100 100 100 100 100 100 100 100 100 100 
100 100 100 100 100 100 100 100 100 100 100 100 100 100 
##$AQSEQ= 0
##$AQ_mod= 1
##$AUNM= <au_zg>
##$AUTOPOS= <>
##$BF1= 81.014009
##$BF2= 200.13
##$BF3= 200.13
##$BF4= 200.13
##$BF5= 200.13
##$BF6= 200.13
##$BF7= 200.13
##$BF8= 200.13
##$BYTORDA= 1
##$CFDGTYP= 0
##$CFRGTYP= 5
##$CHEMSTR= <none>
##$CNST= (0..31)
1 1 145 1 1 1 1 1 1 1 1 1 1 1 1 1 1 1 1 1 1 1 1 1 1 1 1 1 1 1 1 1 
##$CPDPRG= <waltz16>
##$CPDPRG1= <>
##$CPDPRG2= <waltz16>
##$CPDPRG3= <>
##$CPDPRG4= <mlev>
##$CPDPRG5= <mlev>
##$CPDPRG6= <mlev>
##$CPDPRG7= <mlev>
##$CPDPRG8= <mlev>
##$CPDPRGB= <>
##$CPDPRGT= <>
##$D= (0..31)
0 1 0 0 0 0 0 0 0 0 0 0.03 2e-05 3e-06 0 0 0 0 0 0 0 0 0 0 0 0 0 0 0 0 
0 0 
##$DATE= 1617608235
##$DBL= (0..7)
120 120 120 11 120 120 24 19 
##$DBP= (0..7)
150 150 150 150 150 150 150 150 
##$DBP07= 0
##$DBPNAM0= <>
##$DBPNAM1= <>
$$ [...]
##$SUBNAM3= <"">
##$SUBNAM4= <"">
##$SUBNAM5= <"">
##$SUBNAM6= <"">
##$SUBNAM7= <"">
##$SUBNAM8= <"">
##$SUBNAM9= <"">
##$SW= 501.771253377433
##$SWIBOX= (0..15)
0 1 3 0 0 0 0 0 0 0 0 0 0 0 0 0 
##$SW_h= 40650.406504065
##$TD= 32768
##$TD0= 1
##$TE= 0
##$TE2= 300
##$TE3= 300
##$TEG= 300
##$TL= (0..7)
0 120 53 12 22 120 120 120 
##$TP= (0..7)
150 150 150 150 150 150 150 150 
##$TP07= 0
##$TPNAME0= <>
##$TPNAME1= <>
##$TPNAME2= <>
##$TPNAME3= <>
##$TPNAME4= <>
##$TPNAME5= <>
##$TPNAME6= <>
##$TPNAME7= <>
##$TPOAL= (0..7)
0.5 0.5 0.5 0.5 0.5 0.5 0.5 0.5 
##$TPOFFS= (0..7)
0 0 0 0 0 0 0 0 
##$TUNHIN= 0
##$TUNHOUT= 0
##$TUNXOUT= 0
##$USERA1= <user>
##$USERA2= <user>
##$USERA3= <user>
##$USERA4= <user>
##$USERA5= <user>
##$V9= 5
##$VALIST= <valist>
##$VCLIST= <CCCCCCCCCCCCCCC>
##$VD= 0
##$VDLIST= <DDDDDDDDDDDDDDD>
##$VPLIST= <PPPPPPPPPPPPPPP>
##$VTLIST= <TTTTTTTTTTTTTTT>
##$WBST= 1024
##$WBSW= 4
##$XGAIN= (0..3)
0 0 0 0 
##$XL= 0
##$YL= 0
##$YMAX_a= 3311
##$YMIN_a= -5375
##$ZGOPTNS= <>
##$ZL1= 120
##$ZL2= 120
##$ZL3= 120
##$ZL4= 120
##$ABSF1= 248.5645
##$ABSF2= -253.2056
##$ABSG= 5
##$ABSL= 3
##$ALPHA= 0
##$AQORDER= 0
##$ASSFAC= 0
##$ASSFACI= 0
##$ASSFACX= 0
##$ASSWID= 0
##$AUNMP= <proc_1d>
##$AZFE= 0.1
##$AZFW= 0.5
##$BCFW= 0
##$BC_mod= 2
##$BYTORDP= 0
##$COROFFS= 0
##$CY= -3
##$DATMOD= 1
##$DC= 0
##$DFILT= <>
##$DTYPP= 0
##$F1P= 0
##$F2P= 0
##$FCOR= 1
##$FTSIZE= 65536
##$FT_mod= 6
##$GAMMA= 0
##$GB= 0
##$INTBC= 1
##$INTSCL= 5.30512e-09
##$ISEN= 30
##$LB= 1
##$LEV0= 0
##$LPBIN= 0
##$MAXI= 10000
##$MC2= 0
##$MEAN= 0
##$ME_mod= 0
##$MI= 50
##$NCOEF= 0
##$NC_proc= -5
##$NLEV= 6
##$NOISF1= 182.463
##$NOISF2= 159.3651
##$NSP= 0
##$NTH_PI= 0
##$NZP= 0
##$OFFSET= 248.5645
##$PC= 4
##$PHC0= -4509.842
##$PHC1= 244.6011
##$PH_mod= 1
##$PKNL= yes
##$PPARMOD= 0
##$PSCAL= 0
##$PSIGN= 0
##$REVERSE= no
##$SF= 81.014009
##$SI= 65536
##$SIGF1= 159.3651
##$SIGF2= -187.1042
##$SINO= 113.3802
##$SIOLD= 16384
##$SREGLST= <1H.CDCl3>
##$SSB= 0
##$STSI= 65536
##$STSR= 0
##$SW_p= 40650.406504065
##$SYMM= 0
##$S_DEV= 0
##$TDeff= 32768
##$TDoff= 0
##$TI= <>
##$TILT= no
##$TM1= 0
##$TM2= 0
##$TOPLEV= 0
##$USERP1= <user>
##$USERP2= <user>
##$USERP3= <user>
##$USERP4= <user>
##$USERP5= <user>
##$WDW= 1
##$XDIM= 65536
##$YMAX_p= 316572782
##$YMIN_p= -7961775
$$ End of Bruker specific parameters
$$ ---------------------------------
##NTUPLES= NMR SPECTRUM
##VAR_NAME=  FREQUENCY,     SPECTRUM/REAL,   SPECTRUM/IMAG
##SYMBOL=    X,             R,               I
##VAR_TYPE=  INDEPENDENT,   DEPENDENT,       DEPENDENT
##VAR_FORM=  AFFN,          ASDF,            ASDF
##VAR_DIM=   65536,         65536,           65536
##UNITS=     HZ,            ARBITRARY UNITS, ARBITRARY UNITS
##FACTOR=    0.620285442955139, 1,           1
##FIRST=     20137.2065510759, 0,            0
##LAST=      -20513.1999529892, 0,           0
##MIN=       -20513.1999529892, -7961775,    0
##MAX=       20137.2065510759, 316572782,    0
$$ Real data points
##PAGE= N=1
##DATA TABLE= (X++(R..R)), XYDATA
$$ [...]
37734 1705105 821855 -519837 -557931 1096275 2774372 2987477 2007407 597506 -1253271
37725 -1253271 -3217263 -3748507 -2000179 295080 604857 -1208192 -3006378 -3299444 -2466566
37716 -2466566 -1316965 -189777 352885 -381860 -1873761 -2484695 -1551289 -260862 172974
37707 172974 31116 -33345 -442389 -1718230 -2857764 -2271810 -174127 1448931 1489888
37698 1489888 1001309 1248080 1706891 1097363 -379579 -1224158 -852116 -260090 -257062 -322101
37688 -322101 150894 589255 211170 -531475 -644195 -251106 -345453 -1085977 -1553482 -1228766
37678 -1228766 -583821 -58906 458089 884732 750770 148409 -77210 471482 1191732
37669 1191732 1485656 1425038 1049944 144 -1629951 -2962371 -3359533 -2932534 -1738197
37660 -1738197 337127 2425637 2852103 1351582 -177840 -164269 638247 761826 311568
37651 311568 191987 206659 -401671 -1369910 -1959533 -2272427 -2506640 -1922787 -355485 330359
37641 330359 -1437153 -3980661 -4314875 -2556937 -1603477 -2519184 -3260503 -2447066 -1410300
37632 -1410300 -1460832 -1820456 -1630318 -1593201 -2055350 -1687109 120555 1543447 1022349
37623 1022349 -72507 308712 1462936 1245325 -208424 -725275 347219 1369110 1341061
37614 1341061 1343815 2390786 3606670 3553555 2340783 1457629 1868625 2857316 2835057 1251931
37604 1251931 -540013 -858224 38838 316003 -644030 -1278414 -377998 980216 1264960
37595 1264960 831891 813214 879467 71784 -1002733 -967905 -185228 -269563 -1253022 -1394779
37585 -1394779 2336 1572397 2045981 1661666 1048818 394471 126464 770753 1680694
37576 1680694 1510670 363637 -198006 332776 749708 507027 666559 1633275 2117049
37567 2117049 1573925 1511641 2686841 3048461 732602 -2428802 -2986479 -649363 1494196
37558 1494196 1231176 -519188 -1743001 -1701760 -951316 -436362 -828372 -1738230 -1724675
37549 -1724675 -118881 1633213 1775842 823930 639811 1348703 1229903 -293431 -1666870
37540 -1666870 -1665407 -955978 -561858 -473676 -510679 -950803 -1497721 -1163282 -46124 314839
37530 314839 -646730 -1325482 -407698 921147 770309 -596286 -1345677 -743775 308306
37521 308306 860142 692373 4404 -525914 17080 1404312 1970972 943655 -7539
37512 -7539 830498 2352507 2326078 1127774 1144785 2651867 3132146 1255602 -1094013
37503 -1094013 -1834021 -1455869 -1410676 -1650536 -1401474 -892175 -657513 -279491 628774 1230651
37493 1230651 796718 213746 488530 698721 -550615 -2238945 -1805190 1019514 3405510
37484 3405510 3084724 1077687 -158794 74455 594255 544194 347915 550075 761977
37475 761977 236352 -900288 -1564216 -1067620 -190509 -317620 -1559607 -2508423 -2109210
37466 -2109210 -906682 105035 944347 2036957 2927892 2821876 1969393 1278191 831726
37457 831726 75213 -704539 -507741 683455 1717801 2033967 2251772 2614481 2261533
37448 2261533 806025 -573853 -615448 278634 696289 22802 -1182922 -2072419 -2064602
37439 -2064602 -1049188 275030 748254 94905 -541764 -48453 1142612 1661782 921142
37430 921142 -430189 -1409864 -1457481 -662819 163988 28320 -1072672 -1929029 -1621392
37421 -1621392 -695179 -181326 -120257 15694 57364 -475319 -1075282 -682838 617277 1608059
37411 1608059 1766407 1795155 2032547 1684773 351926 -824301 -568132 687395 1404680
37402 1404680 973751 154899 -299374 -484723 -731753 -988965 -1115668 -1198842 -1229010 -890091
37392 -890091 -37115 937445 1585042 1969528 2307582 2277364 1341512 -202365 -1182978 -895610
37382 -895610 59828 704100 908614 1074449 1053662 332074 -823952 -1368699 -817053 192242
37372 192242 883619 1140796 1088409 715183 284196 288822 541674 176229 -868353 -1321782
37362 -1321782 -379208 886275 1013970 303862 136905 666132 726086 -72017 -673719
37353 -673719 -272412 574369 883437 294707 -1069509 -2758994 -3748700 -3146491 -1538605
37344 -1538605 -566866 -779667 -1091928 -866451 -1072929 -2395115 -3550473 -2969840 -1219849
37335 -1219849 -127438 -96098 -27485 405720 350227 -181770 169341 1716388 2518924 923510
37325 923510 -1805837 -2968185 -1949582 -639156 -451498 -626873 -13124 931639 1039933
37316 1039933 433452 232679 581297 389372 -708277 -1435854 -672141 786814 1333369
37307 1333369 882196 851915 1876001 2773933 2240838 612365 -734888 -1105588 -861694
37298 -861694 -502497 -201773 -137439 -506612 -1054012 -1116000 -361212 807758 1681344 1792083
37288 1792083 1040828 -306400 -1599546 -2142608 -1779935 -924311 94700 1331082 2645779
37279 2645779 3293699 2654975 1227235 306260 588150 1529251 2201961 2293748 1981547
37270 1981547 1299123 206267 -880526 -1245822 -742204 -131909 -308918 -1320307 -2320185
37261 -2320185 -2446153 -1686946 -901222 -917220 -1574433 -1857851 -1145827 -29087 488433
37252 488433 318901 182891 283758 -58042 -1185083 -2313610 -2521576 -1961474 -1462066
37243 -1462066 -1367035 -1470579 -1744215 -2252645 -2458914 -1558880 228377 1437916 912936
37234 912936 -791454 -1980654 -1638415 -382731 334127 -224302 -1405825 -2031264 -1775067
37225 -1775067 -1379804 -1470891 -1676079 -1292409 -358651 561972 1343655 2224404 2864812 2418117
37215 2418117 815687 -784249 -1277035 -779141 -90603 436989 885930 1061149 607044
37206 607044 -220709 -617331 -268132 178342 -32328 -792985 -1379694 -1397121 -1012096 -387746
37196 -387746 449216 1002092 333770 -1598515 -3124520 -2420263 115041 2074182 1931896
37187 1931896 697879 94151 117559 -462042 -1783411 -2470619 -1618743 -134337 356899
37178 356899 -594378 -1838992 -1970144 -989204 -488298 -1742052 -3705350 -3914044 -1774543
37169 -1774543 305371 74634 -1468821 -1697845 -170453 1133154 942236 -53923 -1032980
37160 -1032980 -1914540 -2085179 -503307 2115767 3274105 1963651 178251 -39614 675280
37151 675280 652776 -95958 -540848 -662768 -923547 -736690 583289 2064823 2157826 1087862
37141 1087862 426118 761288 1456863 2246967 3276813 3867054 3082670 1468551 557018
37132 557018 705297 983721 1013400 1184118 1208611 383491 -683498 -581936 520495 1055027
37122 1055027 841593 1417295 3036460 3796835 2801740 1813323 2238293 2641418 1261590
37113 1261590 -739999 -901115 760488 1930384 1442340 427128 154691 560129 1085773
37104 1085773 1550777 1875587 1900008 1628846 1075477 144997 -740239 -572019 783967
37095 783967 1806647 1177503 -260643 -769001 -297075 -149821 -518939 -300933 612510
37086 612510 866496 -35450 -725721 -118325 915642 1035449 436650 248734 726508
37077 726508 1137390 1009406 602967 383904 656458 1496482 2570008 3217881 3047867
37068 3047867 2252453 1247674 385610 49205 411883 963143 971663 618546 840220 1700473
37058 1700473 1893715 580421 -1118472 -1474835 -514218 88631 -619196 -1656047 -1598819
37049 -1598819 -530238 183015 -155879 -583317 131065 1526681 1818806 414660 -1004313
37040 -1004313 -740976 489319 710721 -365208 -1269837 -1409398 -1720326 -2424356 -2334257
37031 -2334257 -1253733 -908811 -2108067 -2987735 -1942694 -487904 -814727 -1966262 -1390741
37022 -1390741 520564 766167 -1328187 -2777757 -1481842 741865 1190886 78768
37014 78768 -555622 -86649 513123 669905 557567 39787 -1179307 -2609510 -3304591
37005 -3304591 -2922017 -1770863 -350829 543848 138325 -1075092 -1373811 -104084 1107699
36996 1107699 729269 -171574 454795 2282263 2950383 1556699 -239356 -839530 -563748
36987 -563748 -338867 -214409 -57791 -383025 -1404365 -2155868 -1609592 -181432 710668
36978 710668 311374 -836749 -1697271 -1725094 -1169923 -668782 -522925 -451306 -201442 -47324
36968 -47324 -210595 -191038 539674 1438855 1442615 527949 -272111 -410398 -298971 -159544
36958 -159544 338565 929437 543805 -987839 -2063215 -1117149 1301922 3098086 2899164
36949 2899164 1186097 -456043 -727780 398085 1734896 2228881 2243318 2850387 3927031
36940 3927031 4093482 2843892 1484162 1277126 1780964 1901657 1607889 1582938 1949282
36931 1949282 2335682 2557271 2343345 1129642 -921220 -2454347 -2533857 -1989728 -2050054
36922 -2050054 -2430485 -2115812 -1305576 -992436 -1102533 -761231 -149502 -323496 -1183234
36913 -1183234 -1390715 -584037 4210 -384466 -920893 -801790 -507732 -573706 -414341 489749
36903 489749 1215062 476382 -1443631 -2971493 -3207065 -2691850 -2306230 -2178057 -1813626
36894 -1813626 -850293 461095 1352340 1171217 69246 -1042668 -1351388 -877657 -328326
36885 -328326 -338846 -872267 -1281789 -1029536 -363682 -40937 -331497 -736435 -833456 -768325
36875 -768325 -591027 74253 1082033 1378143 521116 -218866 447062 1665599 1494629
36866 1494629 -246737 -1842541 -2300303 -2351379 -2595220 -2384964 -1200513 280940 1191817
36857 1191817 1418467 1048349 104370 -680737 -192926 1305903 2107538 1480278 732023
36848 732023 959614 1297301 720066 166731 1104337 2905690 3535837 2456940 1165928
36839 1165928 901495 1245295 1192070 543372 -65588 36653 777201 1101518 -39701
36830 -39701 -2124740 -3268328 -2605185 -1519999 -1565446 -2133853 -1555358 190857 1432860
36821 1432860 1174629 63080 -888241 -1212519 -693092 530676 1492544 1242251 270021
36812 270021 -33914 584060 926863 233797 -811735 -1275823 -1085893 -579941 37412
36803 37412 368826 -86893 -1025491 -1360434 -662782 174696 208599 -332069 -625572 -403698
36793 -403698 103755 871668 2038672 3336898 4043107 3550227 1955055 214380 -462651
36784 -462651 212413 1204400 1445116 1265611 1725748 2705467 2851043 1660289 388256
36775 388256 213229 555255 200896 -666115 -787521 126201 925054 773971 361284 809684
36765 809684 1993057 2606548 1707130 -356345 -2474060 -3668928 -3378533 -1562734 905096
36756 905096 2429296 2137430 1067431 1094049 2586473 3980215 3871379 2557116 1069991
36747 1069991 -243331 -1386222 -1914718 -1584125 -1156336 -1421252 -1865468 -1449492 -343980
36738 -343980 301811 89461 -327498 -525567 -671489 -647364 -83370 609594 458607 -549508
36728 -549508 -1253817 -930710 -125381 409044 624526 722532 717779 767143 1072951 1254176
36718 1254176 741760 -62990 -133306 449326 340742 -1059863 -2661129 -3272892 -2940312
36709 -2940312 -2063696 -506667 1449751 2420486 1454754 -432176 -1404875 -1001319 -195456
36700 -195456 288431 688198 1389662 2237941 2734754 2542828 1872274 1447213 1700419 2002189
36690 2002189 1371777 -5534 -908566 -892226 -836327 -1332181 -1791643 -1743964 -1685777 -1846901
36680 -1846901 -1499379 -534232 -290703 -1424361 -2301292 -1290649 447164 559677 -832666
36671 -832666 -1380777 -198037 1022899 880869 104849 -176168 -115364 -79669 531895 2083951
36661 2083951 3400511 3074934 1528024 507331 731453 1089287 297144 -1409977 -2569245
36652 -2569245 -2138767 -603558 518989 225873 -948563 -1544854 -792558 581984 1254880
36643 1254880 827996 193641 349916 1162710 1676142 1525623 1376113 1696055 1868655
36634 1868655 1240615 402790 349059 784394 577585 -318354 -907048 -1078729 -1718537 -2590217
36624 -2590217 -2137365 -218193 982182 80267 -1296421 -1055339 271968 911076 815572
36615 815572 989532 1060312 106955 -895955 -211278 1458578 1695082 312604 -214696
36606 -214696 1253431 2773497 2477138 1140182 419358 472505 584896 572045 409682
36597 409682 -167216 -777126 -500524 353860 215706 -1124697 -1678285 -285554 1287090
36588 1287090 893216 -857204 -1852888 -1703519 -1718033 -2370537 -2688254 -1926135 -408080
36579 -408080 1093509 1743758 901878 -904759 -1846472 -797394 1098196 1982766 1668340
36570 1668340 1187904 812430 147787 -429109 -255356 66498 -538286 -1478595 -1133349
36561 -1133349 328083 868028 -208007 -1024732 -74819 1401053 1327757 -196401 -1304583
36552 -1304583 -1000890 24671 841022 1274592 1506945 1660937 1939514 2497070 2986219
36543 2986219 2707966 1439429 -132855 -991087 -759047 -44569 236035 -115604 -417611
36534 -417611 -128051 285302 -41885 -1075723 -1858557 -1814557 -1375819 -1068035 -697918 31395
36524 31395 687055 647341 168884 83784 493387 647876 342105 487508 1617815 2585207
36514 2585207 1885214 5489 -883527 166524 1608518 1731566 1019430 993634 1726160
36505 1726160 2157899 2265927 2881916 3415853 2004157 -1384536 -4011996 -3744821 -1742755
36496 -1742755 -378688 53634 772172 1767363 1774951 595960 -488059 -645831 -299884
36487 -299884 40207 347821 433856 62930 -229397 277788 1096082 1102780 489273 509234
36477 509234 1107047 657700 -1288001 -2800381 -2211703 -506346 232019 -348014 -962461
36468 -962461 -813829 -222523 397214 947212 1262346 1299674 1474279 1956936 1972910 757038
36458 757038 -1019843 -1788006 -1035218 167022 712229 729144 985940 1608324 1908525
36449 1908525 1409761 691826 868527 2092603 3027743 2424134 911329 234818 785847
36440 785847 1219789 832781 719620 1668016 2483983 1939782 1120816 1827678 3414880
36431 3414880 3513175 1721766 231532 370795 775674 -25468 -1130477 -821157 720330
36422 720330 1807770 1595312 688325 -62289 -225726 311853 1067416 965781 -379931
36413 -379931 -1752827 -1683845 -388059 646054 672424 205325 -204741 -499191 -531636 -214468
36403 -214468 -231583 -1249200 -2288483 -1440504 1290775 3425603 3195152 1856933 1538046
36394 1538046 2004033 1377398 -568840 -1855578 -1180855 322748 797149 -97537 -1335807
36385 -1335807 -2010351 -1937962 -1421598 -1073119 -1439043 -2295654 -2724046 -2288835 -1630260 -1418241
36375 -1418241 -1323137 -742018 -54713 -183739 -1035398 -1362498 -423128 979257 1537966
36366 1537966 1012584 244853 -110504 -275230 -690107 -1146925 -1021390 -299824 152837
36357 152837 -291036 -994158 -809246 186247 544765 -588557 -2119674 -2339222 -1125152
36348 -1125152 95745 400064 396931 1027439 2184102 2982904 2863367 1935109 591897
36339 591897 -720355 -1511650 -1480613 -838153 -230057 -233442 -853329 -1453972 -1332054 -554679
36329 -554679 -68675 -658415 -1926829 -2719881 -2448589 -1466650 -229647 1157036 2379739
36320 2379739 2741144 2088294 1337075 1426562 2110769 2398210 1918632 1228235 915777 1004523
36310 1004523 1184522 1121289 579059 -282412 -799370 -499626 151090 263135 -232419 -512624
36300 -512624 -161526 169127 -228767 -1015698 -1249032 -631355 170061 329471 -332738 -1228178
36290 -1228178 -1452470 -552086 903771 1701383 1181643 -113494 -1164746 -1506195 -1240809
36281 -1240809 -480591 622604 1537176 1747517 1454509 1253473 1151704 650319 -125987
36272 -125987 -285847 466384 1175501 958286 255267 -9179 141578 142787 188028 800672
36262 800672 1302179 277286 -2035552 -3269969 -1748304 1267219 3165760 3015870 1867311
36253 1867311 738021 -209936 -736895 -373781 472127 570717 -407541 -1266610 -992030
36244 -992030 -107158 410707 614485 990524 1198954 724515 287145 1053646 2461358
36235 2461358 2427023 262946 -1977503 -2011090 -205799 1183754 1030898 293038 136517
36226 136517 394901 242648 -502682 -1289413 -1565921 -1237177 -707048 -610049 -1098713 -1373836
36216 -1373836 -561148 843338 1289844 324181 -579175 -114051 869933 673610 -659943
36207 -659943 -1603554 -1662643 -1829363 -2360737 -2037652 -431813 855777 524050 -309583
36198 -309583 37205 1014851 950077 201875 748116 2630633 3375380 1782509 21736
36189 21736 469426 2228935 2716285 1523876 532810 714667 1046133 740838 534785
36180 534785 1048542 1473720 899914 -197015 -843061 -1044436 -1261685 -1147888 -167948
36171 -167948 898869 584077 -982341 -1779060 -491302 1652957 2495748 1645029 517293
36162 517293 107561 -62152 -655410 -1285195 -1173928 -419663 94282 -178385 -935058 -1505862
36152 -1505862 -1418662 -586854 619751 1478975 1478226 874241 442921 634254 1211672 1713045
36142 1713045 1942777 1924872 1663835 1120272 293552 -694021 -1449264 -1385056 -337162 915376
36132 915376 1240368 417765 -630526 -1063079 -1041948 -1072333 -969107 -168806 1162288 2075268
36122 2075268 1998314 1415438 1164643 1391306 1448563 731853 -507986 -1226453 -615417 873252
36112 873252 1859407 1621584 939807 899217 1307978 1136959 315476 -18309 703175 1524162
36102 1524162 1420641 827529 802865 1273284 1216379 353224 -460053 -610363 -465418 -413676
36092 -413676 -106911 733476 1454927 1213402 227844 -461003 -380735 -115309 -336517 -892919
36082 -892919 -1092405 -580172 274245 730945 363467 -470603 -876797 -367723 464394 521740
36072 521740 -498221 -1709488 -2114115 -1764644 -1544767 -1971444 -2606371 -2685503 -1995767
36063 -1995767 -935237 85548 990081 1784732 2268358 2218270 1737580 1148907 556551
36054 556551 -199395 -1079863 -1667406 -1686228 -1433056 -1329717 -1227018 -651034 247220 560378
36044 560378 -226213 -1352474 -1597615 -893336 -540599 -1537776 -3093404 -3358733 -1623644
36035 -1623644 760031 1906460 1396531 289931 -475322 -895802 -1165123 -1079943 -609078
36026 -609078 -294423 -426387 -381486 437448 1412334 1380596 311040 -654964 -875099 -958243
36016 -958243 -1561073 -2290656 -2344611 -1697246 -1100643 -1166229 -1785785 -2282932 -2018943 -1114808
36006 -1114808 -550184 -1089602 -2129637 -2249904 -1016562 476476 1097974 963732 858076
35997 858076 1094699 1469474 1743850 1634457 857054 -283431 -860731 -429082 339194
35988 339194 648277 655669 931977 1389330 1495346 1160300 715053 351388 184250 422339
35978 422339 843951 655999 -349204 -1065404 -443055 898456 1486691 1043208 568070
35969 568070 620346 710938 361209 -324431 -1129517 -1760948 -1539130 -190459 1171318 1175831
35959 1175831 290693 260337 1253022 1344546 -424543 -2201078 -1843138 -11406 894484
35950 894484 152165 -670463 -361761 331771 231468 -370721 -244600 897283 1971313
35941 1971313 1975988 1182655 558467 471780 527368 464610 495333 688677 774795 803244 1201664
35930 1201664 1796056 1678192 655181 -154113 -50237 -50295 -1209163 -2588709 -2547517 -1398359
35920 -1398359 -873785 -1256423 -1106741 70014 989747 919858 882465 1686123 2431128 2004236
35910 2004236 733670 -417691 -1163660 -1519127 -1191862 -225122 656995 1035084 1236527
35901 1236527 1337051 850466 -79989 -421307 230961 1085384 1568258 1913889 1940191 965891
35891 965891 -464410 -743315 88545 -28468 -1717422 -2751105 -1712620 -596196 -1523823
35882 -1523823 -3140474 -3055590 -1971805 -2149063 -3115183 -2433391 -89724 1372827 1052339
35873 1052339 793534 1735406 2673651 2547833 2039321 1870168 1625556 1045408 710067
35864 710067 868473 1147105 1616001 2461520 2690241 1235760 -669751 -621012 1248022
35855 1248022 2224185 1147131 -116628 -139966 -80605 -998429 -1579450 -381906 1591800
35846 1591800 2410936 1821172 770101 -292698 -1200521 -1439600 -1045916 -923726 -1220651
35837 -1220651 -821537 514672 1240767 519111 -177796 467633 1303121 695191 -726149
35828 -726149 -1300899 -960622 -577101 47004 1336597 2151213 1155106 -754089 -1598458
35819 -1598458 -1288299 -1260387 -1689965 -1351363 -13967 1187465 1693018 1866799 1576879
35810 1576879 457116 -537322 -13828 1302339 1075756 -1201596 -3341112 -3574914 -2605669
35801 -2605669 -1851349 -1487314 -1159260 -1059824 -1258372 -1201901 -776529 -751846 -1413593 -1892282
35791 -1892282 -1592478 -1102519 -854975 -121426 1551635 2952000 2584158 820500 -590132
35782 -590132 -826734 -652055 -854506 -1118980 -803194 -170648 -227406 -1324827 -2363505
35773 -2363505 -1904532 -59744 1476936 1687249 1623408 2621993 3962626 3842084 2317066
35764 2317066 1454451 2320098 3543448 3506483 2457579 1623801 1542392 2207860 3648012
35755 3648012 5228607 5413266 3475562 755528 -873471 -1135285 -979751 -911296 -886941
35746 -886941 -1132415 -1668190 -1573516 -169511 1501433 1911308 1403403 1567231 2406953
35737 2406953 2169736 367200 -1096886 -761958 220340 89431 -807047 -931045 -140761
35728 -140761 439755 511082 717676 935825 278795 -1079089 -1804023 -1477080 -1137328 -1252036
35718 -1252036 -863556 383079 1088346 318481 -515251 279811 1934809 2580944 2436559
35709 2436559 3146590 4303090 3480751 309141 -2164793 -1505232 862111 2051435 1564201
35700 1564201 798015 173705 -907643 -2044365 -2148899 -1568494 -1751039 -2703939 -2759666
35691 -2759666 -1197318 735180 1914807 2701382 3483912 3558628 2522738 1384050 1035810
35682 1035810 760588 -385994 -1622888 -1438580 -22263 880049 430147 -418055 -670602
35673 -670602 -626846 -970616 -1546672 -1734873 -1402380 -836339 -180517 443031 619980 190832
35663 190832 -45431 963602 2875155 3778259 2315734 -443890 -2061947 -1540465 -178016
35654 -178016 556537 932658 1945889 3207528 3184820 1465532 -493375 -1290124 -1219192
35645 -1219192 -1301202 -1512580 -1034733 99903 776255 399160 -199652 12708 739213
35636 739213 775916 -237197 -1225984 -1033003 155703 1115961 1072817 501951 493117 1564717
35626 1564717 3102510 3861377 3150163 1617112 596471 553205 687355 421387 501433
35617 501433 1697186 3023103 2689935 711953 -996990 -1364343 -1315135 -1602749 -1360237
35608 -1360237 -57212 828954 -34790 -1289628 -713193 1200151 1942599 983677 439275
35599 439275 1424622 2328023 1729286 782500 1160913 2334115 2634200 1859000 1093762
35590 1093762 738851 362563 27707 239656 801227 1013405 867842 921034 1172085 1156398
35580 1156398 949865 946026 826945 18088 -904881 -677140 570990 1099978 -39170
35571 -39170 -1651211 -2192245 -1826570 -1736072 -2238986 -2711262 -2824795 -2720472 -2249675 -1177274
35561 -1177274 -81397 27275 -846678 -1563047 -1462791 -1208248 -1532074 -1964761 -1568399
35552 -1568399 -439330 352923 170375 -511553 -797586 -249601 883109 1850213 1855728
35543 1855728 785728 -485019 -875122 -213956 650695 731819 -317580 -1942377 -2836454
35534 -2836454 -1892434 337303 1686237 836533 -775533 -795923 715491 1516067 696410
35525 696410 -156425 59146 9909 -1613243 -3482946 -3439345 -1760300 -592386 -794496
35516 -794496 -1341540 -1529364 -1795349 -2260592 -2192941 -1328893 -475047 -450194 -1304726 -2561991
35506 -2561991 -3355901 -2676622 -641720 860785 191466 -1690376 -2446756 -1673370 -1180825
35497 -1180825 -1955000 -2770540 -2257654 -668837 917895 1704090 1170947 -485234 -1684779
35488 -1684779 -931892 821331 1183664 -47708 -531463 819851 2245165 2329045 2113577
35479 2113577 2487125 2086202 -54740 -1999776 -1565229 267884 1120964 858220 814286
35470 814286 781204 -264146 -1403106 -848333 756393 1146887 278562 267037 1449657
35461 1449657 1716133 358271 -508019 494955 1767803 1585454 870017 1288414 2358388
35452 2358388 2413330 1299275 305946 90146 190240 259134 576571 1386576 2404203
35443 2404203 2935472 2336864 746839 -671301 -891776 -333627 -122848 -278238 70336
35434 70336 765983 619154 -412636 -865261 -237059 5416 -1088758 -2149436 -1524320
35425 -1524320 213057 1225126 830189 -344534 -1599737 -2236701 -1442757 441842 1514364
35416 1514364 710344 -352546 311448 1820973 1686732 -217156 -1398276 -585545 553008
35407 553008 259580 -765387 -826856 210997 1115083 1115855 447603 -336028 -708616 -317360
35397 -317360 502595 802738 213723 -407248 -124815 755459 1210679 972392 702007 851200
35387 851200 1084412 922612 421014 12289 -9551 317520 767379 1126737 1302183 1299858
35377 1299858 1166488 1010848 996541 1150073 1236566 1039744 713387 589003 679549 707570
35367 707570 603808 551896 483029 42173 -715687 -1082455 -523638 616588 1627443 2292612
35357 2292612 2736428 2714916 1794774 287814 -659963 -275113 882677 1517371 1011997
35348 1011997 -32810 -623400 -450415 -6929 180402 82753 -184233 -841671 -2038495
35339 -2038495 -3077955 -2813224 -1149271 492723 809963 245803 218102 1031786 1526276
35330 1526276 826552 -508051 -1392359 -1484165 -1115497 -603357 -134580 121299 202503 279030
35320 279030 176121 -440037 -1205421 -1266820 -764725 -1017150 -2409124 -3226011 -1904025
35311 -1904025 423129 1277523 248398 -754229 -523473 68661 -11246 -524438 -1070166
35302 -1070166 -1903213 -2745613 -2381676 -627303 679266 74983 -1241489 -1082060 582434
35293 582434 1798879 1492861 541793 127905 440516 1069209 1505958 1183972 33989
35284 33989 -996535 -937649 -210479 -17255 -467161 -555921 -47080 14679 -923674 -1867608
35274 -1867608 -1659720 -516604 499733 876839 888818 921434 1099466 1294644 1188748
35265 1188748 580664 -281316 -1014637 -1668992 -2451120 -3015594 -2771141 -1867498 -1065418
35256 -1065418 -608741 -119457 371083 405910 315140 1163029 2945655 4073968 3478306
35247 3478306 2155499 1611758 1691147 1176929 -108386 -1167715 -1500327 -1604083 -1789198
35238 -1789198 -1629739 -859294 55426 576792 723595 764167 768582 704308 605042 464447
35228 464447 240301 32969 -14416 21797 6975 115203 614940 1290841 1566151 1317378
35218 1317378 1094185 1318061 1717115 1878545 1917933 2060273 1856338 618003 -1235450
35209 -1235450 -2047896 -742493 1636852 2924905 2281206 932125 403131 798135 1204370
35200 1204370 1075384 520038 -330030 -1430121 -2427535 -2821201 -2509708 -1716534 -527879
35191 -527879 938597 2076337 2207998 1472544 669422 195492 -236718 -795098 -1153949
35182 -1153949 -1100057 -875431 -664560 -267321 462418 1263420 1725042 1570820 710017 -549908
35172 -549908 -1438544 -1432411 -916054 -504393 46783 1319959 2784850 3107166 2097207
35163 2097207 1100498 1032966 1270667 1091429 915361 1151750 967865 -483442 -2359772
35154 -2359772 -3034779 -2336530 -1607130 -1651509 -1804349 -1218451 -180989 234414 -580833
35145 -580833 -2040816 -2759031 -1880916 -209226 434945 -688804 -2306251 -2765303 -2016452
35136 -2016452 -1280099 -1253729 -1503855 -1358911 -609653 512853 1390378 1270663 134122
35127 134122 -940049 -970484 -369191 -261389 -747048 -768890 281273 1668416 2196359
35118 2196359 1384403 -302474 -1839349 -2243088 -1364817 -153628 304665 -49565 -467558
35109 -467558 -526879 -416427 -271324 21165 365599 495292 486416 611948 721819 446339
35099 446339 -31806 -185613 -131858 -524016 -1295585 -1464978 -622252 244468 77189 -694109
35089 -694109 -697902 538106 1982604 2344294 1467086 387869 239425 1168741 2242865
35080 2242865 2382475 1366276 -107914 -1209917 -1623706 -1518998 -1222086 -1011972 -1006838
35071 -1006838 -1087759 -1017074 -724401 -444546 -519928 -1034135 -1638840 -1845559 -1577213 -1276001
35061 -1276001 -1284414 -1352644 -1116139 -818133 -986925 -1525674 -1810030 -1661047 -1459585 -1280036
35051 -1280036 -813596 -255918 -204539 -420985 74953 1204029 1489604 310112 -906015
35042 -906015 -846837 -308335 -561614 -1020215 -455459 423165 -120521 -1795073 -2496454 -1620835
35032 -1620835 -868514 -1286226 -1680203 -861601 390265 769235 386394 65365 -138244
35023 -138244 -505694 -678748 -312091 -900 -426441 -1085351 -915154 152247 1184555
35014 1184555 1582498 1618645 1732809 1948499 2061704 2030312 2052536 2254183 2233177 1235932
35004 1235932 -712210 -2182400 -1768567 -89434 711272 -312066 -1782871 -2048308 -1272250
34995 -1272250 -760656 -1047275 -1490114 -1239074 58876 2053723 3674756 3845248 2706574
34986 2706574 1593037 1348109 1288108 339252 -1416690 -2878021 -3073087 -1768319 419406
34977 419406 2108463 2131346 951193 318364 993850 1759342 1396407 597068 810974
34968 810974 1995168 2790898 2508296 1757643 1315936 1364883 1751151 2197646 2326796 2034974
34958 2034974 1643895 1308467 770176 100679 -68405 365250 565997 219252 367602
34949 367602 1704743 3046867 2901138 1713179 979851 856939 456487 -23546 445407
34940 445407 1481045 1440110 65890 -1015172 -920260 -699997 -1196094 -1591313 -1130597
34931 -1130597 -614152 -887548 -1236077 -726328 -43328 -429457 -1535494 -1874528 -1027157
34922 -1027157 -15689 347007 277899 214470 207334 228736 316848 301336 -75287 -757772
34912 -757772 -1473937 -2035544 -2210252 -1721274 -833345 -372535 -536138 -375267 622265 1186587
34902 1186587 -71500 -2083686 -2241290 -120740 1532756 416221 -2240520 -3498772
34894 -3498772 -2548235 -1114902 -579419 -460095 59702 627918 490676 -188772 -617402
34885 -617402 -486469 -118101 182761 331264 225149 -168295 -596011 -795003 -843246 -870954
34875 -870954 -666438 -66621 484067 417404 -1594 69740 756440 1168117 652300 -332364
34865 -332364 -957245 -1013738 -722212 -168157 469166 639434 113997 -363069 126500 1375499
34855 1375499 2233299 2002059 1015672 -93925 -1009714 -1561726 -1615206 -1322004 -1018356
34846 -1018356 -777607 -484882 -305128 -516676 -931802 -1171523 -1489200 -2417751 -3436523
34837 -3436523 -3080662 -957222 1310184 2002131 1404141 968272 1010822 598993 -465153
34828 -465153 -1025249 -322732 807230 1160493 728828 269077 -62005 -743128 -1838267
34819 -1838267 -2711415 -2754138 -1864557 -335201 1209037 1962101 1683047 1170680 1296011
34810 1296011 1692607 1293675 131503 -561646 -335988 -293767 -1128355 -1672280 -678990
34801 -678990 917756 1191829 160623 -326530 392329 824456 -92463 -1226564 -1108835
34792 -1108835 -152569 260121 -123437 -615938 -1127609 -2027586 -2837112 -2505336 -1009993
34783 -1009993 460757 1031858 919221 634778 315562 -30646 -378052 -858577 -1420824
34774 -1420824 -1451750 -595196 226503 -242281 -1578968 -1925259 -605078 821015 799841
34765 799841 -172357 -777896 -1045836 -1822426 -2709752 -2288343 -519092 625502 -348864
34756 -348864 -2350602 -3019985 -1645841 168477 651948 -152346 -807076 -290548 1098728
34747 1098728 2375628 2870717 2574463 1894798 1259000 771405 203417 -508189 -878307
34738 -878307 -445779 276874 116582 -1156436 -2182350 -1584219 251007 1658511 1668861
34729 1668861 765875 -128530 -604796 -672992 -461562 -224972 -193670 -326139 -535283 -969679
34719 -969679 -1571972 -1671226 -796947 307599 438915 -336966 -723021 -46664 1003516
34710 1003516 1707581 2189478 2505268 2066200 761757 -332416 -307957 266870 328737
34701 328737 -19363 187727 1262580 2595924 3586019 3984165 3565430 2269816 583197
34692 583197 -764132 -1301690 -761128 837879 2554996 2846291 1356448 -386617 -1000043
34683 -1000043 -1039830 -1529003 -1749194 -407705 1631129 2107717 874328 277396 1466161
34674 1466161 2587239 1770401 -68001 -921438 -607704 -240815 -969 621148 1090500
34665 1090500 330717 -1256812 -2028685 -1413489 -501234 -198849 -223165 -211725 -476460 -1133412
34655 -1133412 -1618850 -1679480 -1882418 -2478998 -2611952 -1472267 313714 1257136 702377
34646 702377 -632247 -1597351 -1611447 -871548 4517 525887 665876 624313 388230 -134316
34636 -134316 -660668 -759247 -530476 -452954 -523839 -304395 66136 -177553 -1149433 -1968940
34626 -1968940 -2179265 -2444354 -3116612 -3267913 -2266308 -1271533 -1644924 -2612776 -2282560
34617 -2282560 -598367 639650 682482 723641 1449590 1711732 606269 -836754 -1321116
34608 -1321116 -1259129 -1644866 -2082852 -1568738 -474347 -81468 -539086 -829208 -536224
34599 -536224 -172667 155626 936124 2003560 2469854 2124347 1698128 1553564 1340456
34590 1340456 1117237 1403741 1779691 979429 -958748 -2176175 -1614212 -736180 -1330626
34581 -1330626 -2804162 -3273312 -2489337 -1852637 -1923002 -1779154 -938004 -226175 -271990 -462098
34571 -462098 -15413 905132 1718930 2218003 2305396 1731089 677104 -29219 153356 839286
34561 839286 1409548 1733088 1765710 1184049 130870 -298387 751203 2489298 3136188
34552 3136188 1954447 -38376 -1395889 -1695623 -1559671 -1673602 -2013455 -1964437 -1197363
34543 -1197363 -296598 -101142 -423582 -153857 1051730 2028400 1685123 516615 -370431
34534 -370431 -984926 -1983160 -3030928 -3109971 -2240668 -1405421 -807252 232819 1571394
34525 1571394 2169347 2011711 2207649 2625783 1585523 -1006931 -2443203 -913306 1494504
34516 1494504 1745857 254336 -318281 520033 954736 592596 989339 2234941 2297049
34507 2297049 691613 -204706 1047266 2508861 2061041 729305 616690 1389056 1288885
34498 1288885 319209 -119142 70667 -219642 -978627 -1137190 -725921 -800858 -1249864 -787380
34488 -787380 632897 1377785 585982 -650202 -1109743 -939139 -759057 -676495 -801679
34479 -801679 -1470553 -2316058 -2297213 -1301379 -617454 -1150741 -2194212 -2644832 -2448571 -2095122
34469 -2095122 -1578926 -713089 145023 399613 -141845 -1242547 -2297571 -2356017 -1008689
34460 -1008689 587728 710800 -613912 -1593328 -1367257 -1149537 -1861304 -2301770 -1077418
34451 -1077418 980948 2022292 1873536 1789306 2140100 2162486 1744016 1715796 2280862 2599825
34441 2599825 2119764 1105920 -220625 -1821808 -2987419 -2663661 -1038361 309078
34433 309078 297461 -547728 -1242645 -1604699 -1841901 -1802659 -1357265 -915195 -902934 -1129960
34423 -1129960 -1150046 -866205 -401964 198055 775303 1018622 1007068 1340539 2293302 3252207
34413 3252207 3465881 2966364 2239986 1391360 332482 -454748 -230234 796234 1330900
34404 1330900 491107 -1050697 -1890310 -1507074 -489831 599749 1758947 2782322 2834945
34395 2834945 1471658 -389985 -1335099 -1130267 -756274 -813894 -794463 -153031 776600
34386 776600 1418063 1779667 2046972 1937874 1158633 101564 -566810 -712235 -585002
34377 -585002 -267894 106349 36649 -632977 -1019774 -169728 1430444 2290765 1887252 1204043
34367 1204043 1124073 1311583 1200650 1191890 1989616 3186080 3437339 2122531 203502
34358 203502 -840126 -586719 129388 382116 48750 -493124 -977257 -1146185 -571913
34349 -571913 633359 1259173 258062 -1417276 -1520198 520987 2620735 2779662 1562245
34340 1562245 727809 548470 58280 -783008 -970863 -278118 408800 580432 543595 398722
34330 398722 -26964 -235292 485010 1597185 1854590 1405054 1624289 2564417 2528270 879685
34320 879685 -692832 -807943 -431969 -854684 -1329267 -590595 602200 595219 -306265 -325326
34310 -325326 795177 1432532 783455 -42870 -33785 341971 390330 367592 581764 484754
34300 484754 -413747 -1545139 -2042902 -1900432 -1641445 -1379335 -944305 -511573 -338593
34291 -338593 -161463 413018 1110659 1357583 1369968 1985975 3174104 3605758 2395785
34282 2395785 648253 264991 1400989 2223000 1439493 -44514 -645069 -253083 178233
34273 178233 389464 720497 699499 -556156 -2434751 -3026274 -1734462 -161089 316262
34264 316262 324624 885858 1538445 1449460 1149073 1513964 1970827 1481830 605708 676125
34254 676125 1387584 1219444 105867 -397438 224761 686588 280157 11169 560429
34245 560429 985941 560096 227976 872903 1547486 1011517 -60695 -107515 823392 1291615
34235 1291615 735928 -85005 -691720 -1331692 -1805610 -1379852 -220743 372499 -289759
34226 -289759 -1285093 -1365837 -500071 363040 465986 -230974 -1176448 -1538291 -859462 320402
34216 320402 936594 641887 45563 -354396 -688416 -938254 -621221 166997 321067 -757906
34206 -757906 -1935210 -1740604 -508156 133821 -339004 -864365 -768462 -684230 -975918 -753516
34196 -753516 497887 1532757 1019736 -224210 -309981 895553 1864185 2225674 3339455
34187 3339455 5417525 6204449 4027620 620786 -1006871 -562064 -238033 -976141 -1288351
34178 -1288351 -99224 1408394 1751247 1293501 1202270 1463723 1288815 692099 340159
34169 340159 308756 167674 -53857 -90330 -317454 -1240436 -2250430 -2082700 -616869 827223
34159 827223 1191014 739956 198634 -241295 -660190 -953411 -1107830 -1344596 -1613058 -1498902
34149 -1498902 -961576 -586125 -751430 -1106062 -1227002 -1235461 -1361614 -1436386 -1247030 -929824
34139 -929824 -647478 -377667 -320533 -854157 -1690436 -1847898 -1028556 -214603 -160355 -135142
34129 -135142 822773 2146195 2508326 1841093 1154788 610457 -631275 -2502345 -3543048
34120 -3543048 -2908770 -1623211 -1091578 -1302042 -1259028 -500558 517177 1068991 736039
34111 736039 -172554 -523401 585370 2378312 2926843 1578034 -152125 -770289 -778301
34102 -778301 -1414127 -2400317 -2404911 -1274525 -333192 -476235 -1167335 -1478708 -1181597 -639822
34092 -639822 -371435 -789478 -1715323 -2198671 -1501495 -125681 866312 1284894 1616578
34083 1616578 1670911 740787 -794863 -1425308 -571849 481913 402179 -462173 -963320
34074 -963320 -908461 -947936 -1270608 -1417221 -1165999 -775978 -413907 20160 495367 759616
34064 759616 667354 264666 -433204 -1476816 -2767763 -3919781 -4349628 -3655274 -2162112
34055 -2162112 -936169 -783395 -1283895 -1355296 -732574 -190721 -227706 -356988 -8197 635930
34045 635930 1092327 1162280 693730 -435062 -1597628 -1552784 -34217 1518228 1634082
34036 1634082 588826 -348115 -793986 -1298518 -1954494 -2201547 -1970784 -1959219 -2576523
34027 -2576523 -3371762 -3662511 -3181616 -2089318 -869162 -162908 -210645 -536037 -586941
34018 -586941 -431825 -375964 -295949 42771 426454 609204 787315 909826 189068 -1621124
34008 -1621124 -3087901 -2654304 -943976 62384 -48178 191750 1407718 2301899 1906404
33999 1906404 1106631 930652 866319 80771 -967516 -1436026 -1544614 -1767648 -1544179
33990 -1544179 -314177 903910 663742 -555612 -830242 406254 1620503 1520778 750446
33981 750446 667418 1470330 2237034 2206270 1452788 627107 321092 424338 101149 -1140458
33971 -1140458 -2418788 -2216007 -309648 1707877 2177546 1131807 -27482 -154427 727330
33962 727330 1785447 2192519 1689402 681364 -145467 -362325 5081 646152 1162739
33953 1162739 1273966 1109040 1162803 1658228 2121849 1949781 1182750 280707 -577088 -1317747
33943 -1317747 -1386466 -302338 1185624 1577042 608889 -221833 307210 1475924 1758538
33934 1758538 891899 -123104 -553982 -448314 60890 883381 1470840 1185482 283632
33925 283632 -309714 -319287 -363738 -721233 -785074 -135232 697992 1079387 1154683 1276727
33915 1276727 1189432 523843 -364219 -814065 -784398 -657857 -472252 -136703 -104948 -869078
33905 -869078 -1875659 -1956424 -978892 -117701 -169078 -476962 -50393 951933 1488939 972335
33895 972335 -175073 -992458 -680783 762119 2263844 2496895 1365911 186915 -35922
33886 -35922 109860 -459716 -1542763 -1923512 -1165968 -174895 26085 -733183 -2031968
33877 -2031968 -3261184 -3630875 -2614933 -748613 638154 833022 376807 36376 -206255
33868 -206255 -671874 -1072176 -797346 117993 972829 1324337 1398364 1489252 1449076 1079723
33858 1079723 707960 871554 1420152 1425978 337559 -1104024 -1663624 -1212108 -819678
33849 -819678 -1127517 -1459689 -1033839 -253400 51594 80279 634422 1481745 1402032 83149
33839 83149 -1133930 -966907 98017 452638 -668341 -2374908 -3110253 -2215437 -644393
33830 -644393 -94431 -1157358 -2553459 -2732101 -1937685 -1756997 -2700638 -3487009 -3133358
33821 -3133358 -2514737 -2945026 -4127262 -4696289 -4336030 -4125331 -4747761 -5372450 -4747983
33812 -4747983 -2890546 -1197949 -928601 -1825070 -2459511 -1936332 -858876 -300948 -314539
33803 -314539 -199600 105076 17534 -348873 -180285 364041 -82828 -1829294 -2960767
33794 -2960767 -1763625 621134 1544656 383020 -928739 -911577 -482295 -1230299 -2886766
33785 -2886766 -3563734 -2195057 121734 1451183 1225994 588625 572739 756153 348032
33776 348032 -135145 388858 1398174 1044814 -980158 -2544583 -1973114 -376993 153284
33767 153284 -583129 -1306642 -1466362 -1344445 -729083 692819 2014145 1876481 384396
33758 384396 -1164062 -2112496 -2548642 -2080326 -335244 1560573 1922168 935793 342277
33749 342277 707337 970247 813959 1290472 2598323 3368107 2910521 2197032 1789053
33740 1789053 823521 -901110 -1852226 -1114692 8422 188380 93341 597034 745606
33731 745606 -416925 -1433133 -222950 2574118 4334179 4017836 2886058 2010661 1213642
33722 1213642 453521 242919 390676 20481 -813191 -1016903 -287428 380083 408030 477239
33712 477239 1080422 1470045 839518 -317362 -817718 -255714 721711 1284512 1177425
33703 1177425 787344 627539 710456 609988 244173 74385 172939 -195958 -1366646 -2332715
33693 -2332715 -1985228 -745770 119922 344110 585588 902459 722612 218725 270034
33684 270034 942095 1333252 1114377 931450 1055204 964408 619432 798761 1626771 2019650
33674 2019650 1280644 154498 -419206 -585929 -825993 -858161 -233135 618310 826860
33665 826860 241298 -443765 -426544 614247 2180375 3021746 2243467 578956 -247930
33656 -247930 302431 979813 644928 -324121 -1074499 -1576547 -2058994 -2162344 -1615346 -914775
33646 -914775 -407938 426191 1756525 2399293 1383653 -182994 -339433 994957 2004756
33637 2004756 1595546 599220 216988 521587 840142 621607 -391537 -1972429 -3099323
33628 -3099323 -2682753 -968891 492409 619201 -107424 -628386 -709500 -882391 -1452886
33619 -1452886 -2073167 -2141993 -1410147 -328871 221298 -157468 -826320 -888248 -399216 -205597
33609 -205597 -613995 -964581 -685426 -36167 492992 822249 924195 524113 -252177 -511147
33599 -511147 371567 1688824 2134921 1419656 417218 -190547 -575514 -926840 -816655
33590 -816655 68315 1117911 1387936 775099 35290 -265692 -270865 -298136 -347465 -325386
33580 -325386 -308266 -304270 -78763 505410 1208311 1659226 1606490 826043 -695678 -2202450
33570 -2202450 -2451288 -1190714 149063 46521 -1178645 -1891176 -1297292 -38340 1173684
33561 1173684 2215847 2724874 2024903 460370 -417875 208677 1321349 1730681 1786150
33552 1786150 2299183 2717148 1909253 299313 -409362 333464 1175899 836915 -363758
33543 -363758 -1393957 -1899372 -2071834 -1893642 -1267155 -507596 -67129 91899 413684
33534 413684 1092131 1797267 2086312 1924180 1692365 1680384 1733698 1650090 1796751 2806716
33524 2806716 4578819 6276489 7673695 9688215 12783485 15467459 15529285 12647218
33516 12647218 8772318 5885183 4292906 3283268 2481298 2017396 1905609 1799595 1277640
33507 1277640 296393 -517713 -311756 845011 1627189 976358 -329996 -564126 595030
33498 595030 1639108 1313528 101104 -730613 -671532 -101899 384717 347266 -208563 -584097
33488 -584097 -57430 1008527 1519955 1299226 1321248 1893962 1842424 368836 -1355672
33479 -1355672 -1643706 -592960 317431 419704 338584 555434 826060 1043250 1446849
33470 1446849 1771152 1327811 323666 36648 1058474 2240665 2218883 1355419 1143824
33461 1143824 1951328 2501888 1869667 974782 1295836 2659346 3399023 2703319 1699096
33452 1699096 1734136 2566529 3121320 3232368 3360112 3077671 1517416 -555232 -873048
33443 -873048 1323097 3815898 4118457 2618483 1681151 2345171 3468191 3924976 4101117
33434 4101117 4860297 6173622 7371354 8117820 8652561 9418645 10756850 12745717 15168749
33425 15168749 17716832 20167654 22318310 24081815 25907568 28713400 32981291 38217650
33417 38217650 43641584 48925627 53761289 57234441 58369995 56985567 53461850 48228645
33409 48228645 42204094 37015316 33596409 30964711 27577627 23563463 20316207 18214936
33401 18214936 16349022 14457579 13384078 13283389 13085589 12319470 11843867 12021722 11793468
33392 11793468 10568975 9496620 9603657 10082461 9858135 9534838 10078067 10728104 10254565
33383 10254565 9435169 9989890 11450929 11522062 9682503 8074856 8195221 8849336 8405832
33374 8405832 7220364 6491846 6185918 5620527 5090033 5384417 6334927 7197818 8017683
33365 8017683 9318190 10718330 11076611 9985937 8204373 6660396 5785104 5629864 5848467
33356 5848467 5758286 5167265 4826933 5259143 5637271 4968390 3913124 3882043 4488650 3769076
33346 3769076 1325084 -652418 -464837 658145 629434 -300275 -246288 1143844 2210991
33337 2210991 1909103 1120274 923618 1020664 663853 101033 95453 513494 347417 -815862
33327 -815862 -1942569 -1531637 568837 2592253 2512385 335260 -1807207 -2147612 -1196324
33318 -1196324 -573931 -703175 -774921 -514488 -512956 -813020 -655608 20011 239174 -261098
33308 -261098 -337418 616106 1319622 453299 -1154186 -1671315 -955282 -510605 -1044855 -1683364
33298 -1683364 -1734350 -1728749 -2210151 -2707800 -2607850 -2136527 -1721677 -1068129 279374 1844261
33288 1844261 2556968 2172006 1678378 2044472 2917875 2950448 1413751 -808387 -2101196
33279 -2101196 -1876649 -1071574 -870034 -1427459 -2082969 -2298413 -1950151 -1140862 -254812
33270 -254812 176851 196387 551914 1478014 1934009 1041242 -205037 -7811 1553949
33261 1553949 2399906 1332920 -337871 -744823 126016 889904 770967 135895 -445526
33252 -445526 -718123 -592947 -224990 -31664 -86250 180623 1122659 2121788 2354843 1979256
33242 1979256 1823136 2118422 2288102 1904686 1181515 509267 73276 -44476 149457
33233 149457 467306 778972 1198729 1662544 1617881 723827 -361471 -620778 -62511 267727
33223 267727 -228126 -903375 -851530 -139050 390969 283990 14030 290539 1008026 1177976
33213 1177976 181016 -1105427 -1091831 462778 1987220 2179650 1666857 1689307 1962144
33204 1962144 1285106 -95612 -457963 796395 2074402 1823207 572393 -175655 -112272
33195 -112272 -77017 -462502 -790560 -667697 -276749 46231 110926 -177445 -679268 -940953
33185 -940953 -649482 -1881 692302 1459083 2298483 2722598 2215190 994889 -120522
33176 -120522 -488027 -18919 889534 1485904 1165904 276221 -33775 748302 1723334 1833447
33166 1833447 1275893 841744 451410 -479030 -1538496 -1544438 -363826 711399 750331
33157 750331 312550 338915 794223 985995 612163 -20488 -398016 -114896 775331 1534090
33147 1534090 1332342 172963 -1257719 -2507924 -3334878 -2983602 -842523 1899637 2721704
33138 2721704 743262 -1896000 -2610194 -1379812 -126842 56914 -272958 -360304 -142968
33129 -142968 209476 570918 631839 179403 -454391 -852168 -1173432 -1706080 -2136749 -2054962
33119 -2054962 -1802231 -1940204 -2230591 -2084751 -1678473 -1597898 -1702461 -1437056 -958541 -754249
33109 -754249 -471832 464957 1325171 823816 -569612 -863992 560255 2037472 2167524
33100 2167524 1559346 1239585 1032818 617623 617921 1293403 1507707 507978 -444665 130017
33090 130017 1483486 1744562 700718 -368000 -1005826 -1686103 -1957869 -774052 1147120
33081 1147120 1543988 -82970 -1374583 -428186 1461864 1817254 473769 -621858 -404200
33072 -404200 268200 451505 446378 885822 1604477 2063738 2266478 2601094 3039318 3001779
33062 3001779 2025061 331981 -1253904 -1887376 -1349265 -288533 288559 -36269 -713311
33053 -713311 -937746 -606522 -299200 -435130 -883200 -1409257 -1965780 -2351532 -2162188 -1451085
33043 -1451085 -898811 -843824 -701538 31713 819315 1026954 1242955 2382916 3764277
33034 3764277 3607979 1668659 -85508 12078 1317495 2056576 1511934 305812 -680417
33025 -680417 -979847 -771063 -873618 -1798517 -2608730 -1826211 232417 1447764 805648
33016 805648 -258841 -289614 137594 66496 114551 972637 1455048 257510 -1447634 -1589282
33006 -1589282 -604752 -668606 -1878443 -1973005 -94754 1779903 1897550 943152 206117
32997 206117 -487392 -1727286 -2910970 -3046580 -2238145 -1354475 -952561 -1213763 -2114007
32988 -2114007 -3001437 -2813052 -1372444 180474 766503 585615 600089 1355814 2523613
32979 2523613 3120442 2296736 541632 -302767 770646 2225782 1845836 -121435 -1413327
32970 -1413327 -1092423 -372131 -43639 591320 1637867 1755483 443083 -794532 -762922
32961 -762922 -314046 -535924 -867935 -386171 493896 966319 1182210 1401510 1130952 336871
32951 336871 101211 744370 764789 -838603 -2589251 -2540290 -1013167 347199 1062986
32942 1062986 1627255 1929216 1663323 1319372 1103849 52632 -1984490 -2871431 -996338
32933 -996338 1628571 1736866 -509011 -2010730 -1478307 -720419 -1099514 -1616221 -1247342
32924 -1247342 -708337 -824543 -1060121 -719739 -131294 239777 602707 1068438 1170523
32915 1170523 712493 143447 -216309 -391090 -154115 678505 1411401 1179750 414377
32906 414377 252335 674885 826893 976001 2132894 3622417 3351487 1184218 -163341
32897 -163341 1226227 3774757 4753933 3810760 2612530 2144669 2028761 1876701 1801411
32888 1801411 1761379 1473368 936267 400148 -9427 -194621 61128 728934 1345585 1518290
32878 1518290 1315670 966345 530994 11595 -538985 -1014843 -1089483 -381653 718896
32869 718896 943213 -261075 -1517582 -1034679 1025429 2914545 3667851 3655349 3076423
32860 3076423 1711127 240762 -74350 535368 395341 -864633 -1394520 57040 1989979
32851 1989979 2146016 547873 -830011 -793609 -96317 -50045 -826828 -1329391 -591357
32842 -591357 796779 1139811 -133849 -1504775 -1481213 -717008 -582685 -564570 814610
32833 814610 2989628 3728189 2563272 1404501 1347614 1320167 578267 129192 663258
32824 663258 1288983 1454685 2027685 3258285 3743708 2780996 1787045 1930637 2260371
32815 2260371 1758346 1408683 2441531 4107923 5010640 5304278 5866000 6463571 6299296
32806 6299296 5333833 3891250 2187548 1158624 2019211 3930768 4168565 1974356 48518
32797 48518 607487 2309673 3033219 3242988 4170701 4952525 4408012 3775125 4828827
32788 4828827 6929656 8609448 10299758 12773290 14891694 15861532 17547391 21329773
32780 21329773 25234873 28063814 33468025 44867414 59311712 73684647 95779383
32773 95779383 139900510 207437339 276798354 316572782 307627598 254083129 179223186
32766 179223186 112238045 71702006 55707456 48976059 40676538 32217163 27945745
32759 27945745 25724086 21137978 15368835 12609218 12678819 11980020 9922255 8994293 9434991
32750 9434991 8790903 6527652 4791447 4479146 4235045 3522045 3358131 3752674 3435808
32741 3435808 2417913 2065693 2424233 2114926 1101781 934006 1913207 2538103 2188401
32732 2188401 1966449 2382846 2499179 1928156 1493759 1315539 422589 -997830 -1125326
32723 -1125326 716304 2694996 3013465 2231737 1926529 2395610 2839698 2761704 2162496
32714 2162496 1186093 376376 506353 1480169 2150885 1818158 1205132 1403710 2430479
32705 2430479 3262690 2895292 1237585 -593304 -1034488 244576 1767049 2135615 1886839
32696 1886839 2274073 2924008 2519602 1423768 1391067 2510931 2770142 1332111 13132
32687 13132 383299 1412798 1441287 759525 555996 695746 371793 -58031 293312 1079451
32677 1079451 1296963 1084301 1303079 1742561 1432063 576363 516153 1588465 2441124
32668 2441124 1849410 177098 -1246824 -1374129 4816 2065130 3289645 2926526 2097684
32659 2097684 2480446 3968236 4871756 4500221 4034962 4380023 4729426 4243539 3750182
32650 3750182 4340188 5264519 4967391 3740911 3521577 5000510 6694796 7370246 7742276
32641 7742276 8843190 10111974 10452671 10176942 10313090 10631737 10137116 9258232 9563792
32632 9563792 11014943 11529839 10166678 8873756 9621464 11315208 11479658 9988263 8886538
32623 8886538 8932242 8666176 7170965 5581638 5082455 5195238 5060653 4919151 5178963
32614 5178963 5280825 4725287 4166190 4216363 4131749 3050957 1677188 1220903 1419008
32605 1419008 1277502 1138705 2013500 3172618 2687238 641706 -464561 641325 2015211
32596 2015211 1442678 -339192 -1028660 -106293 1056272 1624543 1906491 1885429 1049237
32587 1049237 -206187 -675897 -234385 -186149 -1180600 -2059303 -1537065 11164 1304607
32578 1304607 1872954 2092080 2127355 1845322 1456154 1338387 1358787 1120243 785637 926468
32568 926468 1560879 2032282 1941834 1587631 1310974 976914 404449 -114224 -118059 364864
32558 364864 744551 462152 -385782 -1000247 -614699 535288 1193439 432380 -1084020
32549 -1084020 -1686427 -592157 1267426 2404299 2232626 1194575 54970 -491639 -42210
32540 -42210 1015290 1493635 609721 -850104 -1233385 2331 1631335 2215789 1733076
32531 1733076 1208883 1193877 1275233 955916 324008 -328405 -1019017 -1838363 -2498845 -2547693
32521 -2547693 -1975950 -1293390 -943146 -854049 -660126 -218735 228478 398814 367296 503387
32511 503387 982719 1524719 1779586 1806040 1845594 1771309 1308345 809050 1041650 1861657
32501 1861657 1900995 314389 -1789731 -2640162 -2126608 -1698663 -2102980 -2495081 -2005009
32492 -2005009 -972377 -134455 400438 783397 894040 772840 801578 905737 416976
32483 416976 -676815 -1279461 -747388 19752 -29102 -471133 -221228 791972 1844917
32474 1844917 2556819 2655740 1458885 -970519 -2874921 -2666461 -1210078 -511665 -613593
32465 -613593 177719 2193513 3782439 3984862 3608656 3173408 2046515 446774 63175
32456 63175 1401095 2474927 1662339 153986 -115395 552387 621897 79778 85208 650639
32446 650639 740797 272127 110444 283976 -13856 -660200 -512804 710886 1865189
32437 1865189 1952302 1141981 87755 -725029 -914715 -530620 -416766 -1201922 -2071866
32428 -2071866 -1752852 -558477 -10860 -418845 -474522 423547 1144347 802222 184018
32419 184018 224696 450492 173457 63465 1003225 2147757 1814632 74424 -1119174
32410 -1119174 -573778 686491 1063556 406968 -292819 -451258 -263483 74211 628638
32401 628638 1227851 1415807 1096424 674187 332532 -249019 -1077457 -1370113 -615425 320269
32391 320269 104905 -1167889 -2017589 -1602135 -651098 -100697 57381 16914 -556554 -1539979
32381 -1539979 -1690946 -251661 1482433 1603830 219730 -764595 -311330 735929 1359587
32372 1359587 1625055 1825038 1671534 1042221 556633 629455 657922 -55180 -1037427 -1100340
32362 -1100340 70119 1361025 1390192 9399 -1458050 -1579020 -432840 451535 21259
32353 21259 -908953 -765101 680992 2142006 2572038 2178073 1640937 1233098 969682
32344 969682 901952 923461 794508 569218 561762 822808 1109974 1334631 1523231 1495943
32334 1495943 1224781 1259906 1945176 2447578 1659368 -24052 -1059696 -945808 -691987
32325 -691987 -864019 -691203 261927 1026417 810086 383343 692754 1119066 501677 -784390
32315 -784390 -1217448 -308272 884587 1381580 1347213 1373004 1520190 1388910 740639 -126685
32305 -126685 -548480 -202865 324013 128087 -760687 -1372263 -1271390 -1214812 -1867161 -2695592
32295 -2695592 -2827005 -2300589 -1738695 -1411128 -1335096 -1607515 -1863475 -1186671 479872
32286 479872 1602811 917868 -595598 -895512 424281 1962693 2674993 2733954 2412796
32277 2412796 1711585 1254876 2030230 3760092 4784598 4099578 2475901 1119926 301416
32268 301416 -160697 -136502 329441 609725 343049 42043 167054 213970 -519746 -1715321
32258 -1715321 -2309939 -1735996 -366661 962958 1408359 475021 -1451185 -3092019 -3318069
32249 -3318069 -2221840 -930361 -456110 -854492 -1303890 -927654 211108 968248 409851
32240 409851 -820212 -1139276 -161853 670367 42871 -1428396 -2037887 -1115699 375001
32231 375001 1042482 332987 -1103474 -1913719 -1305180 -118615 -17831 -1243138 -2089965
32222 -2089965 -1322238 -57638 -67437 -1086038 -1415718 -699527 -253675 -691887 -1095037
32213 -1095037 -909708 -878055 -1361080 -1385999 -388445 525771 299801 -285968 80092 1133441
32203 1133441 1713834 1730391 1822342 1692810 594543 -842277 -1158733 -446832 -312098
32194 -312098 -1203401 -1666624 -832614 202055 409446 541912 1527687 2553687 2256075
32185 2256075 819521 -576103 -1560079 -2341952 -2468629 -1502951 -414776 -498172 -1152296
32176 -1152296 -590270 1211230 2168388 1112110 -605177 -1246945 -881604 -479542 -160056
32167 -160056 454715 1082645 1212998 1105649 1300045 1590840 1447606 1025302 793591 530401
32157 530401 -262919 -1133793 -970319 361474 1621220 1765350 1195821 1001229 1453347
32148 1453347 1811186 1469699 815883 730448 1411621 2041763 1788044 843675 91776 -34185
32138 -34185 258115 942256 2255927 3677057 3814631 2133430 162201 -3171 1819004
32129 1819004 3753264 4108327 2968790 1556350 859674 1174217 2270859 3458115 3828955
32120 3828955 3004658 1607148 646028 406060 247501 -347916 -870130 -416805 802526
32111 802526 1316577 223112 -1409507 -1822993 -951328 -424168 -1118480 -1910713 -1390753
32102 -1390753 235893 1765628 2653263 3039298 2783264 1711192 547422 341256 890512
32093 890512 857389 -251897 -1246665 -960464 6897 115063 -905994 -1591889 -664675
32084 -664675 1247664 2346498 1860831 841875 609329 1065930 1133097 423884 -367192
32075 -367192 -642467 -595372 -598160 -698588 -942642 -1418215 -1727203 -1248174 -253844 107307
32065 107307 -649175 -1712948 -2280541 -2422113 -2152559 -960890 865475 1783136 1055241
32056 1055241 47118 91379 339236 -504601 -1526037 -991705 389486 253248 -1542140
32047 -1542140 -2524313 -1469419 -91137 -67128 -752642 -1032745 -1326881 -2227275 -2866383
32038 -2866383 -2321927 -1354344 -1152625 -1438865 -1357518 -1238378 -1815181 -2473654 -2003309 -635122
32028 -635122 264893 259045 140685 362557 548736 512736 485844 327461 -291506 -876694
32018 -876694 -491711 650749 1103393 57000 -1611173 -2546431 -2405945 -1741580 -1050695
32009 -1050695 -433000 165914 736074 1125481 1162855 1000316 1099116 1556763 1793367 1415091
31999 1415091 1012307 1356916 2049490 1838861 266471 -1801008 -3291538 -3783929 -3232460
31990 -3232460 -1798884 -250154 351777 -135100 -645399 -292293 509246 774115 271432
31981 271432 -473775 -1099468 -1619420 -1887525 -1597439 -969185 -813071 -1460743 -1990928 -1186657
31971 -1186657 701095 1870574 1127881 -467479 -996091 -375509 -378538 -1774594 -2925139
31962 -2925139 -2133825 -201521 759133 345254 96659 919860 1874579 1808470 889053
31953 889053 -10833 -474740 -563423 -420929 -300538 -400690 -436247 14176 658300 782088
31943 782088 457986 484753 960173 1027317 342269 -412806 -902548 -1672644 -2690851 -2873698
31933 -2873698 -2062256 -1900365 -3271801 -4297759 -2869974 -121730 989656 28163 -568919
31924 -568919 457224 1427420 784975 -489147 -888297 -855880 -1490407 -2196111 -1614941
31915 -1614941 -97227 700857 364610 103846 598806 1078694 860068 422635 395533
31906 395533 537125 367087 23864 -135649 -188931 -314538 -291368 99995 557380 696701
31896 696701 720979 1092129 1734477 2143165 2215791 2395882 2879063 3169070 2683101 1474439
31886 1474439 78614 -1087544 -1812081 -1797663 -884372 328019 689600 -210072 -1372558
31877 -1372558 -1634970 -1298907 -1639111 -2793784 -3241566 -1885747 319437 1696258 2018271
31868 2018271 2186752 2271740 1413261 -313121 -1523059 -1566701 -1558148 -2444980 -3216226 -2347200
31858 -2347200 -310038 839980 159983 -1286091 -2288878 -2867524 -3323712 -3169436 -1943044
31849 -1943044 -374214 286383 -163577 -801258 -946814 -836405 -891857 -1057982 -1125557 -1121220
31839 -1121220 -993556 -377334 831110 1964486 2198700 1526411 587076 -333767 -1419661
31830 -1419661 -2382475 -2294013 -866740 785101 1423456 1296222 1600461 2552407 3000687
31821 3000687 2139940 730312 139149 723935 1645409 1945874 1418067 622243 329397
31812 329397 813638 1589009 2019076 2107183 2298775 2599259 2499962 1843915 1109269 679734
31802 679734 510740 682714 1455759 2451624 2687487 1960022 1335248 1593700 2031677 1634800
31792 1634800 644891 -49831 -393419 -846429 -1098818 -433594 786855 1246419 406104
31783 406104 -828194 -1272468 -597590 607337 1246148 506118 -1001534 -1400204 138673
31774 138673 1831425 1410490 -652615 -1779795 -993032 -49499 -558222 -1854831 -2484984
31765 -2484984 -2205884 -1628343 -1190065 -1289609 -2176689 -2977364 -2217844 -146975 987424
31756 987424 48682 -1186813 -750034 530427 634222 -258985 -242867 1041934 1898013
31747 1898013 1343190 377702 101504 233130 96081 -221913 -356887 -361822 -322233 16994
31737 16994 749972 1423286 1493811 887912 45102 -337674 186500 1185743 1576336 955669
31727 955669 224239 263567 633539 485469 119307 391663 1022243 943099 184688 -90206
31717 -90206 437313 683466 -53655 -1060385 -1479779 -1460007 -1397948 -1043854 -147072 700619
31707 700619 642579 -336123 -1342353 -1453923 -594236 217556 -273564 -1953501 -2999398
31698 -2999398 -1943608 344038 1777586 1720638 1176088 677398 -219666 -1275420 -1319354
31689 -1319354 -200638 711014 604021 167643 -171559 -1098431 -2547605 -2906522 -1455214
31680 -1455214 73913 -74902 -1220850 -1876997 -2280129 -3234407 -3764084 -2374608 133603
31671 133603 1552116 1520556 1555961 2149166 2314525 2038369 2611681 4049728 4568828 3434845
31661 3434845 2184464 2019487 1976747 923970 -394567 -781555 -647328 -1095132 -1981832
31652 -1981832 -2360966 -2094646 -1716647 -1325691 -767766 -290202 64247 1007153 2769645
31643 2769645 4008991 3315576 1345393 69453 206983 792319 1091298 1405027 1805582
31634 1805582 1567519 470612 -423527 -62931 1166518 1927925 1447974 99175 -1206229
31625 -1206229 -1803388 -1621194 -1051405 -548986 -391046 -740395 -1552166 -2263310 -2117001
31616 -2117001 -1189677 -526776 -727140 -1087695 -938964 -994357 -2064638 -3090031 -2294615
31607 -2294615 -195880 593075 -909032 -2493917 -1970268 -149966 864913 873522 1084256
31598 1084256 1457454 891458 -217018 16789 1909858 3206801 2143221 -26327 -835686
31589 -835686 118503 1107789 907385 115854 -118935 403676 1026516 1193363 975607 855914
31579 855914 1106505 1360830 978698 -105957 -1268239 -2066780 -2696309 -3239947 -3140629
31570 -3140629 -2091204 -902661 -573289 -822323 -557009 382689 1085335 1176607 1264833
31561 1264833 1460045 865714 -630122 -1335265 140414 2560032 3369079 2001301 357900
31552 357900 -22732 289226 186302 -69637 457748 1610715 2218801 1714331 793765
31543 793765 428263 771301 1159147 903103 4783 -850754 -1062636 -748971 -330875 266568
31533 266568 1299606 2178705 1799218 224364 -1045104 -1092426 -743532 -798795 -386630
31524 -386630 1343724 2889113 1979240 -739859 -1991834 -346529 1819581 1923413 728100
31515 728100 596213 1696678 2127675 1133195 41422 3356 620544 1178476 1732403
31506 1732403 2369538 2570617 2025065 1267635 885759 739829 491845 296675 417713
31497 417713 660339 717116 652960 579605 312555 -103755 5413 1085899 2367386 2563444
31487 2563444 1547256 534075 392952 561191 169529 -384967 58631 1449271 2101194
31478 2101194 801894 -1350608 -2112429 -851980 827423 1334265 951120 899322 1367624
31469 1367624 1440366 696769 -58378 192291 1494892 2908036 3351001 2463653 899120
31460 899120 -304538 -833706 -1307896 -2126589 -2640339 -2108013 -1045733 -710952 -1395996
31451 -1395996 -2178948 -2402229 -2419919 -2603109 -2519192 -1670752 -477793 57856 -568476 -1925598
31441 -1925598 -3069289 -3248428 -2431124 -1237897 -246394 451087 819707 552004 -258624
31432 -258624 -697842 -210940 294675 -265679 -1172301 -770707 802780 1597701 799711
31423 799711 -286606 -836096 -1884850 -3801726 -4465910 -2073832 1633373 3302101 2349602
31414 2349602 1116590 1098005 1483411 1548842 2014075 3156203 3587995 2250010 293827
31405 293827 -383174 345955 1037352 879735 471932 483139 587158 107377 -833072 -1316400
31395 -1316400 -743906 373914 952058 546490 -251244 -612874 -285087 447665 1110350
31386 1110350 1185751 517553 -132760 396654 2115503 3504134 3293932 2001326 1010160
31377 1010160 786312 841270 847797 777834 372944 -512239 -1358034 -1630658 -1550800 -1407608
31367 -1407608 -835091 170278 429462 -691193 -1536078 -95667 2793030 4363961 3869261
31358 3869261 3202203 3354437 2904631 993627 -651428 -264054 1243727 1863830 1404185
31349 1404185 1065361 1154619 971438 333920 -284846 -704248 -930379 -627136 208187 631979
31339 631979 -70508 -1176510 -1580140 -1423543 -1519551 -1801116 -1668335 -1366114 -1627864 -2291465
31329 -2291465 -2601342 -2576766 -2711211 -2589508 -1346449 517679 1334908 564572 -468950
31320 -468950 -534869 29348 301335 117268 -230239 -754595 -1501110 -2100629 -2231127 -2120149
31310 -2120149 -2109199 -2088660 -1814825 -1501862 -1637308 -2268878 -2772379 -2444369 -1331341 -360570
31300 -360570 -361679 -946113 -877388 204612 1094339 632445 -583117 -942575 70559 1405715
31290 1405715 1882380 1260946 52163 -860427 -557946 956835 2167503 1475046 -642884
31281 -642884 -1977758 -1380392 -117106 62998 -823150 -1468384 -1220935 -595929 -231876
31272 -231876 -204067 -279208 -237326 16280 230474 -156051 -1290060 -2345540 -2277787 -1219923
31262 -1219923 -553437 -1222122 -2368151 -2253527 -484665 1392385 1872269 1404960 1524613
31253 1524613 2463101 2852487 1971822 983013 1149576 1842473 1463872 -230032 -1926778
31244 -1926778 -2596389 -2397843 -1858751 -1258066 -894183 -945776 -890949 -8312 1316484 1726312
31234 1726312 706170 -581208 -755709 170304 1142858 1438823 1117980 494417 -281015
31225 -281015 -1195910 -2180662 -2884122 -2749562 -1673992 -491582 -235618 -848544 -1159800
31216 -1159800 -273086 1467709 2916636 3054290 1599122 -611075 -1896200 -1237481 393983
31207 393983 1075340 423256 10563 988231 2501907 3202953 3217844 3462562 3753135 3016004
31197 3016004 1205814 -284242 -417321 197121 242084 -695660 -1926461 -2656787 -2639259
31188 -2639259 -1988555 -957438 -98900 -149182 -1169097 -1958832 -1073021 1337471 3357622
31179 3357622 3442629 2137972 1057823 735966 412048 -403311 -1233127 -1480508 -1048320
31170 -1048320 -96819 948633 1186263 46528 -1579404 -2019562 -811001 934245 2211886
31161 2211886 2973429 3096883 1989934 -84056 -1576670 -1507985 -756224 -568952 -749675
31152 -749675 -415284 259654 333969 -309794 -823163 -639474 29026 732884 1074156 736334
31142 736334 -48002 -370899 280602 1143352 1111865 253367 -386829 -257294 207423 434147
31132 434147 320983 22728 -291038 -447216 -424454 -436273 -633011 -930038 -1251719 -1538856
31122 -1538856 -1449787 -730457 -18437 -343940 -1490032 -1934501 -989007 181261 458429
31113 458429 399780 815026 980958 -96753 -1522117 -1442446 256811 1858831 2208220
31104 2208220 1671357 872855 25565 -444112 -21235 982941 1777528 2322787 3082443
31095 3082443 3736358 3464395 2417284 1551571 1059047 331399 -589822 -1001545 -950905
31086 -950905 -1130554 -1378457 -935411 -232288 -566329 -1767764 -2161068 -1307382 -743742
31077 -743742 -1288159 -1716420 -1175826 -847859 -1715822 -2470153 -1480400 442639 1148676
31068 1148676 168446 -1089992 -1581769 -1483045 -1143941 -558437 184732 828973 1212884
31059 1212884 1163156 651036 372585 1205155 2629003 2973529 1928094 1266495 2021816
31050 2021816 2660001 1646206 168675 158308 924587 379191 -1153601 -1217117 713640
31041 713640 2169620 1301097 -696397 -1644461 -1041584 283048 1622839 2447670 2187994
31032 2187994 975107 -202489 -738389 -980957 -1116212 -577409 715090 1563316 930335
31023 930335 -521042 -1298223 -1034810 -643390 -737199 -832216 -331848 333817 125358 -1095201
31013 -1095201 -2039923 -1497653 -59031 565559 -3129 -264882 716157 1689103 1203631
31004 1203631 20130 -139459 586636 618632 -236460 -542362 112921 375168 -456208
30995 -456208 -1237331 -1019611 -545760 -701504 -955471 -469707 426195 964324 1157448 1310922
30985 1310922 1217388 739927 348946 256151 -135607 -1155336 -2124692 -2423005 -2343238 -2175696
30975 -2175696 -1510934 -261237 745805 1074550 1412469 2083372 2185125 1340328 825071
30966 825071 1474621 1928801 816360 -647474 -499629 570935 268349 -1403558 -2060268
30957 -2060268 -831954 345225 -45625 -945191 -772770 275853 1071362 1142864 415904
30948 415904 -1237390 -3148704 -3798011 -2664750 -1079664 -292153 183207 1201809 2079501
30939 2079501 1513093 -197318 -1294982 -839790 226212 368253 -862302 -2485563 -3025677
30930 -3025677 -1845362 231418 1776113 2190148 1849889 1027906 -357153 -1805490 -2272135
30921 -2272135 -1699936 -1422371 -2279586 -3338679 -3380000 -2666744 -2116534 -1603347 -480696
30912 -480696 805745 1155422 609219 242944 292293 -183701 -1510778 -2548015 -2135612
30903 -2135612 -477265 1346754 2458625 2437951 1328507 -133747 -942522 -894290 -723926
30894 -723926 -947254 -1248930 -1272764 -1180368 -982782 -199251 1131062 1889811 1242299 -12059
30884 -12059 -443953 46502 330470 -112656 -588854 -445705 149437 883457 1702006 2205575
30874 2205575 1721110 569081 252818 1528064 3105554 3293414 2257008 1447843 1306176
30865 1306176 1008883 338637 151128 627634 616850 -486556 -1494822 -1148493 -131231
30856 -131231 -92523 -1212109 -2018154 -1459732 -65883 1003536 1199695 746616 182141
30847 182141 -138413 -390579 -969484 -1624329 -1506397 -566123 -72746 -836770 -1725868 -1238774
30837 -1238774 96035 512227 -190053 -516806 42662 255975 -440258 -763966 197075
30828 197075 1299317 1118899 14554 -924737 -1749694 -2914369 -3631841 -2702344 -525832
30819 -525832 1245353 1855293 1970129 2235136 2495117 2418138 1960558 1280122 839503 1186468
30809 1186468 1931269 1659967 -134716 -1832123 -1691415 -320261 439996 382207 687128
30800 687128 1242584 624394 -1044357 -1658226 -331696 1176065 1351900 1164531 1876955
30791 1876955 2471553 1325305 -753230 -1377542 66835 1888474 2661662 2522482 1923062
30782 1923062 864098 -262409 -538063 196199 995028 1203535 1204042 1348673 1202734 501660
30772 501660 -25215 416801 1523778 2329402 2287345 1350736 -354997 -2144103 -2685712
30763 -2685712 -1396475 423664 1036123 727335 1478902 3913867 6003935 5669300 3538098
30754 3538098 1906867 1705869 1945713 1857045 1969769 2770467 3640159 3765079 3130559
30745 3130559 2021752 496359 -947118 -1187848 -390 1066662 587960 -559418
30737 -559418 -387784 1132977 1905545 838514 -507716 -185304 1545978 2969423 3318346
30728 3318346 3170292 2969825 2514401 1892752 1750864 2242447 2544701 1963721 1019827
30719 1019827 843378 1696320 2640474 2734235 2148302 1833811 2277282 2935145 2968469 2263088
30709 2263088 1479858 1202621 1332478 1399492 1226374 1028511 912531 615299 -10052 -463083
30699 -463083 -64633 941997 1351018 507068 -641709 -727066 149576 667926 297311
30690 297311 -105134 109492 424733 322781 227794 499142 558364 12260 -322620 307662
30680 307662 1139286 1026612 311785 102596 294370 -48143 -759213 -808796 -289209 -324886
30670 -324886 -961048 -1001299 -175851 397291 295487 421927 995928 900574 -123787 -610687
30660 -610687 172115 770286 -50456 -1181749 -1098227 -359834 -346350 -814999 -717380 -358031
30650 -358031 -625706 -957832 -306490 539566 8372 -1232540 -857883 1386143 3019845
30641 3019845 2459545 1015004 347615 38018 -943490 -1995073 -1801580 -557849 270318
30632 270318 1055 -622733 -675064 -86714 500883 430174 -305680 -865495 -353805 1025713
30622 1025713 2089564 2126113 1627464 1311248 1119293 688781 227488 238114 660276 908763
30612 908763 712393 447643 514922 649927 170643 -964367 -1672381 -944657 487741
30603 487741 641733 -1094362 -2855456 -2749482 -1441502 -888120 -1240461 -883211 663516
30594 663516 1926868 1899164 1359546 1082524 487090 -896384 -2100759 -2101843 -1403352 -1082463
30584 -1082463 -1224123 -1379248 -1573754 -1704967 -953561 859962 2248424 1886061 699798
30575 699798 520087 1283257 1402270 550316 69656 544503 939040 632200 516998 1241038
30565 1241038 1851637 1280147 75585 -480039 -212820 88314 118173 244392 473434
30556 473434 248267 -583173 -1285799 -1010761 233726 1528454 1860232 1022852 -206036
30547 -206036 -837124 -615162 -77232 209253 138786 -144129 -483191 -626503 -345437 161046
30537 161046 359409 104954 -74153 324249 1083255 1538437 1326711 659673 53391 -64994
30527 -64994 297601 651054 585434 408203 783119 1636568 2012275 1331531 221044 -416237
30517 -416237 -646206 -1116707 -1736130 -1573971 -137064 1887852 3335476 3576357 2748808
30508 2748808 1444357 358046 -98463 -76404 -37749 -190321 -394566 -583420 -873628
30499 -873628 -1158735 -1004629 -217924 745680 1223683 1060316 670957 509655 662989 903328
30489 903328 976922 827103 587319 369450 137551 -122819 -241370 -75216 220839 400457
30479 400457 488581 585993 447659 -182460 -802661 -446089 913864 1883591 1180486 -690456
30469 -690456 -1876288 -1151951 978487 2999926 3774389 3308255 2513573 2201413 2192840
30460 2192840 1670615 479586 -516401 -713079 -681004 -1149777 -1773336 -1847850 -1668897 -1960594
30450 -1960594 -2352751 -1877837 -863991 -703614 -1486441 -1554690 -90126 1438464 1448643
30441 1448643 512508 166710 548438 694624 419301 329008 416359 144012 -289411 -166802
30431 -166802 370282 503711 275971 600219 1617728 2351210 2237643 1779564 1405580
30422 1405580 954609 642817 1150571 2133792 2038726 335139 -1288376 -1130421 140096
30413 140096 688148 318551 419283 1409720 2015910 1438688 766840 1406459 3041055
30404 3041055 4096971 3770149 2743443 2083275 2203546 2967380 4065435 4900252 4635295
30395 4635295 3041118 1150537 390438 962619 1732898 1911129 1976678 2369933 2234012
30386 2234012 690106 -1209185 -1475091 -214433 72495 -2057026 -4772796 -5410026 -3914878
30377 -3914878 -2280991 -1378685 -319091 1177328 1870718 1132789 280338 577110 1095254
30368 1095254 85854 -2140637 -3366128 -2525985 -1111536 -966903 -1891229 -2364865 -1841633
30359 -1841633 -1120448 -759640 -370738 328191 794128 488730 -271429 -799127 -838699 -442881
30349 -442881 385604 1388610 1923676 1782834 1663112 2112341 2503413 1964002 916277
30340 916277 556615 971414 1020921 221518 -510332 -408580 -13304 -125171 -540355 -624145
30330 -624145 -454206 -560866 -978180 -1290432 -1317700 -1165463 -882576 -571529 -523760 -778642
30320 -778642 -875040 -466727 183068 702004 1104371 1328689 890231 -330680 -1497650
30311 -1497650 -1837026 -1818904 -2396559 -3362579 -3500486 -2345643 -840781 -97374 -298991
30302 -298991 -974682 -1573479 -1548260 -652657 457018 561053 -701439 -2200912 -2550262
30293 -2550262 -1613117 -377379 325139 462238 372602 273096 264452 406204 570777 423940
30283 423940 -258511 -1314157 -2297725 -2754304 -2369167 -1141184 331776 1025519 489171
30274 489171 -410651 -430954 280794 273237 -946090 -1849145 -1100636 144560 -232080 -1985169
30264 -1985169 -2655314 -1163478 730734 1205256 734358 601142 747129 572547 499654
30255 499654 1029002 1300835 421591 -618651 -316765 690317 484641 -980681 -1892562
30246 -1892562 -1681169 -1585893 -1717214 -289100 3015345 5426868 4758656 2733279 2316448
30237 2316448 3172310 2535517 -75470 -2007710 -1616353 -510756 -575285 -1020339 -150289
30228 -150289 1486637 1842746 579652 -512477 -267669 466777 545186 59907 -493667
30219 -493667 -1210102 -1990204 -1935689 -742029 204557 -468626 -1949541 -2319062 -1392194
30210 -1392194 -742171 -987591 -997104 -188966 309347 -316008 -1067457 -836955 -191631 -149539
30200 -149539 -428103 -384427 -575229 -1656443 -2582353 -1817972 82622 959681 -1507
30191 -1507 -1437024 -1908227 -1332092 -276053 730050 1060874 477295 -196747 -90751
30182 -90751 171891 -634592 -2091971 -2492518 -1481031 -530773 -521030 -672686 -329253 61685
30172 61685 350642 1188548 2331776 2340467 1010930 252929 1219982 2300975 1577305 -224485
30162 -224485 -1054120 -601785 -101358 38597 395404 818276 469875 -535037 -1139845
30153 -1139845 -1021655 -933354 -1336065 -1813400 -1869083 -1389247 -423970 658806 1067968 512499
30143 512499 -80683 336287 1443487 2026490 1554413 444231 -730787 -1368685 -815446
30134 -815446 644963 1368531 201669 -1732822 -2406568 -1535235 -437036 199861 666244
30125 666244 701366 -366624 -1831878 -1916736 -358207 1005378 858273 103760 221232
30116 221232 1290619 2471544 3287394 3572325 3077629 1951350 934753 529448 612036
30107 612036 1119334 2149379 3039756 2489072 237683 -2298462 -3653891 -3692164 -2904065
30098 -2904065 -1466291 225848 1107437 541415 -748881 -1632899 -1895482 -1975503 -2047117
30089 -2047117 -2049716 -2034869 -1841492 -1007969 407043 1527013 1730976 1378553 971187 393801
30079 393801 -395330 -780995 -395033 126392 89753 -224620 -242568 -99667 -156498 -209177
30069 -209177 -11439 128260 115746 638485 1979322 3053742 2774853 1709780 1197985
30060 1197985 1438673 1670227 1628647 1491733 944142 -231890 -1092844 -618281 490241
30051 490241 719206 161324 213694 972647 962184 -246480 -1181815 -929455 -561700 -1091891
30041 -1091891 -1653117 -1047848 141347 445967 -294932 -976159 -939674 -477088 20801
30032 20801 382764 349392 -175169 -701315 -685827 -332917 -250926 -477364 -446971 152724
30022 152724 1013983 1696409 2096777 2359501 2506837 2289084 1566687 849882 888830 1247835
30012 1247835 52976 -3616203 -7487715 -7961775 -4496549 -488081 872556 8501
30004 8501 -746477 -613327 -522620 -946244 -1429725 -1761840 -1984620 -1573762 -128669 1339613
29994 1339613 1303429 -133474 -1325255 -1315714 -707130 -322363 -323690 -722648 -1431699 -1678857
29984 -1678857 -717529 701631 960817 -101414 -1009947 -1109619 -1432584 -2425126 -2693968
29975 -2693968 -1301361 278605 158789 -1154903 -1734126 -1176972 -686949 -688082 -387106
29966 -387106 264426 112795 -1184212 -2306805 -2215702 -1638143 -1673764 -1977273 -1489423 -305968
29956 -305968 433853 303822 104517 506120 1131180 1378638 1416399 1696812 1900820 1213285
29946 1213285 -264584 -1120877 -175494 1922965 3242087 2663965 927482 -469835 -851915
29937 -851915 -615136 -432108 -668488 -1282475 -1807319 -1572822 -390908 1014004 1615763
29928 1615763 1119294 115401 -694916 -1063267 -1025432 -628971 -15414 504251 676507
29919 676507 513977 204451 -65215 -150446 19406 333650 512505 343060 -98637 -507135
29909 -507135 -645031 -585709 -647251 -1048683 -1631700 -1971896 -1787037 -1216429 -684535 -451684
29899 -451684 -256638 469117 1795327 2807930 2430936 854957 -476243 -663210 -426335
29890 -426335 -752096 -1272380 -1112346 -693389 -1067678 -1702446 -923797 1049323 1623116
29881 1623116 -525463 -3177750 -3542703 -1977798 -790462 -540995 46212 1112328 1266056
29872 1266056 280274 -298816 130429 158098 -964702 -1646741 -450136 1354263 1527162
29863 1527162 109598 -881591 -403732 695047 1465273 1959790 2434963 2753130 2858923
29854 2858923 2871960 2522977 1412029 -28773 -816181 -917050 -1423661 -2721113 -3497793
29845 -3497793 -2481610 -451276 643034 315038 87587 1177399 2735986 3120989 2185553
29836 2185553 1284220 1280931 1661769 1767535 1798312 1996254 1741851 438350 -1214235 -1901665
29826 -1901665 -1489357 -1136387 -1585057 -2264687 -2290639 -1555993 -604257 -130096 -747474 -2409358
29816 -2409358 -3825559 -3410185 -1263676 663252 923745 227600 82808 674764 1045011
29807 1045011 720028 72811 -592476 -1299714 -1869427 -1964376 -1640541 -1260575 -1001399 -932149
29797 -932149 -1224533 -1693368 -1589769 -616378 313106 244511 -328880 -264259 295241 157135
29787 157135 -814909 -1357199 -911379 -595536 -1307728 -2088049 -1476631 257420 1404807
29778 1404807 1025718 -89885 -619906 -139395 748139 1248183 1197775 1188067 1808488 2757408
29768 2757408 3033594 2155479 785644 -121090 -375567 -379354 -283514 102801 709474 1084973
29758 1084973 997108 795384 979150 1557246 2002751 1834098 1122434 318672 -324574 -858878
29748 -858878 -1137603 -718017 359621 1161292 872425 -63794 -546300 -319015 4224
29739 4224 231404 731377 1181589 557004 -1066550 -2010579 -1239177 15611 91616 -576862
29729 -576862 -323461 926952 1507026 705083 -105602 412281 1668311 2184299 1558334
29720 1558334 518024 -339347 -1003031 -1567340 -1948095 -1949982 -1328630 -107182 983429
29711 983429 973204 -57701 -797769 -367396 460501 443893 -282227 -524423 122607 847153
29701 847153 1010322 871488 684626 85086 -1108151 -2253186 -2644535 -2342274 -1720020
29692 -1720020 -798276 307958 859612 320208 -635247 -936845 -782589 -1345545 -2694995
29683 -2694995 -3284428 -2156104 -551154 -221903 -866415 -668959 798864 1788010 968518
29674 968518 -527421 -707375 476641 1238119 573145 -581413 -1006283 -784549 -572183
29665 -572183 -226475 815497 2230369 2973228 2788202 2631920 3219432 3812199 3070927
29656 3070927 875713 -1291827 -1920251 -1090375 -219820 -259819 -589492 -61019 1185994
29647 1185994 1759907 1012109 78428 261599 1112725 1164034 143950 -791504 -944130
29638 -944130 -837694 -859311 -519867 319941 747296 205360 -477490 -490958 -449995 -1123676
29628 -1123676 -1675169 -817920 806157 1217436 -42120 -1414702 -1852515 -2020557 -2442009
29619 -2442009 -2235467 -762610 872586 1280090 755215 480567 514802 7524 -989089
29610 -989089 -1376328 -709440 143014 295537 -74175 -216960 288479 1339247 2385815
29601 2385815 2491678 986076 -1499127 -3115141 -2492633 -219023 1796175 2356023 1934442
29592 1934442 1569926 1432383 1032090 439090 292917 453575 -229207 -2051303 -3346872
29583 -3346872 -2550433 -761615 -536964 -2169291 -3091895 -1618870 577438 1040032 98943
29574 98943 -11455 1184085 1756557 468032 -1377440 -1923534 -1256465 -828449 -1150973
29565 -1150973 -1291828 -574174 301471 311895 -384098 -804120 -754179 -1027393 -1739594 -1677350
29555 -1677350 -245733 970975 152530 -1839326 -2416828 -1059099 18957 -525624 -1170599
29546 -1170599 -323342 970273 895187 -143678 -465844 47040 165411 -365615 -772316
29537 -772316 -1033564 -1724032 -2404427 -2125985 -1332532 -1284413 -1667254 -827767 1419470 3193364
29527 3193364 3164788 2031130 968692 278962 -1017 236138 434397 -180913 -1104162
29518 -1104162 -1071892 -252489 -40827 -442853 91421 1668621 2250211 980764 -220903
29509 -220903 167684 854127 309333 -416929 265670 1419880 1106860 -303822 -926453
29500 -926453 -534548 -380233 -474083 364372 1979972 2840213 2556674 2255389 2326608 1940421
29490 1940421 1040324 697772 1006299 623051 -902002 -2146838 -1987798 -1139651 -636678
29481 -636678 -265269 441722 935383 584210 -47620 -13673 555284 812654 556440 338481
29471 338481 490382 747587 717162 299078 -210346 -265942 356858 1060949 969197 48910
29461 48910 -859774 -1192848 -1148957 -936699 -396632 321890 550285 43977 -561500 -713320
29451 -713320 -692079 -878208 -919030 -295876 723385 1333694 1122462 297579 -706150 -1455260
29441 -1455260 -1701520 -1733008 -2188177 -3129129 -3687375 -3105586 -1821462 -1014467 -1255686
29432 -1255686 -2009697 -2319303 -1662143 -315180 825031 965069 232927 -400173 -230503
29423 -230503 385713 597553 166735 -309133 -156451 631417 1370270 1346196 591979 -113568
29413 -113568 -274950 -454576 -1434185 -2757834 -3005256 -1723451 -195998 169107 -567415
29404 -567415 -1448471 -1974462 -2081750 -1469976 -46785 1271738 1278865 -12427 -1403465
29395 -1403465 -2021921 -2012255 -1774236 -1414279 -1064074 -874762 -489439 624969 2050310
29386 2050310 2541519 1731259 800065 790946 1128178 722740 -211721 -670699 -712359 -1338239
29376 -1338239 -2528452 -2857938 -1525491 441698 1637944 1876689 1603852 783807 -544863
29367 -544863 -1422545 -976844 194538 887104 1116217 1698050 2327894 1778607 125863
29358 125863 -965776 -682367 -181831 -576251 -1362416 -1783970 -2167867 -2641677 -2047750
29349 -2047750 166643 2220686 2161798 870048 740045 1965064 2527136 1681756 854234
29340 854234 710102 -41150 -1908546 -3043028 -1953345 31040 777861 431020 594856
29331 594856 1480990 1885184 1475030 1167292 1317911 1210609 517056 -126095 -292290 -379386
29321 -379386 -715900 -969908 -755758 -100817 861469 1958106 2652470 2420597 1570475
29312 1570475 941567 718307 392419 2307 330699 1432599 2019399 1132097 -308940
29303 -308940 -621848 331581 966921 134830 -1374773 -1831670 -591758 1287840 2287901
29294 2287901 1934478 1033973 660821 1137580 1953044 2382831 2039176 1053454 1761
29285 1761 -463171 -186426 318239 450361 132287 -370030 -931955 -1410853 -1247357 32976
29275 32976 1834398 2739886 2113475 909528 421838 660038 573491 -328017 -1258270 -1192773
29265 -1192773 -155027 845013 978910 405864 -126031 -235177 -187350 -293400 -482953
29256 -482953 -704260 -1251385 -2131283 -2493596 -1573591 -89007 384791 -344791 -670180
29247 -670180 353528 1331302 505239 -1468887 -2297076 -1217419 300223 1062151 1558812
29238 1558812 2277691 2321717 948043 -695600 -861449 396345 1505966 1695588 1608785
29229 1608785 1677026 1321876 169507 -1088797 -1661340 -1662095 -1525488 -1076409 52707 1423140
29219 1423140 1977756 1283632 127391 -307411 326053 1281744 1670126 1459785 1286949
29210 1286949 1396816 1337150 885350 601108 938208 1424827 1460794 1342067 1514727 1359235
29200 1359235 69474 -1541403 -1755483 -620477 -184530 -1468182 -2852244 -2505306 -996463
29191 -996463 -134624 -268854 -283367 341783 955279 974763 505340 -128487 -521542 -132846
29181 -132846 988034 1758644 1297822 231332 -231332 -89944 -254832 -829257 -1051658
29172 -1051658 -807239 -783821 -1014748 -614919 687216 1887565 2020914 1299382 620592
29163 620592 614743 1279244 1891338 1406235 -250474 -1565730 -1164929 156407 455684
29154 455684 -540827 -1285524 -1080576 -1012141 -1761376 -2352508 -1951738 -1286263 -1213267 -1293546
29144 -1293546 -951994 -794705 -1475320 -2266530 -2061049 -1000515 61995 946883 1814382
29135 1814382 2161594 1403891 -20365 -1186237 -1853987 -2192052 -1952883 -954645 162203
29126 162203 673227 779006 996643 1169024 998880 847698 994531 884047 212200 -132795
29116 -132795 484986 1016186 342621 -552954 4081 1399385 1383427 -427717 -1917859
29107 -1917859 -1595412 -330694 472749 545734 16075 -1152867 -2203341 -1771791 12010
29098 12010 1137844 440216 -721225 -624199 340443 685757 153693 -478389 -1035055 -1795760
29088 -1795760 -2243639 -1514546 66054 1182713 1236387 802392 467448 267964 321529
29079 321529 983777 2100199 2866510 2727762 1883735 773415 -359217 -1217755 -1374971
29070 -1374971 -796235 -69029 210700 50752 -155823 -202437 -120465 170204 841675 1688717
29060 1688717 2025926 1396569 260580 -443183 -467146 -503786 -1017076 -1341536 -516440 1243551
29050 1243551 2553156 2343669 921237 -423488 -529374 717181 2145981 2221158 701927
29041 701927 -906623 -1164067 -543594 -580643 -1529621 -2112291 -1609868 -887901 -956960 -1650447
29031 -1650447 -2259371 -2503634 -2320348 -1595998 -693625 -400821 -786923 -964244 -528102
29022 -528102 -252094 -682730 -1117594 -874842 -507385 -616131 -481069 638363 1616221
29013 1616221 683252 -1708362 -3047804 -2061376 -314993 53270 -1015855 -1916139 -1617807
29004 -1617807 -594251 176670 388532 439864 609144 536372 -259803 -1538021 -2530334
28995 -2530334 -2989092 -3322642 -3526089 -2955705 -1666340 -886499 -1286515 -1806835 -1369789
28986 -1369789 -762904 -1298399 -2423668 -2531789 -1636333 -1146981 -1175434 -388228 1189658
28977 1189658 1665786 428038 -474374 572917 2248423 2533178 1748019 1412037 1454352
28968 1454352 817800 -81888 60801 798510 341395 -1264952 -1773405 -220564 1403308
28959 1403308 1167654 88273 350492 1876019 2612706 1767743 823572 1084987 1820821
28950 1820821 1656537 733965 351992 910442 1368897 869533 -34631 -260854 307467
28941 307467 864656 900016 665399 527432 558726 851482 1560765 2410924 2764501 2468576
28931 2468576 2047761 1744390 1076464 -106134 -846070 -266047 874858 853663 -801595
28922 -801595 -2660215 -3123527 -2072784 -534987 598078 1036522 737577 -266610 -1629730
28913 -1629730 -2603647 -2459967 -1172643 317502 814060 94115 -771164 -625509 426132
28904 426132 1243175 1049823 141089 -736725 -1172175 -1142087 -741393 -131601 463611 916847
28894 916847 1270360 1588238 1814393 1807030 1515999 1186183 1273552 1871196 2308812 1854737
28884 1854737 871305 550823 1226272 1786415 1315514 417386 42421 -147379 -1007790
28875 -1007790 -2123838 -2273658 -1424841 -778416 -855858 -1005619 -870991 -786600 -525832 590035
28865 590035 1847050 1308548 -1190952 -3014545 -2116156 31080 628409 -522591 -1332386
28856 -1332386 -932908 -607547 -1226400 -1825065 -1344059 -266750 285121 111489 -124696
28847 -124696 100976 744387 1359968 1434458 898092 337580 286817 422968 46572 -751049
28837 -751049 -1105631 -577367 332174 911823 904440 458896 20769 199855 1095437 1864872
28827 1864872 1690442 1007088 862182 1202657 997796 191980 151661 1539446 2949119
28818 2949119 2688203 1141544 201058 686135 1447831 1114229 -177121 -1207602 -1312313
28809 -1312313 -988142 -919713 -968817 -575000 104711 199318 -557876 -1264577 -1097182 -459037
28799 -459037 -189918 -252130 -140923 -97524 -719173 -1574566 -1457023 -80751 1562520 2583252
28789 2583252 2824450 2133464 390824 -1459119 -1829096 -518009 905730 1324213 1386059
28780 1386059 1878398 2158650 1346512 7541 -634743 -437519 -131600 -23076 -40539
28771 -40539 -482771 -1495378 -2220398 -1682280 -284272 671740 761507 680315 861475 932514
28761 932514 573914 -31554 -716953 -1506602 -2165624 -2237639 -1621820 -634563 386582 1064311
28751 1064311 910310 -20065 -715680 -299552 692021 1025031 575350 369507 837697
28742 837697 1174029 717855 -70783 -508864 -698082 -997548 -1147551 -694198 35346 144776
28732 144776 -596050 -1278945 -941544 106617 532219 -246187 -1019014 -246352 1596414
28723 1596414 2215022 472031 -1880073 -2390759 -1093078 -211448 -968449 -2074624 -1721458
28714 -1721458 -10939 1277940 853325 -733614 -1815546 -1434046 -322971 67549 -573537
28705 -573537 -1072500 -440651 852152 1771278 2100528 2094337 1441882 -220212 -2085087
28696 -2085087 -2749621 -2072689 -1374109 -1574392 -2061796 -1719506 -380819 1033432 1413594
28687 1413594 489291 -689534 -653244 571759 1110539 -222711 -1779535 -1058138 1547598
28678 1547598 2957417 1595541 -605279 -1133813 -44450 955193 1045144 502423 -480954
28669 -480954 -1621472 -1947889 -947089 139706 -350874 -2116873 -3276293 -3075863 -2714078
28660 -2714078 -3161798 -3589999 -2754137 -953667 377074 556482 268406 468873 1379622
28651 1379622 2542122 3289109 3083297 1879383 310384 -863396 -1584963 -2309952 -2885057
28642 -2885057 -2396678 -658948 952679 1159506 706201 1263295 2631974 2739016 755135
28633 755135 -1517609 -2222007 -1809696 -1598399 -1441114 -554002 405279 94757 -1218589
28624 -1218589 -2041534 -2029697 -2092912 -2281440 -1572321 40997 1159835 1129198 855959 962970
28614 962970 785564 -147052 -1184341 -1826011 -2477839 -3227251 -3287972 -2405685 -1428723 -801755
28604 -801755 -8985 804045 483860 -856355 -1183806 395498 1827920 1182850 -261787
28595 -261787 -275307 544034 49286 -1407709 -1411840 206920 697230 -1311779 -3623399
28586 -3623399 -3817203 -2495543 -1608736 -1335639 -550818 697206 1142797 382695 -594047
28577 -594047 -970290 -956156 -899316 -588392 99125 557185 76083 -1138465 -2053170 -1928777
28567 -1928777 -1064256 -324760 -131549 -134522 155803 640709 673516 -204907 -1628396 -2577654
28557 -2577654 -2343956 -1344666 -714940 -958509 -1381652 -1168814 -554645 -339922 -615295
28548 -615295 -763774 -540861 -282949 -115742 119549 149713 -496517 -1417923 -1610022 -1067961
28538 -1067961 -944008 -1661231 -2098402 -1361441 -220613 147946 -109154 -98738 265851
28529 265851 349662 -102556 -858342 -1667424 -2034725 -1188805 763523 2255855 1906346
28520 1906346 316647 -761634 -636978 -45231 290483 343036 207789 -117418 -380595
28511 -380595 -269466 107856 498800 975088 1563758 1866473 1681589 1432086 1266355 498948
28501 498948 -1079869 -2165844 -1571963 -293636 -332435 -1692813 -2233894 -717402 1500502
28492 1500502 2364889 1583269 531827 429711 1239578 2095786 2430274 2548242 2903210
28483 2903210 2997677 1873674 -101123 -1190647 -770774 -486349 -1667677 -2929671 -2212280
28474 -2212280 -212897 536843 -425814 -1008997 -118820 763246 294880 -570958 -327118
28465 -327118 764969 1363662 1008397 327549 33669 470465 1470905 2132767 1503333
28456 1503333 -55922 -998383 -481279 733130 1583437 1875080 1701383 848440 -485254
28447 -485254 -1315631 -1053450 -402333 -399865 -1125999 -1896155 -2162766 -1765094 -859796 4519
28437 4519 306667 292371 616155 1093067 742496 -597888 -1715425 -1630428 -884964 -615455
28427 -615455 -1080058 -1678907 -1776904 -1037301 361341 1410688 963066 -751065 -2040003
28418 -2040003 -1697733 -319142 784740 1172405 1222460 1302139 1632515 2299425 2802339
28409 2802339 2276747 773287 -358085 -9325 1344938 2429074 2690447 2454383 2141306
28400 2141306 1963847 1966797 1880829 1365746 703195 625384 1132174 1252465 449439 -520228
28390 -520228 -738976 -415591 -391464 -927362 -1575437 -1794873 -1262801 -91845 930953
28381 930953 967713 326169 288358 1347002 2405565 2240025 1029463 -109710 -506391
28372 -506391 -388529 -444584 -1162612 -2126536 -2124379 -754430 475895 -24845 -1391915 -1462441
28362 -1462441 -316785 -200111 -1491447 -1618205 703092 2922545 2441930 592817 227018
28353 227018 1178901 1122151 -247313 -1016865 -526004 -84384 -264431 -122509 651093 1165125
28343 1165125 1233814 1664384 2281517 1847377 481871 -21262 874098 1267716 -225467
28334 -225467 -2096770 -2024506 -117405 1464304 1430992 531017 88343 487058 1172769
28325 1172769 1473808 1217286 768998 593475 848487 1397031 1894677 1757156 635669
28316 635669 -730022 -910397 323388 1363830 935536 -33772 -2810 630495 367706
28307 367706 -565995 -430219 939829 1462185 -92691 -2198957 -2795999 -1977472 -1327398
28298 -1327398 -1617789 -2300623 -2641157 -2396980 -1698379 -859248 -101930 702121 1653742
28289 1653742 2319285 2289933 2035080 2196968 2209116 954931 -1129336 -2148131 -1364706
28280 -1364706 -217586 -51032 -295505 133902 937177 1164071 905738 979504 1496649
28271 1496649 1809237 1468331 421954 -1239862 -2968113 -3734171 -3149804 -2160690 -1904752
28262 -1904752 -2364028 -2817416 -3004643 -2996348 -2484462 -1229431 92031 439472 -304071
28253 -304071 -1323953 -1995599 -2359153 -2648249 -2967986 -3317301 -3457190 -2990974 -2005837
28244 -2005837 -1247735 -1123703 -969461 -2778 1335555 1756394 672174 -1258334 -2949763
28235 -2949763 -3668365 -3242176 -2180451 -1461936 -1614795 -2131476 -2269257 -2089241 -2040311
28226 -2040311 -1899065 -1088692 71002 483418 -165235 -890484 -816287 -284680 -26865
28217 -26865 90141 693817 1592406 1702623 499235 -1017053 -1257647 176346 2028739
28208 2028739 2774100 2178164 1288243 1126221 1731816 2373843 2325038 1456536 403705
28199 403705 73643 620401 1082864 588581 -296457 -285659 596285 855254 -217123 -1347179
28189 -1347179 -1198245 -468311 -823751 -2338411 -3377021 -2879597 -1516583 -485227 -268733
28180 -268733 -810133 -1846992 -2613237 -2100502 -264421 1590964 2189976 1620563 845645
28171 845645 376705 66881 -96215 230321 1077180 1803672 1686040 694851 -449966
28162 -449966 -934853 -554428 149856 454366 225801 63574 520508 1243094 1230486 184292
28152 184292 -697115 109399 2352681 3776300 2631762 -21251 -1506738 -922825 -80693
28143 -80693 -616188 -1541108 -929505 890418 1668222 630683 -379433 165000 1080134
28134 1080134 371394 -1542494 -2251942 -729942 1360761 2047729 1381833 689217 518244
28125 518244 380823 60840 68045 659920 1168431 725318 -600000 -1699530 -1493457 -52952
28115 -52952 1380442 1590983 607489 -416208 -504756 253105 1151107 1709392 1772279 1232240
28105 1232240 245969 -464536 -145540 1078581 2243358 2582478 2239008 1894901 1910996
28096 1910996 1860222 881653 -1251762 -3361295 -3740501 -2174898 -412858 13165 -318905
28087 -318905 12562 894787 1105135 663264 807162 1502099 1054003 -1078807 -3013968
28078 -3013968 -3090738 -2066955 -1344845 -718786 315802 553542 -1215348 -3402504 -3170285
28069 -3170285 -586260 1286811 741431 -489162 -224430 1192776 2074259 1884473 1215398
28060 1215398 447674 -210485 -122466 1097193 2702440 3518797 3219604 2302311 1262482
28051 1262482 395902 -47921 -118499 -175819 -197728 381254 1611717 2412277 1746455 42585
28041 42585 -1246655 -1273992 -448821 303148 428084 55815 -203714 70432 478331 198825
28031 198825 -823732 -1661692 -1677294 -1357780 -1383174 -1507566 -1093790 -295843 136694 47775
28021 47775 108816 839690 1924168 2547581 2098295 638326 -1014351 -1847349 -1634005
28012 -1634005 -1175493 -1269466 -1722402 -1783318 -1239951 -502383 228182 1176835 2272198 2818318
28002 2818318 2292460 1201584 701828 1297414 2204478 2269747 1399250 639080 717730 1072079
27992 1072079 828391 283741 524090 1654289 2398337 1801596 537881 -35911 408304
27983 408304 1020068 1031297 564590 216795 271697 498665 626678 842529 1564122 2630420
27973 2630420 3119846 2394857 1037749 203367 254451 645396 951043 1257295 1609012
27964 1609012 1841511 1971313 2065722 1823310 1059316 411433 556590 875977 150627 -1380135
27954 -1380135 -2073714 -1291800 -293516 -195204 -506636 -478598 -470949 -888629 -999529 -139752
27944 -139752 816185 542995 -806059 -1980805 -2412070 -2415864 -2044364 -956312 670842
27935 670842 2010517 2327515 1353603 -662246 -2739432 -3600678 -2994414 -2005271 -1478120
27926 -1478120 -980988 -69998 487675 -71552 -955504 -853135 105052 770622 800741 668158
27916 668158 364638 -378945 -917050 -309133 1009476 1642730 1243966 675943 241947
27907 241947 -663715 -1986558 -2649575 -2169730 -1324569 -789763 -309694 369742 898947
27898 898947 1098184 1254355 1218908 301376 -1417444 -2691972 -2646562 -1850835 -1309095 -1201898
27888 -1201898 -1223981 -1403580 -1861528 -2234546 -1950171 -865718 594902 1662473 1641665
27879 1641665 654115 -147599 141811 780412 202419 -1749616 -3517877 -3928460 -3397596
27870 -3397596 -2678426 -1718327 -507872 113328 -407634 -1174630 -942148 89111 626173
27861 626173 175234 -416728 -304360 311925 680645 440465 -213184 -914534 -1341926 -1215772
27851 -1215772 -465631 475867 840144 353379 -228678 51790 962163 1201500 159410
27842 159410 -1224061 -1812731 -1648492 -1301545 -769181 -27961 175492 -578073 -1144741
27833 -1144741 -217695 1476045 2057124 1311140 772556 1019894 947379 130629 -186085
27824 -186085 630214 1193232 212762 -1457117 -2199473 -1836888 -1121041 -130192 1325427
27815 1325427 2521145 2594936 2034092 2001395 2522881 2671957 2330958 2385736 3055045 3267604
27805 3267604 2189629 570983 -26885 969229 2543953 3274806 2855371 2170743 1883920
27796 1883920 1564293 730879 86953 585074 1604198 1556426 414033 -13410 1138361
27787 1138361 2387624 2262594 1539909 1754018 2675238 2917730 2298536 1911565 2189024
27778 2189024 2373241 1842599 807285 -219666 -719193 -245047 835502 1139987 -40285
27769 -40285 -1292436 -669502 1574011 3298334 3387115 2753391 2357254 1936744 1231851
$$ [...]
##END NTUPLES=NMR SPECTRUM
##END=
