##TITLE=31Pdec_LY-7Dix 51.B
 CD3CN, 24 sc
 13.05.2021
##JCAMPDX= 6.0         $$ Bruker NMR JCAMP-DX V2.0
##DATA TYPE= NMR SPECTRUM
##DATA CLASS= NTUPLES
##ORIGIN= UXNMR, Bruker Analytische Messtechnik GmbH
##OWNER= root
$$ XWIN-NMR		Version 3.5
$$ Thu May 13 09:39:08 2021 Russian Standard Time (UT+4h)  she@DPX200
##.OBSERVE FREQUENCY= 81.013821
##.OBSERVE NUCLEUS= ^31P
##.ACQUISITION MODE= SIMULTANEOUS
##.ACQUISITION SCHEME= undefined
##.AVERAGES= 24
##.DIGITISER RES= 16
##SPECTROMETER/DATA SYSTEM= spect
##.PULSE SEQUENCE= zgpg30
##.SOLVENT NAME= CDCl3
##.SHIFT REFERENCE= (INTERNAL, CDCl3, 0, 248.564)
##AUDIT TRAIL= $$ (NUMBER, WHEN, WHO, WHERE, WHAT)
$$ ##TITLE= Audit trail, XWIN-NMR		Version 3.5
$$ ##JCAMPDX= 5.01
$$ ##ORIGIN= Bruker BioSpin GmbH
$$ ##OWNER= she
$$ F:/spectra/data/she/nmr/P31/1/pdata/1/auditp.txt
$$ ##AUDIT TRAIL=  $$ (NUMBER, WHEN, WHO, WHERE, WHAT)
(   1,<2021-05-13 09:37:57.32 +0400>,<she>,<DPX200>,
      <created by zg, POWCHK disabled, PULCHK disabled
       configuration hash MD5:
       00 E9 B6 7A A2 85 ED C7 34 08 36 98 17 FE 4E 26
       data hash MD5: 32K
       43 30 98 5B A3 2C 7C 1D FA 17 08 9D DE DA 89 DA>)
(   2,<2021-05-13 09:38:04.96 +0400>,<she>,<DPX200>,
      <Start of raw data processing
       efp BC_mod = 2 LB = 1 FT_mod = 6 PKNL = 1 PHC0 = -6415.144 PHC1 = 585.8007 SI = 64K 
       data hash MD5: 64K
       15 A6 45 BF 76 1D E3 FC F5 74 20 D9 DD 61 79 D8>)
(   3,<2021-05-13 09:38:30.09 +0400>,<she>,<DPX200>,
      <pk PHC0 = 36.46605 PHC1 = -219.4 
       data hash MD5: 64K
       A9 5B 13 38 70 4C CA B5 75 31 6C A2 35 AA 48 AA>)
(   4,<2021-05-13 09:38:33.21 +0400>,<she>,<DPX200>,
      <abs ABSG = 5 
       data hash MD5: 64K
       48 CF 7C 29 0E AA B3 93 72 19 2B F6 1A 97 F7 C5>)
$$ ##END=
$$ 
$$ hash MD5
$$ CF 5C EF 9D 68 39 01 20 D8 4F 0F 51 52 82 F6 6D
##$RELAX= 
##$RELAX= 
##$RELAX= 
##$RELAX= 
##$RELAX= 
##$RELAX= 
##$RELAX= 
##$RELAX= 
$$ Bruker specific parameters
$$ --------------------------
##$DU= <F:/spectra>
##$EXPNO= 1
##$NAME= <P31>
##$PROCNO= 1
##$TYPE= <nmr>
##$USER= <she>
##$AMP= (0..31)
100 100 100 100 100 100 100 100 100 100 100 100 100 100 100 100 100 100 
100 100 100 100 100 100 100 100 100 100 100 100 100 100 
##$AQSEQ= 0
##$AQ_mod= 1
##$AUNM= <au_zg>
##$AUTOPOS= <>
##$BF1= 81.014009
##$BF2= 200.13
##$BF3= 200.13
##$BF4= 200.13
##$BF5= 200.13
##$BF6= 200.13
##$BF7= 200.13
##$BF8= 200.13
##$BYTORDA= 1
##$CFDGTYP= 0
##$CFRGTYP= 5
##$CHEMSTR= <none>
##$CNST= (0..31)
1 1 145 1 1 1 1 1 1 1 1 1 1 1 1 1 1 1 1 1 1 1 1 1 1 1 1 1 1 1 1 1 
##$CPDPRG= <waltz16>
##$CPDPRG1= <>
##$CPDPRG2= <waltz16>
##$CPDPRG3= <>
##$CPDPRG4= <mlev>
##$CPDPRG5= <mlev>
##$CPDPRG6= <mlev>
##$CPDPRG7= <mlev>
##$CPDPRG8= <mlev>
##$CPDPRGB= <>
##$CPDPRGT= <>
##$D= (0..31)
0 1 0 0 0 0 0 0 0 0 0 0.03 2e-05 3e-06 0 0 0 0 0 0 0 0 0 0 0 0 0 0 0 0 
0 0 
##$DATE= 1620884276
##$DBL= (0..7)
120 120 120 11 120 120 24 19 
##$DBP= (0..7)
150 150 150 150 150 150 150 150 
##$DBP07= 0
##$DBPNAM0= <>
##$DBPNAM1= <>
$$ [...]
##$SUBNAM3= <"">
##$SUBNAM4= <"">
##$SUBNAM5= <"">
##$SUBNAM6= <"">
##$SUBNAM7= <"">
##$SUBNAM8= <"">
##$SUBNAM9= <"">
##$SW= 501.771253377433
##$SWIBOX= (0..15)
0 1 3 0 0 0 0 0 0 0 0 0 0 0 0 0 
##$SW_h= 40650.406504065
##$TD= 32768
##$TD0= 1
##$TE= 0
##$TE2= 300
##$TE3= 300
##$TEG= 300
##$TL= (0..7)
0 120 53 12 22 120 120 120 
##$TP= (0..7)
150 150 150 150 150 150 150 150 
##$TP07= 0
##$TPNAME0= <>
##$TPNAME1= <>
##$TPNAME2= <>
##$TPNAME3= <>
##$TPNAME4= <>
##$TPNAME5= <>
##$TPNAME6= <>
##$TPNAME7= <>
##$TPOAL= (0..7)
0.5 0.5 0.5 0.5 0.5 0.5 0.5 0.5 
##$TPOFFS= (0..7)
0 0 0 0 0 0 0 0 
##$TUNHIN= 0
##$TUNHOUT= 0
##$TUNXOUT= 0
##$USERA1= <user>
##$USERA2= <user>
##$USERA3= <user>
##$USERA4= <user>
##$USERA5= <user>
##$V9= 5
##$VALIST= <valist>
##$VCLIST= <CCCCCCCCCCCCCCC>
##$VD= 0
##$VDLIST= <DDDDDDDDDDDDDDD>
##$VPLIST= <PPPPPPPPPPPPPPP>
##$VTLIST= <TTTTTTTTTTTTTTT>
##$WBST= 1024
##$WBSW= 4
##$XGAIN= (0..3)
0 0 0 0 
##$XL= 0
##$YL= 0
##$YMAX_a= 6769
##$YMIN_a= -22935
##$ZGOPTNS= <>
##$ZL1= 120
##$ZL2= 120
##$ZL3= 120
##$ZL4= 120
##$ABSF1= 248.5645
##$ABSF2= -253.2056
##$ABSG= 5
##$ABSL= 3
##$ALPHA= 0
##$AQORDER= 0
##$ASSFAC= 0
##$ASSFACI= 0
##$ASSFACX= 0
##$ASSWID= 0
##$AUNMP= <proc_1d>
##$AZFE= 0.1
##$AZFW= 0.5
##$BCFW= 0
##$BC_mod= 2
##$BYTORDP= 0
##$COROFFS= 0
##$CY= -3
##$DATMOD= 1
##$DC= 0
##$DFILT= <>
##$DTYPP= 0
##$F1P= 0
##$F2P= 0
##$FCOR= 1
##$FTSIZE= 65536
##$FT_mod= 6
##$GAMMA= 0
##$GB= 0
##$INTBC= 1
##$INTSCL= 5.30512e-09
##$ISEN= 30
##$LB= 1
##$LEV0= 0
##$LPBIN= 0
##$MAXI= 10000
##$MC2= 0
##$MEAN= 0
##$ME_mod= 0
##$MI= 50
##$NCOEF= 0
##$NC_proc= -3
##$NLEV= 6
##$NOISF1= 182.463
##$NOISF2= 159.3651
##$NSP= 0
##$NTH_PI= 0
##$NZP= 0
##$OFFSET= 248.5645
##$PC= 4
##$PHC0= -6378.678
##$PHC1= 366.4007
##$PH_mod= 1
##$PKNL= yes
##$PPARMOD= 0
##$PSCAL= 0
##$PSIGN= 0
##$REVERSE= no
##$SF= 81.014009
##$SI= 65536
##$SIGF1= 159.3651
##$SIGF2= -187.1042
##$SINO= 113.3802
##$SIOLD= 16384
##$SREGLST= <1H.CDCl3>
##$SSB= 0
##$STSI= 65536
##$STSR= 0
##$SW_p= 40650.406504065
##$SYMM= 0
##$S_DEV= 0
##$TDeff= 32768
##$TDoff= 0
##$TI= <>
##$TILT= no
##$TM1= 0
##$TM2= 0
##$TOPLEV= 0
##$USERP1= <user>
##$USERP2= <user>
##$USERP3= <user>
##$USERP4= <user>
##$USERP5= <user>
##$WDW= 1
##$XDIM= 65536
##$YMAX_p= 272389086
##$YMIN_p= -5207693
$$ End of Bruker specific parameters
$$ ---------------------------------
##NTUPLES= NMR SPECTRUM
##VAR_NAME=  FREQUENCY,     SPECTRUM/REAL,   SPECTRUM/IMAG
##SYMBOL=    X,             R,               I
##VAR_TYPE=  INDEPENDENT,   DEPENDENT,       DEPENDENT
##VAR_FORM=  AFFN,          ASDF,            ASDF
##VAR_DIM=   65536,         65536,           65536
##UNITS=     HZ,            ARBITRARY UNITS, ARBITRARY UNITS
##FACTOR=    0.620285442955139, 1,           1
##FIRST=     20137.2065510759, 0,            0
##LAST=      -20513.1999529892, 0,           0
##MIN=       -20513.1999529892, -5207693,    0
##MAX=       20137.2065510759, 272389086,    0
$$ Real data points
##PAGE= N=1
##DATA TABLE= (X++(R..R)), XYDATA
$$ [...]
38214 302808 -9110 -389269 -574146 -375040 69586 311767 83260 -328881 -445356 -227318
38204 -227318 -29280 -7129 16806 96009 26375 -210682 -316930 -196737 -188585 -489188 -732442
38193 -732442 -523877 -81472 105052 26959 68592 289021 323835 25755 -286358 -343395
38183 -343395 -267505 -208324 -15303 438572 872157 880515 495175 159713 158386 313388 306900
38172 306900 113247 -23962 38620 157046 122647 -39747 -119785 -40354 21046 -118548
38162 -118548 -404018 -637874 -717918 -677927 -584435 -506534 -503669 -527136 -422813 -152383 96353
38151 96353 162123 145482 208355 274141 175355 -1128 -9068 160970 275945 241266 191412
38140 191412 186149 122159 -2507 -31764 72880 182815 282223 479152 665470 535949
38130 535949 94418 -222996 -133591 123494 232684 264363 396680 503299 388131 181607
38120 181607 124699 158665 102167 51873 210698 464050 530845 424544 367622 354135 218619
38109 218619 55682 115111 310700 294129 29227 -162948 -162470 -172881 -211354 7857 508263
38098 508263 855017 769065 510610 381301 257092 -51788 -345559 -341177 -167797 -158893
38088 -158893 -338649 -475927 -485071 -421179 -224991 153149 469998 405458 39036 -213528
38078 -213528 -141372 65633 161448 108408 -27492 -189024 -277567 -199773 -27869 47120 -36385
38067 -36385 -142910 -134308 -6025 163900 277930 254537 126334 65652 185880 373554
38057 373554 450104 412885 350922 229626 -15586 -254700 -295100 -195712 -179837 -260372 -247835
38046 -247835 -136242 -149966 -335597 -440097 -335585 -258468 -425835 -673812 -718096 -569590
38036 -569590 -427770 -313345 -93518 203139 370722 321352 181433 81358 35357 49555
38026 49555 163600 323914 371354 245836 84805 9131 -93984 -410532 -833133 -943080
38016 -943080 -490630 198554 490647 144626 -427166 -686700 -583064 -463422 -516826 -588354
38006 -588354 -524745 -406378 -339673 -265690 -136211 -93085 -268095 -513693 -541622 -296779
37996 -296779 -25125 32032 -120170 -310734 -414224 -426597 -379775 -248993 6013 301600
37986 301600 421087 254148 -1995 -36717 184480 404966 469769 501556 595228 593384 363108
37975 363108 93840 62183 227763 327826 287097 250184 242701 101748 -205588 -448787
37965 -448787 -419472 -179720 43988 70735 -155568 -516945 -715468 -519822 -89413 143917
37955 143917 7626 -197998 -137803 108517 212446 57431 -171884 -269016 -184463 16237
37945 16237 200304 208414 2051 -244628 -319300 -206472 -39151 118465 281682 381760
37935 381760 297090 92105 50176 353288 812969 1029780 808075 349306 22329 -21590
37925 -21590 38751 -26553 -181769 -187052 51237 340846 458911 407112 328856 298252 301387
37914 301387 322148 329237 267386 164050 136084 185446 133363 -101505 -324886 -352023 -294331
37903 -294331 -324735 -346417 -214972 -117924 -309458 -564818 -402278 131602 428720 207694
37893 207694 -85655 -10047 233330 251677 121296 143980 264398 230213 115994 173283
37883 173283 289037 121502 -251366 -332670 59726 502615 567272 355729 244835 357041
37873 357041 492707 444781 233940 89471 217224 516476 614700 337036 8696 33774
37863 33774 288889 282250 -129533 -565087 -681058 -534221 -321639 -143183 -123293 -377286
37853 -377286 -700116 -660279 -194971 235172 282011 140382 117910 165141 148473 226282 544438
37842 544438 824768 688305 217609 -185594 -348185 -365993 -264067 -24449 163346 91226
37832 91226 -95742 -92947 77545 164376 181686 351445 582630 505993 99217 -195547 -118329
37821 -118329 76760 116072 117581 251905 344495 139256 -264002 -526618 -487392 -250521
37811 -250521 9025 156321 153239 153275 384551 798458 1015019 782932 319838 17912 -18601
37800 -18601 47928 95969 95899 -13962 -251909 -466410 -498083 -402868 -324040 -231078 -10308
37789 -10308 251489 328864 197953 80481 113449 182968 153804 86603 120689 250000 316800
37778 316800 184454 -133678 -484838 -695014 -705655 -597441 -466277 -314260 -97500 172368
37768 172368 431417 619263 675452 542359 248288 -62306 -253595 -305182 -246855 -88756
37758 -88756 93039 123584 -59640 -247143 -198279 6161 64818 -92529 -186447 3067
37748 3067 313584 429597 297467 139778 121114 174304 169450 107542 66724 43011 -38174
37737 -38174 -165103 -216057 -143534 -73003 -112964 -165040 -98511 -49562 -285247 -735278 -954923
37726 -954923 -702034 -276386 -57817 24870 221389 375120 97460 -516990 -861786 -629207
37716 -629207 -201024 -16968 35015 273476 595815 615808 264010 -138096 -328932 -300646
37706 -300646 -106951 181758 348758 195692 -117207 -186667 119680 523936 748341 780119
37696 780119 679865 458183 259048 331921 636815 778998 554892 271892 261806 361568
37686 361568 222704 -91460 -224864 -108920 -8942 -48045 -81643 -46235 -63706 -159729 -209643
37675 -209643 -205866 -262848 -326519 -217523 -5829 22545 -155771 -235722 -92251 49573 76051
37664 76051 162289 293963 105741 -484808 -942878 -829744 -453249 -339243 -417551 -289805
37654 -289805 -16196 13321 -155960 -69330 354027 665892 590821 349154 173226 684
37644 684 -200209 -255414 -128939 -68141 -227760 -464212 -626545 -730528 -749029 -576953 -303663
37633 -303663 -168428 -158566 -23147 245114 364291 276638 229254 233632 -16237 -512774 -797611
37622 -797611 -696899 -594023 -668512 -525480 -12424 279926 -66340 -499918 -353670 37079
37612 37079 -73596 -538472 -569803 -78192 228235 46232 -162327 -100460 -36189 -84987
37602 -84987 65382 426329 485237 88197 -150665 230249 806076 930756 627169 319989
37592 319989 122742 -84664 -213098 -116625 58557 121030 194548 419862 553559 322040
37582 322040 -39264 -89241 123438 164308 -58848 -161986 92666 466061 628599 539627
37572 539627 328860 70123 -189909 -352846 -339186 -171089 35242 118490 -9543 -215140
37562 -215140 -233153 -20702 130442 -14127 -306964 -493189 -610567 -810617 -933171 -662278
37552 -662278 -94703 241760 57608 -310143 -351395 -18195 287199 251793 -2913 -115269
37542 -115269 85938 409769 552952 445795 264373 147339 66572 1504 45644 237347
37532 237347 442611 520540 472087 342668 150143 -4145 25032 153229 85095 -229882
37522 -229882 -443212 -327828 -144976 -192128 -290819 -119492 201389 320005 257174 298769
37512 298769 413449 308075 8563 -145308 -86421 -89441 -236424 -341075 -442107 -789189
37502 -789189 -1227604 -1213545 -661996 -190374 -221576 -400574 -263453 43783 152495 98581
37492 98581 60936 -109135 -531383 -805139 -494574 107961 312788 2061 -313895 -338333
37482 -338333 -296519 -373655 -395744 -208140 55335 222486 269237 176700 -72682 -299598
37472 -299598 -259951 -25683 96486 58243 106427 275770 277948 35864 -102248 88131
37462 88131 323847 269552 67877 83684 337869 531495 512989 432089 475492 645159 765532
37451 765532 622692 207313 -135290 -22802 403919 547478 175654 -172986 49123 537177
37441 537177 536296 -49545 -527331 -430475 -107269 -80317 -287170 -322985 -130123 -10260 -75564
37430 -75564 -107727 10249 75181 -88214 -317945 -347999 -186938 -46333 15352 136641
37420 136641 355073 508123 493983 408693 310693 72190 -342983 -647786 -549639 -175306
37410 -175306 124825 309642 616890 1013894 1112171 763459 342749 207637 219125 88621
37400 88621 -105414 -109560 33485 110490 165597 368889 562912 412116 -4310 -218008
37390 -218008 -66630 79690 -66195 -278510 -223247 54026 294110 385060 306010 -7704
37380 -7704 -453687 -669100 -476703 -216051 -279749 -507823 -456528 -140394 -20492 -252039
37370 -252039 -434250 -253930 42324 61263 -167430 -318471 -252277 -82313 98595 274661
37360 274661 353381 217911 -54336 -222140 -163967 12637 163383 258677 291553 176880
37350 176880 -129792 -457048 -492176 -103135 443169 672603 372413 -170870 -474673 -374495
37340 -374495 -142134 -113436 -334999 -598758 -672150 -435007 49783 500769 609377 403750
37330 403750 278701 505604 864702 970335 807832 661837 620657 513907 329078 298194
37320 298194 474303 588476 498641 438546 574492 623838 258915 -317497 -587209 -418781
37310 -418781 -195547 -249673 -479281 -574099 -379406 10584 330269 309452 -38777 -316992
37300 -316992 -160377 266755 466044 299303 157724 354267 682588 758072 525046 216538
37290 216538 25769 16296 158141 255929 47048 -411652 -670919 -464892 -146830 -213020
37280 -213020 -560362 -635983 -267176 102447 79791 -168350 -242956 -44087 243708 481903
37270 481903 656549 742765 701591 579727 476303 421713 367326 277247 183420 164812 275093
37259 275093 459018 578235 591397 645292 855584 1052824 942507 520905 125100 22102
37249 22102 145455 304129 438146 551938 593031 553377 531064 531121 358755 -98758 -608488
37238 -608488 -820122 -677268 -407681 -184672 -16224 88157 95891 106788 287785 584741
37228 584741 702905 476255 100299 -109896 -69459 68632 133940 40297 -233248 -596623
37218 -596623 -813292 -672935 -246692 127202 168482 -93705 -436185 -727416 -986539 -1183810
37208 -1183810 -1152548 -813904 -388018 -194490 -243876 -223009 38649 287892 207723 -92005
37198 -92005 -206268 -7540 210242 219153 190765 358757 585929 556506 283236 102279
37188 102279 166838 256263 173313 36572 -34 -60753 -302275 -528507 -407851 -32082
37178 -32082 112378 -184842 -545175 -529358 -202196 67048 146840 182340 224899 157935 -29732
37167 -29732 -191081 -266088 -321008 -312486 -90930 279302 479788 359129 147142 72535 9291
37156 9291 -241999 -513741 -451088 -68971 202896 81837 -229804 -376338 -306704 -241043
37146 -241043 -306414 -382513 -288382 -7804 283751 360272 119005 -327210 -710803 -797305
37136 -797305 -554359 -157918 159257 268902 182302 -24596 -263701 -411225 -323122 25502
37126 25502 432304 605301 450120 157398 -28154 -60131 -67309 -141034 -221369 -185222 -3295
37115 -3295 200011 250004 110448 -49382 -37835 114541 182750 47396 -127951 -91631 185430
37104 185430 483036 597978 555897 529819 593853 625718 488147 256695 157678 256170 333994
37093 333994 173867 -144124 -374375 -454735 -539715 -710332 -838148 -764522 -469197 -39401
37083 -39401 396056 687268 741087 589048 297347 -114869 -541828 -718612 -520204 -218277
37073 -218277 -146055 -211953 -106582 105947 78236 -162736 -207514 698 33450 -214982
37063 -214982 -236127 208694 534918 192421 -444852 -666096 -479322 -405533 -556785 -648095
37053 -648095 -678177 -826009 -834170 -318941 358013 384901 -247699 -629203 -272280 229416
37043 229416 211372 -140338 -315327 -272227 -181603 83756 619046 1047480 983415 647177
37033 647177 494227 478755 218007 -279592 -574282 -424399 -29037 327705 523756 533294
37023 533294 432429 430303 616202 740822 526053 118092 -65581 97792 304758 249362
37013 249362 -70626 -471880 -783718 -899194 -800809 -582172 -375720 -284647 -397388 -718765
37003 -718765 -1027901 -1015778 -683403 -379517 -302526 -239377 -6557 156403 -38575 -398298
36993 -398298 -479174 -209717 83324 185653 194813 256431 388528 528488 533442 240328 -248777
36982 -248777 -509108 -303330 28037 12941 -294924 -480928 -420056 -323358 -260595 -119857
36972 -119857 15791 -59958 -237065 -198585 13688 23020 -251372 -479765 -513419 -579351 -750715
36961 -750715 -734224 -396865 -46631 52469 38237 91111 113257 8129 -100292 -165132 -339992
36950 -339992 -557118 -416503 179366 695641 657162 303141 140733 200812 210535 192198
36940 192198 341790 523146 447574 242978 301052 599098 687792 379197 -15825 -197823
36930 -197823 -211225 -186841 -128974 -59170 -47789 -18996 175426 433517 471803 269194 99443
36919 99443 51548 -95449 -384044 -474038 -179051 136682 31930 -373538 -584963 -420328
36909 -420328 -168195 -100941 -149372 -129996 -64435 -127319 -361285 -571032 -544256 -346916 -298564
36898 -298564 -566021 -862957 -740904 -182637 308194 295126 -99324 -412893 -385478 -116242
36888 -116242 180478 357089 330434 115742 -113680 -154432 -3952 134390 99747 -58831
36878 -58831 -182543 -186082 -99818 16832 148994 306343 446091 461344 307694 124725
36868 124725 122674 306691 425384 285779 34334 1421 305010 720606 924323 766561
36858 766561 329491 -168098 -509275 -615348 -572299 -483674 -341499 -128755 15625 -90868
36848 -90868 -376175 -498648 -225560 275399 615157 587977 326807 119757 148087 359769
36838 359769 532083 483717 262425 85361 78213 149985 157463 90406 22813 -22779 -64171
36827 -64171 -87074 -82004 -84744 -86200 9056 215735 362792 321993 246452 356130 543040
36816 543040 477094 134024 -88861 82923 411164 510510 388405 337840 418112 372799
36806 372799 73942 -243476 -299092 -117462 70279 129187 81396 -21548 -105450 -6054
36796 -6054 391165 896434 1089405 781553 287336 72041 209282 389143 416282 415105
36786 415105 476365 418408 123617 -128723 16425 460944 768942 748686 591572 454367
36776 454367 268666 32672 -57288 86872 282972 366467 396528 452878 481666 462838 459403
36765 459403 394795 118028 -177481 -32034 536698 836540 442222 -101716 -46993 456337
36755 456337 678160 474628 364339 506637 429789 -45987 -368427 -116405 279792 172973
36745 172973 -325290 -516052 -84702 538844 776270 559648 322262 443352 767448 761082
36735 761082 223900 -334994 -298542 221050 548399 392632 137465 126709 201007 151546
36725 151546 128630 282164 415411 347522 260796 330869 352270 117520 -150102 -166055 -99529
36714 -99529 -252565 -461500 -330386 84452 329550 229866 54839 44650 189011 449118
36704 449118 784783 961310 732196 251190 -54081 -49828 -5305 -127366 -332802 -500810
36694 -500810 -597597 -518744 -167624 256839 402807 256150 140223 174062 121255 -124297
36684 -124297 -313627 -274135 -185957 -212566 -202434 -17372 139336 13509 -303610 -539434
36674 -539434 -615102 -607329 -511771 -312239 -158250 -216046 -419456 -575597 -633977 -652476 -585045
36663 -585045 -332950 19571 225034 156655 -54832 -185616 -133081 35260 177891 213770
36653 213770 180533 149143 110846 16987 -103575 -178873 -219416 -265867 -228973 32437 448270
36642 448270 740328 745155 570518 392158 278658 254952 315431 299431 -3270 -492958
36632 -492958 -729543 -435975 133036 482724 395439 31162 -314559 -401119 -161444 187473
36622 187473 278170 -4836 -369497 -484251 -353433 -201437 -164515 -254754 -438538 -559619
36612 -559619 -377559 82209 389398 193158 -281334 -501558 -300009 7142 111632 26562
36602 26562 -88163 -141765 -101506 34596 199491 314830 377973 386401 264504 31536 -64043
36591 -64043 183266 585299 734906 517734 207234 48205 1597 -53111 -113090 -151046
36581 -151046 -218795 -324496 -341337 -161900 124983 295204 206803 -59384 -262466 -242209
36571 -242209 -108335 -88885 -172240 -104223 154488 238887 -102089 -533772 -542773 -160746 134506
36560 134506 154963 166800 308035 350223 191170 116598 305822 453476 209580 -271893
36550 -271893 -548358 -462169 -206168 23830 152143 122830 -32818 -98759 92596 367175
36540 367175 381333 67131 -301798 -478219 -478061 -438484 -420167 -400336 -339974 -215645 -61663
36529 -61663 14296 -61309 -199975 -206544 11790 321912 463524 288402 -69604 -303615
36519 -303615 -285335 -242600 -438434 -731614 -705280 -264060 179285 242486 40981 -75653
36509 -75653 -25929 23525 20229 76030 216774 330903 358445 353669 379538 472060 651663
36498 651663 847894 903182 774404 609544 504352 369369 201503 233119 534041 713602
36488 713602 408011 -117200 -304114 -125880 -66044 -307591 -493959 -385382 -215938 -210720
36478 -210720 -234759 -161530 -137983 -203233 -82000 302726 524211 265896 -121905 -136615
36468 -136615 118783 199998 82259 87233 227346 234910 162116 313660 566068 420141 -114043
36457 -114043 -329892 172822 844687 944068 501315 81296 -67019 -118843 -159495 -92444
36447 -92444 14180 -42424 -210053 -214505 -28231 45571 -162242 -451639 -590555 -602848 -580705
36436 -580705 -468690 -227947 -25912 -52185 -259067 -460622 -591592 -692928 -725243 -605881
36426 -605881 -412495 -346945 -447856 -498152 -306458 29229 244609 232108 128113 96206
36416 96206 136428 146743 89048 15030 -42425 -119295 -241890 -354697 -372414 -289833 -205162
36405 -205162 -223875 -348679 -473750 -488402 -369554 -155312 133577 461306 666248 526714
36395 526714 48378 -416098 -502845 -247578 14294 114185 166394 199558 6923 -442357
36385 -442357 -725192 -432428 213023 551385 284883 -224671 -493175 -448509 -311962 -206877
36375 -206877 -89687 67402 214056 295427 282934 181693 69051 47588 101809 93591 -40323
36364 -40323 -187474 -215091 -110527 93514 381454 641446 657087 380198 85151 58123
36354 58123 224907 294946 204708 171861 310888 438703 338343 38082 -258534 -387310
36344 -387310 -295883 -28430 272633 438335 422574 322111 222828 124576 51276 99930 284418
36333 284418 428313 331586 2685 -359273 -575673 -608641 -508974 -330130 -103094 136691
36323 136691 306670 298144 112062 -50650 30571 296864 449648 367077 297481 474021
36313 474021 705807 626484 278438 117940 369762 684075 627014 285146 105844 247148
36303 247148 397978 274689 23149 -24335 172603 327643 235207 45093 71613 405258
36293 405258 790891 901852 705018 508909 618481 972182 1189991 985683 455375 -66027
36283 -66027 -340933 -359932 -234110 -78103 38367 135071 297621 512990 581119 348299
36273 348299 7836 -44445 277539 579176 458216 -5001 -390848 -448304 -265864 -23924
36263 -23924 188370 315661 312318 230528 176752 135248 -18618 -283720 -470722 -455227 -353841
36252 -353841 -343398 -416681 -433927 -336258 -196066 -111451 -140512 -278584 -411880 -363761 -94118
36241 -94118 202345 302266 201213 43658 -116791 -314250 -466994 -402359 -144204 25475
36231 25475 -74421 -245464 -159536 198237 532053 658273 708063 837172 936416 813212
36221 813212 547847 429204 536202 619673 488011 291378 251511 295457 221557 114611
36211 114611 246215 545950 548529 42627 -539302 -659140 -381979 -203884 -297557 -338666
36201 -338666 -111198 117483 26137 -239014 -258957 73244 447183 599633 623642 707539
36191 707539 749118 448202 -222984 -839894 -953884 -611931 -270585 -211106 -263641 -181879
36181 -181879 -31306 7958 17089 193677 432926 427306 191277 99960 295802 433712 229065
36170 229065 -77079 -107021 56183 28755 -270588 -556760 -648135 -633934 -579141 -415309
36160 -415309 -183090 -67652 -95091 -68868 83684 167968 63847 -37527 83239 357069
36150 357069 577565 687857 713760 568580 168182 -335245 -647399 -636398 -406742 -129917
36140 -129917 65549 114645 82399 151818 403060 662639 702413 512538 241621 -33599
36130 -33599 -305091 -487747 -473492 -283627 -15491 268965 443711 284872 -188373 -497858
36120 -497858 -214795 385405 600337 237570 -177522 -207796 -26822 59005 125379 335142
36110 335142 524916 488498 373956 386473 355778 54741 -261617 -152728 280342 490303
36100 490303 288694 43184 17423 23971 -112604 -214498 -117270 -5348 -102187 -302932
36090 -302932 -382168 -353116 -376747 -475147 -528701 -421111 -75165 455796 838833 689745
36080 689745 105141 -342542 -338376 -206970 -297542 -383372 -99589 346973 449885 192881
36070 192881 -1421 -11202 -105214 -296728 -238690 91420 194617 -185759 -599920 -543552
36060 -543552 -183779 -49930 -290313 -614565 -757458 -646739 -291751 152295 361391 212156
36050 212156 30856 148934 375818 304978 7306 -60066 190486 318931 57653 -298693
36040 -298693 -405779 -359495 -381651 -349594 -19986 464297 672529 440733 28751 -263914
36030 -263914 -377621 -368726 -250846 -48512 148826 266877 280410 148617 -135319 -382557
36020 -382557 -276010 254456 824994 935037 493858 -115305 -482007 -535608 -444865 -325043
36010 -325043 -176566 -19655 82044 131807 198513 278399 282248 214061 239057 464126 723113
35999 723113 709126 313998 -249444 -662373 -774644 -679023 -582854 -613316 -705024 -678892 -451186
35988 -451186 -131459 110571 210929 195792 86547 -81439 -211717 -246075 -281245 -461195
35978 -461195 -758228 -967846 -918162 -601017 -139710 253817 343648 70922 -306055 -440508
35968 -440508 -289654 -125912 -147309 -264587 -315965 -287057 -223312 -105330 65536 195890
35958 195890 223515 191118 122287 -21131 -176169 -163896 38295 198527 152537 29624
35948 29624 -15623 -78414 -268872 -407264 -275580 -36036 -36670 -259026 -331275 -107715 123308
35937 123308 97279 -75159 -145707 -58927 93194 222263 209748 -63808 -492006 -727414
35927 -727414 -571960 -241805 -75377 -107380 -118277 -10901 66685 -43852 -303261 -516494
35917 -516494 -507925 -271556 5183 108871 24428 -75008 -81592 -72923 -116323 -100861 90004
35906 90004 323672 309358 -46506 -486900 -649627 -430243 -74551 98524 48962 12929
35896 12929 114769 137815 -138465 -495852 -479021 -41652 344425 335218 145363 134760 264960
35885 264960 271550 163727 179973 330607 345071 101037 -185603 -277483 -199832 -106323 -23372
35874 -23372 142432 398328 556409 376630 -132368 -586279 -561756 -123345 177041 -32248
35864 -32248 -468766 -602165 -355452 -101033 -63732 -79345 45295 252080 392775 424339
35854 424339 355271 192101 6808 -112539 -208107 -362344 -454652 -251995 198172 509522
35844 509522 400410 5353 -340492 -434434 -254973 89814 351752 307096 67712 10412
35834 10412 246921 400403 119108 -400299 -672909 -565155 -382770 -387003 -509084 -563753
35824 -563753 -509892 -416344 -315751 -188510 -42587 41116 -39906 -273563 -457917 -364173
35814 -364173 -10791 331358 452150 396029 287502 123911 -137314 -409911 -541876 -489367
35804 -489367 -347892 -278929 -425329 -755378 -966200 -755190 -254590 54990 -36782 -242753
35794 -242753 -318224 -436418 -729493 -860837 -539327 -158526 -313871 -834766 -965013 -505390
35784 -505390 -86086 -144133 -305280 -115342 206893 229759 74921 156306 426225 460175
35774 460175 176715 -59802 -43301 44444 67363 157757 355597 395706 87231 -343685
35764 -343685 -530560 -428535 -275394 -188508 -39709 247945 460825 283146 -294738 -855969
35754 -855969 -931384 -486387 58591 313934 296070 241744 216420 107363 -88134 -222744
35744 -222744 -248702 -271695 -311660 -242592 -57788 41487 -24188 -7948 308868 703836 733210
35733 733210 318691 -151372 -329855 -271371 -200950 -156486 -46165 80419 55701 -120178
35723 -120178 -211016 -38152 272582 437203 350268 169585 76764 71073 56510 34255 80370
35712 80370 159314 112786 -107231 -312051 -283448 -36205 224118 338726 275538 44131
35702 44131 -293376 -544886 -523474 -310120 -196243 -278883 -303175 -56441 252649 240456
35692 240456 -109835 -409204 -379432 -183332 -156655 -379388 -632252 -678501 -476073 -164178
35682 -164178 66203 108697 14715 -66075 -33231 95517 251478 382959 434362 335453 84564
35671 84564 -182283 -276693 -145780 38799 20823 -268063 -588727 -621407 -330150 -5524
35661 -5524 104876 83468 147510 287762 293330 88844 -152434 -239342 -142407 59484 250167
35650 250167 300584 198872 141591 289779 461717 348209 42649 -5718 316450 525827
35640 525827 212008 -375106 -735401 -822950 -917630 -995770 -742761 -171805 249133 208120
35630 208120 -74765 -227718 -182934 -83482 7550 87050 67979 -121689 -360361 -418275 -218872
35619 -218872 65635 181299 39912 -180328 -207483 7543 208609 144818 -125843 -362391
35609 -362391 -459170 -454319 -323741 -25837 290370 407333 382005 476504 693743 689402 271789
35598 271789 -285721 -596775 -591614 -424795 -194195 20295 40581 -200421 -439905 -348627
35588 -348627 19612 267202 141723 -197021 -413980 -351747 -116646 72640 81866 -29153
35578 -29153 -75135 42471 210071 231933 64068 -130926 -165280 -41561 30805 -132567
35568 -132567 -446242 -630731 -565322 -420308 -341821 -206218 95626 327281 208426 -74728
35558 -74728 -95270 108869 56763 -360142 -622338 -380619 -8208 6631 -210627 -253105
35548 -253105 -154082 -248357 -514943 -583138 -312594 81411 424547 693145 782675 581738
35538 581738 257515 84850 24326 -139137 -295957 -121962 302586 493531 289759 91071
35528 91071 190373 332637 203866 -41373 -72022 95945 203890 173044 118084 84633 41437
35517 41437 35175 130680 258212 271897 102274 -217928 -564242 -726918 -599086 -394941
35507 -394941 -425445 -600926 -494313 -33134 264574 13031 -437842 -487170 -92038 326049
35497 326049 569625 779888 963511 903492 591174 339134 350839 480459 510247 399308
35487 399308 185880 -86950 -263276 -163143 102929 159570 -146141 -507174 -578098 -435319
35477 -435319 -405666 -583055 -757007 -755527 -626403 -467948 -276431 -38483 154420 197897
35467 197897 137261 136462 267153 402995 383246 236656 145698 187354 225330 114055 -99489
35456 -99489 -274979 -388514 -505646 -597011 -542494 -323345 -64212 147287 341095 499094
35446 499094 448417 65089 -467523 -760087 -623852 -286284 -132622 -287605 -542572 -663201
35436 -663201 -627468 -517938 -336641 -66254 190078 312456 350378 408665 395134 140091
35426 140091 -225587 -325262 -79016 117721 -44102 -331453 -358386 -190091 -176946 -321031
35416 -321031 -251748 139763 446475 288600 -167786 -434130 -277554 91779 307832 189580
35406 189580 -140182 -379630 -330721 -105022 4498 -120474 -276619 -191992 143195 460704
35396 460704 506559 311544 156015 254939 511512 661805 640961 650185 823487 1029025
35386 1029025 1119940 1180305 1337396 1519301 1643450 1877744 2400117 2998394 3240413 2996499
35376 2996499 2482842 1852277 1121635 488880 277509 450818 567137 373771 103512
35367 103512 25837 61426 46772 31897 53856 -67689 -400830 -640144 -515905 -245307
35357 -245307 -215979 -389074 -398156 -141764 103402 141492 94102 142588 301179 496457 658823
35346 658823 684023 474940 82417 -289430 -437603 -292467 23368 228848 128263 -106663
35336 -106663 -101261 171056 277795 -38180 -421787 -416777 -134921 -1355 -48824 30885 239890
35325 239890 228461 -69011 -259985 -88711 220757 377459 400371 397386 311013 112452
35315 112452 -15959 83085 305535 437576 371855 90394 -337490 -650888 -557340 -127337
35305 -127337 214962 211541 23140 -139734 -312818 -528675 -598941 -407609 -172684 -154517
35295 -154517 -305356 -436519 -521547 -597493 -574820 -395525 -193762 -72078 74379 284859
35285 284859 340698 130489 -51691 79890 323439 319962 161965 217984 482935 596832
35275 596832 474310 430620 625521 813335 758915 544255 339716 176448 66927 91575
35265 91575 253483 443712 590706 647920 471763 -11551 -547044 -777743 -717824 -657883
35255 -657883 -627084 -383737 18699 151114 -142062 -465347 -461267 -256304 -75275 154361
35245 154361 485836 642140 432498 170758 252387 556092 681717 564358 419006 273847
35235 273847 40119 -97412 114680 454265 409295 -53417 -397776 -296375 -30567 49915
35225 49915 23064 99375 200829 147065 -257 -83957 -142395 -258736 -283049 -23568 377265
35214 377265 571100 479896 352429 332195 272567 87380 7102 260827 662531 780341
35204 780341 485369 96047 -59489 -2154 83200 183785 396213 640133 690728 498097
35194 498097 259776 134348 67364 -48623 -223156 -436564 -666982 -772630 -566219 -137407
35184 -137407 110451 -71310 -438141 -566687 -353897 -17269 232627 295127 118660 -191056
35174 -191056 -322581 -99193 226119 288291 109592 -32244 -114538 -339036 -631115 -630678
35164 -630678 -269877 60454 77950 -27201 17539 157800 226090 258611 323711 285732 44264
35153 44264 -173238 -65733 299133 559698 510166 268952 73605 91286 343880 641755
35143 641755 688681 431214 189967 244745 417617 324655 -50810 -338959 -321105 -185214
35133 -185214 -182524 -296618 -385795 -450102 -568930 -672401 -565971 -200442 201278 360843
35123 360843 246270 66620 -39558 -167137 -382123 -448688 -92246 494558 748349 454486
35113 454486 58086 48429 316911 432733 334550 345726 588451 797115 764248 627183
35103 627183 589830 623328 593507 498919 433349 429135 451164 466913 450026 381203 287448 225556
35091 225556 227067 319810 548106 854626 1009331 839493 506865 353043 458627 566971
35081 566971 480223 296236 162510 30244 -182262 -363880 -355607 -215512 -138572 -166379
35071 -166379 -164694 -78822 -35525 -147705 -350228 -501193 -556968 -562504 -525319 -407270 -238489
35060 -238489 -131759 -135186 -158568 -120999 -80561 -94600 -40950 217128 521498 538985 248563
35049 248563 34517 151913 358190 292727 3207 -175618 -102569 96264 297592 416613
35039 416613 285769 -152117 -579670 -581875 -182808 210509 374164 420214 400705 199171
35029 199171 -91173 -121073 187497 439510 321309 30616 -93772 -64940 -77011 -93826
35019 -93826 62276 359503 569238 530784 226667 -248878 -635202 -633903 -286430 9843
35009 9843 64314 169153 529161 766155 448459 -142233 -337809 -70866 52880 -294543
34999 -294543 -705183 -703565 -392339 -156605 -86076 -8081 142811 293264 428912 565880
34989 565880 607853 447419 170890 -9769 -22862 -11837 -133226 -358678 -507966 -460030
34979 -460030 -303477 -230933 -280395 -282358 -123607 65582 112038 58562 42055 29999 -82727
34968 -82727 -194190 -94299 179557 370930 398178 431325 544304 595782 522557 442891 381631
34957 381631 220819 33362 89832 351829 360930 -83042 -514807 -449604 -89753 85095
34947 85095 131883 434291 839572 730725 51895 -421809 -148570 377718 316888 -380258
34937 -380258 -985558 -952029 -429276 103235 337871 249748 -2543 -200832 -242928 -218441
34927 -218441 -220322 -170616 3216 124328 -53324 -454798 -725334 -675496 -454471 -256344
34917 -256344 -101336 26528 69353 35629 45006 119669 128075 50086 78592 302958 508556
34906 508556 487654 350702 302668 300999 207981 117512 210074 396497 442263 363997 344070
34895 344070 313484 40106 -357321 -442984 -130522 122080 -15070 -277335 -276532 -77851
34885 -77851 19439 -27112 -101184 -269055 -613149 -893628 -793873 -409542 -109281 9861
34875 9861 132094 252900 146439 -173121 -390608 -376986 -337189 -367430 -290925 -107088 -159651
34864 -159651 -559925 -830165 -527103 51901 238918 -86398 -415256 -393152 -210286 -132642
34854 -132642 -84748 78892 211138 81635 -224084 -397842 -323415 -154271 -12208 149268
34844 149268 347532 456620 395756 280411 262768 325507 350243 297029 186736 -2321
34834 -2321 -251894 -389266 -266935 -30054 37739 -43623 56267 439700 729787 574371
34824 574371 159439 -73348 -46442 -28809 -90775 8327 330115 537875 353542 -40872
34814 -40872 -281719 -305394 -306276 -344546 -274731 -52457 126238 75225 -129520 -249000 -178127
34803 -178127 -59401 -91194 -270545 -387725 -302983 -165945 -252094 -575682 -799473 -629847
34793 -629847 -220073 -24003 -235671 -526051 -444063 14273 409695 429598 251863 225156
34783 225156 360727 370382 131950 -160001 -328912 -418460 -454027 -278198 165997 593394
34773 593394 681272 498788 379386 442055 501325 427963 335759 354787 415787 348452 96374
34762 96374 -202069 -299283 -58621 336126 497808 282432 -15387 -75467 13841 -10775
34752 -10775 -90076 41499 306913 292874 -111387 -478085 -430287 -157466 -103286 -347269
34742 -347269 -545542 -395484 18329 313910 182750 -275280 -595997 -441779 -10455 216513
34732 216513 85469 -110001 -98191 80553 288856 476603 550873 373598 39527 -121195
34722 -121195 18752 207189 240349 279239 509406 747958 685926 351278 47527 -59382
34712 -59382 -49540 -30613 -29826 -52808 -82880 -63912 10164 61949 57642 55883 76074 66682 47156
34699 47156 90464 125146 -5232 -237626 -337209 -315892 -445066 -733173 -809212 -534807 -292759
34688 -292759 -362498 -439937 -179025 181702 220561 43305 59074 283177 408862 394425
34678 394425 421884 401741 93965 -342808 -487249 -319831 -205653 -222224 -81040 235906
34668 235906 360972 189862 69266 149878 111120 -215966 -480523 -388180 -172875 -129906
34658 -129906 -110564 96670 262405 91729 -176128 -88935 245494 257897 -215710 -672362
34648 -672362 -675465 -432316 -400223 -603338 -655358 -352588 56367 240175 203888 190663 281978
34637 281978 298437 99303 -203891 -400666 -404200 -249278 -20121 133647 82811 -63882
34627 -63882 -17955 269058 458217 279036 -106613 -428896 -717456 -1044945 -1130885 -667028
34617 -667028 114942 675381 865596 922762 879208 547757 79956 -68929 165575 352309
34607 352309 278252 209801 287823 258000 43525 -10335 207078 241997 -177747 -581472 -437302
34596 -437302 26543 206392 -12112 -297232 -485467 -609955 -543817 -168651 240098 301040
34586 301040 99773 22730 135197 185472 123226 125503 161338 19736 -223824 -228614 71966
34575 71966 352814 372780 209778 -4563 -215939 -281397 -54317 295407 401783 221327
34565 221327 92924 203824 344182 302697 175547 141551 213265 339033 494279 573258
34555 573258 456811 266878 253328 345582 178350 -285624 -547338 -251357 253381 374410
34545 374410 71577 -169616 -33241 302008 491368 386814 61963 -290939 -446696 -299917
34535 -299917 16219 256751 307200 218583 55890 -150533 -320375 -338533 -196102 -24883
34525 -24883 42617 -18593 -171600 -382747 -582484 -624144 -391696 20294 312114 255686
34515 255686 -44472 -256923 -204947 -39917 8696 -73136 -148682 -174993 -211674 -238148 -152397
34504 -152397 33244 158087 126544 35932 36860 154190 289807 336273 264404 152415 122073
34493 122073 191704 241697 211358 238269 429547 566264 305665 -281016 -652100 -433364
34483 -433364 97108 368163 210936 -48618 -109513 -21039 48315 100560 204164 263842
34473 263842 115673 -186545 -383089 -345575 -227910 -190955 -143532 71660 352017 433230
34463 433230 285320 162838 219660 313117 279867 173628 97910 31270 -8912 135870 461420
34452 461420 608835 300310 -175065 -276731 51194 339446 289449 106248 37264 -26851
34442 -26851 -260490 -502759 -444765 -76480 300819 444516 372591 239104 150874 96853
34432 96853 -10173 -190525 -291643 -143315 152347 258865 28970 -274032 -314199 -93789
34422 -93789 142453 280568 393296 497029 499821 399791 314379 254237 65747 -291282
34412 -291282 -570663 -512314 -201173 31268 44892 36036 187099 358135 284234 -37002
34402 -37002 -357224 -520900 -566342 -491046 -204039 186190 323664 55261 -300573 -395074
34392 -395074 -348993 -469305 -637879 -455063 25067 224967 -113219 -470012 -259554 331809
34382 331809 629577 413572 134484 201746 454056 478375 179160 -188429 -420216 -564559
34372 -564559 -704424 -716427 -404370 145462 514375 388527 -29481 -218823 49389 469243
34362 469243 610351 402647 120705 30276 177909 428346 572213 452328 100325 -271646
34352 -271646 -466445 -435491 -208113 157114 465411 417340 -47587 -534813 -548668 -56466
34342 -56466 470566 578774 243520 -229243 -529937 -528368 -291117 -18538 106410 68696
34332 68696 -13104 -62504 -101901 -138075 -111816 -6610 88086 80226 -21672 -143167 -213101
34321 -213101 -172722 -2024 220899 368257 414714 458411 547792 589997 494254 296155 61188
34310 61188 -200145 -400154 -317926 103194 507790 465869 41982 -272171 -232740 -112728
34300 -112728 -164349 -186718 63251 320674 123053 -440130 -756260 -517299 -109238 -29706
34290 -29706 -261394 -439631 -373737 -144193 130747 351946 366221 90464 -311259 -546892
34280 -546892 -478611 -184747 179684 455484 504238 328930 123564 61694 83630 24536
34270 24536 -110956 -159737 -51200 97142 120187 -61616 -400580 -705636 -740926 -477996
34260 -477996 -189605 -151190 -306633 -378069 -249541 -73072 -22722 -104265 -209663 -241539
34250 -241539 -187999 -142140 -189501 -227303 -38571 354851 603574 467886 154799 -3010
34240 -3010 -7360 -42356 -46320 178984 525221 651432 491192 308626 233674 124990 -46140
34229 -46140 -60615 172092 425615 482173 375910 209565 3647 -175434 -211341 -145719
34219 -145719 -112055 -19260 341900 800942 846716 348580 -172063 -243781 -41250 21323
34209 21323 -58139 249 234604 431817 476974 391334 173579 -111918 -251344 -158378 -56414
34198 -56414 -118914 -156806 11379 128562 -123358 -490738 -406196 161533 615335 551662
34188 551662 219271 11168 -88373 -290224 -525973 -515353 -208802 99422 127394 -68124
34178 -68124 -184092 -32676 270315 491695 550473 491353 290725 -78729 -412423 -409912
34168 -409912 -136805 -39411 -325057 -628586 -544854 -221356 -101735 -287939 -506453 -562278
34158 -562278 -476643 -274416 24956 266027 311622 278274 341453 403705 260542 -9370
34148 -9370 -159392 -186546 -264798 -352291 -263951 -73494 -11748 -3429 216448 520060 457504
34137 457504 11329 -264463 -61000 244199 238858 82967 97386 169218 20690 -241411
34127 -241411 -328573 -310944 -462686 -680307 -549589 -14309 440633 387108 -58163 -448965
34117 -448965 -484236 -174859 257965 523014 431187 59307 -296085 -388583 -234674 -63625
34107 -63625 -87396 -299036 -471679 -399484 -152385 2696 -33531 -56470 113387 328122
34097 328122 328518 149872 67275 168341 235826 103909 -98114 -169249 -126002 -123481 -209399
34086 -209399 -308290 -370986 -393666 -350589 -266570 -310614 -618495 -1005769 -1066646 -652748 -86127
34075 -86127 222959 214757 90886 -38066 -170775 -194500 36059 392820 542492 391941
34065 391941 206002 193897 247528 218613 173477 174128 68088 -234211 -473830 -339241 79436
34054 79436 417263 514474 493827 455839 396934 368320 413797 386459 122793 -236161 -409376
34043 -409376 -428513 -568662 -820805 -840602 -523704 -235013 -275268 -455710 -429937 -162438
34033 -162438 173077 494265 730138 677533 275991 -127124 -139589 120182 175323 -107601
34023 -107601 -316367 -95659 339870 495990 225703 -167762 -384859 -441788 -475955 -452283
34013 -452283 -250149 46072 175181 55957 -79790 -8815 195744 329630 351405 333126
34003 333126 258624 100533 -817 103206 281080 259160 33326 -127350 -101474 -61709
33993 -61709 -148152 -264261 -285086 -227274 -121189 52070 204224 164240 -33329 -136165
33983 -136165 -76463 -108528 -356266 -493679 -158005 493813 938819 916218 643652 438459
33973 438459 356220 249473 37805 -161877 -162019 45892 221649 148811 -75260 -182618
33963 -182618 -123173 -72526 -57471 114990 467777 715778 686981 586314 622213 646859 442917
33952 442917 138228 24878 134173 294249 465338 702806 897378 874699 693728 559459
33942 559459 498021 396731 297968 345850 480957 505273 441119 505939 711719 816687 736815
33931 736815 682489 770877 796119 549002 133026 -207189 -386858 -457969 -458466 -443542 -517341
33920 -517341 -669562 -703590 -485155 -154651 62792 152993 243549 328394 277018 100363
33910 100363 -144 97498 265394 296294 145103 -56675 -141551 -16195 263620 459406
33900 459406 312367 -133961 -473334 -375933 -20875 140153 27248 27663 352819 650573
33890 650573 528847 188687 134654 395166 486959 163882 -233870 -298120 -52830 228609
33880 228609 384883 357433 117592 -178540 -230720 -18761 79291 -157666 -410802 -319815
33870 -319815 -82393 -116040 -321663 -220114 224683 477466 250986 -43278 64326 384498
33860 384498 368899 -66026 -413365 -278658 107977 233433 -21171 -273111 -192285 81881
33850 81881 231908 277014 480998 802537 848611 507764 225515 355079 577583 404751
33840 404751 26094 94173 691209 1079432 679316 -137815 -546311 -285355 160985 286040
33830 286040 127671 49333 176282 246102 11094 -387330 -601104 -550797 -474349 -485660
33820 -485660 -400475 -152355 -47554 -301275 -586566 -444788 30311 355167 381065 367303
33810 367303 384698 203973 -143347 -255697 -24943 96327 -203017 -554837 -452072 12511
33800 12511 356596 402840 342522 285250 177510 84739 151401 289984 255930 51817 -56729
33789 -56729 25535 72521 -79795 -254616 -200893 25494 125752 -53191 -327112 -389777
33779 -389777 -163415 114829 180320 67894 45865 222243 380387 298999 78756 -23092
33769 -23092 16028 -23778 -232822 -395544 -256599 163425 598635 813517 782883 642853
33759 642853 538709 534655 623856 757415 842504 782848 593047 421592 370018 346630 225096
33748 225096 82325 89053 203836 227796 178283 303741 623370 773360 521559 152796
33738 152796 54934 149434 82008 -179069 -331226 -257214 -149613 -90365 99102 461545
33728 461545 692645 526268 102886 -235090 -341709 -293170 -175325 -33070 74461 135695
33718 135695 229840 380323 458354 373478 268358 352397 594938 758607 718127 573362
33708 573362 431320 252419 -3656 -207770 -170897 105894 394365 480170 392333 351441
33698 351441 500767 733805 813740 632089 302364 17011 -120878 -122807 -58716 -17920
33688 -17920 -57474 -128961 -103964 68886 278328 390767 430998 524688 675336 712746 502777
33677 502777 123914 -226136 -443112 -561150 -615794 -558477 -343554 -41212 204277 319915
33667 319915 344800 311672 167014 -113222 -373900 -373760 -66792 303245 457267 368342 231861
33656 231861 216340 332221 490074 569639 458460 156335 -147854 -228904 -86391 60738
33646 60738 72692 47200 113848 213214 207900 115587 79094 142935 191322 101459 -133170 -410782
33634 -410782 -571758 -487370 -201317 58910 122945 81817 121921 218800 191394 39471 -20542
33623 -20542 75340 79501 -191242 -505445 -478427 -103157 224665 233845 120363 247129 621973
33612 621973 845505 595182 35514 -356282 -324683 -58814 133628 200674 272276 361225
33602 361225 356058 253276 160572 70464 -124012 -345074 -328467 -26524 229705 151862 -115154
33591 -115154 -223869 -78339 165112 398570 586886 587943 269654 -183017 -366738 -151846
33581 -151846 141646 158818 -84116 -330022 -459842 -563608 -694413 -731485 -548991 -236112
33571 -236112 -41587 -75424 -157628 -68233 111889 95246 -161447 -333138 -171665 148708
33561 148708 330699 397097 548087 719541 649200 356722 191223 332776 573803 708682
33551 708682 824300 1025122 1153912 1036816 803108 693495 690864 609244 450983 392510
33541 392510 451901 449027 325702 260789 391688 619778 781387 838953 805037 652942 448246
33530 448246 416812 679850 1011078 1087048 954155 996731 1380652 1774045 1785874 1500976
33520 1500976 1343512 1498728 1739563 1840097 1892863 2083852 2350450 2482866 2506091 2755573
33510 2755573 3516175 4700765 5979601 7188372 8485540 10015496 11465819 12139376
33502 12139376 11587046 10085116 8357563 6898212 5723855 4707455 3869456 3271094
33494 3271094 2854666 2531648 2288695 2103171 1894583 1664596 1545130 1589945 1646163 1556611
33484 1556611 1378051 1277196 1306135 1387509 1433065 1392618 1277466 1185435 1185573 1170607 1016096
33473 1016096 886851 1081607 1493492 1597011 1176655 707926 712430 1056050 1260380 1229060
33463 1229060 1211423 1245609 1144473 953790 943432 1143392 1306650 1344235 1402283 1490970
33453 1490970 1439026 1272726 1262169 1508785 1817547 2031843 2157184 2115534 1766761 1276090
33443 1276090 1090958 1404233 1938833 2370089 2654378 2844858 2915469 2902399 2928181 2975825
33433 2975825 2919724 2838917 2965832 3268795 3471893 3561977 3831265 4297786 4584194 4583554
33423 4583554 4738981 5357577 6115841 6610738 6969532 7495047 8096910 8548231 8982900
33414 8982900 9640631 10387250 11008088 11762400 13089653 14882994 16600643 18077926 19741759
33405 19741759 21984364 24744885 27773329 30949117 34259033 37730408 41401204 45090331
33397 45090331 48216743 50136789 50665059 50019981 48339478 45605411 42040209 38201280
33389 38201280 34570510 31291519 28343556 25698411 23250718 20868065 18613075 16715117
33381 16715117 15258978 14089869 13063287 12189474 11489190 10901887 10396928 10028081 9847780
33372 9847780 9879602 10132497 10504641 10770496 10859404 11031474 11521735 12129837 12491570 12657343
33362 12657343 12977420 13422968 13497326 12945976 12118426 11424078 10830200 10176808 9629630
33353 9629630 9430293 9409328 9148654 8560950 7987745 7725933 7695904 7593466 7201488 6556326
33343 6556326 5935145 5634021 5624967 5500282 4917083 4030435 3296056 2901215 2634882 2318926
33333 2318926 2074051 2035395 2056879 1922055 1694194 1593565 1588221 1384254 866667 316190
33323 316190 84788 232901 592199 1000956 1321709 1395574 1197921 944163 842833 832773
33313 832773 760484 691040 768231 861202 693545 309694 62927 98757 191862 161125 88744
33302 88744 29938 -109336 -254095 -124083 261168 436863 144298 -241725 -283302 -128443
33292 -128443 -170610 -357791 -332558 -65127 152840 234942 348873 498491 493562 308470
33282 308470 87065 -151228 -424616 -509998 -208899 182933 189642 -84767 -81602 277884
33272 277884 414215 36234 -356829 -261786 81007 180314 102511 240094 542343 559010
33262 559010 175640 -203917 -260926 -141989 -114505 -155610 -71815 154545 329652 302218
33252 302218 129485 -8287 4212 124197 206312 123567 -144030 -482966 -694727 -639462
33242 -639462 -383697 -162585 -151201 -307488 -449697 -416006 -155663 204824 382186 212945
33232 212945 -65379 -64787 164011 146597 -252751 -515453 -248253 137708 31610 -411008
33222 -411008 -523871 -160512 205636 339028 484968 694038 624560 230412 -7944 159772
33212 159772 346069 217739 49220 172648 368711 291637 97545 126953 275364 214576
33202 214576 11240 -944 191047 317229 333073 399771 428726 151992 -329343 -538841
33192 -538841 -285927 44454 22719 -291265 -516328 -453220 -251847 -171085 -285627 -421737
33182 -421737 -377195 -197309 -132955 -285160 -448578 -410693 -241682 -147058 -192929 -327774
33172 -327774 -498456 -574297 -361922 86555 385451 287268 39264 -7774 84548 69250
33162 69250 27913 196393 423854 331444 -24650 -183431 -30486 9963 -303449 -602228
33152 -602228 -462795 1741 399878 603475 719812 747320 570431 187551 -262804 -605013
33142 -605013 -651534 -321883 132884 263439 -35518 -343394 -274354 24612 182641 161088
33132 161088 172132 236696 203288 97001 72786 79850 -51428 -201488 -23874 524839 1057327
33121 1057327 1247520 1147990 929212 620035 248239 -44201 -192262 -282155 -311777 -144929
33111 -144929 164207 322381 266750 335214 688198 913929 610762 67974 -133702 842
33101 842 -26749 -328241 -462496 -216604 44381 8013 -130431 -115444 -64539 -119765 -85677
33090 -85677 181677 378311 210206 -23263 180284 716216 987988 783480 517435 535977
33080 535977 648898 521572 163637 -186102 -399685 -476396 -398088 -151997 195531 542163
33070 542163 777425 755038 405485 -83583 -386171 -407572 -362793 -425172 -506482 -494982 -487061
33059 -487061 -582048 -610869 -333580 142587 400425 225118 -120019 -253909 -168252 -154495
33049 -154495 -291710 -288623 30377 330755 172276 -294882 -432555 24470 599988 759672
33039 759672 600720 545054 639685 592384 347449 167693 166874 174397 111755 130696 282001
33028 282001 381055 336453 319432 443380 525302 359962 48294 -137435 -93630 66721
33018 66721 210157 281726 260876 138932 -51305 -222071 -264234 -144652 3504 -10917
33008 -10917 -162300 -182839 45621 238203 82700 -262026 -359021 -131163 43967 -81918
32998 -81918 -282734 -225739 74679 333409 355630 187231 16600 10353 163642 290507
32988 290507 243609 95922 -18480 -144018 -376192 -582335 -526614 -249691 -43780 -38237
32978 -38237 -79973 -49053 -16651 -37447 -46999 -37163 -102172 -242015 -322093 -273592 -156022 -30868
32966 -30868 31696 -113901 -487497 -787290 -713060 -427673 -332757 -431260 -350854 -16139 195643
32955 195643 92415 -17665 135757 350130 327338 153750 112205 248831 372127 314201
32945 314201 40787 -315831 -451095 -163851 285439 390896 73110 -197236 -78140 201274
32935 201274 274974 176806 175234 321869 435005 387076 224893 112058 221227 533459
32925 533459 754683 658290 455058 497814 685307 606526 268252 135275 344348 454220
32915 454220 194547 -97953 -105003 -66436 -282660 -505922 -306589 229124 607425 570775
32905 570775 295893 75045 54392 185045 278193 220864 164490 290315 436748 317170
32895 317170 77092 159444 575818 847418 777435 707140 827947 835052 522090 153836
32885 153836 -41082 -203576 -382386 -300892 96795 418832 459282 491162 632618 576950
32875 576950 309506 363948 884542 1163404 708605 87807 22602 270354 175841 -203347
32865 -203347 -348892 -240113 -237739 -315000 -169102 139180 346554 559736 1031183 1596733
32855 1596733 1934670 2128668 2388951 2501072 2167846 1635556 1365263 1317074 1143478 853463
32845 853463 714702 726678 726759 782419 987216 1140621 1088855 1055502 1190668 1192511 844721
32834 844721 484154 442835 503935 405860 344496 456597 420881 145815 174628 759062 1252789
32823 1252789 1148208 952757 1225678 1551268 1406843 1245225 1637503 2078056 1813911
32814 1813911 1226218 1196848 1664625 1968834 2065340 2259384 2330161 2075014 2071908 2732748
32804 2732748 3358237 3373847 3590949 4776828 5924906 5665562 4544648 4046141 4146689
32795 4146689 3836951 3329446 3579131 4220925 4219387 4005196 4657651 5572682 5452408 5000456
32785 5000456 5857822 7425201 7844542 7686686 9176929 11992937 13738365 14676792 17606311
32776 17606311 22431523 25777513 27457231 31960652 40605937 47447855 48143232 50176630
32768 50176630 69080451 114049865 178077851 239515546 272389086 261562499 214683762
32761 214683762 157960782 115113639 90347111 73628542 58061659 45669056 38693743
32754 38693743 34080316 28666307 23620589 20736983 18707564 15900206 13355764 12324341
32746 12324341 11622444 9917436 8259387 8008520 8275135 7606240 6464707 5989182 5834191
32737 5834191 5175606 4506371 4598607 4846327 4333802 3524297 3346420 3559836 3448210 3202289
32727 3202289 3257468 3160163 2423119 1675465 1691413 2055181 1981331 1664679 1636006 1589748
32717 1589748 1092557 705799 1115415 1782643 1737302 1173347 1005791 1304399 1412408 1266514
32707 1266514 1375318 1698657 1683208 1316539 1148259 1303944 1344562 1089429 838735 793522
32697 793522 857449 945708 996297 841505 517288 439970 826389 1263284 1308889 1131643
32687 1131643 1061165 957689 609432 319390 449441 759981 850700 885718 1196606 1515391
32677 1515391 1352795 884624 712639 910955 1018389 861499 706151 655934 546906 439666
32667 439666 624984 1074643 1376461 1303592 1072894 984426 1107255 1338590 1524974 1533530
32657 1533530 1377714 1207850 1078378 905190 745987 827846 1138941 1329140 1221697 1070454
32647 1070454 1082256 1080533 928644 876154 1121821 1395335 1360406 1125679 1002116 1064389
32637 1064389 1284492 1743085 2333591 2621324 2426749 2222494 2504353 3072960 3414807
32628 3414807 3519642 3787829 4300894 4715619 4845296 4923538 5257141 5883080 6578871 7077015
32618 7077015 7342332 7690804 8456698 9526686 10481771 11189905 11845433 12397593 12488408
32609 12488408 12113546 11777613 11745314 11678561 11289414 10798043 10426098 9990231 9348896 8710993
32599 8710993 8159284 7448382 6628274 6207775 6265821 6109244 5358245 4653794 4614052 4768069
32589 4768069 4326758 3439009 2819677 2600785 2438157 2366959 2630090 2931272 2754731 2249625
32579 2249625 1982284 1983976 1842058 1569769 1563350 1793932 1833552 1629651 1512357 1488642
32569 1488642 1261021 904974 799935 902335 798619 484354 386407 573787 631219 396628
32559 396628 192576 232559 370459 510591 726173 920691 883419 703030 646787 674648
32549 674648 569977 445923 558405 729811 580766 245996 208924 493158 685953 696510
32539 696510 780312 861921 602829 151023 34645 253488 280441 63888 179134 781244
32529 781244 1241805 1134081 824966 741577 741308 585542 418745 396334 371221 268285 257598
32518 257598 306126 116300 -250354 -293082 122038 496359 511638 452156 515149 415074
32508 415074 64650 -73750 202476 374375 97084 -129389 167962 536993 342254 -126993
32498 -126993 -140713 259352 401104 111675 -126627 -53918 87859 137879 209820 278972
32488 278972 179867 62740 290585 798960 1068715 847029 446113 214776 137580 96436
32478 96436 139426 297223 423596 401948 314127 287612 335890 405979 428379 315945 90903
32467 90903 -13801 201316 574058 735119 589924 398096 360294 394284 370706 299788
32457 299788 193428 256 -199637 -187378 36685 118904 -190284 -619402 -694171 -370024
32447 -370024 -45264 22806 -17505 7766 1360 -125568 -171441 48006 306035 250820 -18630
32436 -18630 -76088 150252 278278 144257 85969 321774 512259 316534 5088 42909
32426 42909 329477 380872 117466 -68636 10166 105615 25837 -92520 -104194 -72197 -64257
32415 -64257 -50318 -68708 -189687 -281982 -142028 123309 200849 87768 114512 387976 614967
32404 614967 585709 441725 336090 208791 39962 -45249 -62552 -180678 -317669 -147717
32394 -147717 316497 592449 411781 111522 79597 227263 307383 338560 370056 231493
32384 231493 -88681 -193992 151265 542189 488122 133465 -76721 -142116 -321507 -445695
32374 -445695 -123919 437660 548941 72273 -310922 -106014 289893 242232 -197647 -460357
32364 -460357 -293221 11270 132865 95520 86857 178351 328092 490964 598319 519287
32354 519287 186461 -241499 -458813 -310369 49179 332852 385942 235749 1334 -145124
32344 -145124 -58438 176894 240229 -28839 -340128 -306555 20029 275823 351312 431052
32334 431052 505693 332088 -33554 -166529 62607 229304 37761 -185949 -44807 281981
32324 281981 374287 235071 156859 173633 119402 41620 82944 105883 -84581 -275381 -116813
32313 -116813 224872 242685 -82673 -203593 134549 500791 462013 182808 52292 102204
32303 102204 136916 149714 245372 332428 234000 8250 -126166 -121753 -109503 -120044 -48263
32292 -48263 93977 119247 -65050 -288638 -316155 -111345 177676 404813 491474 381342
32282 381342 97116 -151926 -107065 188336 329630 26470 -467714 -647073 -430325 -240794
32272 -240794 -355221 -508537 -337387 69819 353305 410853 412484 407623 286762 117012
32262 117012 154143 436667 667940 632448 477962 420607 385452 161273 -216076 -464077
32252 -464077 -398037 -95317 271471 596038 803076 807597 614154 385364 305408 383965
32242 383965 467229 439789 334671 222017 86437 -100150 -247664 -217757 -27076 135739
32232 135739 138859 61407 58425 148878 226210 235038 222948 197024 39408 -322872 -697077
32221 -697077 -740548 -393119 -52693 -112812 -398350 -362370 115213 488258 306429 -123387
32211 -123387 -192304 148228 443959 512781 600408 736669 537667 -94142 -566614 -308584
32201 -308584 414911 829897 641398 283283 219694 383101 427187 283810 248202 538417
32191 538417 919929 904832 355260 -260876 -384995 -40840 257288 221490 76814 71763
32181 71763 86110 -55783 -198414 -104112 105002 92773 -186980 -429506 -399184 -160419
32171 -160419 117282 357850 524843 546743 409131 253566 286923 558589 847553 845936
32161 845936 514508 180702 168456 401082 537476 441581 288535 220385 164568 53764
32151 53764 -19901 26623 131000 195376 176576 51535 -124223 -159209 27225 162095 -47696
32140 -47696 -396487 -418047 -120496 38507 -41539 52831 418957 538310 171499 -108295
32130 -108295 188254 606296 446222 -116099 -352885 -138871 -4410 -162394 -238816 -12862
32120 -12862 221515 169208 -78799 -286739 -319034 -101824 300392 575201 485898 257952
32110 257952 271612 459846 442501 173216 -30575 -49116 -43688 -9975 211562 473909 439704
32099 439704 207063 229029 516973 557083 197998 -32694 202950 484423 345669 33628
32089 33628 65650 427038 709776 756685 687297 507344 165521 -137757 -124793 147606
32079 147606 396688 556798 784633 1077070 1204479 1033498 672784 294412 9930 -89691
32069 -89691 35186 282380 475932 525098 443192 274386 93990 1638 11198 19308 -34930
32058 -34930 -75221 -35119 21344 32579 70986 210656 364659 393683 305943 224960 212761
32047 212761 228146 215052 154261 70885 33351 80074 131371 84519 17547 142202 483339
32036 483339 757826 685216 312493 -67625 -227902 -154845 14354 114246 85990 50544
32026 50544 169771 407249 544478 470163 308386 196870 92894 -97831 -330662 -486835
32016 -486835 -542922 -558459 -541370 -416411 -119684 298991 650623 725301 514491 269210
32006 269210 224528 315009 303403 133962 -27472 -64384 -4632 134313 350269 493489
31996 493489 359187 -864 -301074 -414810 -487763 -584064 -514203 -177174 174912 225372
31986 225372 -11906 -258259 -303839 -139376 119780 314458 343366 263507 195962 128056
31976 128056 -24130 -168222 -100011 151666 326591 344308 396949 528600 488305 195543
31966 195543 -15114 99090 263828 130743 -119610 -52013 303668 471665 251135 -116
31956 -116 103027 472744 722758 637312 324404 19999 -136888 -167165 -160824 -156042 -131821
31945 -131821 -92883 -82100 -116045 -204839 -410569 -738125 -988219 -922534 -593108 -289034
31935 -289034 -133114 8829 181094 228792 140838 149166 306572 316915 30511 -226598
31925 -226598 -121623 187252 357745 384954 434526 413212 151260 -173367 -254721 -172558
31915 -172558 -228275 -373450 -291398 2398 150777 64189 36891 176197 212943 35053
31905 35053 -55458 156513 441168 521738 480905 490443 444529 186099 -131767 -239556 -152637
31894 -152637 -84182 -79564 -25311 57606 8716 -204489 -438443 -579241 -601848 -451092 -86496
31883 -86496 327312 484021 280915 -34479 -150176 -21784 163577 262391 291062 302120
31873 302120 283584 235283 250001 404719 592027 590824 359374 144709 183509 366160 363513
31862 363513 82478 -189235 -169286 51508 179007 148103 176854 398767 657268 754263
31852 754263 725091 706984 659478 436926 98797 -93936 -37603 77194 77266 44992 108210
31841 108210 196420 204076 223404 368632 499379 397133 134347 -16235 18608 95372 178404
31830 178404 343266 479638 371434 106539 11760 109435 67351 -189193 -293822 -86239
31820 -86239 52775 -143141 -302013 -17475 408221 409174 97783 124299 674814 1216442
31810 1216442 1289489 1015254 689954 353271 -28261 -316468 -376479 -261036 -70396 155528
31800 155528 315682 277242 132303 160241 407751 566606 411616 99740 -130421 -285774
31790 -285774 -430624 -435591 -211876 -2263 -88294 -301606 -188908 324392 767818 723805
31780 723805 315903 -63478 -280467 -461687 -604561 -514890 -175840 100845 54912 -172199
31770 -172199 -263778 -176689 -125363 -186169 -199263 -90570 -20402 -109870 -245215 -285998 -274676
31759 -274676 -292178 -276153 -145457 31832 142713 176727 152609 54935 -38428 32854 217805
31748 217805 199845 -147821 -476014 -401890 -46237 176585 140690 43939 -4433 -60569 -89279
31737 -89279 -1902 87256 -1605 -149837 -85055 119523 93017 -233793 -475765 -356654 -69250
31726 -69250 73245 30583 -72807 -157486 -127418 128509 493062 620415 368447 31077
31716 31077 -30847 193777 470923 650465 716499 668933 534882 399325 303623 206254 107554
31705 107554 81559 131902 168737 168754 183355 164638 5426 -205349 -218016 15139 261038
31694 261038 357419 368484 320259 115756 -155826 -179952 114469 378918 364372 282292 380799
31683 380799 508606 450097 377393 537529 729716 570784 136845 -130469 -81616 26234
31673 26234 31136 28745 18743 -156691 -430122 -480777 -236839 -43669 -151005 -346335 -303280
31662 -303280 -34443 212328 292691 202108 -25949 -248824 -222054 87794 336848 202090
31652 202090 -140020 -192816 214521 692629 761095 387458 -28665 -116497 107140 316308
31642 316308 257279 12171 -139274 -70694 84347 172313 204444 224203 159647 -24201 -148932
31631 -148932 -26736 210623 235600 -9144 -223191 -200387 -110858 -180849 -323527 -318047 -188847
31620 -188847 -134748 -176089 -154445 -44510 14778 5822 74484 246554 367284 383497 415522
31609 415522 472404 398292 225158 244034 514688 629746 272874 -252717 -414366 -170482
31599 -170482 89296 179988 264198 414227 472514 401394 390848 512145 574770 438798 207182
31588 207182 14796 -126938 -196608 -126895 10793 33237 -50145 -5084 252446 493270
31578 493270 510359 388697 303490 257606 171917 69839 30173 71511 160179 218716 120868
31567 120868 -156390 -404554 -428155 -361983 -445532 -549854 -355728 -4230 -35943 -534083
31557 -534083 -874742 -604157 -48396 307117 526575 815827 867325 284522 -585256 -926221
31547 -926221 -509824 92072 336235 224620 -27756 -312199 -491135 -392989 -118177 -10893
31537 -10893 -184403 -374838 -376040 -305613 -307547 -300865 -204419 -149372 -256288 -386437 -314376
31526 -314376 -31650 271623 443185 484353 499809 586230 704534 673421 406260 120375
31516 120375 125428 395800 557616 355099 -54734 -342343 -368342 -218305 -26896 119954
31506 119954 200055 256563 324323 322596 106431 -333912 -788394 -974592 -757412 -271782
31496 -271782 136444 196576 25086 21253 329095 579141 380147 -97787 -336638 -167791
31486 -167791 90068 156597 82978 -20806 -178856 -340125 -299082 -14827 223451 128449
31476 128449 -253167 -650164 -822963 -628822 -75591 543672 787382 515137 50456 -225143
31466 -225143 -261823 -216350 -166332 -122266 -128189 -163426 -112525 1899 -43851 -308740 -476427
31455 -476427 -277862 56809 90789 -190657 -396358 -339365 -267322 -407103 -596871 -557040
31445 -557040 -335204 -262147 -508778 -843117 -881465 -538862 -159226 -135771 -432938 -616650
31435 -616650 -397854 14176 217503 127320 -12798 -36761 -30239 -97320 -182439 -208231 -221924
31424 -221924 -287320 -341231 -284391 -155007 -81793 -73196 18526 263202 475760 398820 49287
31413 49287 -259057 -297825 -190324 -170243 -203457 -71735 220375 399213 337333 251566 349967
31402 349967 506990 489073 334633 270917 345354 375107 237303 16234 -136483 -138278 12509
31391 12509 222880 329943 276889 224386 334623 495601 454640 201523 -4186 -7443 69426
31380 69426 87372 90060 125841 86459 -94881 -240987 -138775 135704 304336 259460 156540
31369 156540 137687 152329 105335 24602 -17869 -47646 -130584 -213931 -136900 173007 570142
31358 570142 802150 751226 539908 374140 298228 170456 -89715 -318755 -286527 -22519
31348 -22519 188555 177112 104672 205234 436528 558532 496996 426433 473463 529544 445472
31337 445472 263147 128344 69710 602 -109443 -193385 -204793 -177151 -160998 -169719 -182999
31326 -182999 -155689 -52724 71056 77221 -86116 -264472 -256815 -80174 37632 -55700 -253315
31315 -253315 -326179 -181768 43366 119390 -47706 -302423 -390620 -248679 -64552 3482
31305 3482 49084 228048 447841 442867 130125 -294523 -607824 -730314 -659530 -444468 -252712
31294 -252712 -247916 -348715 -323667 -179032 -186850 -410155 -494325 -164556 304039 422231 151066
31283 151066 -102437 -97938 -25090 -101439 -216242 -143267 78301 174020 -8000 -306968 -435226
31272 -435226 -298380 -89285 -40117 -117206 -78160 136235 243482 6144 -370664 -480879
31262 -480879 -290110 -163696 -295904 -439921 -351758 -197104 -247329 -388797 -289214 39834
31252 39834 230610 145816 103940 348321 605364 465704 17078 -250273 -114212 143508
31242 143508 217832 173483 201495 245020 119565 -132318 -266824 -184760 -44447 -22999 -123729
31231 -123729 -234050 -249883 -142417 -6918 -10895 -169857 -235342 16543 427453 603512
31221 603512 413695 110621 -59560 -98283 -48255 139827 377397 370002 23287 -316075
31211 -316075 -310530 -138095 -224512 -600440 -891246 -893819 -778207 -683331 -501310 -199973 -9390
31200 -9390 -56621 -87405 158415 484149 486300 182894 32098 274282 579150 521466 178488
31189 178488 3565 212701 562943 739694 711218 602402 431932 167644 -76576 -126485
31179 -126485 -12239 46335 -52251 -160880 -111578 69526 240660 314459 279367 161291
31169 161291 33492 -33935 -83569 -208203 -336294 -257755 34248 218980 45110 -295729
31159 -295729 -413330 -242539 -78213 -113802 -188696 -60042 239851 417488 236970 -208341
31149 -208341 -536533 -443807 -55541 198292 107280 -93188 -131435 -110806 -277354 -562816
31139 -562816 -685483 -609620 -553485 -567242 -459749 -181084 64339 166162 249311 365123
31129 365123 356209 164720 -21693 -82752 -134057 -225922 -191973 -4354 48335 -186484 -400517
31118 -400517 -284692 -35611 -2471 -60030 182685 668464 900228 677777 363573 311275
31108 311275 418615 398563 187276 -72034 -217706 -136544 139156 340020 208603 -115313
31098 -115313 -240629 -98393 -18274 -139196 -162106 91700 282617 56590 -369698 -528995
31088 -528995 -381536 -247387 -216075 -81353 181400 311867 194744 34281 12371 68962
31078 68962 106625 140401 152926 58688 -79652 -37903 239565 499397 494865 269287 21857
31067 21857 -128993 -141757 1057 207000 289700 196808 83762 61566 39456 -64519 -141949
31056 -141949 -85110 332 -40269 -150949 -147652 27027 280043 509956 640633 611718 463144
31045 463144 328942 244658 102959 -92362 -132162 61709 211780 36730 -341138 -599543
31035 -599543 -668610 -685063 -635223 -392242 -39148 187694 250697 292844 304183 146430 -97170
31024 -97170 -150937 36641 233356 316583 390380 465798 382489 128519 -109264 -289135 -533652
31013 -533652 -725672 -534914 -18400 268575 31979 -310451 -267362 16895 75857 -175495
31003 -175495 -466554 -644209 -703155 -562966 -240790 -61604 -262566 -541268 -434405 -4294
30993 -4294 316423 435660 620081 849251 740002 225822 -208311 -172025 163875 453354
30983 453354 649930 841505 918234 708836 292412 -44535 -77605 212304 615594 763002
30973 763002 431082 -133953 -405569 -182496 197154 324566 170436 -33605 -114754 -11521
30963 -11521 272152 588568 690215 508788 252876 117378 57512 -45326 -179146 -283418
30953 -283418 -351565 -328904 -99920 286332 564865 568268 410622 238525 24238 -235348
30943 -235348 -356104 -220568 7000 137136 227982 374816 446681 318564 169871 216445
30933 216445 300655 127374 -188107 -225444 87650 336137 228804 -6757 -9702 212769
30923 212769 385111 381951 326116 353343 460562 572289 634653 621891 518224 348266 233316
30912 233316 355070 751726 1139628 1096753 540084 -90323 -271084 46166 447714 556030
30902 556030 358064 88205 -38932 22915 131824 73158 -216392 -561432 -750770 -748438
30892 -748438 -616139 -364036 -46192 126525 9725 -206729 -203196 30902 212221 196557
30882 196557 119014 80889 -6595 -177130 -280152 -234276 -182081 -235178 -260969 -102717 139875
30871 139875 237236 139223 -1135 -38651 61942 263434 469047 552195 479741 356744
30861 356744 267075 143004 -106452 -401533 -540867 -421249 -130012 157238 313858 331983
30851 331983 308212 336514 398503 404740 335639 251872 170219 58306 -32429 8874 145730
30840 145730 194077 115022 104006 243249 280431 -4447 -372984 -387816 -44310 188200
30830 188200 6751 -343879 -464023 -329087 -223037 -293146 -396684 -341456 -91449 266986
30820 266986 608971 786599 689551 371209 53378 -66956 1962 95992 96508 34906 12877
30809 12877 78613 193532 267249 196222 -73838 -452158 -697155 -607976 -255179 57883
30799 57883 120343 34543 34590 154045 217542 149242 100352 184886 268512 203673 143445 341307
30787 341307 665262 652552 175394 -266355 -176907 256141 464143 312928 175421 236633
30777 236633 236530 37288 -46204 215176 489070 354150 -15865 -93628 224727 543671
30767 543671 614896 598537 629412 556912 277946 -9357 -87501 -18230 15446 -27247 -89186
30756 -89186 -149508 -179411 -124520 -44964 -103880 -307784 -442535 -385039 -276933 -246227 -174940
30745 -174940 59762 312674 383966 351704 419116 533467 450639 148856 -101166 -114715
30735 -114715 -10622 14365 -66804 -183029 -325101 -499443 -606009 -504683 -211243 62971
30725 62971 122470 10030 -47179 79827 277543 376269 375131 367668 339827 218001 58681
30714 58681 -17987 -51980 -168117 -296853 -252341 -105765 -148126 -400146 -521263 -357827
30704 -357827 -199799 -255237 -256584 59938 419990 402913 130889 79827 339997 552791
30694 552791 521723 404764 291632 59702 -258892 -379457 -178489 110812 232164 164863
30684 164863 -11283 -215244 -274586 -48474 296987 452672 448028 596151 887902 882576
30674 882576 382657 -199586 -402304 -280527 -142319 -61325 32423 73109 11607 6365 142031
30663 142031 196529 17826 -119780 77292 382557 360458 56139 -99694 17093 119963
30653 119963 82858 111549 258611 239591 -78882 -393814 -407225 -259297 -268596 -453426 -566769
30642 -566769 -486510 -353120 -355705 -504459 -602375 -430122 -30378 241586 121347 -152738
30632 -152738 -95048 334960 619108 393503 -45370 -192532 -28455 73011 -32877 -115258
30622 -115258 -16457 109221 90097 -3851 -30415 -8592 -38230 -122047 -207796 -316463 -498662
30611 -498662 -717894 -881910 -946831 -903617 -717491 -388480 -33842 207815 341172 470499
30601 470499 598278 596053 400569 116357 -119633 -257909 -273735 -127402 117004 261099
30591 261099 189927 24615 -65981 -96848 -159478 -203284 -134362 -46015 -104576 -251207 -281287
30580 -281287 -202090 -218614 -343010 -338302 -125225 82075 156240 216148 243017 -51945 -674923
30569 -674923 -1051697 -733159 -129076 -9791 -416352 -634086 -254027 303687 484619 329887
30559 329887 229017 296042 334065 235324 112491 91025 166550 246345 237443 137676 66076
30548 66076 107780 140645 -11189 -249277 -270763 -33895 116950 -59782 -337589 -356400
30538 -356400 -120530 86265 134543 122861 98604 -15804 -213168 -344011 -317127 -203888
30528 -203888 -110536 -77644 -131513 -300020 -512707 -582546 -389203 -72435 37208 -237254
30518 -237254 -637809 -655703 -116178 513834 607114 133832 -317962 -310342 -34299 114462
30508 114462 113290 189825 362286 452313 428169 393868 312557 84646 -136024 -69516 220419
30497 220419 343869 148043 -94911 -184594 -293687 -549850 -680623 -427130 -51875 -14327
30487 -14327 -281024 -400609 -229731 -121266 -287527 -412565 -156128 275949 407823 164265
30477 164265 -83908 -75362 79702 213800 357204 556740 694500 671364 599386 617714
30467 617714 641494 501420 250438 104381 102125 53722 -136216 -302000 -267300 -104801
30457 -104801 -27277 -120655 -292295 -410481 -397230 -239386 -4684 179231 233536 202573
30447 202573 180928 194004 178063 42526 -257222 -642320 -889339 -785633 -369896 53131
30437 53131 205233 89456 -94751 -212031 -279773 -342365 -356371 -224406 81145 440629
30427 440629 663416 671212 551345 370269 45738 -437471 -797454 -729100 -392472 -277490
30417 -277490 -488643 -548643 -142557 313592 232950 -274586 -573531 -426545 -244274 -383826
30407 -383826 -669976 -769384 -652227 -456137 -192613 143722 376475 327046 88099 -91998
30397 -91998 -125870 -122229 -170257 -237229 -235625 -83173 239453 585716 676149 365077 -164152
30386 -164152 -568602 -667421 -521548 -279698 -68988 16676 -39516 -140151 -163843 -84641
30376 -84641 49882 204555 337613 354344 200865 -10291 -80285 54569 262216 390177
30366 390177 430336 482455 601504 714899 689205 486014 247987 181997 328731 498013
30356 498013 479737 279185 91826 78228 215768 345525 320132 135842 -41929 -29862
30346 -29862 148518 253872 129110 -55147 12399 354703 608859 432322 -79539 -481681
30336 -481681 -461889 -148587 80003 20193 -189661 -293436 -205952 -33530 106910 180883
30326 180883 175653 69647 -103909 -249914 -309424 -301032 -245034 -135195 -21260 -15779 -147465
30315 -147465 -288312 -297880 -168039 28025 218705 286468 90160 -298886 -504280 -224090
30305 -224090 337447 661156 550493 329629 333841 461585 410282 166508 16023 133077
30295 133077 371577 467374 301996 -37130 -335430 -387383 -167384 124658 275423 296038
30285 296038 341695 429713 403252 195663 -38606 -125133 -60272 73397 235911 371319
30275 371319 365578 210138 93127 159598 273090 206003 -4595 -116580 -69152 -56760 -177249
30264 -177249 -254122 -121744 110770 220424 141915 -55885 -316093 -556639 -619300 -455176
30254 -455176 -286187 -386448 -732376 -1032426 -1074863 -890685 -612706 -364091 -281104 -437666
30244 -437666 -687928 -750566 -525539 -196778 34704 166453 262063 274505 160754 55660
30234 55660 127457 292596 273020 -25068 -359430 -467570 -398740 -392437 -512633 -585039 -485380
30223 -485380 -298337 -138071 -1712 86268 -23555 -358229 -623304 -514633 -152876 71052
30213 71052 31072 -78114 -191786 -456871 -772380 -720610 -214717 198889 45457 -408405
30203 -408405 -600638 -487497 -413098 -396644 -149499 266900 398949 90027 -297589 -463018
30193 -463018 -507598 -562195 -517775 -308243 -78609 93249 279773 389900 200750 -145453
30183 -145453 -159709 249608 549852 404935 207334 376549 624099 470109 91033 2531
30173 2531 161747 75699 -314867 -537088 -383465 -194912 -245293 -376130 -395486 -377562 -380450
30162 -380450 -257405 46641 312791 330823 124664 -187571 -489951 -581287 -330135 -3395
30152 -3395 -79688 -597113 -1035942 -1012886 -726033 -487770 -197050 361851 959714 1094261
30142 1094261 653766 74684 -178998 -71233 90431 33309 -222414 -411352 -323190 -51679
30132 -51679 131962 131575 94259 122956 143049 120576 162778 260599 172261 -219866 -618726
30121 -618726 -630469 -264765 115826 266464 241176 146459 -23235 -241727 -343120 -196435
30111 -196435 82301 210738 57858 -176788 -179169 81394 291178 211760 20471 44324
30101 44324 258147 320829 90089 -197877 -306488 -253374 -99094 199395 567548 743011
30091 743011 625092 426747 281952 12946 -441209 -690275 -385272 185140 434297 270905
30081 270905 102685 140134 189049 142973 182527 357539 407901 200332 -15084 -9077 75405
30070 75405 31393 -9315 219138 661477 962038 866967 419094 -152914 -565219 -608487
30060 -608487 -347286 -114854 -129704 -205888 -45531 276967 397535 205482 -1273 18065
30050 18065 111572 38619 -119487 -113435 36184 59090 -110028 -191933 8193 266764 233606
30039 233606 -83528 -346219 -329175 -121675 86656 195466 150289 -55529 -255175 -200713
30029 -200713 92376 282453 142494 -105018 -95088 164660 319662 153099 -173466 -363380
30019 -363380 -303504 -129429 -75118 -221729 -329015 -59250 497700 743717 305578 -332474
30009 -332474 -353071 298888 836624 723784 327594 236786 406669 405787 181355 62267
29999 62267 145991 188395 104996 136571 408350 672645 643960 345098 -1838 -211788 -165015
29988 -165015 161825 551674 650482 385993 103779 113792 281814 279272 69475 -124544
29978 -124544 -225609 -367434 -578717 -700607 -665353 -594294 -539234 -377798 -90859 94140
29968 94140 27574 -82706 42884 304304 324140 -15658 -381331 -395991 -71955 252805
29958 252805 303502 111214 -72572 -35943 205183 454651 559215 531886 430368 226042
29948 226042 -81926 -306718 -232672 52542 184156 -28874 -329688 -325234 17083 338829
29938 338829 344629 150668 109798 350568 602887 530263 154147 -176059 -209650 -22582
29928 -22582 201184 384120 436689 194812 -267091 -483841 -127586 444854 595507 293566
29918 293566 111949 301799 425826 118660 -315996 -420578 -262808 -171295 -140494 15762
29908 15762 178284 113662 -17125 126357 430327 437193 65838 -298871 -459001 -605703
29898 -605703 -770190 -633170 -120042 297317 218204 -135853 -313648 -264401 -230887 -273510
29888 -273510 -277528 -264240 -335421 -409028 -328509 -166783 -134051 -234007 -283544 -241486 -249034 -340314
29876 -340314 -365741 -249052 -110072 -67840 -90595 -107001 -127404 -188266 -283122 -397126 -506904
29865 -506904 -501527 -226028 293583 742551 775323 405119 32313 4462 215327 278179
29855 278179 76907 -74430 73088 283752 173530 -186859 -366183 -237805 -148767 -330024
29845 -330024 -532403 -465560 -265379 -230357 -349367 -422889 -460508 -592471 -702440 -530185
29835 -530185 -125755 128589 -7614 -382445 -689300 -730134 -455460 5412 343121 340583
29825 340583 159655 121582 229705 220913 89403 149722 451525 559745 205306 -193704
29815 -193704 -68005 454291 693605 362703 -81650 -129806 114854 184516 -86614 -423307
29805 -423307 -530369 -394530 -175247 -12316 -217 -181212 -450218 -569630 -404025 -96041
29795 -96041 89538 64091 -26064 4120 214658 515456 688068 505632 6494 -406961
29785 -406961 -378105 -94649 -92160 -505916 -850970 -704600 -272066 -8670 17058 15381 -27339
29774 -27339 -274001 -574204 -583758 -365387 -377725 -734525 -932515 -561037 90008 443050
29764 443050 377581 217010 156585 83376 -79761 -189219 -120262 20520 35534 -104371
29754 -104371 -221607 -134224 132681 356610 355969 181349 17628 -37919 7448 163613 405824
29743 405824 545815 396921 77591 -108091 -127239 -254724 -569368 -761346 -625671 -405179
29733 -405179 -360068 -296418 101724 675741 941635 740962 364305 75426 -118800 -227186
29723 -227186 -165273 40816 223024 305747 339360 298259 122672 -32872 81645 389818
29713 389818 521043 358655 206864 265454 306800 119323 -64159 70661 359058 353032
29703 353032 -19411 -346647 -278008 103646 468524 566536 347042 -41006 -329148 -363012
29693 -363012 -262626 -213758 -157997 91402 454459 595120 404494 198256 261844 416126
29683 416126 276772 -172457 -524392 -454956 -75118 266390 368959 290915 190124 160809
29673 160809 191303 208948 163458 83208 34213 31165 38659 59127 138096 249857 270464 143706
29661 143706 2862 14908 134364 130895 -128536 -517311 -779745 -749438 -454466 -109588
29651 -109588 10177 -177046 -425152 -421232 -180722 11289 65092 205366 508130 648359
29641 648359 388275 54050 129940 517207 638168 263199 -199236 -324564 -187222 -87701
29631 -87701 -104481 -143698 -177005 -195193 -117393 47068 118090 12690 -76923 47515 318219
29620 318219 569871 772900 896889 772554 358100 -57447 -212055 -247928 -416824 -608179
29610 -608179 -563928 -399445 -438978 -616392 -558170 -272584 -210121 -508599 -702232 -422657
29600 -422657 66441 339706 419620 550259 678661 579734 305817 125307 129408 222206
29590 222206 382196 611892 735479 590458 357966 359374 546155 535638 186975 -186422
29580 -186422 -275174 -168308 -150993 -309754 -487706 -517485 -392178 -258643 -263062 -354039 -311279
29569 -311279 -83940 29514 -226419 -590120 -537467 -15458 447787 474621 314475 374359
29559 374359 593931 609695 335993 34055 -94296 -57564 119966 407724 580389 365050
29549 365050 -126933 -423585 -305903 -113006 -197655 -336721 -62023 545134 854934 567905
29539 567905 159656 185166 475496 434122 -46061 -443897 -394240 -147520 -89096 -197714
29529 -197714 -244676 -218304 -223225 -184296 -3603 151426 84874 -28423 112807 367051 287113
29518 287113 -151101 -443027 -318013 -137817 -274456 -503664 -394093 -6428 230882 188443
29508 188443 145773 259859 306666 47373 -404544 -707228 -653617 -344670 -70753 -25565
29498 -25565 -94726 4831 324311 568835 507151 318967 314993 456741 450729 246081 100655
29487 100655 134140 151124 17486 -80366 71325 382030 616460 719407 766531 708709
29477 708709 416373 -32411 -323721 -245858 60694 272126 240233 107953 89804 221938
29467 221938 371566 435105 429377 384935 262958 44734 -177959 -287627 -262996 -149731
29457 -149731 12488 146613 120285 -90791 -295475 -299932 -166228 -83100 -43701 113048
29447 113048 358977 453926 330894 231761 320581 399423 205988 -186478 -488403 -581079
29437 -581079 -548852 -416987 -125919 242353 462014 446938 345531 286046 207920 45491
29427 45491 -89219 -65383 33271 15973 -116843 -162952 -20144 164995 212537 140484 88763
29416 88763 115619 179832 245772 282271 220139 49717 -92015 -95706 -100588 -333401 -724057
29405 -724057 -923499 -773683 -516399 -409163 -377795 -251609 -129710 -230375 -494394 -630383
29395 -630383 -521021 -336097 -247053 -246682 -260650 -246763 -172957 -62579 -52250 -238272 -486005
29384 -486005 -566297 -459803 -351826 -357167 -428356 -486756 -453303 -227326 134849 315698 99621
29373 99621 -244702 -285830 -62506 10941 -165345 -268979 -184738 -202315 -423799 -517093 -329257
29362 -329257 -226135 -454345 -640684 -384722 52121 166364 -4257 -68052 15443 14949
29352 14949 20445 305465 667996 566195 -28858 -511708 -498064 -254202 -106907 31070
29342 31070 280851 425296 273070 39915 11689 103025 91856 52990 188054 389938
29332 389938 359076 86470 -122032 -102772 -19290 -44216 -115933 -123202 -139528 -306414 -561553
29321 -561553 -641665 -385646 45570 310662 227073 -80943 -356519 -450108 -366623 -178418
29311 -178418 20753 129965 100627 -24730 -157429 -204253 -83164 168939 290577 1861
29301 1861 -590655 -1008742 -966739 -701152 -554885 -495087 -331785 -170656 -245978 -446924
29291 -446924 -439094 -194363 7423 53209 46239 -69714 -432657 -788535 -657844 -118277
29281 -118277 135769 -232961 -687896 -614310 -167300 99226 67372 24777 62747 17696
29271 17696 -116888 -179394 -189239 -318095 -529033 -576860 -376059 -105653 41815 -478 -224443
29260 -224443 -508085 -596649 -360686 -10182 164853 165937 159101 114080 -106412 -383603 -427649
29249 -427649 -208051 37177 213377 428242 617220 526186 201032 92968 422838 759795
29239 759795 570493 -11037 -337367 -112280 258317 262984 -55246 -239931 -66884 218296
29229 218296 312551 248889 224260 213643 19828 -336057 -552645 -437817 -123434 195725
29219 195725 487979 711716 682720 350356 -2618 -117860 -162351 -460077 -933762 -1168808
29209 -1168808 -1013344 -770202 -736159 -854673 -927528 -899710 -780815 -499192 -33773 422812
29199 422812 610478 480086 223892 54820 29905 76455 122416 159558 184058 139444 2738
29188 2738 -97796 12313 298967 516163 522078 439601 407302 350810 155230 -95270 -238390
29177 -238390 -265774 -243620 -126648 132365 385405 426241 266534 91391 14179 42214
29167 42214 176732 365501 482181 532370 701040 980133 995350 531661 -5429 -87687
29157 -87687 151665 134575 -265627 -608291 -657559 -668894 -786161 -740075 -394202 -86519
29147 -86519 -114093 -291937 -343989 -351163 -451376 -434237 -62923 425350 564826 287515 -59296
29136 -59296 -244183 -364437 -542483 -692136 -641225 -329349 134228 520039 624557 443798
29126 443798 151502 -115318 -330272 -432601 -318762 -54530 118530 100192 54219 100906
29116 100906 108293 -57523 -273091 -314697 -118049 229871 566672 637788 276240 -261982
29106 -261982 -445354 -149434 115718 -84886 -487392 -555285 -261416 -28536 -61004 -170616
29096 -170616 -193782 -172192 -115773 54891 273251 319937 122973 -146602 -322872 -409872
29086 -409872 -474092 -533624 -584446 -625432 -646506 -643742 -597289 -425995 -111980 118808 4719
29075 4719 -283585 -237375 232507 532865 227817 -241941 -180436 314147 541828 294665
29065 294665 70368 164790 242680 35666 -137693 72331 418115 433559 165917 71250
29055 71250 297414 491815 356022 68743 13169 260058 503005 477671 286493 214215
29045 214215 317975 387436 310916 246544 322440 392983 281068 71493 -66626 -178078
29035 -178078 -369871 -511291 -408344 -177584 -96829 -132725 18576 409177 709484 664125
29025 664125 375670 69898 -136974 -176265 -21801 170076 180181 59169 78028 287379
29015 287379 421082 327613 192324 200971 268054 248264 149557 -17787 -329808 -701261 -812152
29004 -812152 -509513 -71922 150174 166893 192736 241546 155291 -68811 -249940 -293022
28994 -293022 -278688 -292765 -329504 -365370 -398642 -401039 -317819 -136255 78564 211586 166837
28983 166837 -44302 -285732 -415827 -404256 -289805 -102318 87693 158164 120577 187264
28973 187264 447671 613724 379129 -66427 -239557 -39642 178458 231187 352294 667065
28963 667065 854787 608535 119320 -185364 -170857 -27336 38817 -55310 -261619 -374972
28953 -374972 -213954 45694 -15398 -453704 -783261 -632087 -255200 -82981 -63291 132204
28943 132204 455799 508866 158218 -284678 -518753 -554051 -519651 -458861 -382609 -308091 -191536
28932 -191536 5031 166142 121963 -84364 -201388 -84665 128640 206014 80539 -114286
28922 -114286 -207337 -155363 -58900 -16820 -12262 -15219 -126252 -439245 -779408 -810638 -460092
28911 -460092 -19313 242070 327913 310766 172470 3200 71392 464682 872663 941810
28901 941810 667512 269893 -88668 -280716 -182963 87147 159759 -95560 -317069 -173209
28891 -173209 134904 235148 183162 282791 514068 596739 494493 404458 324289 73197
28881 73197 -289385 -488195 -476612 -473147 -550809 -560673 -471199 -411499 -351692 -107124 289224
28870 289224 562719 604723 585806 609409 564984 386798 168398 -33062 -235703 -354443
28860 -354443 -266037 -64160 36483 42089 121107 232172 156920 -110488 -367081 -566184
28850 -566184 -781081 -852258 -565565 -187137 -246463 -678334 -785113 -273500 267144 247039
28840 247039 -120843 -315695 -301224 -310034 -254150 47034 321071 143647 -336429 -534783
28830 -534783 -260727 88843 177646 104370 48805 -33057 -197479 -317828 -289624 -211472 -197871
28819 -197871 -175801 -19675 221935 373336 357624 276802 268894 335378 341624 202625 30200
28808 30200 12439 153751 264147 249409 258911 431900 624438 562083 218570 -120114 -187648
28797 -187648 -18036 153384 196078 202705 287826 358038 211958 -133259 -391631 -373010 -218406
28786 -218406 -120509 -12124 209503 325293 39627 -475897 -688064 -399920 19904 189324
28776 189324 140739 71847 7227 -113782 -281927 -499237 -760840 -860255 -537785 49337
28766 49337 371816 226065 9744 74234 208673 88760 -141868 -146770 43111 164259
28756 164259 170641 135405 -55721 -454613 -702418 -442238 50470 169939 -155314 -419000
28746 -419000 -339655 -167684 -123073 -61868 113497 176711 -22337 -233591 -171584 51983
28736 51983 141144 79118 99578 279679 403796 251693 -112907 -392166 -361900 -101484
28726 -101484 113561 132719 49416 -10054 -49509 -82108 -51822 -13617 -163872 -483470 -593098
28715 -593098 -262166 157049 181583 -89161 -164226 32098 57159 -312354 -725609 -773938
28705 -773938 -463075 -34015 317120 407283 141647 -198251 -109933 463051 950467 881800
28695 881800 481775 274953 393920 601532 756546 885445 925720 744939 383594 43328
28685 43328 -129937 -99006 114234 363388 405648 193698 -120 40977 138439 12271
28675 12271 -230797 -232883 46438 231107 42195 -351110 -569287 -421693 -13243 385707
28665 385707 531017 404192 248362 287256 426322 392504 152869 -22830 32962 137550
28655 137550 46283 -174482 -251226 -115102 -17267 -183606 -478585 -538611 -233833 129494
28645 129494 170196 -73374 -182515 91537 515385 717239 649997 512364 357891 78015
28635 78015 -253921 -334537 -33017 379600 540783 381779 87443 -165418 -277051 -179562
28625 -179562 70769 239583 165808 27002 134789 467238 642341 423979 32140 -176897
28615 -176897 -147619 -67039 -23389 46830 146719 192466 195350 263171 392911 445890 372383
28604 372383 290959 292027 322947 319211 279988 160458 -110379 -421158 -513000 -358674 -275261
28593 -275261 -458828 -625047 -394280 115103 402697 241200 -88485 -227888 -141555 -32060
28583 -32060 -60413 -222126 -376854 -381075 -269413 -228350 -290922 -234999 17434 134080 -141545
28572 -141545 -437577 -193243 427250 661551 276361 -64008 175530 599443 552826 116881
28562 116881 -139640 -91062 -104771 -296931 -366724 -213434 -163420 -402464 -610890 -422957
28552 -422957 26277 273979 108200 -232135 -386793 -272888 -133500 -206139 -386607 -357288
28542 -357288 -91715 7277 -316386 -678228 -499135 152623 582834 361778 -208393 -617798
28532 -617798 -739669 -701725 -540630 -297328 -195546 -373750 -588207 -507971 -209328 -61786
28522 -61786 -174304 -274326 -153735 56177 124053 -9129 -277230 -583775 -747389 -573937
28512 -573937 -143849 142838 -2563 -391461 -602055 -500280 -320054 -276051 -318188 -296202
28502 -296202 -176596 -16647 147182 300539 418780 482080 459320 282438 -43746 -307736
28492 -307736 -249988 82038 327469 271856 121294 154356 292714 263213 49902 -110575
28482 -110575 -124174 -135807 -241866 -386511 -550130 -750083 -831879 -588500 -162252 18707
28472 18707 -164280 -342690 -261457 -174866 -351467 -544532 -371388 39072 248723 196213
28462 196213 186599 280168 220533 1081 -22655 262016 472341 316487 45177 34915 235234
28451 235234 350520 335985 372088 486927 525023 436927 347731 356844 443087 528833 515287
28440 515287 347224 158823 197917 442538 490420 83954 -431033 -508870 -158700 98512
28430 98512 15561 -64628 192991 576188 637314 310902 -49026 -135244 28946 222162
28420 222162 271629 166763 14903 -104328 -221960 -348940 -329607 -22942 377426 475689
28410 475689 215176 1203 110427 267072 91704 -265272 -322110 23180 386892 486118
28400 486118 434058 383668 255614 -13992 -255912 -305928 -247621 -231415 -233788 -172797 -91925
28389 -91925 -44280 54904 273941 498066 594563 605660 599568 497936 275581 156698 312658
28378 312658 493357 312869 -155273 -445479 -377360 -277210 -419635 -619509 -581579 -355593
28368 -355593 -184622 -114415 -28231 66052 52851 -48229 -83535 4115 112761 137783 63513
28357 63513 -77134 -223743 -299746 -293997 -284623 -308538 -294861 -217238 -187187 -257499 -267889 -88645
28345 -88645 91273 -19350 -357944 -559768 -488674 -412289 -535202 -646004 -454524 -85078
28335 -85078 54919 -164831 -438786 -464301 -317889 -274464 -394134 -463286 -320920 -86044
28325 -86044 8381 -81942 -180815 -133996 26700 178850 261553 275513 224509 143366 110077
28314 110077 125978 50278 -208994 -481875 -490200 -231824 -31573 -125394 -340437 -321963 7191
28303 7191 359708 437178 256367 101916 212451 526113 716543 508985 -6594 -418610
28293 -418610 -398213 -19457 375744 564982 594396 589489 578185 540984 501372 476797 426526
28282 426526 342583 321717 429776 536317 425644 88083 -223657 -279687 -116959 64989
28272 64989 163615 235815 356896 519211 652598 666379 493713 176501 -119121 -270067
28262 -270067 -356034 -524944 -707907 -652295 -310459 -4555 -30644 -228033 -182705 178366
28252 178366 466911 381985 129257 104343 327450 456033 306576 87721 57827 191155
28242 191155 315455 385675 432651 384928 181454 -9533 57319 333971 510318 459461
28232 459461 393702 471651 510738 291703 -48257 -183721 -56215 91376 92152 31461 33474
28221 33474 68606 32659 -94998 -208185 -146273 135244 417713 384761 51856 -154618
28211 -154618 50817 382133 405063 206480 213314 441760 459009 153765 -7536 279170
28201 279170 645033 617481 314299 172490 274476 365877 339900 282397 170562 -61838
28191 -61838 -237723 -107943 220115 382066 274659 139724 135941 169174 170770 195840 180932
28180 180932 -53076 -441924 -633495 -453979 -153216 -25805 -34711 123 58776 5373
28170 5373 -120222 -130714 30697 210363 238915 108398 -39950 -58996 55293 157960
28160 157960 140776 77606 82948 86212 -74351 -346062 -460620 -285222 14713 224060 299652
28149 299652 269173 115959 -105157 -212052 -118399 5663 -54805 -276728 -460861 -502496
28139 -502496 -473188 -475714 -520572 -535641 -456425 -324940 -275169 -347671 -377690 -216708 -8746
28128 -8746 -14965 -172200 -119565 259137 623005 653885 463809 320257 233562 85823 -48785
28117 -48785 -22372 95947 141108 139587 190124 187039 -14660 -260806 -280557 -150656 -207759
28106 -207759 -509817 -760074 -790070 -727373 -621048 -329075 69082 175383 -148084 -461477
28096 -461477 -335757 21614 93735 -196971 -452117 -389642 -99243 238552 532571 675101
28086 675101 574586 346214 218757 216516 160175 -14917 -194605 -334780 -476602 -493896
28076 -493896 -179241 317493 496313 135842 -399251 -683712 -745236 -796048 -779809 -555279
28066 -555279 -285923 -227331 -280904 -170822 50769 99135 -27555 -75917 -31286 -99857 -198715
28055 -198715 -1315 412625 505504 83414 -366845 -408841 -225553 -127961 -2168 296321
28045 296321 445759 139126 -250685 -120519 418732 672067 377137 -45 -23538 190999
28035 190999 319596 245390 5942 -298089 -440959 -260828 26725 52463 -140439 -158366
28025 -158366 66440 126196 -205103 -626645 -821144 -873246 -930217 -861992 -579992 -347529
28015 -347529 -416848 -615392 -623043 -445055 -305655 -270617 -271446 -327549 -458013 -522837 -411778
28004 -411778 -255648 -234249 -333461 -476500 -670355 -808199 -606050 -35722 437618 401760
27994 401760 59777 -124146 -121149 -242410 -516110 -655062 -581425 -502844 -462696 -273007
27984 -273007 46432 193159 57840 -101335 -86070 -12384 4522 84659 309365 492850
27974 492850 450361 293315 248241 324293 343655 211921 20849 -66105 32358 214513 249819
27963 249819 45038 -169608 -88682 245877 476293 397141 161017 -26746 -156718 -254165
27953 -254165 -235139 -111982 -127935 -436280 -768707 -688444 -149241 423729 644541 567438
27943 567438 487842 499586 435645 213386 20867 41810 146618 73580 -131697 -116377 280080
27932 280080 763673 952830 810562 554226 318985 115864 -7658 19479 181750 412152
27922 412152 634665 686853 414813 -3013 -96223 284982 662396 555163 155789 -19586
27912 -19586 77314 89438 -41026 -6727 242104 370935 237810 87799 54616 -44322 -262793
27901 -262793 -350143 -217171 -132238 -227307 -236151 11752 236597 148753 -105356 -243597 -274655
27890 -274655 -312733 -266722 -51465 142131 118791 7753 15186 53322 -79646 -329043 -477169
27879 -477169 -450216 -299495 -63147 145257 146623 8840 59245 342562 427556 91883
27869 91883 -191116 71419 556584 551060 2384 -477660 -559079 -503931 -516976 -417790 -120668
27858 -120668 94200 33130 -95488 -65050 -5545 -146486 -422881 -563088 -423544 -93668
27848 -93668 212245 299032 156862 -862 -12472 -30919 -289950 -667194 -791128 -591258
27838 -591258 -405173 -457808 -553092 -423871 -127263 67966 1937 -277173 -565183 -597560
27828 -597560 -289948 80720 158170 -17125 -93983 11535 -545 -243240 -370049 -122543
27818 -122543 205294 195513 -54055 -106689 135639 319886 189716 -78985 -157677 38221
27808 38221 312607 419149 278780 46832 -25357 147249 386537 479705 454999 532505
27798 532505 813384 1105803 1096864 688494 149117 -116407 8581 224256 205532 37882
27788 37882 75376 395274 649269 545221 254386 169176 393834 665572 728118 612784
27778 612784 518393 514220 453116 203873 -101261 -197229 -89273 -112504 -433589 -708212 -521639
27767 -521639 -19620 269654 167893 -26683 -144995 -375612 -734535 -807080 -347544 232622
27757 232622 359432 30010 -308955 -406086 -345017 -189510 97027 403827 487748 276663
27747 276663 -62086 -340814 -451274 -323684 -16742 217479 195027 63784 70555 156220
27737 156220 79554 -118554 -133124 94853 242739 99031 -115205 -100688 78066 126263
27727 126263 -44596 -229944 -235708 -100996 292 -16967 -74768 -65907 -17387 -60149 -233399
27716 -233399 -409321 -455037 -371264 -210926 15123 252795 353481 239684 14610 -205841
27706 -205841 -420156 -570171 -465283 -111233 106010 -97928 -407868 -302755 153923 392576
27696 392576 201408 -5405 92173 238768 103035 -168694 -248397 -159814 -137492 -174150
27686 -174150 -88719 92099 175197 141897 128090 123683 5412 -156457 -137762 63497 174500
27675 174500 43821 -152774 -203863 -157015 -192740 -343585 -465125 -410982 -159769 163939
27665 163939 346388 242598 -65940 -329646 -380974 -269821 -143217 -82746 -90387 -136848
27655 -136848 -166636 -127921 -44458 14590 71008 235790 498657 639133 486761 194798
27645 194798 81969 223977 388234 398680 356257 390148 387587 179792 -117939 -209105 -45952
27634 -45952 89037 -11401 -212957 -286799 -231108 -195116 -234763 -321216 -478850 -718180 -894995
27623 -894995 -825010 -521518 -184347 7427 -20247 -254949 -529101 -543579 -193906 206136
27613 206136 291320 164249 215431 453676 444707 30429 -328126 -194499 210756 384309
27603 384309 295084 331879 605132 747085 470539 -19143 -318103 -308386 -192070 -170446
27593 -170446 -234260 -238344 -99588 101275 220091 236114 267019 375779 469883 456713 376341
27582 376341 275611 81740 -238178 -496344 -465486 -198820 15166 -1824 -179553 -374493
27572 -374493 -502101 -506285 -386042 -271629 -305433 -425618 -430948 -278532 -139686 -124992 -142838
27561 -142838 -101609 -71858 -134492 -205283 -139734 64892 268335 336109 238905 68824 -11375
27550 -11375 84190 240962 256611 95510 -72445 -102123 -22388 61740 81704 6457 -106913
27539 -106913 -47792 346227 858572 1017666 694763 331344 353138 584790 560143 259457
27529 259457 136907 416663 753145 732506 406895 111323 -34763 -165966 -314121 -313696
27519 -313696 -107183 90404 64793 -106393 -199942 -192424 -244409 -351640 -275951 49720 286882
27508 286882 119779 -230344 -261559 71536 265777 16625 -331399 -328472 -86376 -30833
27498 -30833 -197609 -222629 19294 206781 89072 -152994 -225443 -127665 -60988 -137647 -351125
27487 -351125 -662518 -949283 -1018695 -836628 -608951 -482149 -316793 46372 432768 494529
27477 494529 167015 -257073 -484457 -460273 -283516 -93133 -39151 -169764 -322513 -293122
27467 -293122 -115548 1074 -298 17830 93410 91706 -8007 -31538 55861 12222 -283490
27456 -283490 -548146 -481301 -243585 -230848 -490682 -699129 -662487 -501448 -336664 -140717
27446 -140717 29506 -2548 -189730 -188093 163905 543201 567787 327149 202245 292656
27436 292656 346290 217437 71166 66756 100045 -8668 -247699 -474364 -622227 -709908
27426 -709908 -720047 -612919 -443798 -351217 -403561 -522581 -578620 -512930 -351679 -155726
27416 -155726 6474 83464 94710 125932 202219 205784 35435 -172050 -158486 68395 178421
27405 178421 -8131 -212911 -118461 96558 24683 -256991 -226148 249717 619213 450470
27395 450470 93926 137428 516200 664022 383552 37145 -109442 -222698 -460124 -625574
27385 -625574 -491295 -167954 76657 161101 153243 68773 -82504 -174132 -94108 63984 110745
27374 110745 29201 -9762 103296 267759 308686 198867 91063 122712 231339 236726 108338
27363 108338 37254 178014 430205 573146 509158 268022 -84408 -385027 -383709 -44170
27353 -44170 296750 327456 187216 188572 258193 74758 -299455 -423969 -188834 -27573
27343 -27573 -238202 -527183 -485066 -155353 145907 272226 240132 61393 -154386 -195909
27333 -195909 -99249 -212907 -648948 -995384 -908495 -658164 -654598 -726065 -408258 209550
27323 209550 504193 188494 -329299 -542210 -411333 -228603 -219239 -389628 -558699 -490038
27313 -490038 -153918 177339 260020 190238 173722 160465 16153 -113698 -7113 183481
27303 183481 123348 -122692 -166906 44562 129576 -108275 -408762 -512109 -463207 -341086
27293 -341086 -106168 136328 131050 -100806 -223505 -142735 -179545 -482883 -711809 -594288
27283 -594288 -392822 -453370 -636175 -597492 -369213 -239498 -239312 -149183 83081 271764 285678
27272 285678 158928 -19106 -129998 -60467 112288 129568 -77529 -234250 -142881 -1295
27262 -1295 -28971 -44233 215142 562414 588461 303628 120181 233451 428174 510944 543477
27251 543477 573991 489279 268187 111736 167200 300244 266038 2225 -309519 -406272
$$ [...]
##END NTUPLES=NMR SPECTRUM
##END=
