##TITLE=31Pdec_LY-6.70+TMF
 D2O, 24 sc
 28.2.2020
##JCAMPDX= 6.0         $$ Bruker NMR JCAMP-DX V2.0
##DATA TYPE= NMR SPECTRUM
##DATA CLASS= NTUPLES
##ORIGIN= UXNMR, Bruker Analytische Messtechnik GmbH
##OWNER= root
$$ XWIN-NMR		Version 3.5
$$ Fri Feb 28 15:31:47 2020 Russian Standard Time (UT+4h)  she@DPX200
##.OBSERVE FREQUENCY= 81.013821
##.OBSERVE NUCLEUS= ^31P
##.ACQUISITION MODE= SIMULTANEOUS
##.ACQUISITION SCHEME= undefined
##.AVERAGES= 24
##.DIGITISER RES= 17
##SPECTROMETER/DATA SYSTEM= spect
##.PULSE SEQUENCE= zgpg30
##.SOLVENT NAME= CDCl3
##.SHIFT REFERENCE= (INTERNAL, CDCl3, 0, 182.463)
##AUDIT TRAIL= $$ (NUMBER, WHEN, WHO, WHERE, WHAT)
$$ ##TITLE= Audit trail, XWIN-NMR		Version 3.5
$$ ##JCAMPDX= 5.01
$$ ##ORIGIN= Bruker BioSpin GmbH
$$ ##OWNER= she
$$ F:/spectra/data/she/nmr/P31/1/pdata/1/auditp.txt
$$ ##AUDIT TRAIL=  $$ (NUMBER, WHEN, WHO, WHERE, WHAT)
(   1,<2020-02-28 15:30:35.67 +0400>,<she>,<DPX200>,
      <created by zg, POWCHK disabled, PULCHK disabled
       configuration hash MD5:
       00 E9 B6 7A A2 85 ED C7 34 08 36 98 17 FE 4E 26
       data hash MD5: 32K
       FA F8 FE B5 40 AD 84 30 D9 07 44 D8 FF 94 82 3E>)
(   2,<2020-02-28 15:30:38.29 +0400>,<she>,<DPX200>,
      <Start of raw data processing
       efp BC_mod = 2 LB = 1 FT_mod = 6 PKNL = 1 PHC0 = -1610.366 PHC1 = 663.0013 SI = 64K 
       data hash MD5: 64K
       51 B1 AB 45 D4 76 7E 01 B0 38 9D 58 1E 9E 98 8A>)
(   3,<2020-02-28 15:30:54.68 +0400>,<she>,<DPX200>,
      <pk PHC0 = 2.548914 PHC1 = 0 
       data hash MD5: 64K
       98 C1 1A 10 0C 85 95 69 3B 05 B9 F0 F9 E8 E5 A6>)
(   4,<2020-02-28 15:31:01.12 +0400>,<she>,<DPX200>,
      <abs ABSG = 5 
       data hash MD5: 64K
       B1 D4 F3 5A 10 94 34 81 F3 48 A8 9C EA C3 23 CA>)
(   5,<2020-02-28 15:31:15.34 +0400>,<she>,<DPX200>,
      <pk PHC0 = -6.403041 PHC1 = 0 
       data hash MD5: 64K
       AB B8 3B DD 44 86 7D 4C 1F 50 9F 2B 77 86 5B DF>)
$$ ##END=
$$ 
$$ hash MD5
$$ C2 A5 8E 52 00 8E 21 44 FA 3E C4 5A 66 93 F4 28
##$RELAX= 
##$RELAX= 
##$RELAX= 
##$RELAX= 
##$RELAX= 
##$RELAX= 
##$RELAX= 
##$RELAX= 
$$ Bruker specific parameters
$$ --------------------------
##$DU= <F:/spectra>
##$EXPNO= 1
##$NAME= <P31>
##$PROCNO= 1
##$TYPE= <nmr>
##$USER= <she>
##$AMP= (0..31)
100 100 100 100 100 100 100 100 100 100 100 100 100 100 100 100 100 100 
100 100 100 100 100 100 100 100 100 100 100 100 100 100 
##$AQSEQ= 0
##$AQ_mod= 1
##$AUNM= <au_zg>
##$AUTOPOS= <>
##$BF1= 81.014009
##$BF2= 200.13
##$BF3= 200.13
##$BF4= 200.13
##$BF5= 200.13
##$BF6= 200.13
##$BF7= 200.13
##$BF8= 200.13
##$BYTORDA= 1
##$CFDGTYP= 0
##$CFRGTYP= 5
##$CHEMSTR= <none>
##$CNST= (0..31)
1 1 145 1 1 1 1 1 1 1 1 1 1 1 1 1 1 1 1 1 1 1 1 1 1 1 1 1 1 1 1 1 
##$CPDPRG= <waltz16>
##$CPDPRG1= <>
##$CPDPRG2= <waltz16>
##$CPDPRG3= <>
##$CPDPRG4= <mlev>
##$CPDPRG5= <mlev>
##$CPDPRG6= <mlev>
##$CPDPRG7= <mlev>
##$CPDPRG8= <mlev>
##$CPDPRGB= <>
##$CPDPRGT= <>
##$D= (0..31)
0 1 0 0 0 0 0 0 0 0 0 0.03 2e-05 3e-06 0 0 0 0 0 0 0 0 0 0 0 0 0 0 0 0 
0 0 
$$ [...]
##$SUBNAM3= <"">
##$SUBNAM4= <"">
##$SUBNAM5= <"">
##$SUBNAM6= <"">
##$SUBNAM7= <"">
##$SUBNAM8= <"">
##$SUBNAM9= <"">
##$SW= 369.568048894756
##$SWIBOX= (0..15)
0 1 3 0 0 0 0 0 0 0 0 0 0 0 0 0 
##$SW_h= 29940.119760479
##$TD= 32768
##$TD0= 1
##$TE= 0
##$TE2= 300
##$TE3= 300
##$TEG= 300
##$TL= (0..7)
0 120 53 12 22 120 120 120 
##$TP= (0..7)
150 150 150 150 150 150 150 150 
##$TP07= 0
##$TPNAME0= <>
##$TPNAME1= <>
##$TPNAME2= <>
##$TPNAME3= <>
##$TPNAME4= <>
##$TPNAME5= <>
##$TPNAME6= <>
##$TPNAME7= <>
##$TPOAL= (0..7)
0.5 0.5 0.5 0.5 0.5 0.5 0.5 0.5 
##$TPOFFS= (0..7)
0 0 0 0 0 0 0 0 
##$TUNHIN= 0
##$TUNHOUT= 0
##$TUNXOUT= 0
##$USERA1= <user>
##$USERA2= <user>
##$USERA3= <user>
##$USERA4= <user>
##$USERA5= <user>
##$V9= 5
##$VALIST= <valist>
##$VCLIST= <CCCCCCCCCCCCCCC>
##$VD= 0
##$VDLIST= <DDDDDDDDDDDDDDD>
##$VPLIST= <PPPPPPPPPPPPPPP>
##$VTLIST= <TTTTTTTTTTTTTTT>
##$WBST= 1024
##$WBSW= 4
##$XGAIN= (0..3)
0 0 0 0 
##$XL= 0
##$YL= 0
##$YMAX_a= 55305
##$YMIN_a= -58859
##$ZGOPTNS= <>
##$ZL1= 120
##$ZL2= 120
##$ZL3= 120
##$ZL4= 120
##$ABSF1= 182.463
##$ABSF2= -187.1042
##$ABSG= 5
##$ABSL= 3
##$ALPHA= 0
##$AQORDER= 0
##$ASSFAC= 0
##$ASSFACI= 0
##$ASSFACX= 0
##$ASSWID= 0
##$AUNMP= <proc_1d>
##$AZFE= 0.1
##$AZFW= 0.5
##$BCFW= 0
##$BC_mod= 2
##$BYTORDP= 0
##$COROFFS= 0
##$CY= -3
##$DATMOD= 1
##$DC= 0
##$DFILT= <>
##$DTYPP= 0
##$F1P= 0
##$F2P= 0
##$FCOR= 1
##$FTSIZE= 65536
##$FT_mod= 6
##$GAMMA= 0
##$GB= 0
##$INTBC= 1
##$INTSCL= 5.30512e-09
##$ISEN= 30
##$LB= 1
##$LEV0= 0
##$LPBIN= 0
##$MAXI= 10000
##$MC2= 0
##$MEAN= 0
##$ME_mod= 0
##$MI= 50
##$NCOEF= 0
##$NC_proc= -2
##$NLEV= 6
##$NOISF1= 182.463
##$NOISF2= 159.3651
##$NSP= 0
##$NTH_PI= 0
##$NZP= 0
##$OFFSET= 182.463
##$PC= 4
##$PHC0= -1614.22
##$PHC1= 663.0013
##$PH_mod= 1
##$PKNL= yes
##$PPARMOD= 0
##$PSCAL= 0
##$PSIGN= 0
##$REVERSE= no
##$SF= 81.0140089999434
##$SI= 65536
##$SIGF1= 159.3651
##$SIGF2= -187.1042
##$SINO= 113.3802
##$SIOLD= 16384
##$SREGLST= <1H.CDCl3>
##$SSB= 0
##$STSI= 65536
##$STSR= 0
##$SW_p= 29940.119760479
##$SYMM= 0
##$S_DEV= 0
##$TDeff= 32768
##$TDoff= 0
##$TI= <>
##$TILT= no
##$TM1= 0
##$TM2= 0
##$TOPLEV= 0
##$USERP1= <user>
##$USERP2= <user>
##$USERP3= <user>
##$USERP4= <user>
##$USERP5= <user>
##$WDW= 1
##$XDIM= 65536
##$YMAX_p= 412425473
##$YMIN_p= -1725318
$$ End of Bruker specific parameters
$$ ---------------------------------
##NTUPLES= NMR SPECTRUM
##VAR_NAME=  FREQUENCY,     SPECTRUM/REAL,   SPECTRUM/IMAG
##SYMBOL=    X,             R,               I
##VAR_TYPE=  INDEPENDENT,   DEPENDENT,       DEPENDENT
##VAR_FORM=  AFFN,          ASDF,            ASDF
##VAR_DIM=   65536,         65536,           65536
##UNITS=     HZ,            ARBITRARY UNITS, ARBITRARY UNITS
##FACTOR=    0.456856943014862, 1,           1
##FIRST=     14782.0589164792, 0,            0
##LAST=      -15158.0608439998, 0,           0
##MIN=       -15158.0608439998, -1725318,    0
##MAX=       14782.0589164792, 412425473,    0
$$ Real data points
##PAGE= N=1
##DATA TABLE= (X++(R..R)), XYDATA
$$ [...]
##PAGE= N=2
##DATA TABLE= (X++(I..I)), XYDATA
36955E22883K4696q5189q3727j9616l687k3957n04N6826O7806J9502k0857j6746
$$ 522883 547579 462390 378663 359047 355360 331403 330899 387725 455531 475033 454176 437430
36943D37430L17L943J1430L5547M9928K3355l8281r4311r9034l6435N3482R3281
$$ 437430 437747 441690 453120 488667 538595 561950 523669 429358 330324 293889 347371 440652
36931D40652M2024n1393r3331m4108M6249R4735N7739m2301j33284j42945o5585
$$ 440652 482676 431283 337952 293844 340093 434828 492567 450266 316982 174037 108452
36920A08452K1978M4488K1894L1067P7225P8582P733l6294L0461J29112J15978
$$ 108452 130430 174918 196812 227879 305104 383686 391419 355125 385586 514698 630676
36909F30676m862q7115o0838j8609m5613q5132n0369K5631N1952K7569K1078M0025
$$ 630676 625814 538699 477861 459252 413639 328507 278138 303769 355721 383290 404368 444393
36897D44393K5444l4797p9331o4061p625N5080R9666R4520K3465o7298j02170
$$ 444393 469837 435040 355709 291648 284023 339103 438769 533289 556754 489456 387286
36886C87286o2311O639O4147R8109R0830K8449n2668q7002n4512P246N5518O3513
$$ 387286 324975 331614 395761 493870 584700 613149 560481 473479 418967 426213 481731 545244
36874E45244J5508o0638q5610k4264M1032J5705n9675o8780k150L9866K0166Q648
$$ 545244 560752 500114 414504 390240 431272 446977 387302 318522 316372 356238 376404 385052
36862C85052L7004M4952J0196J376M3571N3628j5807p9710n8277j3228m0517j02514
$$ 385052 422056 467008 477204 478580 522151 575779 559972 480262 421985 408757 368240 265726
36850B65726q5217J8627R5683P1832l425m0652j5529K6672L6881J5834M815K2852
$$ 265726 180509 199136 294819 366651 363226 322574 307045 333717 370598 386432 391247 414099
36838D14099L2739k945n6984p7635o8826o3728m3589K7457J01078Q6368j841m7760
$$ 414099 446838 443893 386909 309274 240448 176720 133131 160588 261666 348034 346193 298433
36826B98433n265M8981N6738N2129N8211L3346k6673m9227o025L4325K7553J5204
$$ 298433 293168 342149 398887 451016 509227 542573 515900 466673 460648 494973 522526 537730
36814E37730J6750j2801o3063m6972L3842N5020j7349m5653M1147J03820K6949
$$ 537730 554480 541679 478616 431644 465486 520506 503157 457504 498651 602471 629420
36803F29420p5471o2362j4501p3555j66238j25421Q600N6413J2253L7999J60621
$$ 629420 553949 491587 477086 403531 237293 111872 120472 176885 189138 227137 387758
36792C87758K14507J09957m3114j15319r3655j4766Q0300J09124J7593j02759
$$ 387758 602265 712222 669108 553789 460134 445368 525668 634792 652385 549626
36782E49626j11342k6341J7390k312R382N0611J5731p9598q6915J1259M5783n0315
$$ 549626 438284 411943 429333 427021 436403 487014 502745 423147 336232 347491 393274 342959
36770C42959j10389p367J31411J26277R938o1895m8025k1582j7922j6728j6724
$$ 342959 232570 225203 356614 482891 492829 430934 382909 361327 343405 326677 309953
36759C09953k1948o744K6510K1860k9479m8386k545J7529m9164j06036m2209P8825
$$ 309953 288005 281261 307771 329631 300152 251766 249221 266750 217586 111550 69341 148166
36747A48166J08656L6301j6432P673M1227K6458q891k8476m3808o1899m9397J1016
$$ 148166 256822 293123 276691 284364 325591 352049 343158 314682 270874 208975 159578 170594
36735A70594P4492Q3417M1491O906J4535L1165P836l8522m1918M205J9127l9565
$$ 170594 245086 328503 369994 376900 391435 422600 430436 391914 349996 354201 373328 333763
36723C33763q9388m2104M6688N6113q531l2514J3756M0964J6174K1987R3819J37977
$$ 333763 244375 202271 248959 305072 296541 264027 277783 318747 334921 356908 450727 588704
36711E88704Q3311m805m0376l9887m7881m0876J648J8516m0252j10141r8399j9913
$$ 588704 672015 667210 626834 586947 539066 498190 499838 518354 478102 367961 269562 249649
36699B49649M0356N4087N7165O7078O3181K4961n0307j29868j29618N860J80217
$$ 249649 290005 344092 401257 468335 531516 556477 506170 376302 246684 252544 432761
36688D32761K06643M6613j20628j37146n8425j3151O107P4401J50387J24477P350
$$ 432761 639404 686017 565389 428243 369818 356667 362774 437175 587562 712039 719389
36677G19389p8675p8630m8207l1549j5613l632k4780o2661o2494j4754L7588O3329
$$ 719389 640714 562084 513877 482328 466715 463083 438303 375642 313148 298394 335982 399311
36665C99311N1561r248q5155p9138M0068J39181P7392o8953q8466N6275J60634
$$ 399311 450872 441624 356469 277331 317399 456580 533972 465019 376553 432828 593462
36654E93462O5935j24325j97993j00752M4088J12474Q1557n651q7416j03240l8172
$$ 593462 659397 535072 337079 236327 280415 392889 474446 468795 381379 278139 239967
36643B39967M1847M9103j4237m5616K4336J19961J03166l1284j21272m8231Q8700
$$ 239967 281814 330917 316680 271064 295400 415361 518527 487243 365971 317740 406440
36632D06440J06434M47o3000j4331K2611m1605r9091k8880Q3472P0868m7817r8002
$$ 406440 512874 513321 450321 435990 458601 416996 317905 289025 372497 443365 395548 297546
36620B97546j6102Q1600J00690Q1177P1868L4187n7555j26233r1123M393M5569
$$ 297546 281444 363044 463734 544911 616779 650966 593411 467178 376055 380448 426017
36609D26017j662n5964l3226M9503R6452M7082m8767q6806l3886L9473O1850M4116
$$ 426017 424355 368391 335165 384668 481120 528202 479435 392629 358743 398216 460066 504182
36597E04182K8843J4084j6868l7708k0328J616j6448m5166k6715J7635J3368m3304
$$ 504182 533025 547109 530241 492533 472205 473821 457373 412207 385492 403127 416495 373191
36585C73191p7683n6582k6157j3566J8719Q3611J15847O6920k328O684R0398J38454
$$ 373191 295508 238926 212769 199203 217922 301533 417380 484300 481972 488656 579054 717508
36573G17508P2378n7500j34782j09991l8903M529J0859J0287O624j4358l4421
$$ 717508 789886 732386 597604 487613 448710 453239 464098 474385 481009 466651 432230
36562D32230k2918J449m281k3555M05N4390N4092k1326q4782p1333k3991q89J3551
$$ 432230 409312 410761 406480 382925 383330 437720 491812 470486 385704 314371 290380 289491 303042
36549C03042M3889N6205K6435j217M256l337n6552r6131o1373J5023P4811J13223
$$ 303042 346931 403136 429571 428354 432610 429273 372721 276590 215217 230240 305051 418274
36537D18274J17712L3537j12600j65600m3512J11881J22184J8984m3233l0798
$$ 418274 535986 569523 456923 291323 247811 359692 481876 500860 457627 426829
36527D26829j9893j8287J7016L8057k7970j06184n8593P7541J23647K6774q6645
$$ 426829 406936 388649 405665 443722 415752 309568 250975 328516 452163 478937 392292
36516C92292j21081r8181l5985P0985J43124P7650o0429r4620n468M7994q71m0325
$$ 392292 271211 173030 137045 208030 351154 428804 368375 273755 268287 316281 315410 275085
36504B75085o687J7504l728J7576R2726Q9153k8097r0853K546R8304K5738j31041
$$ 275085 268398 285902 282174 299750 392476 481629 453532 362679 365225 463529 489267 358226
36492C58226j70079o2981N2149Q2472M5539q059k4997L2621J18021J28266N9333
$$ 358226 188147 125166 177315 259787 305326 297267 272270 304891 422912 551178 610511
36481F10511K0437L9298M457j18141j82529r2197L4629O4394M7970O8886O1835
$$ 610511 630948 670246 674703 556562 374033 281836 316465 380859 428829 497715 559550
36470E59550l3510r7351k0657P0835J6455q2955k9675J13333J21288L96l2392
$$ 559550 526040 428689 408032 478867 495322 412367 382692 496025 617313 617709 585317
36459E85317N0104L2334j41885k29023p3441J30199J32521j5969r2230l4753L8475
$$ 585317 635421 667755 525870 296847 223406 353605 486126 470157 377927 343174 381649
36448C81649N1782L6288K0088j832q595K5040O0748L6631l5897q4339p1383k1348
$$ 381649 433431 469719 489807 487975 479380 504420 565168 601799 565902 481563 410180 388832
36436C88832L0687N7736K7056o4470j40514r8787N6208J81368J44886j0703j12508
$$ 388832 419519 477255 504311 439841 299327 200540 256748 438116 583002 572299 459791
36425D59791p3811p41l1043j24270j16873K5405J38332Q9583l5317o5727J8858
$$ 459791 385980 385239 354196 229926 113053 138458 276790 366373 331056 265329 284187
36414B84187R3878P8483R025n0278o7823k5815O6217J37647J14805J7256o6246
$$ 284187 378065 456548 465573 415295 347472 321657 387874 525521 640326 657582 591336
36403E91336q9847p6398m8966j1067J4878M796j4379K179L8293M0151R017l862
$$ 591336 501489 425091 376125 365058 379936 384732 370353 372532 410825 450976 459993 456131
36391D56131J1728J7005N617J2936L8189L5650k623k7000j2133K828k4668q6183
$$ 456131 467859 484864 490481 503417 541606 577256 574633 547633 535500 538328 513660 427477
36379D27477j37518j30951m5661O8604J08372M1312k2211L0564J36767J34361
$$ 427477 289959 159008 113347 181951 290323 331635 309424 339988 476755 611116
36369F11116L123j02283p7663M063L7124K9758L2475K1874m6495j31436j45139
$$ 611116 614239 511956 434293 438356 475480 505238 537713 559587 513092 381656 236517
36358B36517o9205L5225J08503J30111J00753L8614k0292n4004p2516q2317o2079
$$ 236517 167312 202537 311040 441151 541904 580518 560226 506222 433706 351389 289310
36347B89310k741N6107O5860L1093M471K4812P3402Q8551K7710p3184j20067o7764
$$ 289310 286569 342676 408536 439629 444100 468912 542314 630865 658575 585391 465324 397560
36335C97560J5975L6363k532k0065R737L1087J4371J317J4110N136n2761r7572
$$ 397560 413535 449898 447366 427301 437038 468125 482496 483813 497923 503059 450298 352726
36323C52726o3413J7394O2635N2050K6546N954k2146m4512k3124L5863O7886K7799
$$ 352726 289313 306707 369342 421392 447938 453892 431746 387234 364110 399973 467859 495658
36311D95658m8881q2837l4044O1293J24540J01608J0080p5097r2278n0490o232
$$ 495658 446777 363940 329896 391189 515729 617337 627417 552320 460042 409552 403320
36300D03320J0693K1370M1475M0005p827n4337l0831L5875L9151m3198q8457o646
$$ 403320 414013 435383 476858 516863 509036 454699 423868 459743 498894 455696 367239 360593
36288C60593J00509P5669m9586r6449j5791M6585K038l6963L7445J28304Q2898
$$ 360593 461102 536771 487185 390736 374945 421530 423568 386605 424050 552354 635252
36277F35252n8902j23820n7140L4979O8765O7781O5146M3018r601o5305r7759
$$ 635252 576350 452530 395390 430369 499134 566915 632061 675079 665478 600173 502414
36266E02414r2026l0627O5678J13875O3138j9166l7718n281L577j2522n830K792
$$ 502414 410388 379761 445439 559314 622452 603286 565568 560287 563864 551342 545512 548304
36254E48304l9360q8071m9114N4436R9106M8275q668q358K6216P7267J41996J48922
$$ 548304 508944 420873 371759 426195 525301 573576 564908 556550 582766 660033 802029 950951
36242I50951K4167j42238j68513n4062K837q2008j43712m6589Q8725Q2379k7502
$$ 950951 975118 832880 664367 610305 613142 531134 387422 340833 429558 511937 484435
36231D84435p1619j2413M4219L6708J085k4851l1046j459N2496O5102Q684l9201
$$ 484435 412816 400403 444622 481330 482415 457564 426518 425059 477555 542657 551341 512140
36219E12140p513M9693M2475p603j7034J2167P267m5910r1773r6840o4391O735
$$ 512140 504627 554320 596795 589192 572158 584325 591592 545682 453909 357069 292678 299413
36207B99413R1098J11909M3399j5072K4774Q8261N2330m3588o2181r211k0406
$$ 299413 390511 502420 545819 530747 555521 643782 696112 652524 590343 581132 560726
36196E60726j01685q6617Q4848K33477J93761M5618l7529m4551p3856j17107p5483
$$ 560726 459041 372424 457272 690749 884510 930128 892599 848048 774192 657085 581602
36185E81602M3957J16749Q6555J6055n5022j48163k12422j24025R5995K20486
$$ 581602 625559 742308 828863 844918 789896 641733 429311 305286 401281 621767
36175F21767J05405q2793r3772M5080R3752k1061j20678q4863j5445j1901p07
$$ 621767 727172 644379 550607 595687 689439 668378 547700 462837 447392 435491 434784
36164D34784P9116J09570q773j39023r3159O6271J23823M3183k0013j047P414
$$ 434784 513900 623470 614697 475674 382515 448786 572609 615792 595779 594732 602146
36153F02146k6864j7020M6820N2897k1017m7082K7055P8867K8857k1895J3967
$$ 602146 575282 558262 605082 657979 636962 589880 616935 695802 724659 702764 716731
36142G16731M5738k5977j18071r9755q650K6447m753j6850J609n778k7150J986
$$ 716731 762469 736492 618421 518666 510016 536463 531710 514860 516469 510691 483541 485527
36130D85527O2438O0906j8867q2341o0194L809K7308j669k0354J8893P2798M9360
$$ 485527 547965 608871 590004 507663 447469 451278 478586 476917 456563 475456 548254 597614
36118E97614n5205j15887m5160N8661N0899j8221K2726J61365J87222L1389j06848
$$ 597614 542409 426522 381362 440023 490922 472701 495427 656792 844014 875403 768555
36107G68555p5801N771j3337o4647l2976O350n1441r9267P368J55117J27491k6301
$$ 768555 692754 698525 685188 620541 587565 593915 542474 443207 450575 605692 733183 706882
36095G06882o6192L5684O6790m1327r9669l050Q6529J7119j14190j41900p9154
$$ 706882 640690 676374 743164 701837 602168 599118 685647 702766 588576 446676 367522
36084C67522l7415l0048O72N1862Q1150R5063J14037J02637K4143p4111j04050
$$ 367522 330107 300059 300731 352593 433743 528806 642843 745480 769623 695512 591462
36073E91462m2806M8903Q8992L4968p5372j32787o2462O7409J08844K0770q1975
$$ 591462 548656 597559 686551 721519 646147 513360 450898 518307 627151 647921 565946
36062E65946q9942k9668Q515K743Q93L0945O4204N6969L892m6958l8127K4044
$$ 565946 476004 446336 454851 457594 458487 489432 553636 610605 614497 567539 529412 553456
36050E53456O4485L5044k2028m8236n7027q2147q8591k8208M9945N2332q220k2131
$$ 553456 617941 652985 630957 582721 525694 443547 354956 326748 376693 429025 420805 398674
36038C98674N0707J24486J15511M0916l1593o1048m4568j1745j1174m8172n2629
$$ 398674 449381 573867 689378 730294 698701 637653 593085 581340 570166 521994 469365
36027D69365K6825J25958J42830Q0533J8580k3149p7886j17266p7537M467J8246
$$ 469365 496190 622148 764978 845511 864091 840942 763056 645790 568253 572720 590966
36016E90966m4556p2416j3691N4291O5871N1765M5605K6493j531J1533N5295M3031
$$ 590966 546410 473994 460303 514594 580465 632230 677835 704328 702797 714330 769625 812656
36004H12656m5960j14697r4111l8240j7744j8802r510j0860l3248k8790K3587
$$ 812656 766696 651999 557888 519648 501904 483102 473592 462732 429484 400694 424281
35993D24281O2556M1576J0896L3689P9344O8182j6382j10635j38734p6820J9110
$$ 424281 486837 528413 539309 572998 652342 720524 704142 593507 454773 377953 397063
35982C97063N3093K739l3831K3729R7127O1108m1727n3464L9977Q1079P14p8070
$$ 397063 450156 452895 419064 442793 539920 601028 559301 505837 545814 626893 627607 549537
35970E49537n6602p02K1491O5406J57519J77864L9987j38343j92527j35482q1842
$$ 549537 492935 492233 513724 579130 736649 914513 954500 816157 623630 488148 406306
35959D06306m6552K4081R6863R1491L2953J6900M8548M5647j5506p0999p3969
$$ 406306 359754 383835 480698 572189 605142 622042 670590 716237 700731 629732 555763
35948E55763l4711K3963P0074N5494j2823l9936L0357J08994Q4126l842l1511
$$ 555763 521052 545015 615089 670583 657760 617824 648181 757175 841301 837459 805948
35937H05948O202N992m8961n6572J6994N8135k1018j33610j29440j600J02559
$$ 805948 812150 818142 769181 712609 729603 787738 766720 633110 503670 502070 604629
35926F04629O9083m6217r5806k6690O0524N5761q954j6711N2479R2377L5708m8275
$$ 604629 673712 627495 531689 504999 565523 621284 612330 595619 648098 740475 776183 727908
35914G27908o4124j6064L0097M0498J3622m7416j07594j07385m8947q430j5517
$$ 727908 663784 647720 677817 718315 731937 684521 576927 469542 420595 412165 396648
35903C96648o239M4096M5752n1790j30962o5185O5290P6445l2940p2582L9471
$$ 396648 390409 434505 480257 428467 297505 232320 297610 374055 341115 268533 308004
35892C08004J36895N3080j13265j18738P9417K43022J63322n6070j37926q246
$$ 308004 444899 497979 384714 265976 345393 588415 751737 695667 557741 549495
35882E49495J18183O5304n2336l1056R3092J11148j8764j17383q0626j5992k3222
$$ 549495 667678 732982 680646 649590 742682 853830 835066 717683 637057 621065 597843
35871E97843l6419J6002O2670K1369n4266p7378o1231m4401q24O8695P7581M93
$$ 597843 561424 577426 640096 661465 607199 529821 468590 424189 423365 492060 569641 570134
35859E70134m4934J4070O6557Q064o2533p094J05483J08250M305o9496p8586r1074
$$ 570134 525200 539270 605827 613891 551358 544264 649747 757997 762302 692806 614220 523146
35847E23146r2642p855J14139J32131L3161n5303p6726r7314j35817j14871j7563
$$ 523146 430504 422649 536788 668919 702080 646777 570051 472737 336920 222049 204486
35836B04486O0746O3394M6805O1257P1675M0596m370k1387k81N1404R8252P0483
$$ 204486 265232 328626 375431 436688 508363 548959 544589 523202 522921 574325 672577 743060
35824G43060m5820j39302r7452K6993Q7992N5706K3033K5283M204m6090n0726
$$ 743060 697240 557938 460486 487479 575471 631177 654210 679493 683697 637607 586881
35813E86881L537L8566L0276M7429J02252R7103j4692j29729j33649n2515Q592
$$ 586881 590418 628984 659260 706689 808941 906044 891352 761623 627974 575459 584051
35802E84051J1138k351N405K5540K9326K875l5397m8522k5164O482K5869M5094
$$ 584051 595189 592838 598243 623783 653109 655984 620587 572065 546901 553383 579252 624346
35790F24346O2352M5422n01j6356J0402J1403l4147l8063M0242Q6604M598j09238
$$ 624346 686698 732120 731619 715263 725665 737068 702921 664858 705100 791704 796302 687064
35778F87064j11011l5744q837j7912K9656Q7197K8775j01140j24946k0882M5958
$$ 687064 576053 540309 531472 513560 543216 630413 659188 558048 433102 412220 458178
35767D58178O026j7264N6629J32434J14097M0442k6275r2908j49860j38966p0357
$$ 458178 464204 446940 503569 636003 750100 790542 764267 671359 521499 382533 312176
35756C12176l3539l8935P073J15495J58773P3257k9440l5969J7495N1532P3642
$$ 312176 278637 239702 246775 362270 521043 594300 564860 528891 546386 597918 671560
35745F71560J08235J06229K4096q4180j32249r9512k1559N0099N8077q962o6170
$$ 671560 779795 886024 910120 825940 693691 594179 572620 622719 680796 671834 605664
35734F05664k8184N2426N7281n760k9526j1168m7223j19331r2223L4400Q8276
$$ 605664 577480 629906 687187 681427 651901 640733 593510 474179 381956 416356 504632
35723E04632J0857l5296N1180J31424O8070m3532n2266p21j4266o3607l1751N8216
$$ 504632 515489 480193 531373 662797 730867 687335 635069 634348 620082 556475 524724 582940
35711E82940O5583m6534j55824j41910q646J42664K00910J30564P460o4467p5445
$$ 582940 648523 601989 446165 304255 295609 438273 639183 769747 777207 712740 637295
35700F37295q2892q1877k1880N2295L2015n8687o8224L4424R8013M6370P776Q2425
$$ 637295 554403 472526 450646 502941 534956 476269 408045 442469 540482 586852 594628 677053
35688F77053J61894J16293O126m0220l0541m3075o6346m6402m467J4098K4152
$$ 677053 838947 955240 961366 921146 890605 847530 781184 734782 730315 744413 768565
35677G68565L4757l618r3354j39237r3628l5701k2261M784P3048R6204M0289J1186
$$ 768565 803322 799704 706350 567113 473485 437784 415523 420307 493355 589559 629848 641034
35665F41034O0138P4715n895n3468J7158P3378O233n1164L1249J05770j5757k06215
$$ 641034 701172 775887 769992 716524 733682 807060 813293 762129 793378 899148 883391 677176
35653F77176k03239l3946N0229p026k8348M3152O4558q137l0793N5718J12961
$$ 677176 473937 439991 490220 483194 454846 497998 562556 554419 523626 579344 692305
35642F92305M9434l4058l4497k890j6663m3769k6598J1294K0029J424j8451k5388
$$ 692305 741739 707681 673184 670294 653631 609862 583264 594558 614587 616011 597560 572172
35630E72172l247M7675P7558M5465m545p020J2525j5952p6123q4904k2898N3327
$$ 572172 568925 616600 694158 739623 735078 728058 740583 724631 648508 563604 540706 594033
35618E94033J06008J29406J01491K0839m4594m3498l0976p1371j09766n9440L8216
$$ 594033 700041 829447 930938 951777 907183 863685 832709 761338 651572 592132 630348
35607F30348P2819L7944J1970Q210j9691n7650m9978q525J8209M3310Q7845Q6767
$$ 630348 703167 741111 753081 761291 741600 683950 633972 625447 643656 686966 774811 861578
35595H61578j3647j22854j21149n2563m2317p5744l8436O1526J00360N1666J1512
$$ 861578 847931 725077 603928 551365 509048 433304 394868 456394 556754 608420 619932
35584F19932J5322L566k8671j7344K7444K4658k2358k7872J2919J7418j9136p643
$$ 619932 635254 638820 610149 592805 620249 644907 622549 594677 607596 625014 605878 598235
35572E98235O7372J09682O3573k2735r5131j33974j03442R756J16223J12172L2483
$$ 598235 665607 775289 838862 816127 720996 587022 483580 493336 609559 721731 754214
35561G54214j2605j8603n4747q9360k6556R4816J22188K3402o4105l9129N0709
$$ 754214 741609 723006 668259 578899 552343 647159 769347 792749 728644 689515 740224
35550G40224J13558J02320O858j17130j40926j8194J01764O6134m4218n0251K8229
$$ 740224 853782 956102 962960 845830 704904 686710 788474 854608 810390 760139 788368
35539G88368L3343l1912k2315N4812L3528j04901j80720j13481k8435j2108O479
$$ 788368 821711 789799 767484 822296 855824 750923 570203 456722 428287 416179 422658
35528D22658O8367R8469P3152O8535Q3572K0633j02431j32540l4858M3237K3360
$$ 422658 491025 589494 662646 731181 814753 835386 732955 600415 565557 608794 632154
35517F32154M5K9290L0347k5988m3891K434Q666m5805l6917O6417J20619N9200
$$ 632154 632199 661489 691836 665848 621957 624391 633057 587252 550335 616752 737371 796571
35505G96571J0335N4062P2852k8741j45178j42846n1501L0470P4733P6540J7389
$$ 796571 806906 860968 933820 905079 759901 617055 565554 596024 670757 747297 764686
35494G64686n4088n2734j1959m0244j02938n5551Q2811J30229N1866N687L2213
$$ 764686 710598 657864 645905 605661 502723 447172 529983 660212 712078 717765 749978
35483G49978q163j17400r7800Q2605J83184Q6612j7382K413J944j04402j34789
$$ 749978 741815 624415 526615 609220 792404 879016 861634 864047 865991 761589 626800
35472F26800N592R1772l0985j37482p226J69221J08926q4492j20836l674N1051
$$ 626800 632392 724164 693179 555697 548471 717692 826618 742126 621290 617616 668667
35461F68667J9024L5611P9645K5263p8060p9214q94K6431J3877M3095N4077l9019
$$ 668667 687691 723302 802947 828210 750150 670936 670042 696473 710350 753445 807522 768503
35449G68503j32138q6950J6215L2116J7312P6795J02372l2863j71024r4756P7370
$$ 768503 636365 549415 565630 597746 615058 691853 794225 761362 590338 495582 572952
35438E72952P5645n6439n9540P1470J11364L8958M0179J04902L7963j19031j01072
$$ 572952 648597 592158 532618 604088 715452 754410 794589 899491 937454 818423 717351
35427G17351R3602J50962k7284j48525l2077R8194K2725j12341q2928L9377N8705
$$ 717351 810953 961915 934631 786106 754029 852223 874948 762607 679679 719056 777761
35416G77761p575j3022M2927N0941N187j0637J2032P299l9118p2798n3400N219
$$ 777761 770186 757164 800091 851032 856219 845582 857614 864913 825795 752997 699597 704816
35404G04816M7473J5886o7530q2149L6353J58163J11502n4593j26711m0502M9770
$$ 704816 752289 768175 700645 618496 654849 813012 924514 869921 743210 702708 752478
35393G52478L8568Q723M0720O6354J1933n8584n4270n769j290m7109p6492n2465
$$ 752478 791046 799769 840489 906843 918776 860192 805922 800153 798863 751754 675262 622797
35381F22797m059J4765j7529n2207r228J08548J84144J28155o92q4083q8181m4290
$$ 622797 618738 633503 615974 563767 554539 663087 847231 975386 974694 890611 802430 758140
35369G58140K9019Q9498N4073o5436j11204K809J31299J09249N341j9769P992
$$ 758140 787159 876657 930730 865294 754090 756899 888198 997447 1002788 983019 991011
35358I91011l9607j24045j00323J3152O8722N2265P1160J12727O2976m7990o6382
$$ 991011 951404 827359 727036 740188 808910 861175 932335 1045062 1108038 1060048 993666
35347I93666J5196M1628l9016j12747j11631q0980l7390L5579O9019k102o8223
$$ 993666 1008862 1050490 1011474 898727 787096 706116 668726 704305 773324 771222 702999
35336G02999N185J09706M3484j21125j29933J6472O1069n6725j04020K4710J41446
$$ 702999 708184 817890 861374 740249 610316 626788 687857 631132 527112 551822 693268
35325F93268J22689R8090J48369J32901j9853j37095r0685n861j3486l5643J3826
$$ 693268 815957 914047 1062416 1195317 1175464 1038369 947684 941823 928337 892694 906520
35314I06520M6973o663m0994K2535P2386J4499m8933j1189M8665K4152l7780n5909
$$ 906520 953493 946830 905836 928371 1000757 1015256 966323 955134 1003799 1027951 990171 934262
35302I34262n1025m2352J6564R0327M7906r3918j32972r612O7909k5813j09262
$$ 934262 883237 840885 857449 947776 995682 901764 768792 759180 827089 801276 692014
35291F92014r877J34840J16629o985n2131j4603k274n020M1241P8497K3646n8624
$$ 692014 682137 816977 933606 926621 874490 859887 857613 852593 893834 972331 995977 937353
35279I37353o1714j6616o850j4420K437J273l3060p327J04541J55487N1361p0616
$$ 937353 875639 859023 852173 837753 840190 841463 808403 801076 905617 1061104 1112465 1041849
35267A041849n5647K8877M1613N370J3282L5443L037m0646m1345n3297j02228
$$ 1041849 986202 1015079 1056692 1062062 1075344 1110787 1113824 1073178 1031833 978536 876308
35256H76308q5386K8847Q0914j4187p5366M7677J80175R2661j02482j28759L416
$$ 876308 790922 819769 900683 886496 811130 858807 1038982 1131643 1029161 900402 903818
35245I03818M3803o9753j45283q0606J1506L8359M2573N0138J0752p0114j04499
$$ 903818 947621 877868 732585 651979 663485 701844 744417 794555 805307 735193 630694
35234F30694n8714Q739M9635O1188M3578J7777L4384P4980L1365j12385j90277
$$ 630694 571980 580719 630354 691542 735120 752897 787281 862261 893626 781241 590964
35223E90964q0695R3873J48392J02154Q9842J11763O8323l2117q7808p1101k2723
$$ 590964 510269 604142 752534 854688 944530 1056293 1124616 1092499 1004691 933590 910867
35212I10867N2796J36413J27504j1042j31898r5035J3679K9811k4991k1168K6239
$$ 910867 963663 1100076 1227580 1216538 1084640 989605 1003284 1033095 1008104 986936 1013175
35201A013175k153r4284j16259k9290P2892J14463Q7646K994q8600r7401k7080
$$ 1013175 1011022 916738 800479 771189 844081 958544 1046190 1049184 960584 863183 836103
35190H36103Q50m2156j5918J19210J58582k3732k09296j46225N0669J01552J5447
$$ 836103 836953 794797 778879 898089 1056671 1032939 823643 677418 728087 829639 845086
35179H45086J5489J10892R2500p4119j76090r5667M4574J09006R4529L0153o6460
$$ 845086 860575 971467 1063967 989848 813758 718091 762665 871671 966200 996353 929893
35168I29893j21334o8129K8419O1743M8039N4464M9597p771l8769J2288L1983
$$ 929893 808559 740430 768849 830592 878631 933095 982692 974921 936152 948440 980423
35157I80423o1481j22505k0756Q5387J102j40801r6394N2796M9838o4486l4428
$$ 980423 918942 796437 775681 861068 862170 721369 624975 677771 727609 663123 628695
35146F28695J22390J34715k7740j01445k939N1069l4131p4154K9300J17866Q6612
$$ 628695 751085 885800 858060 756615 753676 804745 770614 696460 725760 843626 930238
35135I30238M9616Q3991R7450M9305K7642K6592p1167k17095j97474N223J46096
$$ 930238 979854 1063845 1161295 1210600 1238242 1264834 1193667 976572 779098 784321 930417
35124I30417J00910K1463J9337J330p1159o5947M4016P8003l8467j30246q1555
$$ 930417 1031327 1052790 1072127 1073457 1002298 936351 980367 1058370 1019903 889657 808102
35113H08102j8277l8498l1407P4173J36433N0198n7834n1340O117J6053J6442
$$ 808102 789825 751327 719920 794093 930526 980724 922890 871550 877667 893720 910162
35102I10162M4419K7118n2127p2297J2295P0458K4047j8682K4883O6459K8015
$$ 910162 954581 981699 929572 857275 869570 940028 964075 945393 970276 1036735 1064750
35091A064750k6930m3990o0663n7686M6463J74236J21638q8330j65599K242J53000
$$ 1064750 1037820 993830 933167 875481 921944 1096180 1217818 1129488 963889 966131 1119131
35080A119131O6262j03463j16487j8056J5987o233K3315P2131L8591m7458p9126
$$ 1119131 1185393 1081930 965443 947387 963374 957141 980456 1052587 1091178 1043720 964594
35069I64594l7650K5711P4764P0664o931o7743J658J24147J06867l8904r6422
$$ 964594 926944 952655 1027419 1098083 1091152 1023409 1025067 1149214 1256081 1217177 1120755
35058A120755o519M7183j6494n1268J418m153r5926q3297O7204J04784o4532j62187
$$ 1120755 1114236 1161419 1144925 1093657 1095075 1090922 994996 911699 978903 1083687 1019155 856968
35046H56968O70J84900J25695l9330n4457J8863j6039j03896o9309M2319O6364
$$ 856968 857638 1042538 1168233 1128903 1074446 1093309 1077270 973374 904065 946384 1012748
35035A012748J5345L835K1012J5350M6550J31526J19661n6768k01061j42644l949
$$ 1012748 1028093 1031928 1052940 1068290 1114840 1246366 1366027 1309259 1108198 965554 961605
35024I61605M1648M8512J03153J02530j0548m8781R5174J85862K1875j83099j44165
$$ 961605 1003253 1051765 1154918 1257448 1246900 1198119 1293293 1479155 1501030 1317931 1173766
35013A173766J6032J3237r5762o4860P0349Q9431R257N022L8583l7569j27216
$$ 1173766 1189798 1203035 1107273 1042413 1112762 1202193 1211450 1216472 1255055 1217486 1090270
35002A090270m1731J06949O9433q4294q2481N9336Q8614q548j2018Q4031N5242
$$ 1090270 1048539 1155488 1224921 1140627 1058146 1117482 1206096 1197548 1185530 1269561 1324803
34991A324803j14639j84037p3044L5383M2805L9472M3779k5158j03618m4876P3976
$$ 1324803 1210164 1026127 953083 988466 1031271 1070743 1114522 1089364 985746 940870 1014846
34980A014846M3281r0395q2868O5625J08759J3038J7296J71296K14133K9092j41977
$$ 1014846 1058127 967732 884864 950489 1059248 1072286 1089582 1260878 1475011 1504103 1362126
34969A362126q6841P8428J42184P3131n0341j57585j56689j3076J04441N06k09460
$$ 1362126 1275285 1353713 1495897 1569028 1518687 1361102 1204413 1191337 1295778 1296284 1086824
34958A086824k18883l639J38730O6014k6012J8927Q4593M8707j0490j0963j8336
$$ 1086824 867941 864302 1003032 1069046 1043034 1061961 1146554 1195261 1184771 1173808 1155472
34947A155472p6240j07337p8682n2921j6558J07448K33329J68165m9193j48087
$$ 1155472 1079232 971895 893213 840292 823734 931182 1164511 1332676 1283483 1135396
34937A135396l7798O9212L0848k5765J0885M5531M085j8207K2704N279j09395
$$ 1135396 1097598 1166810 1197658 1171893 1182778 1228309 1232394 1214187 1236891 1242170 1132775
34926A132775j55781l3190J25126J80260J67060J33058L0119j14601j52494o1041
$$ 1132775 976994 943804 1068930 1249190 1416250 1549308 1579427 1464826 1312332 1251291
34916A251291j0425p0611r3498l180N6866N691j1542R1336J49032L0718j14831
$$ 1251291 1240866 1170255 1076757 1073577 1130443 1136134 1124592 1215928 1364960 1395678 1280847
34905A280847j07847k3867j8480n1195l651Q1173R2086N7863O7581Q8646L9959
$$ 1280847 1173000 1149133 1130653 1079458 1075807 1156980 1249066 1306929 1374510 1463156 1503115
34894A503115m4735q0233p3637p5546p1860l6313n781o956N137N4634Q0863L4622
$$ 1503115 1458380 1378147 1304510 1228964 1157104 1120791 1115010 1108054 1113191 1167825 1248688 1283310
34882A283310m7959j10754j25984o6878N3077J23764O4053k1238J5734J04248
$$ 1283310 1235351 1124597 998613 931735 984812 1108576 1172629 1151391 1167125 1271373
34872A271373N9593p8225q0924Q0634J73739P9343n2142q8567q0883o5908J0658
$$ 1271373 1330966 1252741 1171817 1252451 1426190 1505533 1453391 1364824 1283941 1218033 1228691
34861A228691R1477K3442j31554j13488R9542K04605O3302p1104k500Q0827k7014
$$ 1228691 1320168 1343610 1212056 1098568 1198110 1402715 1466017 1394913 1392413 1473240 1446226
34850A446226j72027j20325M1204Q3260J0047k4002k667L527K3184Q6069R0299
$$ 1446226 1274199 1153874 1195078 1278338 1288385 1264383 1261716 1265243 1288427 1374496 1464795
34839A464795j8756r5569k7323M9363k2210j44157j43430o2636l7707l4674N0412
$$ 1464795 1446039 1350470 1323147 1372510 1350300 1206143 1062713 1000077 962370 927696 978108
34828I78108J54014J42796M9621K056N504j6510n5322n3886k0327K3075Q9665
$$ 978108 1132122 1274918 1324539 1326595 1332099 1315589 1260267 1206381 1186054 1209129 1298794
34817A298794J27718L5526j17580r8544J20376K37562N4448k02914k21101m2766
$$ 1298794 1426512 1462038 1344458 1245914 1366290 1603852 1658300 1455386 1234285 1191519
34807A191519P9012P8730N9202K8898o6579j58715j42730o0897p730L3776R0372
$$ 1191519 1270531 1349261 1408463 1437361 1370782 1212067 1069337 1008440 1000710 1034486 1124858
34796A124858Q3467m908k2225J04543J94219R7884l6080j9681N0338p103j17802
$$ 1124858 1208325 1203417 1181192 1285735 1479954 1577838 1541758 1522077 1572415 1565312 1447510
34785A447510j05540k5249l8067q6353m054J49802J69480M1612o7068r2138q9859
$$ 1447510 1341970 1316721 1278654 1192301 1188247 1338049 1507529 1549141 1482073 1389935 1300076
34774A300076n0734N7682J37071Q4027j0511j1306J3074p0347j78186j29543L7907
$$ 1300076 1249342 1307024 1444095 1528122 1517611 1506305 1519379 1449032 1270846 1141303 1179210
34763A179210J27514R4190N4967M8590J1752n3363q4370p7298m6020L9097J33418
$$ 1179210 1306724 1400914 1455881 1504471 1516223 1462860 1378490 1301192 1255172 1294269 1427687
34752A427687R2693p7055j38361J9724J63929Q2992o9178o7631m690n9785j18022
$$ 1427687 1520380 1443325 1304964 1324688 1488617 1571609 1502431 1434800 1430110 1370325 1252303
34741A252303N054J58867Q5724j05396j10292N1670J10702L5290K0601O7072M729
$$ 1252303 1257357 1416224 1501948 1396552 1286260 1337930 1448632 1483922 1504523 1571595 1576324
34730A576324j09986n6956J04341Q2209j39466k48295j01633R6966J68062J53648
$$ 1576324 1466338 1409382 1513723 1595932 1456466 1208171 1106538 1203504 1371566 1525214
34720A525214R9363k5776j45390j22061j8144j5710p9856j7892J39243J59918
$$ 1525214 1624577 1598801 1453411 1331350 1313206 1297496 1217640 1199748 1338991 1498909
34710A498909K0386o0976j7098q842p7907p2822L2610Q1398L9577L9241Q5468
$$ 1498909 1519295 1458319 1441221 1432379 1354472 1281650 1314260 1395658 1435235 1474476 1559944
34699A559944M7283l8414J334J17177P4184j15610j72285j8762J02343N8269L70
$$ 1559944 1607227 1568813 1570147 1687324 1761508 1645898 1473613 1454851 1557194 1615463 1615833
34688A615833J8287j0352j13293j21696J875O6064j793l3618M7038R5820N2966
$$ 1615833 1634120 1623768 1510475 1388779 1390654 1456718 1454925 1421307 1468345 1564165 1617131
34677A617131M5108Q0307r711k05383k35605k2671J55251J04672j3833k0755P596
$$ 1617131 1662239 1742546 1732835 1527452 1291847 1269176 1424427 1529099 1515266 1494511 1502107
34666A502107k0919j4930O7907Q0954k9309p6286M7688J66891J13531k3237r8654
$$ 1502107 1481188 1466258 1534165 1615119 1585810 1509524 1557212 1724103 1837634 1814397 1715743
34655A715743j19397j09902k4980P4894K7521j27024j30348P5963K16371J14311
$$ 1715743 1596346 1486444 1461464 1536358 1563879 1436855 1306507 1382470 1598841 1713152
34645A713152m5697n7857N01r594l9961j7133j692j8861K4793J17895J02204k4427
$$ 1713152 1667455 1609598 1610099 1600505 1560544 1543411 1541719 1522858 1547651 1665546 1767750 1743323
34633A743323n8127L8503M5896r3402j31454L3082J40346K6014q6060o022P7769
$$ 1743323 1685196 1723699 1769595 1676193 1544739 1577821 1718167 1744181 1658121 1652099 1729868
34622A729868k3444j24860j0127J59894J36507J4175J0933N3107m9659k05522
$$ 1729868 1706424 1581564 1571437 1731331 1867838 1882013 1892946 1946053 1896394 1690872
34612A690872j83234j4607P8150M7299K0016L5200L7086L4181M6062M625j03067
$$ 1690872 1507638 1493031 1571181 1618480 1638496 1673696 1710782 1744963 1791025 1795650 1692583
34601A692583j37085k9267O6622L1824q123O8513J34299M4602q4891p5138K1365
$$ 1692583 1555498 1526231 1592853 1624677 1616554 1685067 1819366 1863968 1779077 1703939 1725304
34590A725304N6237M1053M3786J0592q4651r7786N0309J78685J12897l7357q8232
$$ 1725304 1781541 1822594 1866380 1876972 1792321 1694535 1744844 1923529 2036426 1999069 1910837
34579A910837p2766r2341q2138K5600R7127J2064r5135n4828N3646P5154N0091
$$ 1910837 1838071 1745730 1663592 1689192 1786319 1798383 1703248 1648420 1702066 1777220 1827311
34568A827311P2746P2063j8185o6047K6319R3902k2797j74874j44529j062O0134
$$ 1827311 1900057 1972120 1953935 1887888 1914207 2008109 1985312 1810438 1665909 1664847 1724981
34557A724981N2551Q9131J10885J3787j05777j04909m5655m3414l2611O5618J25599
$$ 1724981 1777532 1866663 1977548 1991335 1885558 1780649 1734994 1691580 1658969 1724587 1850186
34546A850186L0352p9908l7923N6826L9243k0082J3667O3662J3145m6248j0858
$$ 1850186 1880538 1800630 1762707 1819533 1858776 1838694 1852361 1916023 1929168 1882920 1872062
34535A872062M161r1621j25040L6363J87567J17700j2961K2867R4556j8950j78092
$$ 1872062 1876223 1784602 1659562 1695925 1883492 2001192 1988231 2011098 2105654 2086704 1908612
34524A908612j21409N2253P2010j7522Q410R9422N3160n2831J935J36751J01280
$$ 1908612 1787203 1839456 1911466 1893944 1902354 2001776 2054936 2002105 2004040 2140791 2242071
34513B242071o0292j06420m9721q0390j45681m8469J24134J13604m0776p6275
$$ 2242071 2181779 2075359 2025638 1945248 1799567 1751098 1875232 1988836 1948060 1871785
34503A871785J9546L5879l0610k474Q3960L9442q0810o4773L4543m711j22073
$$ 1871785 1891331 1927210 1896600 1894126 1978086 2017528 1936718 1871945 1906488 1901777 1779704
34492A779704o7950J06934J15201m8163j07051l087N6031K8391P0057J51987R3515
$$ 1779704 1711754 1818688 1933889 1885726 1778675 1775588 1831619 1860010 1930067 2082054 2175569
34481B175569l7239p617J16912N9988j37564j66326j6773J2242j10690r4923R8719
$$ 2175569 2138330 2130713 2247625 2307613 2170049 2003723 1986950 1999192 1888502 1793579 1892298
34470A892298J63884K0941l7630J00701J70208L0078j01833p4785k6025l1019
$$ 1892298 2056182 2077123 2039493 2140194 2310402 2340480 2238647 2163862 2137837 2106818
34460B106818L7398J62793J28900n3402r6364N0712Q6462r0153j76705j1578J31704
$$ 2106818 2144216 2307009 2435909 2382507 2286143 2336855 2423317 2333164 2156459 2144881 2276585
34449B276585L1540j16227q0491K6492J7819m1123k3886J7256J7637M9986J32152
$$ 2276585 2308125 2191898 2111407 2137899 2155718 2114595 2090709 2107965 2125602 2175588 2307740
34438B307740J37300L7822j9040J1983J043o6874m1496O6693N0776j00846j33225
$$ 2307740 2445040 2482862 2463822 2475805 2476848 2409974 2368478 2435171 2485947 2385101 2251876
34427B251876L3136J47319N4156p5415q8779q2974j32824j16423K1306J26852
$$ 2251876 2285012 2432331 2486487 2411072 2322293 2239319 2106495 1990072 2011378 2138230
34417B138230J03794M4663L84q6625j51137l9091J60549J73003p142r3875l962
$$ 2138230 2242024 2286687 2287071 2200446 2049309 2010218 2170767 2343770 2336628 2242753 2238791
34406B238791L8416l4764j4976J29432J40036m4765j42647l1838M7413k7541l8559
$$ 2238791 2277207 2242443 2227467 2356899 2496935 2452170 2309523 2277685 2325098 2297557 2258998
34395B258998J13621J80345K8637r6638j7920P5934J6773n2485j2524n657j06467
$$ 2258998 2372619 2552964 2581601 2484963 2467043 2542977 2559750 2507265 2494741 2489084 2382617
34384B382617j32213j746R1031N6421O5042J47293P6315j55074k11579P436J54572
$$ 2382617 2250404 2248658 2339689 2396110 2461152 2608445 2684760 2529686 2318107 2325543 2480115
34373B480115M4942k8053J25272K13620J5229j90478j25544J2260k6293q2225
$$ 2480115 2525057 2497004 2622276 2835896 2851125 2660647 2535103 2547363 2521070 2438845
34363B438845L8166J47868N6419l2412P9609J71768J9324j50027n7497J17065
$$ 2438845 2477011 2624879 2681298 2648886 2728495 2900263 2919587 2769560 2712063 2829128
34353B829128P5482p1060o0111L6223J8706l0683L0638N7564r4257k09582o1417
$$ 2829128 2904610 2833550 2773439 2809662 2828368 2797685 2828323 2885887 2791630 2582048 2520631
34342B520631J48762J14535o4900j06095k9365k2822m8240K5296J04441N1231
$$ 2520631 2669393 2783928 2719028 2612933 2583568 2560746 2512506 2537802 2642243 2693474
34332B693474k4923K0452Q3465L4950k2482N968k578r6032p8306R6894J43300
$$ 2693474 2668551 2689003 2772468 2807418 2784936 2790904 2788326 2692294 2613988 2710882 2854182
34321B854182n1512j55137M1478K28658J25047l9733o359K3223j52566k51334
$$ 2854182 2802670 2647533 2689011 2917669 3042716 3002983 2996624 3019847 2867281 2615947
34311B615947j4054K42526J44395p8094l2220J26926M7723j21059l7107J48787
$$ 2615947 2601893 2844419 2988814 2910720 2878500 3005426 3053149 2932090 2894983 3043770
34301C043770P7192j21665p4879J26611J21635l4137k0317J00969L0744j42908
$$ 3043770 3120962 2999297 2924418 3051029 3172664 3138527 3118210 3219179 3249923 3107015
34291C107015r8946Q4009O5258j16418j34671J1862N4880R15N6796J41123L2688
$$ 3107015 3008069 3092078 3157336 3040918 2906247 2918109 2972989 2973904 3030700 3171823 3204511
34280C204511j24382k7871J96487J77774n0746j38555l8078M748l7321m23N5817
$$ 3204511 3080129 3052258 3248745 3426519 3375773 3237218 3199140 3203888 3166567 3166144 3221961
34269C221961k2182q4667P4042K45230J15900j40518j38949M8068P3039l3987
$$ 3221961 3199779 3115112 3189154 3434384 3550284 3409766 3270817 3318885 3391924 3357937
34259C357937P02R9783O8j62384o8179J46636J07910r7760r0768Q5796P7819r0207
$$ 3357937 3358639 3458422 3458490 3296106 3227927 3374563 3482473 3384713 3293945 3379741 3457560 3367353
34247C367353r6507L7844M0411k4615Q6548K17167O3186j71512p9831J74006J30099
$$ 3367353 3270846 3308690 3349101 3324486 3411034 3628201 3691387 3519875 3440044 3614050 3744149
34236C744149j02865n5837J91159J51783j31637j62315P4164J17691o3996n6018
$$ 3744149 3641284 3585447 3776606 3928389 3796752 3634437 3708601 3826292 3762296 3706278
34226C706278J38483R7847j45649j23534J47416J62026j00577j19476J62168K07159
$$ 3706278 3844761 3942608 3796959 3673425 3820841 3982867 3882290 3762814 3924982 4132141
34216D132141r6615k16373K9073J56995n4543j94403l7481Q2150j2466k8562J36603
$$ 4132141 4035526 3819153 3848226 4005221 3950678 3756275 3718794 3800944 3788478 3759916 3896519
34205C896519J69940L859k9492J09670P3040j29453q6562J68369J25892k18197
$$ 3896519 4066459 4070318 4040826 4150496 4223536 4094083 4007521 4175890 4301782 4083585
34195D083585k60464J13885K78609m506j64013J09498L12465R0888j34623K620
$$ 4083585 3823121 3937006 4215615 4211109 4047096 4156594 4469059 4559947 4425324 4427944
34185D427944J78463P2114n5457L4568Q3371p6718j39365M0712J05451j07921
$$ 4427944 4606407 4678521 4623064 4657632 4741003 4664285 4524920 4565632 4671083 4563162
34175D563162k07315J9243J93993O4495n7691M5856R5750n8352j02520Q3959J39200
$$ 4563162 4355847 4375090 4569083 4633578 4575887 4621743 4717493 4659141 4556621 4640580 4779780
34164D779780o2386j26282Q6383J58323o0804j25538J38478K57144J972j66870
$$ 4779780 4717394 4591112 4677495 4835818 4775014 4649476 4787954 5045098 5047070 4880200
34154D880200J7284J37279n9366j62086O7225J96078l3267j86440J7310J67632
$$ 4880200 4897484 5034763 4975397 4813311 4880536 5076614 5043347 4856907 4874217 5041849
34144E041849l617q8141J55879K71367j6243k25088j2770J88600L0230j01508
$$ 5041849 5038232 4950091 5105970 5377337 5361094 5136006 5123236 5311836 5342066 5240558
34134E240558R6454K20092j6086j76600L2170J55849r9829k39164O3480K78529
$$ 5240558 5337012 5557104 5541018 5364418 5396588 5552437 5452608 5213444 5276924 5555453
34124E555453J9148j92805P0438K96496J8314k63943l0506K68191R3933j55219
$$ 5555453 5574601 5381796 5452234 5748730 5767044 5503101 5472595 5740786 5834719 5679500
34114E679500L8152K84776O9163k17280l2169K59715R9881j86554m4367K39958
$$ 5679500 5717652 6002428 6071591 5854311 5822142 6081857 6181738 5995184 5950817 6190775
34104F190775J31154j17435j3408J94615N7047j57288k8554J39482n4034k39632
$$ 6190775 6321929 6204494 6191086 6385701 6442748 6285460 6256906 6396388 6342354 6102722
34094F102722K4922L38606J85705q2751M6125K43857K7329k39668m4180K54526
$$ 6102722 6127644 6466250 6651955 6569204 6615329 6859186 6886515 6646847 6602667 6857193
34084F857193J20715j20985L3310K48270N1090j68951O9601L09942N022l50034
$$ 6857193 6977908 6856923 6890233 7138503 7189593 7020642 7090243 7400185 7405207 7055173
34074G055173q8993L56272K49300j04110j7580K66245J56887p8717P8075K75419
$$ 7055173 6966180 7322452 7571752 7467642 7450062 7716307 7873194 7794477 7872552 8147971
34064H147971L203k85605p269L47060J09924k44411l925L75909J62732j88246
$$ 8147971 8151174 7865569 7858300 8205360 8315284 8070873 8066948 8442857 8605589 8417343
34054H417343P1712M55516J50897l48041j35265L58018J81653l08909j69046L01258
$$ 8417343 8489055 8944571 9095468 8747427 8612162 8970180 9151833 8842924 8673878 8975136
34044H975136K03516j56410Q5351N48467K95004k93016j89292L13277K06567k48010
$$ 8975136 9178652 9022242 9107593 9656060 9951064 9658048 9468756 9782033 9988600 9740590
34034I740590p5285M35621K87172k28783r5442L93868K10010l25107j24756M95621
$$ 9740590 9665305 10100926 10388098 10159315 10063873 10457741 10667751 10342644 10217888 10713509
34024A0713509L88071j79151m4341N47125M23180j82033q6854M73406L05099l30440
$$ 10713509 11101580 10922429 10878088 11425213 11848393 11666360 11579506 12052912 12358011 12027571
34014A2027571j84053M93241M08263k13978p6243N68821L84343l31754j41075
$$ 12027571 11843518 12336759 12745022 12531044 12454801 13023622 13407965 13076211 12935136
34005A2935136O57162M99598l75460l00485O04307O49501j41565j27181O60747
$$ 12935136 13592298 14091896 13716436 13415951 14020258 14669759 14528194 14401013 15061760
33996A5061760N76052k94398j94690Q02920Q01393k44878l72358O10834P79973
$$ 15061760 15637812 15343414 15148724 15951644 16753037 16508159 16135801 16746635 17526608
33987A7526608j21385k21825P14736Q04134j64154k47819P67210Q87803q8403
$$ 17526608 17405223 17183398 17898134 18702268 18538114 18290295 19057505 19945308 19856905
33978A9856905j01926J008324J043160j59880k22217J090287J232359j50042l74412
$$ 19856905 19754979 20763303 21806463 21646583 21424366 22514653 23747012 23596970 23222558
33969B3222558J071884J435834P1785k32727J240165J633222J67392j96880J400467
$$ 23222558 24294442 25730276 25802061 25569334 26809499 28442721 28610113 28413233 29813700
33960B9813700J899946L69561l1305J660678K136732M31259J08671K191775K792201
$$ 29813700 31713646 32083207 32051902 33712580 35849312 36280571 36389242 38581017 41373218
33951D1373218P46003K87369K796394L707887J401386P81279L704549M872808
$$ 41373218 42119221 42406590 45202984 48910871 50312257 51093536 54798085 59670893
33943E9670893K210918J572390N349833P020032L794506L051212Q103251J0473337
$$ 59670893 61881811 63454201 68804034 75824066 79618572 82669784 90773035 101246372
33935A01246372O146071M997057J1771693J4436521P821021Q909656K3199464
$$ 101246372 107392443 112389500 124161193 138597714 146418735 155328391 178527855
33928A78527855J5366472m7253017j29355561j51382809q7764281j655020L5709329
$$ 178527855 193894327 146641310 17285749 -134097060 -221861341 -223516361 -187807032
33921a87807032K4507637J0709907J3681396J6323848R210127M590289Q510813
$$ -187807032 -163299395 -152589488 -138908092 -122584244 -113374117 -108783828 -100273015
33914a00273015J0516733N441274K074723N040502O888196L420872R97710L384628
$$ -100273015 -89756282 -84315008 -82240285 -77199783 -70311587 -66890715 -65893005 -62508377
33906f2508377N021528K478722O49631K598635L860013J617242L4756J834968
$$ -62508377 -57486849 -55008127 -54358496 -51759861 -47899848 -46282606 -46247850 -44412882
33898d4412882L178457J390616o3609J377815K570701J081359k13325J001731
$$ -44412882 -41234425 -39843809 -39907418 -38529603 -35958902 -34877543 -35090868 -34089137
33890c4089137K095815Q95236j65403R28962J844186O51048l95943O22474J591665
$$ -34089137 -31993322 -31098086 -31263489 -30334527 -28490341 -27839293 -28235236 -27612762 -26021097
33881b6021097O20199l38413N30134J388131M94378l96626M09423J239595M38716
$$ -26021097 -25400898 -25739311 -25209177 -23821046 -23326668 -23723294 -23313871 -22074276 -21635560
33872b1635560l94044L71112J208758M96472l43351K73393J010998L38769m48961
$$ -21635560 -22029604 -21658492 -20449734 -19953262 -20296613 -20023220 -19012222 -18673453 -19122414
33863a9122414J77093R91723M50143l47437J05282Q30740M13776k40686J85985
$$ -19122414 -18945321 -17953598 -17503455 -17850892 -17745610 -16914870 -16501094 -16741780 -16555795
33854a6555795Q18666M12565j77710K14176P10585J83509m47231j7628N84736
$$ -16555795 -15737129 -15324564 -15502274 -15288098 -14577513 -14394004 -14841235 -14858863 -14274127
33845a4274127J92891l44593J13297P14270K94352l24574M6704O52110L13387
$$ -14274127 -14081236 -14425829 -14312532 -13598262 -13303910 -13628484 -13581780 -12929670 -12616283
33836a2616283k74862K8042N67422K55782k52363R1876N94892J88029m05488l4053
$$ -12616283 -12891145 -12863103 -12295681 -12039899 -12292262 -12200386 -11605494 -11417465 -11822953 -11857006
33826a1857006O28815L61439k85279j11373M28453K14526l05577m3154N40394
$$ -11857006 -11228191 -10866752 -11152031 -11263404 -10834951 -10620425 -10926002 -10969156 -10428762
33817a0428762L16731l05775j68493M32640L81539j31035j04905K98019K00762
$$ -10428762 -10112031 -10417806 -10586299 -10153659 -9772120 -9903155 -10008060 -9710041 -9509279
33808i509279j81142k9492L68329J87816k42425o0492M09895K76361j78287p2622
$$ -9509279 -9690421 -9719913 -9351584 -9163768 -9406193 -9466685 -9056790 -8780429 -8958716 -9031338
33798i031338L38134K02077k21553q6824L50037K44435j59828l4706L64920K05686
$$ -9031338 -8693204 -8491127 -8712680 -8799504 -8449467 -8205032 -8364860 -8399566 -8034646 -7828960
33788g828960k47236j29382L14123J94999k75899j90472L01164L02679j07706
$$ -7828960 -8076196 -8205578 -7891455 -7696456 -7972355 -8162827 -7861663 -7558984 -7666690
33779g666690j08899K30434J68118j66251m3633L39701K04389k31653j18878L52023
$$ -7666690 -7775589 -7545155 -7377037 -7543288 -7586921 -7247220 -7042831 -7274484 -7393362 -7041339
33769g041339K72957k28444k15715K61910K75092j98510k60161J73417K56321
$$ -7041339 -6768382 -6996826 -7212541 -6950631 -6675539 -6874049 -7134210 -6960793 -6704472
33760f704472j34567k23856J11743J59893j55963j26506K88123L20711j21271
$$ -6704472 -6839039 -7062895 -6951152 -6791259 -6947222 -7073728 -6785605 -6464894 -6586165
33751f586165k58659R4444K49628J2073k7581K36047K00014j81049k16877J92602
$$ -6586165 -6844824 -6750380 -6500752 -6488679 -6516260 -6280213 -6080199 -6261248 -6478125 -6285523
33741f285523L29432J258j38663J29734K27802l1183q9956K12407L03656r579
$$ -6285523 -5956091 -5954833 -6093496 -5963762 -5735960 -5767143 -5857099 -5644692 -5341036 -5350615
33731e350615j92430k9361M0564j18265r7215J27320Q4737j83548r5391L19108
$$ -5350615 -5543045 -5572406 -5531842 -5650107 -5747322 -5620002 -5535265 -5718813 -5814204 -5495096
33721e495096L61137m9697j91640J29300K48085q2690k66696m3428O6660j41071
$$ -5495096 -5133959 -5183656 -5375296 -5245996 -4997911 -5080601 -5347297 -5390725 -5324065 -5465136
33711e465136j54803J67170K34898j24907k61663J05510L62431J43377n1371J17424
$$ -5465136 -5619939 -5452769 -5217871 -5342778 -5604441 -5498931 -5136500 -4993123 -5044494 -4927070
33701d927070K07689o3674k36643j3008J72891J7839j01192N6811J13555j05527
$$ -4927070 -4719381 -4783055 -5019698 -5032706 -4859815 -4841976 -4943168 -4886357 -4772802 -4878329
33691d878329j50942J55828K96705K6319j31695J20997K74149j5773k59837n5684
$$ -4878329 -5029271 -4873443 -4576738 -4550419 -4682114 -4561117 -4286968 -4302741 -4562578 -4618262
33681d618262J81373M1232j39299n582J19329p3425k26093j3634K00149N5080
$$ -4618262 -4436889 -4395657 -4534956 -4540538 -4421209 -4494634 -4720727 -4734361 -4534212 -4479132
33671d479132j24640J9870K00705Q2717o6356N0916J55503k4277j72547l719J46991
$$ -4479132 -4603772 -4583902 -4383197 -4300480 -4366836 -4315920 -4160417 -4184694 -4357241 -4360960 -4213969
33660d213969k8836j83406K5868K44195O6366j89412o0677K19116J76570n7113
$$ -4213969 -4242805 -4426211 -4400343 -4156148 -4089782 -4279194 -4339871 -4120755 -3944185 -4001298
33650d001298o4680Q4192N4497r4483r1911K727j2428n5168J273M930j21179j00949
$$ -4001298 -4065978 -3981786 -3927289 -4021772 -4113683 -4110956 -4123384 -4178552 -4177279 -4172349 -4293528 -4394477
33638d394477J85332L58285J56228q1458j7228J07389N575p6755J12191K45483
$$ -4394477 -4209145 -3850860 -3694632 -3776090 -3793318 -3685929 -3680354 -3757109 -3644918 -3399435
33628c399435j0923l19230k21012O7132Q1331o8568J61J77893J07321r9469q0770
$$ -3399435 -3410358 -3729588 -3950600 -3883468 -3802137 -3870705 -3870544 -3692651 -3585330 -3684799 -3765569
33617c765569Q0666M4336j20230q7129R0788J06215r015J1314J23061P7683o9267
$$ -3765569 -3684903 -3640567 -3760797 -3847926 -3757138 -3650923 -3659938 -3648624 -3525563 -3447880 -3517147
33606c517147o8769M1084M2747k1622K8278J12726N1315n2610m729R1788M3206
$$ -3517147 -3585916 -3544832 -3502085 -3523707 -3495429 -3382703 -3331388 -3383998 -3388727 -3296939 -3253733
33595c253733n0066j1361M4199m3615j22057j8226Q7889o5q6177M7397J78893
$$ -3253733 -3303799 -3315160 -3270961 -3314576 -3436633 -3454859 -3366970 -3367035 -3453212 -3405815 -3226922
33584c226922L8367j53247n9161J50944J05837r9170j07477M7303O5119l3135
$$ -3226922 -3188555 -3341802 -3400963 -3250019 -3144182 -3243352 -3350829 -3303526 -3238407 -3271542
33574c271542k164J04882N3260p7487l7343R3598N6371p7125n0382O4508Q775
$$ -3271542 -3273706 -3168824 -3115564 -3193051 -3230394 -3136796 -3080425 -3157550 -3207932 -3143424 -3134649
33563c134649j41249j05005O7240R2737j6923j9015P0678L4498r2230q9560J4245
$$ -3134649 -3275898 -3380903 -3313663 -3220926 -3237849 -3256864 -3186186 -3151688 -3243918 -3333478 -3319233
33552c319233K3862j6592O1068J54350O2947p9197j0882J55604J23806l3444j6377
$$ -3319233 -3295371 -3311963 -3250895 -3096545 -3033598 -3112795 -3123677 -2968073 -2844267 -2877711 -2894088
33541b894088J27030R6256q1553r8878N8960J05667j1733o6197j6890m3802j31885
$$ -2894088 -2767058 -2670802 -2752355 -2851233 -2792273 -2686606 -2698339 -2764536 -2781426 -2825228 -2957113
33530b957113q2593P1758J06715L3443N3342J27124L8715j46891j49238K2853
$$ -2957113 -3039706 -2967948 -2861233 -2827790 -2774448 -2647324 -2608609 -2755500 -2904738 -2881885
33520b881885Q4878j3896m0985N7168Q0587j9527p3147m4053o2238j03305j3341
$$ -2881885 -2797007 -2810903 -2851888 -2794720 -2714133 -2733660 -2806807 -2850860 -2913098 -3016403 -3029744
33509c029744J54213J89388Q7796J6879j5082j01369j46506j5950J36262R1915
$$ -3029744 -2875531 -2686143 -2598347 -2581468 -2596550 -2697919 -2844425 -2860375 -2724113 -2632198
33499b632198j2896O9829J92370M6203k27715k17566N0662J56395L776p7420M0696
$$ -2632198 -2645094 -2575265 -2382895 -2336692 -2564407 -2781973 -2731311 -2574916 -2571140 -2648560 -2607864
33488b607864J21018O8896N9457J00566k837j84528j41948J02296J86473L5724
$$ -2607864 -2486846 -2417950 -2358493 -2257927 -2260764 -2445292 -2587240 -2484944 -2298471 -2262747
33478b262747l0272Q7735R4331j15953k33739q4728Q2743O2629l030J9561J4982
$$ -2262747 -2293019 -2205284 -2110953 -2226906 -2460645 -2545373 -2462630 -2400001 -2403031 -2383470 -2368488
33467b368488p2264q1742K8552O3589l6638p5471J3110L5233p1141j01981J7886
$$ -2368488 -2440752 -2522494 -2493942 -2430353 -2466991 -2542462 -2529352 -2494119 -2565260 -2667241 -2649355
33456b649355R1706L8515L3281J22498J02419o5507j23053K5852J21239O930r7690
$$ -2649355 -2557649 -2519134 -2485853 -2363355 -2260936 -2326443 -2449496 -2423644 -2302405 -2295475 -2393165
33445b393165m232J17964N8662q8161j23395m4912L3733O1830K7604m9273n2085
$$ -2393165 -2397397 -2279433 -2220771 -2308932 -2432327 -2477239 -2443506 -2381676 -2354072 -2403345 -2455430
33434b455430Q8256J98192Q1951j18556j20985J3778M956j08732l9788J66170
$$ -2455430 -2367174 -2168982 -2087031 -2205587 -2326572 -2312794 -2307838 -2416570 -2456358 -2290188
33424b290188J62811n3597j06513P4210J24114o0256j10626J18981K49790M7562
$$ -2290188 -2127377 -2180974 -2287487 -2213277 -2089163 -2149419 -2260045 -2141064 -1891274 -1843712
33414a843712j68770j08728J9126l5061j13029k1265P9270J8235m4407L4407P7419
$$ -1843712 -2012482 -2121210 -2102084 -2137145 -2250174 -2271439 -2192169 -2173934 -2218341 -2183934 -2106515
33403b106515m0718j04557K7770J12482l1021j48468o35J85809J13978p3588q6257
$$ -2106515 -2147233 -2251790 -2224020 -2111538 -2142559 -2291027 -2291662 -2105853 -1991875 -2065463 -2151720
33392b151720J3912M569o7884l6531M1713L9644L3139J07296J29317J1083o2612
$$ -2151720 -2137808 -2133239 -2201123 -2237654 -2195941 -2156297 -2123158 -2015862 -1886545 -1875462 -1938074
33381a938074L8195J13498j1835j52526j00173L771l2503p9964K6986J28743L7412
$$ -1938074 -1899879 -1786381 -1798216 -1950742 -2050915 -2047144 -2079647 -2159611 -2132625 -2003882 -1966470
33370a966470q3169j7525R0820K3293q0755J0501J63192J13588m8271o0380L0417
$$ -1966470 -2049639 -2067164 -1976344 -1953051 -2033806 -2023305 -1860113 -1746525 -1794796 -1855176 -1824759
33359a824759l752j20750j02194L0323Q0613L9538K4920l132j17601j67966o933
$$ -1824759 -1828511 -1949261 -2051455 -2021132 -1940519 -1900981 -1876061 -1879193 -1996794 -2164760 -2171693
33348b171693J79694J35275k9063l3998Q0901O7068o3157q3618J8647N3151m239
$$ -2171693 -1991999 -1856724 -1885787 -1919785 -1838884 -1771816 -1834973 -1918591 -1899944 -1846793 -1851032
33337a851032j2940K4433m976n3182K148Q0346K4641q5710o7330K7125K5062k3621
$$ -1851032 -1863972 -1839539 -1844515 -1897697 -1895549 -1815203 -1790562 -1876272 -1943602 -1916477 -1891415 -1915036
33325a915036L7743J25756M7250j17004j26509l897K2113o4448o8256L9956R6921
$$ -1915036 -1877293 -1751537 -1704287 -1821291 -1947800 -1951697 -1929584 -1994032 -2062288 -2022332 -1925411
33314a925411O4706M6899K9737p0273j53087n9535J04408J03206k1510k7597Q9616
$$ -1925411 -1860705 -1813806 -1784069 -1854342 -2007429 -2066964 -1962556 -1859350 -1880860 -1908457 -1818841
33303a818841J01218l0369r5779k4975J5045n1981r8415n4250n466N903L2518
$$ -1818841 -1717623 -1747992 -1843771 -1868746 -1853701 -1905682 -2004097 -2058347 -2063813 -2057910 -2025392
33292b025392N7983J4820m1681k259Q3641Q4142J8759n774r050n1168m5694P9509
$$ -2025392 -1967409 -1952589 -1994270 -1996529 -1912888 -1828746 -1809987 -1815761 -1824811 -1875979 -1921673 -1842164
33280a842164J63108M6050j08591n7339R8634R3182k7632j2425J09887Q6159p3820
$$ -1842164 -1679056 -1633006 -1741597 -1798936 -1700302 -1607120 -1634752 -1647177 -1537290 -1451131 -1524951
33269a524951j08081J5260O0299k2755l2212O6045P0662n4959j14074o0357n8861
$$ -1524951 -1633032 -1617772 -1557473 -1580228 -1612440 -1546395 -1475733 -1530692 -1644766 -1705123 -1763984
33258a763984j15797m9191J14219J26403k3604o0134P6333J10042n7253j50135
$$ -1763984 -1879781 -1928972 -1814753 -1688350 -1711954 -1772088 -1695755 -1585713 -1642966 -1793101
33248a793101j3296J12120K4298j00717m9458P4910Q7258L1368K2283K1364k0852
$$ -1793101 -1806397 -1694277 -1669979 -1770696 -1820154 -1745244 -1657986 -1626618 -1604335 -1582971 -1603823
33237a603823k1372N0775O6578k1961n9688L5695J10986N1754j9826Q126L0979
$$ -1603823 -1625195 -1574420 -1507842 -1529803 -1589491 -1553796 -1442810 -1391056 -1410882 -1402756 -1371777
33226a371777m4912r5546n724R7382M9685p5260j00152j9892L8726K6404j1294
$$ -1371777 -1416689 -1512235 -1517959 -1420577 -1370892 -1446152 -1546304 -1566196 -1527470 -1501066 -1512360
33215a512360l6444k7765K3548N9855J1098o1193k5944Q1153P5155p4137j67934
$$ -1512360 -1548804 -1576569 -1553021 -1493166 -1482068 -1543261 -1569205 -1488052 -1412897 -1487034 -1654968
33204a654968q7769L0748L4998k8268m5962j5891J8033N8006R0005O7133J5998
$$ -1654968 -1742737 -1711989 -1676991 -1705259 -1751221 -1767112 -1749079 -1691073 -1601068 -1533935 -1517937
33193a517937J6285M0848j5953j26748j42289m3591K5998J7013M0078J27822J58533
$$ -1517937 -1501652 -1460804 -1476757 -1603505 -1745794 -1789385 -1763387 -1746374 -1706296 -1578474 -1419941
33182a419941Q1668K500k0508n1267r7816p6579j527J2096l1975j8674L2813o814
$$ -1419941 -1338273 -1335773 -1356281 -1407548 -1505364 -1581943 -1583470 -1571374 -1603349 -1622023 -1589210 -1596024
33170a596024r1149l4754J29834J56717Q034p2180P995M2320n9808q4138Q3523
$$ -1596024 -1687173 -1721927 -1592093 -1435376 -1427342 -1499522 -1491527 -1449207 -1509015 -1593153 -1509630
33159a509630K10386R6080j01598j48021p4182k1738O260L2559j8369j32600j27008
$$ -1509630 -1299244 -1203164 -1304762 -1452783 -1526965 -1548703 -1542443 -1509884 -1528253 -1660853 -1787861
33148a787861N3472J92016J35474L1583M6571R7345O3170J4687K3737j2365j44830
$$ -1787861 -1734389 -1542373 -1406899 -1375316 -1328745 -1231400 -1168230 -1153543 -1129806 -1142171 -1287001
33137a287001k09606j01738K0775J3706j6390L9209O5087k7280q4197N737O9960
$$ -1287001 -1496607 -1598345 -1577570 -1563864 -1580254 -1541045 -1475958 -1503238 -1587435 -1581698 -1511738
33126a511738l7612j35834j5997J88083K28582J32100O3711P242j14724j92749
$$ -1511738 -1549350 -1685184 -1701181 -1513098 -1284516 -1152416 -1088705 -1081463 -1196187 -1388936
33116a388936j09984M141p389l8619N6662J49673O7253n4433N98J16441M1323
$$ -1388936 -1498920 -1494779 -1502168 -1540787 -1484125 -1334452 -1267199 -1321632 -1321034 -1204593 -1163270
33105a163270j42757j42995L9494J18450j990j18416q6239K7001J39145K23229
$$ -1163270 -1306027 -1449022 -1409528 -1291078 -1293068 -1411484 -1497723 -1470722 -1331577 -1108348
33095a108348J99874K5637j40977j15984J2832K0007q5945j00749J2991Q7162
$$ -1108348 -908474 -882837 -1023814 -1139798 -1126966 -1106959 -1192904 -1293653 -1280662 -1193500
33085a193500N2148R261O117j2137l5139k435L0032l8214j38641j12796K2377
$$ -1193500 -1141352 -1132091 -1125974 -1138111 -1173250 -1175685 -1145653 -1183867 -1322508 -1435304 -1412927
33074a412927J03408Q1590M5612K5463j4144l0440L4890R8683M9106m5078m7148
$$ -1412927 -1309519 -1227929 -1182317 -1156854 -1170998 -1201438 -1166548 -1067865 -1018759 -1063837 -1110985
33063a110985K185k2361p4057j7521J00793J20336M7524J6974K7511k6497j10979
$$ -1110985 -1108800 -1131161 -1205218 -1222739 -1121946 -1001610 -954086 -937112 -909601 -936098 -1047077
33052a047077r9999k6201k8591r0761q1865j2001O555j230O3922J31166N6510
$$ -1047077 -1147076 -1173277 -1201868 -1292629 -1374494 -1386495 -1379940 -1381170 -1317248 -1186082 -1129572
33041a129572q7961j09368k8231j7625n8939J3961J56836J49617o403p2560J6545
$$ -1129572 -1217533 -1326901 -1355132 -1372757 -1431696 -1417735 -1260899 -1111282 -1117685 -1190245 -1173700
33030a173700O8690Q265r378O5735O5440o3179j27319k5857O8416J2268p7607
$$ -1173700 -1105010 -1096745 -1106123 -1040388 -974948 -1038127 -1165446 -1191303 -1122887 -1110619 -1188226
33019a188226n4038K2795L3839J749k176K255j8330k1945K1744O2458N1551k72
$$ -1188226 -1242264 -1219469 -1185630 -1183881 -1186057 -1183802 -1202132 -1224077 -1202333 -1139875 -1088324 -1088596
33007a088596o8206j20006r8222o687M2554k526k0541O2438Q5919p2551j97923
$$ -1088596 -1156802 -1276808 -1375030 -1381717 -1339163 -1341689 -1362230 -1299792 -1213873 -1286424 -1484347
32996a484347l4803K44330K56166J4022j10484p740M9898n1459q4347M5925J03711
$$ -1484347 -1519150 -1274820 -1018654 -1004632 -1115116 -1122856 -1072958 -1124417 -1208764 -1162839 -1059128
32985a059128k3946j02229R882R0059k8764j38904l8038J00368M3210r8027r6803
$$ -1059128 -1083074 -1185303 -1175421 -1085362 -1114126 -1253030 -1291068 -1190700 -1147490 -1245517 -1342320
32974a342320r127k3256j01982q0813K5689R0561J14382J51111J30984K21r6922
$$ -1342320 -1351447 -1374703 -1476685 -1557498 -1531809 -1441248 -1326866 -1175755 -1044771 -1044550 -1141472
32963a141472k1668R8269N9669p8265j05277j7144Q063o2231p6261J7657Q4127
$$ -1141472 -1163140 -1064871 -1005202 -1083467 -1188744 -1205888 -1197825 -1260056 -1336317 -1318660 -1234533
32952a234533L3373m7114m7097J7248O2782N6152K5783P044L171j0922m4265o3387
$$ -1234533 -1201160 -1248274 -1295371 -1278123 -1215341 -1159189 -1133406 -1126362 -1123191 -1134113 -1178378 -1241765
32940a241765m3879j9579k0182m574N3059P1591r707p5458J4795J66740J58419
$$ -1241765 -1285644 -1305223 -1325405 -1329979 -1276920 -1205329 -1215036 -1290494 -1275699 -1108959 -950540
32929i50540j3348j31714j07227o7720p2805j7829J07622J42232L6599m3353p024
$$ -950540 -963888 -1095602 -1202829 -1270549 -1343354 -1361183 -1253561 -1111329 -1074730 -1118083 -1125107
32918a125107J9719l9989o6114Q348N6218R182m927O8656P1092o5186j39651j7832
$$ -1125107 -1105388 -1145377 -1211491 -1203143 -1146925 -1137743 -1142670 -1074014 -1002922 -1068108 -1207759 -1225591
32906a225591J13739N5638p9408r3561l4672m2328o3792Q562Q9336N1884k6288
$$ -1225591 -1111852 -1056214 -1135622 -1229183 -1263855 -1306183 -1369975 -1361413 -1272077 -1220193 -1246481
32895a246481j6434J7963k7964o8321L980P7638J7028o0216K1031J62433J47938
$$ -1246481 -1262915 -1244952 -1272916 -1341237 -1337257 -1259619 -1242591 -1302807 -1281776 -1119343 -971405
32884i71405Q306o2288m5378n9158p7384Q647J20218Q5531m5137o8073K5461N0453
$$ -971405 -963099 -1025387 -1070765 -1129923 -1207307 -1198660 -1078442 -992911 -1038048 -1106121 -1080660 -1030207
32872a030207m1144r8405m0792M6819Q9455Q9455M0222m1557n1614M7261R5915
$$ -1030207 -1071351 -1169756 -1210548 -1163729 -1074274 -984819 -944597 -986154 -1037768 -990507 -894592
32861h94592k5665j50813o9752R9331Q9422o2400r1038K3209L8866q4514r8924
$$ -894592 -920257 -1071070 -1140822 -1041491 -952069 -1014469 -1105507 -1082298 -1043432 -1127946 -1226870
32850a226870Q1232K04302R0189r7167j41982p6381k4867J9993R1631J07620R441
$$ -1226870 -1145638 -941336 -851147 -948314 -1090296 -1166677 -1191544 -1171551 -1079920 -972300 -962859
32839i62859r5288q2964K968M4562K8835K2768M5197N9600M5896J7263l63J4910
$$ -962859 -1058147 -1141111 -1138143 -1093581 -1064746 -1041978 -996781 -937181 -891285 -874022 -874385 -859475
32827h59475M6365L6265l0453q3729p7852p2851j13547j20497l0888N2235J6372
$$ -859475 -813110 -776845 -807298 -891027 -968879 -1041730 -1155277 -1275774 -1306662 -1254427 -1238055
32816a238055n1304o146R0862P6840j7539k5748M9434N3922j9334k7069L1168
$$ -1238055 -1289359 -1295505 -1204643 -1127803 -1145342 -1171090 -1121656 -1067734 -1087068 -1114137 -1082969
32805a082969M438j00857r8865L4717R5541R820l2449P5632J58701O7330o3244
$$ -1082969 -1078531 -1179388 -1278253 -1243536 -1147995 -1138175 -1170624 -1094992 -936291 -868961 -932205
32794i32205m9989M6945O4118K961k7061p166R909J4104P031l8008q8083m9689
$$ -932205 -982194 -935249 -871131 -868170 -895231 -902397 -892488 -878384 -871353 -909361 -997444 -1047133
32782a047133N6835P5589l5097j07068l7387L1761l1589j01233q292J51140J67212
$$ -1047133 -990298 -914709 -949806 -1056874 -1094261 -1062500 -1094089 -1195322 -1203614 -1052474 -885262
32771h85262O8205O0368J65863J81510J4504j68610j91348q8989j382J9747O859
$$ -885262 -817057 -756689 -590826 -409316 -394812 -563422 -754770 -843759 -845141 -825394 -818535
32760h18535j9941m8593l3626M7648J21296Q4230m5394j19070m2533Q6287J00636
$$ -818535 -838476 -887069 -920695 -873047 -751751 -667521 -712915 -831985 -874518 -788231 -687595
32749f87595l057o6631j5970K9401l5576j16483p5163L0912L8723m7133o3680
$$ -687595 -690652 -757283 -773253 -743852 -779428 -895911 -971074 -940162 -901439 -948572 -1012252
32738a012252L7761J18494Q0295q042o2227r8818j29651q7151M9948J68448J55306
$$ -1012252 -974491 -855997 -775702 -783744 -845971 -944789 -1074440 -1161591 -1111643 -943195 -787889
32727g87889M2994n3976p8960m8933L293M5108N2415L8954L3828K3975j9377o6500
$$ -787889 -744895 -798871 -877831 -926764 -923471 -878363 -825948 -786994 -753166 -729191 -748568 -815068
32715h15068o5935m2734n5681o8888L864J23305J41871K8558p0514m9321J9673
$$ -815068 -881003 -923737 -979418 -1048306 -1044442 -921137 -779266 -750708 -821222 -870543 -850870
32704h50870L2844R991J3534K2833j0654n8574n6578l062M5680M3163j5447q6672
$$ -850870 -818026 -808035 -794501 -771668 -782322 -840896 -897474 -900536 -854856 -811693 -827140 -913812
32692i13812r6631k1941N7336N9106K7128N4388J08220P1840m6390j04241n0185
$$ -913812 -1010443 -1032384 -975048 -915942 -888814 -834426 -726206 -654366 -700756 -804997 -855182
32681h55182L08l9984j03031r4723k7152L6936O6461M9016k164j3302N9490J09770
$$ -855182 -854874 -894858 -997889 -1092612 -1119764 -1082828 -1016367 -967351 -969515 -982817 -923327 -813557
32669h13557O048j63528j67192J9105J52637Q6685k7435j2939O5441N9773q147
$$ -813557 -807509 -971037 -1138229 -1119124 -966487 -879802 -907237 -920176 -854735 -794962 -803109
32658h03109k6716n60o304l2837j7748K2193K3048j6607n1932o0603k9933M6687
$$ -803109 -829825 -830385 -836689 -869526 -887274 -865081 -842033 -858640 -910572 -971175 -1001108 -954421
32646i54421J08854O8960l4668n2941M1829Q8017j2604j30850j16563k1298K5137
$$ -954421 -845567 -776607 -811275 -864216 -822387 -734370 -746974 -877824 -994387 -1015685 -990548
32635i90548K7698N6815P6023J3171o6680k7184J29263K48165K07258K8803j65481
$$ -990548 -962850 -906035 -830012 -816841 -883521 -910705 -781442 -533277 -326019 -297216 -462697
32624d62697k50003j86739o5339l227L830M4168J10433R9790R650l9420j6837
$$ -462697 -712700 -899439 -964778 -968005 -964175 -920007 -809574 -709784 -700134 -739554 -756391
32613g56391k6945q1889m6938R1852J36455o837j43397r5696K0103K6558o771
$$ -756391 -783336 -865225 -912163 -820311 -683856 -690693 -834090 -929786 -909683 -883125 -889896
32602h89896O9420J74608J26172l5758j12215n8356L925K0786L0616J4114o3343
$$ -889896 -820476 -645868 -519696 -555454 -667669 -726025 -722100 -701314 -670698 -656584 -719927
32591g19927j14640m5192N2053K5001p3403p0192K9026O1209k059k1541M8838
$$ -719927 -834567 -879759 -827706 -802705 -876108 -946300 -917274 -856065 -858124 -879665 -830827
32580h30827R2158M4565j6549l2802m1252o1831n8363k8368K68N0683J37380J60760
$$ -830827 -738669 -694104 -710653 -743455 -784707 -846538 -904901 -933269 -933001 -882318 -744938 -584178
32568e84178K8741j44800j50919R900J19927N3000q5070j45579j00943N297J17223
$$ -584178 -555437 -700237 -851156 -841256 -721329 -668329 -753399 -898978 -999921 -994624 -877401
32557h77401J48452M8688q8336j13704k6261M5959N5694O9744R4602M6481p3974
$$ -877401 -728949 -680261 -768597 -882301 -908562 -862603 -806909 -737165 -642563 -596082 -670056
32546f70056j42018r2699m519M3637O6228P9148M4735l5171q0418m4001J9926
$$ -670056 -812074 -904773 -909292 -865655 -799427 -720279 -675544 -710715 -791133 -835134 -815208
32535h15208M0021J2226k3078l1649q176Q476k9580q6310n2262Q4339J69655Q9893
$$ -815208 -775187 -762961 -786039 -817688 -825864 -817388 -846968 -933278 -985540 -901201 -731546 -641653
32523f41653n1450q9415l4124k206p127P978J2375m6813r2294k6975O9378N8215
$$ -641653 -693103 -782518 -816642 -818848 -825975 -817997 -805622 -852435 -944729 -971704 -902326 -844111
32511h44111j2469l914M2697j3582j15937p7643P1270J04320j5780p1723L4512
$$ -844111 -856580 -860494 -817797 -831379 -947316 -1024959 -953689 -849369 -865149 -936872 -902360
32500i02360J33676R9654L3923L2573K1686n1384q9882l8056M526k2583k8948
$$ -902360 -768684 -669030 -635107 -602534 -580848 -632232 -722114 -760170 -755644 -778227 -807175
32489h07175L0861M8120l2210q5717j9143O9868O9031K1478L147n982j9791J6807
$$ -807175 -776314 -728194 -760404 -846121 -865264 -795396 -726365 -704887 -701740 -707722 -727513 -710706
32477g10706Q5686O7762m1483q2125m289K1892r3849j75741p0747Q4195Q8038
$$ -710706 -625020 -557258 -598741 -680866 -685155 -663263 -757112 -932853 -1003600 -919405 -831367
32466h31367r881l7571R486K6589K0690N4551P5441Q793o7500l8982M0718M8148
$$ -831367 -841248 -878819 -869333 -842744 -822054 -767503 -692062 -683269 -750769 -789751 -749033 -700885
32454g00885M545M717K2502j5997n1281R106Q4069L1905q7696r1223K2945P3687
$$ -700885 -696340 -691623 -669121 -685118 -736399 -727293 -643224 -611319 -699015 -790238 -767293 -693606
32442f93606m481p9342n4230J3980N8701Q5919P9804n946j24011j55338r1409
$$ -693606 -698087 -777429 -831659 -817679 -758978 -673059 -593255 -599201 -723212 -878550 -969959
32431i69959m4704m6308n21J05513J25521j0836j39503p9249R6338J59065M5592
$$ -969959 -1014663 -1060971 -1061492 -955979 -830458 -841294 -980797 -1060046 -963708 -804643 -759051
32420g59051p7310o5851K0056L8792k8040p4434k9520O2753J16885R3773J0680
$$ -759051 -836361 -902212 -882156 -843364 -871404 -945838 -975358 -912605 -795720 -701947 -691267
32409f91267p5281q4884R813J10814Q2678m6985q8882L2065J33772M2082j24168
$$ -691267 -766548 -851432 -841619 -730805 -648127 -695112 -783994 -751929 -618157 -576075 -700243
32398g00243j25176K8892J13432N8061J9119O5678O3201m9072j16037k8818Q6167
$$ -700243 -825419 -796527 -683095 -625034 -605915 -540237 -477036 -526108 -642145 -670963 -584796
32387e84796Q4572K0101r220m8218j42380j72753l4899J42030J58398L3051o0944
$$ -584796 -500224 -480123 -489343 -537561 -679941 -852694 -887593 -745563 -587165 -554114 -615058
32376f15058o6721n8917n6543j6581K4412j3632r2561r1245M488Q5744Q6212M2758
$$ -615058 -681779 -740696 -797239 -813820 -789408 -803040 -895601 -986846 -982358 -896614 -810402 -767644
32364g67644O246K603N6143J41398J46553M411j69315j91159m7380R5461J04980
$$ -767644 -761398 -758795 -702652 -561254 -414701 -410290 -579605 -770764 -818144 -722683 -617703
32353f17703N890r9057j34136q1228J4710P2716N8420J6234j2036l9751o6665
$$ -617703 -611813 -710870 -845006 -926234 -911524 -838808 -780388 -764154 -776190 -815941 -882606
32342h82606m4369K8538O9239L9333J3048M2076O3724L0776R951M7092O2703J023
$$ -882606 -926975 -898437 -829198 -789865 -776817 -734741 -671017 -640241 -630290 -583198 -520495 -519472
32330e19472n0861k6780k0086r8723j31236L154J62160J28078m9826j38691p5672
$$ -519472 -570333 -597113 -617199 -715922 -847158 -844004 -681844 -553766 -603592 -742283 -817955
32319h17955J477K3182M2462N1888j1353q7443n2526M6074M0973o2761p8522N1326
$$ -817955 -816478 -793296 -750834 -698946 -710299 -797742 -850268 -804194 -763221 -825982 -904504 -853178
32307h53178J60727J23343Q074p8176j15332r3778L546R9716Q0969j0570k0266
$$ -853178 -692451 -569108 -561034 -639210 -754542 -848320 -844774 -745058 -664089 -674659 -694925
32296f94925O1279Q5008J5057j4022L3907J2780j25592k03305j02408L1666L1483
$$ -694925 -633646 -548638 -533581 -547603 -513696 -500916 -626508 -829813 -932221 -900555 -869072
32285h69072l1489n667P4035P3573M260j4213L1227M4847p36l6454k9804j9410
$$ -869072 -900561 -906228 -832193 -758620 -754360 -768573 -737346 -692499 -693235 -729689 -759493 -778903
32273g78903k1242n383K8886L8675R699j7761q141K3802L8804K3805M096L073
$$ -778903 -800145 -805528 -776642 -737967 -728268 -746029 -754170 -730368 -691564 -667759 -663663 -660590
32261f60590J911k8264n5158j3262O9070O3347o4740j51336m5556J50236K02053
$$ -660590 -658679 -686943 -742101 -755363 -686293 -622946 -687686 -839022 -884578 -734342 -532289
32250e32289O3635q4479r8052j5201O1116P9174K6557o4810r7362j6881P1645
$$ -532289 -468654 -553133 -651185 -666386 -605270 -526096 -499539 -564349 -661711 -678592 -606947
32239f06947L4143p5288r0985k822M4088N142j7429J0449J5731J4181J03622K18720
$$ -606947 -572804 -648092 -739077 -741899 -697811 -692669 -710098 -699649 -683918 -669737 -566115 -347395
32227c47395J55013p9795k05692q4477O5617K8509q6205q1107q639k5656q4370
$$ -347395 -192382 -272177 -477869 -562346 -496729 -468220 -554425 -635532 -644171 -669827 -754197
32216g54197l4060Q4574J04494J9616k8911n715j040k7847p863M7776L6541m5692
$$ -754197 -788257 -703683 -599189 -579573 -608484 -614199 -615239 -643086 -650949 -603173 -566632 -612324
32204f12324q3518l2430K0822J7504J0997N0184R0340O9815k454p4250j09618
$$ -612324 -695842 -728272 -707450 -689946 -678949 -628765 -538425 -468610 -471064 -545314 -654932
32193f54932r9789n8741j7651P821L7862Q9354J38152J48373J11355L4978o2460
$$ -654932 -754721 -813462 -831113 -823292 -785430 -696076 -557924 -409551 -298196 -263218 -325678
32182c25678j27855j04279j7631L3286P698k8781k2909j3036l7475n4920k5696
$$ -325678 -453533 -557812 -575443 -542157 -534459 -563240 -586149 -599185 -636660 -691580 -717276
32171g17276J0501J2411J4358M8878P0110L7162j341N497J1750l9251r3061n5550
$$ -717276 -706775 -694364 -680006 -631128 -561018 -523856 -525197 -519700 -507950 -547201 -640262 -695812
32159f95812N4620J23639Q9324o283q6959j03910n5757M690J6527q673n977K7685
$$ -695812 -641192 -517553 -428229 -434512 -521471 -625381 -681138 -676448 -659921 -668594 -674571 -646886
32147f46886K5154j7628j4359N3846P8854K270p1846m1116L4106M9345K8064M3716
$$ -646886 -621732 -639360 -653719 -599873 -521019 -518749 -590595 -631711 -597605 -548260 -520196 -476480
32135d76480O3207J2541p0895r3257n8294l5831k5869J7088O6433N5937j361l7703
$$ -476480 -413273 -400732 -471627 -564884 -623178 -659009 -684878 -667790 -601357 -545420 -546781 -584484
32123e84484m0715l9714k6485J0399K3005k2006o2111l4334J2314R507L99N1499
$$ -584484 -625199 -664913 -691398 -680999 -657994 -680000 -742111 -776445 -764131 -754624 -754225 -702726
32111g02726J09148Q9375M2408O4334J01672K7565j18016j57149m5985O3866O1292
$$ -702726 -593578 -504203 -461795 -397461 -295789 -268224 -386240 -543389 -589374 -525508 -464216
32100d64216N257k2333l7157o4738o4463j4351K8937K0360m911q204j7336o1687
$$ -464216 -458959 -481292 -518449 -583187 -647650 -662001 -633064 -612704 -617615 -625819 -643155 -704842
32088g04842r7257o0254L2956Q9679M5708n3323r0300r283J07444J36333O9152
$$ -704842 -802099 -862353 -829397 -739718 -694010 -747333 -837633 -846916 -739472 -603139 -533987
32077e33987Q1k9906o2416q6218k1679J06412J40873K9051p0321l5985K2945k4303
$$ -533987 -533906 -563812 -626228 -712446 -734125 -627713 -486840 -457789 -528110 -564095 -541150 -565453
32065e65453r2396m8855K5943j2658q1564j482J52459J31504p0163j78714n9149
$$ -565453 -657849 -706704 -680761 -693419 -774983 -776465 -624006 -492502 -562665 -741379 -800528
32054h00528J08225J45077J10197J06095Q1301k5564j22725j04820l1013k3006
$$ -800528 -692303 -547226 -437029 -330934 -249633 -275197 -397922 -502742 -533755 -556761
32044e56761p5590q7754j7931Q1250J31551P9452n9433j73400j50316k5621N5050
$$ -556761 -632351 -720105 -738036 -656786 -525235 -445783 -505216 -678616 -828932 -854553 -799503
32033g99503L8136J5334M8759P3323K9418k7356k4475J4320K7452J1460m032j3330
$$ -799503 -761367 -746033 -697274 -623951 -594533 -621889 -646364 -632044 -604592 -593132 -597164 -610494
32021f10494j7482p146M716r836l6532l2010p18J0219r452l1251m8768n9706k3338
$$ -610494 -627976 -635122 -630406 -640242 -676774 -708784 -709502 -699283 -708735 -739986 -788754 -848460 -871798
32008h71798O3238R7733J2882p4294k2612P8714L2767j16135j18153P1124J96644
$$ -871798 -808560 -710827 -697945 -772239 -794851 -716137 -683370 -799505 -917658 -846534 -649890
31997f49890J09052j1178K0465R5342L7461q2540r1100j7445j5169p8951p3840
$$ -649890 -540838 -552016 -531551 -436209 -398748 -481288 -572388 -589833 -605002 -683953 -757793
31986g57793Q222L8515j9135n7032j0747N5107P0154N0731M5275O6843R0995P3834
$$ -757793 -749571 -711056 -730191 -787223 -797970 -742863 -672709 -621978 -576703 -509860 -418865 -345031
31974c45031q086j00996j10393l5885P517m1123r1469n0064L5082P5101Q3668
$$ -345031 -353117 -454113 -564506 -600391 -592874 -633997 -725466 -775530 -740448 -665347 -581679
31963e81679J00976P2931m6154j47982r4909N4082J08749K0207p1004n8945Q458
$$ -581679 -480703 -407772 -453926 -601908 -696817 -642735 -533986 -513779 -584783 -643728 -635270
31952f35270N3169O8999O2485J3777n5683p5289l0648O926n625k1723J232K6055
$$ -635270 -582101 -513102 -450617 -436840 -492523 -567812 -598460 -591534 -597159 -618882 -617650 -591595
31940e91595O683k8903k4718J7651N0863M9118K2386j1227l2147k1361J1462K2784
$$ -591595 -584912 -613815 -638533 -620882 -570019 -520901 -498515 -509742 -541889 -563250 -551788 -529004
31928e29004q998m2654k8058J4310J9224j7104j8606N2447J16203P6409l5516
$$ -529004 -538002 -580656 -608714 -594404 -575180 -592284 -610890 -558443 -442240 -365831 -401347
31917d01347r9396p5791m0402l8216j4642N9158J01985M9716k3326j7298L0097
$$ -401347 -500743 -576534 -616936 -655152 -669794 -610636 -508651 -458935 -482261 -499559 -469462
31906d69462J5921m5459m8989J7689N5431J7718l1560l6436j5005O423K7959L7462
$$ -469462 -453541 -499000 -547989 -530300 -474869 -457151 -488711 -525147 -540152 -533729 -505770 -468308
31894d68308K5386K8487O6667O5771m0934j66125j62062l8209O4995R7443J21148
$$ -468308 -442922 -414435 -347768 -281997 -322931 -489056 -651118 -689327 -624332 -526889 -405741
31883d05741J25479K8463j14500j21144L3193J42329O5943q2696j36389q7926
$$ -405741 -280262 -251799 -366299 -487443 -454250 -311921 -245978 -328674 -465063 -552989
31873e52989j1160O0703Q0750j4055j47132j23160P9126K19520J36110j6796l2823
$$ -552989 -564149 -503446 -422696 -436751 -583883 -707043 -627917 -408397 -272287 -289083 -321906
31862c21906K9819k513j07717j32463o1823o724L346J6697J1984n5762j11372
$$ -321906 -292087 -294600 -402317 -534780 -596603 -603327 -599981 -583284 -571300 -627062 -738434
31851g38434m2247J07927J86819J45549O4203J748m7964q3006q8915p1673j7511
$$ -738434 -780681 -672754 -485935 -340386 -276183 -274435 -322399 -405405 -494320 -565993 -583504
31840e83504J02857K16966J66174n1931k04116j30394J8933L2089l5324n700Q2387
$$ -583504 -480647 -263681 -97507 -149438 -353554 -483948 -465015 -432926 -468250 -473950 -391563
31829c91563N3253p0432r3462J8030R0482L6405l9472m8908l0756k7869k7411
$$ -391563 -338310 -408742 -502204 -484174 -393692 -357287 -396759 -445667 -476423 -504292 -531703
31818e31703l5202n8439l5574O3343J21268L9103n7282M775J30555Q6843r9202
$$ -531703 -566905 -625344 -660918 -597575 -476307 -437204 -494486 -489711 -359156 -272313 -371515
31807c71515j67738n0901M2198O830o495Q6415J31406K2821r8640r0656k5914
$$ -371515 -539253 -590154 -547956 -541126 -547621 -461206 -329800 -306979 -405619 -496275 -522189
31796e22189p938J7894J00994J27753J3586j08778q1944K8287O0599J8808J9095
$$ -522189 -530127 -512233 -411239 -283486 -269900 -378678 -460622 -432335 -371736 -352928 -333833
31785c33833O4715N8168j1935n8153m4579k1904k7143m4359m9580l0110R683K0998
$$ -333833 -269118 -210950 -222885 -281038 -325617 -347521 -374664 -419023 -468603 -498713 -489030 -468032
31773d68032m8367j44817j31157J9391J47998J14361j1875o5060j6782K0969j4661
$$ -468032 -516399 -661216 -792373 -772982 -624984 -510623 -522498 -587558 -604340 -583371 -598032
31762e98032n9477l4630M5404R9234P5406O257l1593q152L2240N0133O8005J01446
$$ -598032 -657509 -692139 -646735 -547501 -472095 -465838 -497431 -505583 -473343 -423210 -355205 -253759
31750b53759R7291K2675m6842l7471j5624q0155j70444j48882l8175J3310j4620
$$ -253759 -156468 -133793 -180635 -218106 -233730 -313885 -484329 -633211 -671386 -658076 -672696
31739f72696n579M4862R121j01888r8205O7320J76061P6134p6048o8757N3703
$$ -672696 -678275 -633413 -624292 -726180 -824385 -757065 -581004 -504870 -580918 -649675 -595972
31728e95972J10680O6188R214k6611n2262l3853L0464M3327l6920q4589k603R0525
$$ -595972 -485292 -419104 -409890 -436501 -488763 -522616 -492152 -448825 -485745 -570334 -572937 -482412
31716d82412M8165m5772j8273Q2075N9648q1877j22192K0998J53692J05143k2840
$$ -482412 -434247 -480019 -498292 -416217 -356569 -438446 -560638 -539640 -385948 -280805 -303645
31705c03645l1925P1826R9885l9304k10192k26690q4025N0977O3844K4195N0345
$$ -303645 -335570 -263744 -163859 -203163 -413355 -640045 -724070 -673093 -609249 -585054 -534709
31694e34709J19929J17459K7986m8382o6172p3996p0535J5530J51052J70150J1025
$$ -534709 -414780 -297321 -269335 -317717 -383889 -457885 -528420 -512890 -361838 -191688 -180663
31683a80663j62588j81674q7019j5854M322K5744M8876M6520L6762K8154j9127
$$ -180663 -343251 -524925 -611944 -627798 -623476 -597732 -548856 -502336 -465574 -437420 -456547
31672d56547q8470p7906K5167P4938n630p4641j860R5838M1886r9336j28512l0061
$$ -456547 -545017 -622923 -597756 -522818 -528448 -603089 -604949 -509111 -467225 -566561 -695073 -725134
31660g25134M3181M6187P2109J33343J34817O5609J4406j3322r7492k07287j99525
$$ -725134 -681953 -635766 -563657 -430314 -295497 -229888 -215482 -228804 -326296 -533583 -733108
31649g33108n2888P4601P4923J9828P583K5056K4436J4918J8829L2378O2107J05124
$$ -733108 -785996 -711395 -636472 -616644 -609061 -584005 -559569 -544651 -525822 -493444 -431337 -326213
31637c26213Q8082n1206k11821k04553j4970J48738J23608k1874j27488j38160
$$ -326213 -238131 -289337 -501158 -705711 -720681 -571943 -448335 -470209 -597697 -735857
31627g35857q4529J4934J31532J88070J42065N9154K7933L9365J2476q7090j99143
$$ -735857 -820386 -805452 -673920 -485850 -343785 -284631 -256698 -217333 -204857 -291947 -491090
31616d91090k23613j11535O7179J55141O7458q2693r8536M9421J79621J39449
$$ -491090 -714703 -826238 -759059 -603918 -536460 -619153 -717689 -668268 -488647 -349198
31606c49198o275q8584n5815N918K6381K6529M2404N6891M1628J8122K7352N3607
$$ -349198 -355473 -444057 -499872 -493954 -467573 -441044 -398640 -341749 -300121 -281999 -254647 -201040
31594b01040L1898n1904j15149p6635K9069R2858O9227P690m1607p3666q0993
$$ -201040 -169142 -221046 -336195 -412830 -383761 -290903 -221676 -213986 -255593 -329259 -410252
31583d10252n0946k2281m8765r0754n2555M8224P8313J337m9296J5334R4462O8249
$$ -410252 -461198 -483479 -532244 -622998 -675553 -627329 -549016 -547679 -596975 -581641 -487179 -418930
31571d18930j7257n4161m3848l8925k4877J1649P141n3351n3813O4486J61050
$$ -418930 -436187 -490348 -534196 -573121 -597998 -586349 -579208 -632559 -686372 -621886 -460836
31560d60836J09631J7213L0176O0731m3847j74386j00186J24138K07044P0364
$$ -460836 -351205 -333992 -303816 -243085 -286932 -461318 -561504 -437366 -230322 -159958
31550a59958n8550m1644j2191p7588j24544n1953M0174M1712J4186L6386M3180
$$ -159958 -218508 -260152 -272343 -349931 -474475 -526428 -486254 -444542 -430356 -393970 -350790
31539c50790l2214j04555p3922O775L9077M2138P4260R0700J9469r0579j24757
$$ -350790 -383004 -487559 -561481 -554706 -515629 -473491 -399231 -308531 -289062 -379641 -504398
31528e04398o2333J7195N1546M2890J9382M611k84k4081p4628r1465k4860N6726
$$ -504398 -566731 -549536 -497990 -455100 -435718 -431107 -431391 -455472 -530100 -621565 -646425 -589699
31516e89699M7941j7578j2001O2522O0581n8163j39714o8772O3493J15460Q2882
$$ -589699 -541758 -559336 -571337 -508815 -448234 -506397 -646111 -714883 -651390 -535930 -453048
31505d53048L5210j1774n7896o0277j0827K1152O591J8964R9095J60563J16768
$$ -453048 -417838 -429612 -487508 -547785 -558612 -537460 -530869 -511905 -412810 -252247 -135479
31494a35479P274q3542j36335j47789q0934M2541J02984L8380m7781l1846N6749
$$ -135479 -128205 -211747 -348082 -495871 -576805 -534264 -431280 -392900 -440681 -472527 -415778
31483d15778J00943O1842p079m7155k8919L2098N0495m3608j59597j20179O5998
$$ -415778 -314835 -252993 -260072 -307227 -336146 -304048 -253553 -297161 -456758 -576937 -510939
31472e10939J67671N7476r6028r2625R699M0806R384L6138R4332M7550r0611j48372
$$ -510939 -343268 -285792 -381820 -474445 -464746 -423940 -414556 -378418 -284086 -236536 -327147 -475519
31460d75519n5678O2841Q0496J2059o4078j07718j06637n7417J0942N6082P5736
$$ -475519 -531197 -468356 -387860 -375801 -439879 -547597 -654234 -711651 -700709 -644627 -568891
31449e68891R2291R5197N4956j7418p4839q4110l8810M2681J00003O6531l3815
$$ -568891 -476600 -381403 -326447 -343865 -418704 -502814 -541624 -498943 -398940 -332409 -366224
31438c66224q6349l3671M1778M2501o515j8270K0048N2272M9203K6475J299j3085
$$ -366224 -452573 -486244 -444466 -401965 -408480 -426750 -406702 -354430 -305227 -278752 -277453 -290538
31426b90538o551k467l7454q4576p0039L943M2611K887m4105l7694p736J5916
$$ -290538 -297089 -299556 -337010 -421586 -491625 -487682 -445071 -442184 -486289 -523983 -531719 -515803
31414e15803N3537Q1779K6354q3060j00041P742P3121r947j01491m1649Q3617
$$ -515803 -462266 -380487 -354133 -437193 -537234 -529492 -456371 -466318 -567809 -609458 -525841
31403e25841Q4771l1875r7436m4784L4554N6396K2985l0041n6845j9828L5473
$$ -525841 -441070 -472945 -570381 -615165 -580611 -524215 -501230 -531271 -588116 -607944 -572471
31392e72471R388p5524o0514Q8416J71639N2479j08290j00376J4839N1298K1091
$$ -572471 -563083 -638607 -699121 -610705 -439066 -386587 -494877 -595253 -580414 -529116 -508025
31381e08025N4748J11195M5954r5800j25510j8576P2640Q6808R5631J03055M4640
$$ -508025 -453277 -342082 -296128 -391928 -517438 -536014 -463374 -376566 -280935 -177880 -133240
31370a33240k7290K489Q1652N2040o5063r1543k397M2181p317k2915L1689K5664
$$ -133240 -160530 -158041 -76389 -24349 -89412 -180955 -183352 -141171 -148488 -171403 -139714 -114050
31358a14050p8322j33018o0445K5668L6391L4254N6036J7560j01930j69388r9669
$$ -114050 -192372 -325390 -385835 -360167 -323776 -289522 -233486 -215926 -317856 -487244 -586913
31347e86913J4063O1912N5846L3383j8596p3467n4829K0250M2056j956n715N1400
$$ -586913 -572850 -510938 -455092 -421709 -440305 -513772 -568601 -548351 -506295 -508251 -513966 -462566
31335d62566O8411K8122K8286O2285K895j29630j37103K2060J25862M2317o6375
$$ -462566 -394155 -366033 -337747 -275462 -272567 -402197 -539300 -517240 -391378 -349061 -415436
31324d15436m5407L662l5789n0901P1769J82842R6493q0066j08553M959N3601
$$ -415436 -460843 -457181 -492970 -543871 -472102 -289260 -192767 -272833 -381386 -376427 -322826
31313c22826k7318r9070o3901K5800Q2237O2676k5625r4647k9706J27194J70085
$$ -322826 -350144 -449214 -513115 -487315 -405078 -342402 -368027 -462674 -492380 -365186 -195101
31302a95101K0164j28630r9826L797J4778o016O5526J22286m291j91342j68972
$$ -195101 -174937 -303567 -403393 -399596 -384818 -390834 -325308 -203022 -207313 -398655 -567627
31291e67627L3970J19825r64r1002l250R1688J7399j24092j37996k1938Q7503
$$ -567627 -533657 -413832 -414796 -505798 -509048 -417360 -399961 -524053 -662049 -683987 -596484
31280e96484J19145Q5990O598p6157q2657j855O1524K6503m4801m4441K4159O5258
$$ -596484 -477339 -391349 -384751 -460908 -543565 -545420 -483896 -457393 -502194 -546635 -522476 -457218
31268d57218L0623k8623l9438N711M4242K2253k6058j4667N8498P8760j9318j22892
$$ -457218 -426595 -455218 -494656 -488945 -444703 -422450 -448508 -463175 -404677 -325917 -345235 -468127
31256d68127q3455N9582J28506O1395k5187l7887k4848m4894n0955J2626R1686
$$ -468127 -551582 -492000 -363494 -302099 -327286 -365173 -390021 -434915 -485870 -473244 -381558
31245c81558R5823L3541j2239j0964p993l0192l6754J2678P8538P1555l0506j28363
$$ -381558 -285735 -252194 -264433 -275397 -283390 -313582 -350336 -337658 -259120 -187565 -218071 -346434
31233c46434j04437K6864J27012J04612J6151l5793l5866l1069l4682l1112l2431
$$ -346434 -450871 -424007 -296995 -192383 -176232 -212025 -247891 -278960 -313642 -344754 -377185
31222c77185n0641m7575P621O0861L7664l7435p3251m7388j8112r527J6381O2652
$$ -377185 -427826 -475401 -467780 -406919 -369255 -406690 -479941 -527329 -545441 -554968 -538587 -475935
31210d75935O8277Q650n1613m7237K860L9124M6135N1076O0924M2911k4563r8441
$$ -475935 -407658 -399008 -450621 -497858 -494998 -455874 -409739 -358663 -297739 -254828 -279391 -377832
31198c77832r5737N322J09246J02136N434m2207K0990Q9410M6734o7687j28937
$$ -377832 -473569 -468247 -359001 -256865 -251431 -293638 -272648 -183238 -136504 -204191 -333128
31187c33128r9794m1717J376L1426L4913r350o7346p5194k6647K5989M5646K9414
$$ -333128 -432922 -474639 -473263 -441837 -406924 -416274 -483620 -558814 -585461 -559472 -513826 -484412
31175d84412j8255o6366m6686N7183J40492R1336m1482r3538r18J21207J34804
$$ -484412 -502667 -569033 -615719 -558536 -418044 -326708 -368190 -461728 -462646 -341439 -206635
31164b06635L5804p2450j03208n4890Q716K9538J8664L2663P4634P1463r820q8587
$$ -206635 -170831 -243281 -346489 -401379 -392663 -363125 -344461 -311798 -237164 -165701 -175521 -264108
31152b64108q4614m3471n1288p6731k3287Q5423J15253L2703l0551K2046J04293
$$ -264108 -348722 -392193 -443481 -520212 -543499 -458076 -342823 -310120 -340671 -318625 -214332
31141b14332Q4686j3875n9804j7828Q100m9619j06918n5814N7132Q5780N667m3744
$$ -214332 -129646 -143521 -203325 -221153 -213053 -262672 -369590 -425404 -368272 -282492 -276825 -320569
31129c20569J8909Q1680K8374n4659k3317N7807Q646j38846j55224J1603J32106
$$ -320569 -301660 -219980 -191606 -246265 -269582 -211775 -203129 -341975 -497199 -485596 -353490
31118c53490N8550n2969k7882M5035P261q2445p2361J5298N9555O3767R1346Q8950
$$ -353490 -294940 -347909 -375791 -330756 -323495 -405940 -478301 -463003 -403448 -339681 -248335 -159385
31106a59385r018j01025o5818P793l0399j11272o8504M4490L8575p1102j00455
$$ -159385 -168403 -269428 -335246 -327453 -357852 -469124 -537628 -493138 -454563 -525665 -626120
31095f26120l2345j4932m5216K4552J54383J26640n9668j40178k0880O7507j9931
$$ -626120 -658465 -673397 -718613 -694061 -539678 -413038 -472706 -612884 -633764 -566257 -586188
31084e86188r8367J338J31487R1568l9637o5969J4116P5252R6089J20244J10589
$$ -586188 -684555 -683217 -551730 -460162 -499799 -565768 -551652 -476400 -380311 -260067 -149478
31073a49478K6232n9728p2656n8463o3510k5173Q1863J36449O2557j4180L0993
$$ -149478 -123246 -182974 -255630 -314093 -377603 -402776 -320913 -184464 -121907 -136087 -105094
31062a05094J03256N6139n2452p5243l7530o8433j49425j48234n8105p25j1773
$$ -105094 -1838 54301 1849 -73394 -110924 -179357 -328782 -477016 -535121 -535846 -547619
31051e47619m274N9402J14484J15045Q3250M2329J410j4493o412l0029r8938j25220
$$ -547619 -551893 -492491 -378007 -262962 -179712 -137383 -135973 -150466 -156878 -186907 -285845 -411065
31039d11065n0214M3822N8537L0626L9856N5110P447o4499q3459p0856p3725m1269
$$ -411065 -461279 -417457 -358920 -328294 -288438 -233328 -225881 -290380 -373839 -444695 -518420 -559689
31027e59689O5755J30474L3642j15177j06148M8938J32674N0136o3449q0279l4692
$$ -559689 -493934 -363460 -329818 -444995 -551143 -502205 -369531 -319395 -382844 -463123 -497815
31016d97815Q01K7898N4335M5816J045k4049m63M5309Q8105J06759N5033o8060
$$ -497815 -497014 -469116 -414781 -368965 -367920 -391969 -392432 -347123 -259018 -152259 -97226 -165286
31004a65286j53212j06208k738J6296l4739k9256L6464L6097n3716r9696k8255
$$ -165286 -318498 -424706 -427444 -411148 -445887 -475143 -438679 -402582 -456298 -555994 -584249
30993e84249P1560J08448R9821P5246J8278m1644k3634N8470Q1504M427o4447
$$ -584249 -512689 -404241 -304420 -229174 -210896 -252540 -276174 -217704 -136200 -131773 -196220
30982a96220n5708m6844r7615j24259n2481K9382N550p1919o4328L6692J09099
$$ -196220 -251928 -298772 -396387 -520646 -573127 -543745 -538195 -610114 -674442 -637750 -528651
30971e28651Q7789L1858J1265K6042M7083O0195N2832J1735m8169q6376p9591
$$ -528651 -440862 -409004 -397739 -371697 -324614 -264419 -211587 -199852 -248021 -334397 -413988
30960d13988m1206L495M0831O2232N1750l20o7122q9657l9709L1302M6669M452
$$ -413988 -455194 -451699 -410868 -348636 -296886 -297206 -364328 -453985 -493694 -462392 -415723 -411271
30948d11271k8775k2968j0278K821N0896J05454P1758m7393j06883k9917O0453
$$ -411271 -440046 -463014 -473292 -470471 -419575 -314121 -242363 -289756 -396639 -426556 -366103
30937c66103L8479k4195j1150J1261p4874j75277r9247J01162J68413K9329j02214
$$ -366103 -327624 -351819 -362969 -351708 -426582 -601859 -701106 -599944 -431531 -402202 -504416
30926e04416o4062M6951Q8451P7575P2750L8010m6844r2170l9493K8599K8757
$$ -504416 -568478 -521527 -433076 -355501 -282751 -244741 -291585 -383755 -423248 -394649 -365892
30915c65892P296K7587M7037J4414k1159p165Q667k2464m4383N778Q0499R9682
$$ -365892 -358596 -331009 -283972 -269558 -290717 -297882 -289215 -311679 -356062 -350284 -269785 -170103
30903a70103O2948L752p2052j24553p2339O1254J16570J8684r3640p8579j905
$$ -170103 -107155 -103403 -175455 -300008 -372347 -311093 -194523 -175839 -269479 -348058 -349963
30892c49963L637l6299k0747K5470J8291m178L8821P8358q425j51490j54001l46
$$ -349963 -346326 -382625 -403372 -377902 -359611 -363789 -324968 -246610 -255035 -406525 -560526 -560872
30880e60872J10937O6623k3909l8855r877k081J5278P7382J19190O9168k5059
$$ -560872 -449935 -383312 -407221 -446076 -455953 -458034 -442756 -365374 -246184 -177016 -202075
$$ [...]
##END NTUPLES=NMR SPECTRUM
##END=
