##TITLE=31Pdec_LY-6.2.Dix.1.B
 CD3CN, 24 sc
 1.04.2021
##JCAMPDX= 6.0         $$ Bruker NMR JCAMP-DX V2.0
##DATA TYPE= NMR SPECTRUM
##DATA CLASS= NTUPLES
##ORIGIN= UXNMR, Bruker Analytische Messtechnik GmbH
##OWNER= root
$$ XWIN-NMR		Version 3.5
$$ Thu Apr  1 13:34:00 2021 Russian Standard Time (UT+4h)  she@DPX200
##.OBSERVE FREQUENCY= 81.013821
##.OBSERVE NUCLEUS= ^31P
##.ACQUISITION MODE= SIMULTANEOUS
##.ACQUISITION SCHEME= undefined
##.AVERAGES= 24
##.DIGITISER RES= 16
##SPECTROMETER/DATA SYSTEM= spect
##.PULSE SEQUENCE= zgpg30
##.SOLVENT NAME= CD3CN
##.SHIFT REFERENCE= (INTERNAL, CD3CN, 0, 248.564)
##AUDIT TRAIL= $$ (NUMBER, WHEN, WHO, WHERE, WHAT)
$$ ##TITLE= Audit trail, XWIN-NMR		Version 3.5
$$ ##JCAMPDX= 5.01
$$ ##ORIGIN= Bruker BioSpin GmbH
$$ ##OWNER= she
$$ F:/spectra/data/she/nmr/P31/1/pdata/1/auditp.txt
$$ ##AUDIT TRAIL=  $$ (NUMBER, WHEN, WHO, WHERE, WHAT)
(   1,<2021-04-01 13:32:09.75 +0400>,<she>,<DPX200>,
      <created by zg, POWCHK disabled, PULCHK disabled
       configuration hash MD5:
       00 E9 B6 7A A2 85 ED C7 34 08 36 98 17 FE 4E 26
       data hash MD5: 32K
       7E A2 E7 E9 1F 97 C7 48 9B E0 5F B3 44 24 23 F0>)
(   2,<2021-04-01 13:32:20.67 +0400>,<she>,<DPX200>,
      <Start of raw data processing
       efp BC_mod = 2 LB = 1 FT_mod = 6 PKNL = 1 PHC0 = -4342.691 PHC1 = -54.79894 SI = 64K 
       data hash MD5: 64K
       1C 30 43 71 A0 F6 68 9E F6 C2 32 A2 21 86 69 EA>)
(   3,<2021-04-01 13:33:13.59 +0400>,<she>,<DPX200>,
      <pk PHC0 = -41.41383 PHC1 = 45.20003 
       data hash MD5: 64K
       8C AC ED 65 23 4F A5 E6 08 FD FE 7D 0D 4C 18 9F>)
$$ ##END=
$$ 
$$ hash MD5
$$ EE 2D 4A 3C AB 2F 75 15 7E 4E B4 0A 52 CC E3 E3
##$RELAX= 
##$RELAX= 
##$RELAX= 
##$RELAX= 
##$RELAX= 
##$RELAX= 
##$RELAX= 
##$RELAX= 
$$ Bruker specific parameters
$$ --------------------------
##$DU= <F:/spectra>
##$EXPNO= 1
##$NAME= <P31>
##$PROCNO= 1
##$TYPE= <nmr>
##$USER= <she>
##$AMP= (0..31)
100 100 100 100 100 100 100 100 100 100 100 100 100 100 100 100 100 100 
100 100 100 100 100 100 100 100 100 100 100 100 100 100 
##$AQSEQ= 0
##$AQ_mod= 1
##$AUNM= <au_zg>
##$AUTOPOS= <>
##$BF1= 81.014009
##$BF2= 200.13
##$BF3= 200.13
##$BF4= 200.13
##$BF5= 200.13
##$BF6= 200.13
##$BF7= 200.13
##$BF8= 200.13
##$BYTORDA= 1
##$CFDGTYP= 0
##$CFRGTYP= 5
##$CHEMSTR= <none>
##$CNST= (0..31)
1 1 145 1 1 1 1 1 1 1 1 1 1 1 1 1 1 1 1 1 1 1 1 1 1 1 1 1 1 1 1 1 
##$CPDPRG= <waltz16>
##$CPDPRG1= <>
##$CPDPRG2= <waltz16>
##$CPDPRG3= <>
##$CPDPRG4= <mlev>
##$CPDPRG5= <mlev>
##$CPDPRG6= <mlev>
##$CPDPRG7= <mlev>
##$CPDPRG8= <mlev>
##$CPDPRGB= <>
##$CPDPRGT= <>
##$D= (0..31)
0 1 0 0 0 0 0 0 0 0 0 0.03 2e-05 3e-06 0 0 0 0 0 0 0 0 0 0 0 0 0 0 0 0 
0 0 
##$DATE= 1617269529
##$DBL= (0..7)
120 120 120 11 120 120 24 19 
##$DBP= (0..7)
150 150 150 150 150 150 150 150 
##$DBP07= 0
##$DBPNAM0= <>
##$DBPNAM1= <>
##$DBPNAM2= <>
##$DBPNAM3= <>
##$DBPNAM4= <>
##$DBPNAM5= <>
##$DBPNAM6= <>
##$DBPNAM7= <>
##$DBPOAL= (0..7)
0.5 0.5 0.5 0.5 0.5 0.5 0.5 0.5 
##$DBPOFFS= (0..7)
$$ [...]
##$SUBNAM2= <"">
##$SUBNAM3= <"">
##$SUBNAM4= <"">
##$SUBNAM5= <"">
##$SUBNAM6= <"">
##$SUBNAM7= <"">
##$SUBNAM8= <"">
##$SUBNAM9= <"">
##$SW= 501.771253377433
##$SWIBOX= (0..15)
0 1 3 0 0 0 0 0 0 0 0 0 0 0 0 0 
##$SW_h= 40650.406504065
##$TD= 32768
##$TD0= 1
##$TE= 0
##$TE2= 300
##$TE3= 300
##$TEG= 300
##$TL= (0..7)
0 120 53 12 22 120 120 120 
##$TP= (0..7)
150 150 150 150 150 150 150 150 
##$TP07= 0
##$TPNAME0= <>
##$TPNAME1= <>
##$TPNAME2= <>
##$TPNAME3= <>
##$TPNAME4= <>
##$TPNAME5= <>
##$TPNAME6= <>
##$TPNAME7= <>
##$TPOAL= (0..7)
0.5 0.5 0.5 0.5 0.5 0.5 0.5 0.5 
##$TPOFFS= (0..7)
0 0 0 0 0 0 0 0 
##$TUNHIN= 0
##$TUNHOUT= 0
##$TUNXOUT= 0
##$USERA1= <user>
##$USERA2= <user>
##$USERA3= <user>
##$USERA4= <user>
##$USERA5= <user>
##$V9= 5
##$VALIST= <valist>
##$VCLIST= <CCCCCCCCCCCCCCC>
##$VD= 0
##$VDLIST= <DDDDDDDDDDDDDDD>
##$VPLIST= <PPPPPPPPPPPPPPP>
##$VTLIST= <TTTTTTTTTTTTTTT>
##$WBST= 1024
##$WBSW= 4
##$XGAIN= (0..3)
0 0 0 0 
##$XL= 0
##$YL= 0
##$YMAX_a= 5368
##$YMIN_a= -16784
##$ZGOPTNS= <>
##$ZL1= 120
##$ZL2= 120
##$ZL3= 120
##$ZL4= 120
##$ABSF1= 0
##$ABSF2= 0
##$ABSG= 0
##$ABSL= 0
##$ALPHA= 0
##$AQORDER= 0
##$ASSFAC= 0
##$ASSFACI= 0
##$ASSFACX= 0
##$ASSWID= 0
##$AUNMP= <proc_1d>
##$AZFE= 0.1
##$AZFW= 0.5
##$BCFW= 0
##$BC_mod= 2
##$BYTORDP= 0
##$COROFFS= 0
##$CY= -3
##$DATMOD= 1
##$DC= 0
##$DFILT= <>
##$DTYPP= 0
##$F1P= 0
##$F2P= 0
##$FCOR= 1
##$FTSIZE= 65536
##$FT_mod= 6
##$GAMMA= 0
##$GB= 0
##$INTBC= 1
##$INTSCL= 5.30512e-09
##$ISEN= 30
##$LB= 1
##$LEV0= 0
##$LPBIN= 0
##$MAXI= 10000
##$MC2= 0
##$MEAN= 0
##$ME_mod= 0
##$MI= 50
##$NCOEF= 0
##$NC_proc= -3
##$NLEV= 6
##$NOISF1= 182.463
##$NOISF2= 159.3651
##$NSP= 0
##$NTH_PI= 0
##$NZP= 0
##$OFFSET= 248.5645
##$PC= 4
##$PHC0= -4384.105
##$PHC1= -9.598907
##$PH_mod= 1
##$PKNL= yes
##$PPARMOD= 0
##$PSCAL= 0
##$PSIGN= 0
##$REVERSE= no
##$SF= 81.014009
##$SI= 65536
##$SIGF1= 159.3651
##$SIGF2= -187.1042
##$SINO= 113.3802
##$SIOLD= 16384
##$SREGLST= <1H.CDCl3>
##$SSB= 0
##$STSI= 65536
##$STSR= 0
##$SW_p= 40650.406504065
##$SYMM= 0
##$S_DEV= 0
##$TDeff= 32768
##$TDoff= 0
##$TI= <>
##$TILT= no
##$TM1= 0
##$TM2= 0
##$TOPLEV= 0
##$USERP1= <user>
##$USERP2= <user>
##$USERP3= <user>
##$USERP4= <user>
##$USERP5= <user>
##$WDW= 1
##$XDIM= 65536
##$YMAX_p= 376207630
##$YMIN_p= -26266808
$$ End of Bruker specific parameters
$$ ---------------------------------
##NTUPLES= NMR SPECTRUM
##VAR_NAME=  FREQUENCY,     SPECTRUM/REAL,   SPECTRUM/IMAG
##SYMBOL=    X,             R,               I
##VAR_TYPE=  INDEPENDENT,   DEPENDENT,       DEPENDENT
##VAR_FORM=  AFFN,          ASDF,            ASDF
##VAR_DIM=   65536,         65536,           65536
##UNITS=     HZ,            ARBITRARY UNITS, ARBITRARY UNITS
##FACTOR=    0.620285442955139, 1,           1
##FIRST=     20137.2065510759, 0,            0
##LAST=      -20513.1999529892, 0,           0
##MIN=       -20513.1999529892, -26266808,   0
##MAX=       20137.2065510759, 376207630,    0
$$ Real data points
##PAGE= N=1
##DATA TABLE= (X++(R..R)), XYDATA
$$ [...]
35796A23549j81873j36670p2619O6795J84897J92940J06516k4308j30342j08527
35786B0358N3251J81439J01089j20860k54507j93210l5455Q1510J09190P2643
35776A5448K5310O417m982n1409r4367m5307O9289R8396j8243j47062j42834k3299
35764c12643R7662J40026P5422o2458j44190m5230J87875L79070M09446K43011
35754I67991j25870n35880o12324j96809K82203K89777m0414j25205J13415J66517
35744A83401j01497j67745J88621M02246O6514l40126k80084p0914k26757m30770
35734g77111o8473N69207N96827p3885n78889l80418J20192L70806L28056J42146
35724B48458j55569m08760l32688J0106J93513O1951p0902r83O6137k8668j01024
$$ y = [123549, -58324, -194994, -267613, -200818, -15921, 177019, 283535, 259227, 128885, 20358, 73609, 255048, 356137, 235277, -19230, -212440, -247895, -166385, -57195, 15448, 40758, 47175, 42193, -9216, -103583, -148890, -79601, 18795, 552, -146510, -289344, -312643, -214981, -74955, 467, -61991, -206181, -251411, -63536, 315534, 724980, 967991, 842121, 306241, -306083, -502892, -220689, 69088, 28674, -96531, 16884, 183401, 81904, -85841, 102780, 505026, 571540, 231414, -48670, -119584, -346341, -777111, -845584, -276377, 320450, 246565, -332324, -712742, -592550, -221744, 106312, 248458, 92889, -315871, -648559, -638453, -444940, -382989, -453891, -454874, -388737, -417405, -518429]
35713e18429L310J31451J20494L7119j9778l5029P0237L35002M80498J80521l44681
35702D40715n05352j97474O0418k3174j15972N6002K15284O5731j77220j77003
35692c58045p221O4829R31r5318j75482j30649J59677M66007L38727j67632m05780
35681c09956p9193K67911J18960j94785r3573K80309L40626J1041k48014k00263
35671a06937l1630J13460K53305K77637L5418k81427k78425P4037L62870K59485
35661F77793j45774n27547o07863l08917J44596L47849J52709j23054j22231Q1789
35651d30650J83530J26232P7441P0617J34j11561j36399p2303j4473K8692Q7370
35640a91370J04641M6639P978M1682N0337r193l5197k7179j18596k17835k7447
$$ y = [-518429, -515119, -383668, -263174, -226055, -245833, -280862, -210625, 124377, 604875, 785396, 440715, -64637, -262111, -201693, -224867, -340839, -284837, -69553, -3822, -181042, -358045, -365266, -300437, -299506, -394824, -570306, -700955, -541278, -75271, 263456, 95824, -309956, -389149, -121238, -2278, -197063, -290636, -10327, 330299, 341340, 93326, -106937, -138567, -25107, 228198, 505835, 541253, 259826, -18599, 55438, 418308, 677793, 532019, 4472, -603391, -912308, -767712, -419863, -267154, -390208, -512439, -430650, -247120, -120888, -43447, 27170, 27304, -84257, -220656, -292959, -307432, -278740, -191370, -86729, -40090, -32112, 9570, 59907, 50714, 15517, -11662, -130258, -348093, -375540]
35629c75540L57401L72241j44252n39133k98427J21615N3209k86356k47969R4318
35619h92893J61733o808J42566N35550M77490r1438l77687m1889K47957j5390
35609A39191l56219k10948J41883J95007R2175J80321K31707j04685m84134l22152
35599d97854J78900K75352j47050m30134k03261J44186K10162J44439J84995J76891
35589C6626o2001k86985j61021J91392L57058K27701O2623K2048j2789j23983
35579B50669j73916n7779R0469R7176o140q2206r3229n7935N1248J83942J34818
35568C37117j60381l82020k02913J74883K52305j2010j40974P8621K61914J00356
35558C06898j31020r7364J9922o4687j48326P0568L15927J09090l56957m26487
$$ y = [-375540, -18139, 354102, 209850, -329283, -627710, -506095, -452886, -739242, -987211, -892893, -731160, -737968, -595402, -59852, 417638, 326200, -51487, -93376, 154581, 139191, -217028, -427976, -286093, -91086, 1089, 181410, 413117, 308432, -175702, -497854, -318954, -43602, -190652, -620786, -824047, -679861, -469699, -325260, -140265, 36626, -25375, -312360, -473381, -281989, 75069, 302770, 365393, 387441, 374652, 250669, 76753, 18974, 109443, 206619, 200479, 118273, 25044, -32891, 18357, 202299, 337117, 176736, -205284, -408197, -233314, 18991, 6981, -133993, -55372, 206542, 306898, 175878, 78514, 98436, 33749, -114577, -44009, 271918, 381008, 24051, -402436]
35548d02436k5486K15528k2677k93698j69644J31035K19430J34456R9575Q0630
35538c3287m3002j68167j55170p4190o656J24782K89428K35249p5999k59904p7609
35527b44525J23850l7469k92179j18273L65146N04746R5508l15154k35442J37452
35517a6340L12712J62026r0575k65466l15288j80341J36092L90729K67538k09846
35507A91241o01708m95681M5947N62268O66826L60838q0185l88564m41629k69562
35497d50209m4047L4996l5693l9335J29208K42914P6214j65113r0499K27822K76124
35486A62382j12935m25307j99601K64746L42908o179k46734r6010J46834J65193
35476d703O7045O8244Q9592n0940k70282l31276j97017k8649Q3591J58723J62151
$$ y = [-402436, -427922, -212394, -235071, -528769, -698413, -567378, -347948, -213492, -113917, -33287, -76289, -244456, -399626, -473816, -480472, -355690, -66262, 168987, 92988, -166916, -244525, -120675, -158144, -450323, -568596, -203450, 301296, 396804, 81650, -153792, -16340, 296372, 458398, 367823, 102357, -212931, -393272, -257180, 133549, 401087, 191241, -410467, -906148, -860201, -297933, 368893, 729731, 649546, 260982, -180647, -450209, -494256, -459260, -494953, -534288, -405080, -162166, -85952, -251065, -341564, -113742, 162382, 49447, -375860, -575461, -310715, 32193, 26014, -220720, -316730, -169896, -4703, 62342, 130586, 220178, 169238, -101044, -432320, -629337, -657986, -574395, -415672, -253521]
35465b53521M2571r4364p9271N0778R4776J1939l4485O987j5354j42672j79634
35454e92250l1036J07065Q6004N7336J39289J25916j23271k81187q297L91436
35444a28995L32634j21767l12815n693K85802J68218o4808l9499Q6390K1389j16305
35433A04551r5433k6750p9304r0155R0961K00858n356k29368p0523K68094K83908
35422C51483j5653j98561j62752j98139l53248l29588l8271K39483K91004J62247
35412b51995n9880k59408j93295J77308M12505J58600k02233q2174L18585L05020
35402C23033j26068k65936Q4034K86769m332k75015q4246K17266J69545o4957
35392B60093j36287q9142m4314J51448M98852O09730L66619K77734O63262J008873
$$ y = [-253521, -210950, -305314, -384585, -333807, -239031, -227092, -261577, -254590, -269944, -412616, -592250, -623286, -516221, -430217, -372881, -233592, -107676, -230947, -512134, -520431, -128995, 203639, 81872, -230943, -236636, 49166, 217384, 152576, 113077, 199467, 220856, 104551, 9118, -17632, -96936, -187091, -96130, 104728, 99372, -129996, -200519, 67575, 351483, 335830, 137269, -25483, -223622, -576870, -906458, -944729, -705246, -414242, -251995, -311875, -571283, -764578, -587270, -174765, -16165, -218398, -300572, 18013, 323033, 196965, -68971, 15063, 301832, 297500, 22485, -61761, 155505, 325050, 260093, 123806, 34664, -9650, 141798, 640650, 1250380, 1616999, 1894733, 2557995, 3566868]
35382C566868O94489q8192p03532r26141q79360n69214q6806J26737j53571m57117
35372E24161l01043L1191K8630j43612k1830K35276J32999k06688k36967K8809
35362G0926Q2826j13323r6580J70233K00446j01147k51666p2450L3075j08220
35352a85880j17823J61162K94666K1286k60219j69178N6393N7996m1821K5282
35342a58136J54584J19205M043k515L8541J0504K037O4652R902k32200l55981
35331c45364j33555J49211R1387k07141l16427j09928J41327K17822J68777J13751
35321b30140P7382J8125j15202k97057l33228l0415M49194O47213L86516L7423
35311F09811p026J32114R0558j47205k77651j88847r5518j68239k94812k60243
$$ y = [3566868, 4261357, 4173165, 3469633, 2543492, 1664132, 1094918, 1008112, 1134849, 981278, 524161, 223118, 254309, 282939, 139327, 117497, 352773, 485772, 279084, 42117, 70926, 153752, 40429, -56151, 114082, 314528, 213381, -38285, -110735, -77660, -185880, -303703, -142541, 152125, 173411, -86808, -255986, -199593, -141597, -183418, -158136, -3552, 115653, 119696, 117181, 155722, 166226, 168263, 232915, 242817, 10617, -345364, -478919, -329708, -238321, -445462, -761889, -871817, -730490, -512668, -343891, -230140, -152758, -134633, -249835, -546892, -880120, -910535, -461341, 185872, 572388, 609811, 602785, 734899, 825457, 678252, 400601, 211754, 116236, -52003, -346815, -607058]
35301f07058r334K93374L92934J84785j22004j99197j6295J11132j9183k09743
35291b00589j92872k4051P1496N7394M6311N2332L2051M6080J35474J59164M921
35280A87711j62636j39589m5313j24329k74027j48482K62929N36932L91670M1527
35270E26393j59107j50268p2232K6582J60423K32348J25315q3767j89857j38347
35260B77483r1684j83301l12756k65509m197K42318K24672l1546k54340k50409
35250f49269j03232j627K1728P4425J95342K93023K78710J55371k0955j74761
35240F8755k13442r9642O4386J18257L6359m1203m120P7295N3270r9249k35116
35229b74450k01584k060K11574K91922K23960J07343M3241N3979P8782J8114j71328
$$ y = [-607058, -616392, -323018, 69916, 254701, 132697, -66500, -82795, 28337, 9154, -200589, -393461, -417512, -346016, -288622, -242311, -189979, -157928, -111848, 23626, 182790, 187711, 25075, -114514, -159827, -284156, -558183, -706665, -443736, 93196, 484866, 526393, 367286, 217018, 144786, 171368, 331791, 564139, 689454, 605687, 415830, 277483, 185799, 2498, -310258, -575767, -579964, -337646, -112974, -144520, -398860, -649269, -752501, -754128, -732400, -657975, -462633, -169610, 109100, 264471, 243516, 68755, -144687, -244329, -179943, -61686, -25327, -66530, -70650, 6645, 59915, -39334, -274450, -476034, -478094, -266520, 25402, 249362, 356705, 399946, 453925, 532707, 550821, 379493]
35218C79493l72614l64444q6412K05347K08801r711p6014J61345L85062K46108
35208F76961j35417l33064j82965N3310Q4227p2113j97999j62734j6770J03472
35198a83092J01278Q552l0305P0018J85280J08879j52003l32838k30690L8270
35188d16651J95392J34239k2235j47774k33010k57298j15914J94204M28545L33616
35178I3114J3339j55471k6652J23480M1425j07457m7364R7572j2322l11165l48770
35167f40271q834K59943J43785m8509N3440K21218K3122l78270m13032n398L04252
35156d88554J98930j3346q456O6437k26m4609J17577K42441J4500l65843m09358
35145f90507n0466K89752L25006J99167J24947Q1738j3658j03688r8255k1582
$$ y = [379493, 6879, -357565, -443977, -238630, -29829, -39540, -115554, 45791, 430853, 676961, 541544, 208480, 25515, 78825, 163052, 90939, -107060, -269794, -286564, -183092, -81814, -73262, -103567, -33549, 151731, 260610, 108607, -224231, -454921, -416651, -221259, -87020, -109255, -257029, -490039, -747337, -863251, -669047, -240502, 93114, 106453, -49018, -75670, 47810, 89235, -18222, -65586, 31986, 19664, -291501, -640271, -649105, -389162, -245377, -293886, -240446, -19228, 3894, -374376, -787408, -792806, -488554, -289624, -302970, -311426, -244989, -245215, -289824, -172247, 70194, 84694, -281149, -690507, -740973, -451221, -126215, 72952, 197899, 279637, 265979, 162291, 64036, 42454]
35135D2454M2054L5881n9021j81898j87343l1044R7921K4404j09068m3761J56248
35124b13173J96679O1243K9576J35215N7034k78732m44007j53759K32938K45269
35114a31717J0756k2022J68054K11379O290j69485j75377j54398j36301L5550
35104c57271K88966K85275l8559k88822j80310P1759J56077J30711J95107K64906
35094E27839J14928j99603l67765k14980J26251L79060L34577J1856k97631k99725
35084A14807q6224k3721j72379j67427J26360K70145n4651l96505j47689M39866
35074i7418N39513l818m34320k38707J48270J30206j42765j53941R5719J65500
35064H239n5891k12855q5427J32038K09781J68510R6222j6178j47944j98637j57463
$$ y = [42454, 84508, 120389, 61368, -120530, -307873, -338917, -240996, -216592, -325660, -369421, -213173, -16494, 44749, 74325, 209540, 266574, -12158, -456165, -609924, -376986, -131717, -120961, -142983, 25071, 236450, 242740, 73255, -102122, -256520, -392821, -357271, -68305, 216970, 178411, -110411, -290721, -218962, -62885, 67826, 262933, 527839, 642767, 443164, 75399, -139581, -13330, 365730, 700307, 712163, 414532, 114807, 28583, 4862, -167517, -334944, -208584, 61561, 6910, -389595, -537284, -97418, 442095, 438277, 3957, -234750, -86480, 43726, -99039, -252980, -157261, 8239, -47652, -260507, -345934, -213896, -4115, 164395, 260617, 244439, 96495, -102142, -259605]
35053b59605j17503p4348N2035J59007L5264k12584j73373K23707M53081J21802
35043B07483l72397l79400L8878K55170Q5120j0754J88038K63728n9899l58954
35033a42987j93753J47440J56399l2293N4345L26705K78108p3026j61262J41776
35023E01452K80637k8844l09783j49918J11768M133k80934k70232j1801Q4835
35013f8687m3094j26974j17739j72604j98673M5391M18675M84263J69397j21093
35003B68862j25375l1033n5800j23878j13205p9991o6641K0491J75871K01732
34993G1033K0982j47309r8506O1410R2234n8318k42518l00648j72164O1891K01577
34982e10336J27769j6148j5969P0762K1070j15676l2829K97699M75123K42355
$$ y = [-259605, -377108, -451456, -399421, -240414, -205150, -417734, -591107, -367400, 85681, 207483, -164914, -544314, -505436, -250266, -165146, -175900, 12138, 275866, 215967, -142987, -336740, -189300, -32901, -65194, -10849, 315856, 593964, 520938, 359676, 501452, 782089, 753245, 443462, 293544, 405312, 409445, 128511, -141721, -153522, -68687, -111781, -238755, -356494, -529098, -727771, -682380, -263705, 220558, 389955, 268862, 143487, 112454, 56654, -67224, -180429, -260420, -327061, -306570, -130699, 71033, 92015, -55294, -153800, -92390, -156, -58474, -300992, -601640, -773804, -711913, -510336, -382567, -398715, -414684, -343922, -322852, -438528, -471357, -173658, 301465, 543820]
34972E43820j23894k45129j68823j57081j94368q2558J16821J29671p1564k03371
34962d56476j05680M8564N8626k6528m8381J8118Q5306J06408J01044Q9595P9074
34951e0330P7925P9278O0503K5832J5657M8886Q2648N4401m2371j34108j26011
34940I2310l711J21432J05367o3379k22899k08729n2994M7185j8713j19361n7260
34929c80752J32642K01534N4634p0203M0573J87602K4241l39130l93741p269K83024
34918b66845M9300l19718j61863M21391O47069J71114m33146n04366j37921J13649
34908d21336N3990m3686J2166O8051l9475j71399p8546K04522L43914J30647k13723
34897a54875l10991j38768j9387p2800k2555K71089M49907J90775j94415j80599
$$ y = [543820, 419926, 174797, 5974, -151107, -345475, -428033, -311212, -181541, -253105, -456476, -562156, -513592, -454966, -481494, -529875, -511757, -426451, -320043, -218999, -129404, -50330, 27595, 106873, 167376, 193208, 208865, 257751, 340399, 394800, 352429, 218321, 92310, 88599, 210031, 315398, 252019, 29120, -179609, -232603, -185418, -204131, -323492, -380752, -248110, -46576, 8058, -62145, -21572, 166030, 190271, -148859, -542600, -549869, -266845, -217545, -537263, -699126, -277735, 369334, 540448, 107302, -397064, -534985, -421336, -367346, -411032, -398866, -330815, -370290, -541689, -620235, -415713, -71799, 58848, -154875, -465866, -604634, -624021, -696821, -719376, -448287, 1620, 192395, -2020, -182619]
34887a82619J39943K21557k2676j14423J24768K66327M8614j64058l7975J56621
34877D36079N3074j83694k06799r2783j02461j41020K6497K52402K17841j535
34867B57601q3439l3940j02727k27972j13554J64309J85615j03095k34400N0050
34857b41552L72590K79710j13076l27044j60630J40580K60385J62667O0579J07516
34847E41725J71478J4613k98953m05580j82909K762j39089l10997j00021K86915
34837d20056L17557K4435m9418K05051K71679p4128l45865j67183J04282K0451
34827a13195k06045j26920J60235K27829M1854r2180j10923j70726j88167L4789
34817e43449L04642K23041j27660k44418J825J95449J13410M7196J66064J39795
$$ y = [-182619, -42676, 178881, 156205, 41782, 166550, 432877, 481491, 317433, 279458, 436079, 489153, 305459, 98660, 5877, -96584, -237604, -211107, 41295, 259136, 257601, 174162, 140222, 37495, -190477, -304031, -139722, 45893, -57202, -291602, -241552, 131038, 410748, 297672, -29372, -190002, -49422, 210963, 373630, 434209, 541725, 713203, 727816, 428863, 23283, -159626, -156864, -295953, -606950, -706971, -420056, -102499, -78064, -127482, 77569, 349248, 275120, -70745, -237928, -133646, -113195, -319240, -446160, -285925, -58096, -16242, -108422, -219345, -390071, -578238, -543449, -238807, -15766, -143426, -387844, -386019, -190570, -77160, -29964, 136100, 275895]
34807B75895k33975n26371k86445K16547L91963K02814P0955P8741r5343m46695
34797c51914m93612m9573L88433L32945j8575j57514n206J19180P6111L6799J04030
34786a8896J62750J24868M7829j8382q4670j18501q4575o3568j15410p8294K11505
34775c5344N23393M13962j17405n15850l88999j6192J04515n7885j54894m5854
34765b90553O5173K1043q3266j15965q5105m4143L656N4701Q0775P9756O1685
34754b52243L249r1504j32417n6009N6767R2642O9308N9024L6622l5742o4389
34743c14692L3380J19124N584k03715k14712J1260J85196J20230k6825m4340L6030
34732b93480O8682M1784M7306J16556J90871J79274K1172j98760k39273n116J92215
$$ y = [275895, 41920, -484451, -770896, -554349, -162386, 40428, 111383, 190124, 94781, -351914, -845526, -895099, -506666, -173721, -192296, -349810, -355016, -235836, -159725, -122926, -18896, 143854, 268722, 316551, 298169, 213499, 94998, 10423, -53145, -168555, -246849, -35344, 488049, 902011, 784606, 268756, -120243, -136435, -31920, -89805, -244699, -290553, -225380, -204337, -287603, -403568, -488673, -532816, -529160, -474459, -393684, -313928, -252243, -248994, -340498, -472915, -528924, -472157, -379515, -310207, -251183, -214561, -250303, -314692, -281312, -162188, -156604, -360319, -575031, -563771, -378575, -258345, -285170, -329510, -293480, -224798, -183014, -135708, -19152, 171719, 350993, 372165, 173405, -65868, -70984, 121231]
34721A21231j0378m10170l96055J46791N57389L18245j85373k74712R341R2031
34711c1660j42218k23762L4635K17689M8417j35574K6551L14053L11782N9588
34701D79501j15235j68114k82922l91036k16475K04348M58928L03142l6705k06318
34691B9114j23560O1470J96827K05976Q2726r7499k45050l39879l49636j49033
34681g28544K67938N69046L94011r9770l50756j47051J00919J9976j77370j13581
34671b65182J16093J57745L5523O9841K32279J18552l30536n71936k00468L99757
34661b38332N10765K0777m56380l89242N5636L22533J79487r0210j49555k6015
34651b60536L9639o78K3547J50023J70326k2063j89588o0720K48102L54102J09948
$$ y = [121231, 110853, -299317, -695372, -548581, 8808, 327053, 141680, -133032, -123691, -31660, -173878, -397640, -363005, -145316, -96899, -232473, -205922, 108131, 419913, 479501, 364266, 196152, -86770, -477806, -694281, -489933, -31005, 272137, 235432, 29114, -94446, -32976, 163851, 369827, 452553, 355054, 110004, -229875, -579511, -728544, -460606, 108440, 502451, 402681, 51925, -95126, 5793, 25769, -151601, -265182, -149089, 8656, 44179, 114020, 346299, 464851, 134315, -437621, -638089, -238332, 272433, 293210, -163170, -552412, -496776, -174243, 5244, -84966, -234521, -260536, -220897, -221575, -198028, -48005, 122321, 100258, -89330, -150050, 98052, 452154, 562102]
34640E62102k21535l03337p8834K26485L37341J51151j78520l75247l04276o9101
34630b53771J63296L02228K63270j7521l63997l99489l8020K83329J58105j99025
34620a01595k75447j7469J64900P1517p2017q6633p9364j20740q2610P5019J94375
34609c30064K05130K04122J82124J7390j95761j98916k9387n362j49591j04079
34599d04394K13973L80203J44354j48632j45654k8734q2424j48415K8390K62172
34589G0839K21478r244j25780j23494j71308j91880l0169J47709Q1868j12169
34579b42150j35995j6558N264o1233l7149L1619k210k1369J47844L13263J77042
34568A58368j18027j85875q992J38030K20609L54627L40893p9809n93637o02461
$$ y = [562102, 340567, 37230, -41604, 184881, 522222, 673373, 494853, 119606, -184670, -253771, -90475, 211753, 475023, 457502, 93505, -305984, -344004, -60675, 97430, -101595, -377042, -394511, -229611, -158094, -230111, -316744, -396108, -516848, -599458, -524439, -330064, -124934, 79188, 261312, 278702, 82941, -115975, -145362, -150724, -300315, -404394, -190421, 189782, 334136, 185504, 39850, 11116, -71308, -219723, -191333, 70839, 292317, 283073, 157293, 33799, -137509, -329389, -359558, -211849, -129981, -242150, -378145, -394703, -389439, -450672, -487821, -456202, -458412, -479781, -331937, -18674, 158368, 40341, -145534, -154526, -16496, 204113, 558740, 899633, 819824, 226187, -376274]
34558c76274j28768K28076K34729K11390K43378J1644m13116m29327J03536M77444
34548A62712J81723l15553l35918K0519K04261Q1427q6895j80955k21495j18255
34538f08429J19679J91256n3176k53499m7895L39956M55425K80090R4319n3518
34528D64208k47691l18111q8247J69516O8720k28250k25593J05405K87549R0397
34518G7903j93904k68834j58791M1211K94339M19192J85685k68163m94064l27390
34508f92816p6953j9136n8788j9411P7074J70743K81217L18977J12573k08602
34498a15122k17131J85787M84200K14033l46449n32775j82520K22051K47832j1572
34488e1666j95362j25291J04308K91892K84828R4885q0768n8163Q8035J08613
$$ y = [-376274, -505042, -276966, -42237, 169153, 412531, 424175, 11059, -418268, -314732, 162712, 344435, 28882, -307036, -286517, -82256, -829, -87724, -268679, -490174, -608429, -488750, -297494, -350670, -604169, -652064, -312108, 143317, 423407, 517726, 464208, 216517, -101594, -189841, -20325, 48395, -179855, -405448, -300043, -12494, 77903, -116001, -384835, -543626, -502415, -208076, 211116, 396801, 128638, -365426, -692816, -769769, -788905, -847693, -867104, -790030, -619287, -338070, -19093, 93480, -115122, -332253, -146466, 337734, 551767, 205318, -327457, -509977, -287926, -40094, -51666, -247028, -372319, -268011, 23881, 308709, 403594, 322826, 264663, 352698, 461311]
34478D61311n5929j60049j818K59247K97634N5461k05000k66097j84456j12225
34468H8079o6295R688P7005M5381p0369j68496k08772k27790k21218j23878P6951
34457g89714K82308L49066J96467j00784k98694j85489J18813K19941m0888l06146
34447e55120j74007J98379L06675M5937j60733k9016J98125J87738r276j43122
34437a34420j39106m9753J19840K88676K26801j14874l86678k51118J26384K98945
34427a5303J48618l5593l7636M3625N8429L8584P0072J12700N8849j00069k32126
34416A10150j96907l5822J9572j49054k89109o9794L57740M46031L3922l50573
34406a23844k45703P2192Q9138j09353o7041J83997J62282j82403l06719M1271
$$ y = [461311, 405382, 245333, 243515, 502762, 800396, 855857, 650857, 384760, 200304, 88079, 21784, 31472, 108477, 153858, 83489, -85007, -293779, -521569, -742787, -866665, -789714, -507406, -158340, 38127, -62657, -361351, -546840, -428027, -208086, -248974, -555120, -729127, -530748, -224073, -178136, -338869, -367885, -169760, 17978, 8702, -134420, -273526, -323279, -203439, 85237, 312038, 197164, -189514, -440632, -314248, -15303, 133315, 97722, 60086, 103711, 162140, 200724, 270796, 383496, 442345, 342276, 110150, -86757, -122579, -103007, -252061, -541170, -610964, -253224, 192807, 226729, -123844, -369547, -297355, -208217, -317570, -384611, -200614, -38332, -220735, -527454, -486183]
34396d86183L86084K72063o8987j81523r1684q7473j16862N7919K80862J44677
34386A08893k91072m53058p5269L69265L20391j02822l23501j14825J79576K00449
34376a81973Q768j28587j24656o6474O303J06653J68135J11564J6995M2294J63101
34365A22123J71810k0186k31891k32479n408K53732L18172J06773k12153l19969
34355d9476r9147J55259Q0689k33283l49664j15549J53551K04117J78805K37770
34345A63072K25746Q297j80131q3206J21916R0626j46522k76729k01157p9504
34335c57592N686Q1290Q6058k1069o9187O7826J65902j6089k56511j80643Q3219
34324d11110R0217j47404j64221J52828L69533K41282O2445Q2231J21332K1351
$$ y = [-486183, -100099, 171964, 102977, -78546, -170230, -257703, -374565, -316646, -35784, 108893, -182179, -635237, -710506, -341241, -20850, -123672, -447173, -561998, -382422, -181973, -173205, -301792, -426448, -492922, -486619, -379966, -211831, -100267, -83272, -40978, 122123, 293933, 273747, 41856, -190623, -196031, 57701, 375873, 482646, 270493, -49476, -148623, 6636, 87325, -145958, -495622, -611171, -457620, -253503, -74698, 163072, 388818, 397115, 216984, 133778, 255694, 346320, 199798, -76931, -278088, -357592, -351906, -270616, -184558, -205627, -274814, -206988, -41086, -57175, -313686, -494329, -411110, -320893, -468297, -632518, -479690, -110157, 131125, 193570, 275801, 397133, 418484]
34314D18484m0981K3219k7914k67146l42139q6205R8463r2196k77377r441M16483
34303a86750L96836j4397k36711j01148R488q5231j15545N6309J81543J06829
34293A1223K4405N9388L5871j38554k33874q0608J21827J25724R403j2205N4398
34282b3002N4544k9294q2322n2444K5271J16271J72420J20174k9704j53417j80664
34271f2167j77303j83265j15651N2550J67693J05453j5662n956J02617J27034
34261d657L9734l250N9177Q5946l0116j71898j50433L3585J81789J25842j00604
34250F5115l02268k93832n9723K04411K36647k4444l16994k99642L9076L24048
34240d27606K43666m8937j56401R467J50380Q6910L7904K15807M03632K48809
$$ y = [418484, 377503, 400722, 372808, 105662, -236477, -322682, -224219, -316415, -593792, -603233, -186750, 210086, 195689, -41022, -142170, -132682, -217913, -333458, -277149, -95606, 11223, 35628, 95016, 130887, -7667, -241541, -322149, -200322, -74598, -65195, -77400, -23002, 31542, 2248, -80074, -132518, -107247, 9024, 181444, 301618, 271914, 118497, -62167, -239470, -422735, -538386, -485836, -318143, -212690, -228352, -234308, -131691, -4657, 35077, 31827, 91004, 176950, 146834, -25064, -175497, -141912, 39877, 165719, 65115, -237153, -530985, -590708, -386297, -149650, -174094, -491088, -790730, -751654, -427606, -183940, -232877, -389278, -379811, -229431, -142521, -104617, 111190, 514822, 763631]
34230G63631j55027l43256j39106J07429N2010j62848j64458R6340K89330J49065
34220D93110k09310m38703l32394k1924J81493J43637M6130Q7769J47712k6665
34210G0855l21868k84428K10726O37884M60094j27694m58648k75779N5128J94312
34200A60582K36922L32285L10390m127l71835l99718j11762Q0214l8626k34126
34190c9801k20476n4188P870j20093k78641k80537q3346K05095M01194L72130
34180i0793J77443M1636Q8783J51045j4840l27200l92263k3850M19936M34461
34170D64358K6762k92008j98951N1662Q2341m9962m6449Q0434N1466j36468j50825
34159a17640J08266K91455J33428j64997l19064l59456l51757j04999M00428O37802
$$ y = [763631, 608604, 265348, 126242, 233671, 285681, 122833, -41625, 54715, 344045, 493110, 283800, -154903, -487297, -509221, -327728, -184091, -137961, -50192, 97520, 70855, -251013, -535441, -324715, 313169, 773263, 645569, 186921, -88858, -33730, 160582, 397504, 729789, 1040179, 1036052, 664217, 264499, 152737, 232951, 194325, -39801, -260277, -314465, -306595, -426688, -705329, -985866, -1069212, -864117, -462923, -90793, 86650, 128286, 217069, 368114, 353274, 26074, -366189, -390039, 29897, 464358, 491120, 199112, 161, 51823, 134164, 84202, 37753, 118187, 169653, 33185, -117640, -9374, 282081, 415509, 250512, -68552, -428008, -779765, -884764, -484336, 153466]
34149A53466J81332m86555n04879R8365M23040P3177k88855p5024L17915K72759
34139A64741j9193j0965J78121K0715l80062l72888J36630M71876K39367j14546
34129C13796r1246J19686Q3467j58809k62544j67060p6750m4179L6156J22737
34119a24746O0890j10930j66501j6852J70340K02814Q3543k4845R271J32402J46322
34108C61708l8202k33508k07192m2835l9508k39303l36882j48242J14591J81334
34098f28039P2005n7037j50363j47720P7568M33806N40422K34765j06318q4434
34088A84655J28462J15328q6403r9639R9265J38153r3941k62702j69147m9118
34078i5087j08880j66514q704K09055K07065K3091o3336N2653J75069P7948k07847
$$ y = [153466, 334798, -151757, -656636, -558271, -135231, -62054, -350909, -425933, -108018, 164741, 145548, 134583, 312704, 333419, -46643, -419531, -282901, 188975, 428342, 313796, 222550, 342236, 425703, 266894, 4350, -162710, -239460, -283639, -247483, -124746, -63856, -174786, -341287, -358139, -187799, 15015, 98558, 73713, 82984, 215386, 361708, 323506, 89998, -117194, -160029, -199537, -438840, -775722, -923964, -809373, -628039, -556034, -613071, -763434, -911154, -833586, -399780, 140642, 375407, 269089, 184655, 313117, 428445, 342042, 242403, 341668, 479821, 385880, 123178, -45969, -95087, -203967, -370481, -379185, -170130, 36935, 60026, -3310, 49343, 224412, 302360, 94513]
34067I4513l90541k21186J62103L16726N8921k33099j41515J51641J58966j01129
34057a44600j39724J33066K02913j65054m43286j46302L70859M31282J3513l28758
34047b16091l04977j12885N4655K15863L31528K73274R9374J1871J8091m8568
34037C22135j71109j42467N2936J61721L1404j94069l03479k37411o0415J00048
34027d40706J07433j8892p0674L6454P9004r1484k02026K0698K89316J37905k54210
34016d07182k46841K31295N06557J99206k04168j52316J52278J84932p6116k58034
34006g0389k46940k37737k75008j76772J16541M18934N14062L30150j1755k18043
33996A43043p0790K35354K53726q5446l24603j49975J48012J68526j523n2680
$$ y = [94513, -296028, -517214, -355111, -38385, 20536, -212563, -354078, -202437, -43471, -144600, -284324, -151258, 51655, -113399, -556685, -702987, -332128, 99154, 112667, -216091, -521068, -633953, -579298, -363435, -31907, 241367, 340741, 352612, 370703, 322135, 151026, 8559, 61495, 223216, 254620, 60551, -242928, -480339, -540754, -440706, -333273, -352165, -422839, -386385, -307381, -398865, -600891, -580193, -290877, -152972, -407182, -654023, -422728, 83829, 283035, 78867, -73449, 78829, 263761, 187645, -70389, -317329, -555066, -830074, -1006846, -890305, -471371, 42691, 372841, 361086, 143043, 72253, 307607, 561333, 475887, 151284, 1309, 149321, 317847, 316324, 263644]
33986B63644p092p6171j95975j50041K30J9030r3266j57470j48656j32608m0433
33975g18808J46011J92428k0138j61074P4202L95709L38132K6666n9106R2207
33965C06229Q5848j03884j13969P1239O4804j77816k34817L6557K60952J91760
33955C86903K047j80322m04676m73621r2596M23057L72531j87203l72976J25418
33945d01438M86316R4490m58829l96660K7662J49889L8308J05982J57583j73053
33935c69750m67435p0364O69410P72191J30184l85744l10840p5569k0409Q3302
33925d5024K93582K06431k36230m55835j66124J29351J5210j36184J23890M89838
33915B18905L97147o8228l61318k95531j18105K3357J72180K47712J04602j49198
$$ y = [263644, 256552, 180381, -15594, -165635, -165405, -146375, -239641, -397111, -545767, -678375, -718808, -572797, -380369, -400507, -561581, -487379, -91670, 246462, 273128, 214022, 306229, 392077, 288193, 174224, 245463, 310267, 132451, -102366, -65809, 195143, 386903, 388950, 208628, -196048, -669669, -762265, -339208, 33323, -153880, -526856, -401438, 84878, 179368, -279461, -676121, -648459, -498570, -460262, -354280, -196697, -369750, -837185, -907549, -238139, 534052, 664236, 278492, -32348, -107917, -128326, -45024, 248558, 454989, 218759, -237076, -403200, -273849, -258639, -394823, -270933, 218905, 616052, 547824, 186506, -109025, -227130, -203773, -31593, 216119, 320721, 171523]
33905A71523k70370k58835k80756k85008o3556L14801M92903L25777R0184N6458
33895B93121R3479q6489m22092n07202j40395L41493M49390J54569j17932r0149
33885c2207O0480P8185p12n4510j48567l00580k52114J27558M40276K48533j93186
33874b6844k54070J02998K87928N2596j67002m7553J28585P4354K432J33455K12848
33863D99727j4177k68680j85150M7129J4452k16302k60880r2237j0906o1988j7543
33852e66555J05879L4544k19232k78168J8297L45095L56070J14230q8613j05230
33842b83683N005J11386J12343K2597j4757P9660J63218P1892r0977r5293L1752
33831A13143L0474j74551l49075k96573r8833O3101J26741J12910N1921J7192
$$ y = [171523, -98847, -357682, -638438, -923446, -987002, -672201, -179298, 146479, 236663, 293121, 386600, 300111, -121981, -629183, -769578, -428085, 21305, 175874, 57942, -32207, 28273, 106458, 105746, 51236, -97331, -397911, -650025, -522467, -82191, 166342, -26844, -280914, -177916, 110012, 162608, -4394, -51947, 76638, 150992, 153424, 286879, 499727, 485550, 216870, 31720, 78849, 93301, -123001, -383881, -476118, -487024, -549012, -566555, -460676, -426132, -645364, -923532, -905235, -560140, -204070, -89840, -178453, -283683, -278678, -167292, -54949, -32352, -47109, 32551, 195769, 267661, 176684, 81391, 113143, 143617, -30934, -380009, -676582, -775415, -712314, -585573, -472663, -420742, -403550]
33821d03550P7392J61249J21668k7392j07014n3614k0749j17723k12746j17704
33811g00183J41762L58604L86455K60516J07314p37q7686j80824k16314j20115
33801e1208K5893M6205n7655r1937k1549q3785l48516m34347j3605N87456P29789
33790B86741L25962r5136j89261j70287k71343l27547j53302O2325O3344n2918
33780e21422l8514J00066J90911K01747J80545P4569j09572j47538Q6572L03958
33770C21322J50951k33788l76748j28171J96550L15089K57001J22551p3095k32914
33760C18748j90138o401M3241q8632j02400J53507L68498K01550k04895m27060
33750F6018l18801q7987P6800J66360J78446O0396j32656k18002r3449J36574
$$ y = [-403550, -326158, -164909, -43241, -70633, -177647, -231261, -252010, -369733, -582479, -700183, -558421, -199817, 186638, 447154, 554468, 553731, 466045, 285221, 68907, -51208, -25315, 20890, -36765, -128702, -150251, -234036, -582552, -1016899, -1030504, -443048, 286741, 612703, 517567, 328306, 158019, -113324, -440871, -594173, -531848, -468504, -521422, -559936, -459870, -268959, -67212, 113333, 187902, 78330, -69208, 17364, 321322, 472273, 238485, -138263, -266434, -69884, 245205, 502206, 624757, 551662, 318748, 128610, 122209, 165450, 76818, -25582, 127925, 496423, 697973, 493078, 66018, -252783, -340770, -263970, -97610, 80836, 141232, 8576, -209426, -302875, -166301]
33740a66301K67093J69546r0892k53596q7408K75206L79398J0242m36928m28497
33730c62137l3215J74875m4450k70827r0910K84687L68385J02059j44834j57646
33720a74013q6841p9131l9274J23821K64480J96896j1886j24904n5281N1564N0042
33709A15473k9908q7418j18592j72102j93276o3515J75172K84461J30162q8530
33699d8073p5542J46275K51872O7060j88470k01728L6851K58732K50081M9759
33689E46817j32956j24209M5316J46210M835k39313k75061n2466J30085P2459
33679A21717l5053L0214J09632n6158k82804j22538L92469O43914K57315l44813
33669G13895n33135l23550k16840l48545l22357M8448L46457J84142j46803q9204
$$ y = [-166301, 100792, 270338, 179446, -74150, -161558, 113648, 493046, 503288, 66360, -362137, -395352, -220477, -264927, -535754, -626664, -341977, 26408, 128467, -16367, -174013, -260854, -339985, -379259, -255438, 9042, 205938, 194052, 69148, 13867, 65431, 115473, 85565, -1853, -120445, -292547, -485823, -549338, -374166, -89705, 40457, -48073, -123615, 22660, 274532, 341592, 153122, -48606, -11755, 246977, 497058, 546817, 413861, 289652, 334968, 481178, 486013, 246700, -28361, -80827, 49258, 121717, 86664, 116878, 226510, 170352, -112452, -234990, 157479, 801393, 1058708, 713895, 180760, -142790, -359630, -708175, -1030532, -982084, -635627, -451485, -598288, -687492]
33659f87492L22204N07625K12341j60823k04198m0831K2695j0711K015K973p3278
33648a07480l9307K03537L15126q267m21881l70667M295O7475k39520k86058J54728
33637g28019M77408K22458k25446l39986k09401r6671J32174N32870O09084M8164
33627D22635n33722l94162J55169K58613o4923k3818M97118O54404K0703p02566
33617B89451p38938k51980J33472K15858J66885P7407j4414L02P2189j3470j86727
33606b49965p1212L38784M83723O4846m27675m33440j17321L2041r440L5766J17308
33595b36585j3998k43663k25393K9467J90953J60720J27845J43101P8506l3282
33585b2329l9019q548j28050k79967j57161J95076L78834K39273N1326K4050J9323
$$ y = [-687492, -365288, 142337, 354678, 193855, -10343, -51174, -28479, -39190, -37175, -34202, -107480, -146787, 56750, 371876, 363609, -58272, -428939, -424644, -357169, -596689, -882747, -728019, -250611, -28153, -253599, -593585, -802986, -899657, -767483, -234613, 374471, 422635, -111087, -505249, -350080, -91467, -156390, -180208, 316910, 971314, 992017, 289451, -449487, -701467, -567995, -352137, -185252, -107845, -122259, -121957, -49768, -63238, -249965, -321177, 17607, 501330, 566176, 138501, -294939, -412260, -380219, -389659, -353893, -236585, -250583, -494246, -719639, -690172, -499219, -338499, -210654, -67553, 10953, -22329, -61348, -69896, -197946, -477913, -635074, -439998, -61164, 178109, 229435, 253485, 272808]
33574B72808r3987j73420q3611N7395J11765J45280K19133J93654l4970k84834
33564C29213l05212j19412M7297P6621J1728r6214k02928k07067o3696Q7257Q6962
33553c55451M341K1081J13479R2442l7066m3619J20665J81622k279j37297N7016
33542A4934L29568K29923j68019l40609j11725J08947P965j75881j12780J02003
33532a15674J95198J50359P7716n7488k43451k33468R1318M16209M13583K32950
33522I27252K08848L36137M18467M61313N28015N59421P64626J655853L001323
33513H861255L312268J457599j474670l124708k667770j493760r69714q63487
33505C037013m70888j6458m4018l30358l58359k46077l51089m67695k28114J31060
$$ y = [272808, 178821, 5401, -78210, -20815, 90950, 236230, 455363, 649017, 614047, 329213, 24001, -95411, -48114, 28507, 40235, -55979, -258907, -465974, -529670, -442413, -355451, -351110, -330029, -216550, -124108, -161174, -204793, -84128, 97494, 95215, -42082, 14934, 344502, 574425, 406406, 65797, -45928, 63019, 70984, -104897, -217677, -115674, 79524, 229883, 307599, 250111, 6660, -226808, -135490, 280719, 694302, 927252, 1136100, 1472237, 1890704, 2352017, 2880032, 3439453, 4204079, 5859932, 8861255, 12173523, 13631122, 12156452, 9031744, 6363974, 4870214, 3900500, 3037013, 2566125, 2549667, 2505649, 2175291, 1816932, 1570855, 1219766, 752071, 523957, 655017]
33495F55017J69447K7461Q3776J94855J0921k73020k23412L7959O2164j28615
33485F16553j56580j969N1031j3970m3172j44408l96566m17635P5069N62282L71804
33474E02439k07707l23426R2732K93135j1300k79219j36617J15634J69522J27833
33464C43026P7930o3235j47610P4678L38676J22853l87628m31628P6026L37429
33454C40517n7k68371O308K55899q4105m96094k09667M73347O20754J09737k82525
33443D65743j21207J73405J43376n0734l6344J63890K36635O7494j34233j57099
33433G50926o5985p4433j93054j83559M6269K12622N4831k17004k13823K1508
33423A38298J10904j6245m6846J33007K61727J96906J24619J49446J17785n159
$$ y = [655017, 824464, 851925, 935701, 1130556, 1141477, 868457, 645045, 683004, 745168, 616553, 459973, 458004, 509035, 495065, 451893, 307485, -89081, -506716, -431647, 130635, 502439, 294732, -28694, 64038, 357173, 345873, 66654, -69963, 45671, 215193, 343026, 420956, 357721, 210111, 284789, 623465, 746318, 358690, -72938, 3088, 340517, 340460, 72089, 78397, 334296, 250191, -245903, -455570, 17777, 638531, 748268, 465743, 344536, 517941, 661317, 610583, 574239, 738129, 974764, 1042258, 908025, 750926, 684941, 610508, 417454, 233895, 280164, 492786, 547617, 330613, 116790, 138298, 249202, 232957, 186111, 319118, 580845, 777751, 902370, 1051816, 1169601, 1164442]
33413A164442j5083J13640J14827q6725j89324j47K73774L85548L29927J53538
33403B244417j02299j91975J04235M56143K85071k68459l63585K99067R79350
33394C441965J021919P53012P47841R02939Q90353R33748J381537J972254K289123
33385A4334691K565782L263356M158659M643247M658736M480826L767178J804821
33377D3677296j197793l913048n240381n245100m609472l795025l002071k393982
33369A4280424j993086j663480j391576j292278j259691r97909n10743j65641
33361E006020j34957j70365r5069j11895l83280o60395o24727l44795j17754m9847
33351B312936m2538l8394m2249o220R3953J40219K0433j41128q1684K38843N12134
$$ y = [1164442, 1149359, 1262999, 1377826, 1291101, 1101777, 1101630, 1375404, 1760952, 2090879, 2244417, 2142118, 1950143, 2054378, 2510521, 2795592, 2527133, 2163548, 2462615, 3441965, 4463884, 5216896, 5964737, 6867676, 7758029, 8691777, 10073314, 12045568, 14334691, 16900473, 20163829, 24322488, 28965735, 33624471, 38105297, 41872475, 43677296, 42479503, 38566455, 33326074, 28080974, 23471502, 19676477, 16674406, 14280424, 12287338, 10623858, 9232282, 7940004, 6680313, 5682404, 5171661, 5006020, 4871063, 4700698, 4605629, 4493734, 4110454, 3450059, 2825332, 2480537, 2362783, 2312936, 2270398, 2232004, 2189755, 2183535, 2277488, 2417707, 2438140, 2297012, 2215328, 2454171, 2966305]
33340B966305M32533J37405J28364O37120J215707J227433O98200L00708L99163
33331H142938N53823K53399k85696n13207m23296m56049o76449o79824l29394
33322E586245M057P1679Q8774K36118K77832l6385n27822q29138q22116o19975
33312C429269l52704j66095j97018l53965l43579r2264R3012l4871l09157m37581
33302A235047l98900l24136k15770l9236J04233J39243J61288K02998R2667k02178
33292G55256l61918j66895J08473J36456Q7511K47940L49350n5738o66950o64549
33282b31064L0361N08639K02709k65093q8883M65150N23764l5055m76031l55561
33272B78936l9939K2827p8115o7102K4562K9150l733P4975K23258K70216J56990
$$ y = [2966305, 3398838, 3536243, 3664607, 4301727, 5517434, 6744867, 7443067, 7743775, 8142938, 8696761, 8950160, 8664464, 8151257, 7727961, 7271912, 6595463, 5915639, 5586245, 5590302, 5661981, 5750755, 5986873, 6264705, 6228320, 5700498, 4871360, 4049244, 3429269, 3076565, 2910470, 2713452, 2359487, 2015908, 1923644, 2016656, 1981785, 1672628, 1235047, 836147, 512011, 296241, 257005, 361238, 500481, 661769, 864767, 957434, 755256, 393338, 226443, 334916, 471372, 558883, 806823, 1156173, 1100435, 433485, -231064, -200703, 307936, 510645, 245552, 156669, 621819, 1145583, 1110528, 634497, 278936, 238997, 261824, 183709, 116607, 141169, 170319, 166586, 241561, 464819, 735035, 892025]
33261H92025l8636k15796k88226k23970j17560r2274r2688M6053K74523L01433
33251D44884j411l74972m92006l24122o1024J52821K48533J73853j1535j03397
33241c48376J7653K14042K73071J61434o645j39469j99480j76297j22791j16304
33231d43162j29157o2163P2128J65765K10418K53573J85802j07688l77768k15507
33221d47759K72957M63357R3171l25748k75986L7453J24112k8787j02541m3646
33211b33417j9239k938J26766K53157K06247J00442J02554Q4580r4920k22696
33201C00536q6531O9642o6201k95516k45235k1326M3177L2220K05980L59815J33792
33190D30353k23041j59563K24355L20347M4969r0290N2288M7473k14985l03049
$$ y = [892025, 853389, 637593, 349367, 125397, 7837, -84437, -177125, -131072, 143451, 444884, 443473, 68501, -423505, -747627, -808651, -655830, -407297, -233444, -244979, -348376, -330723, -116681, 156390, 317824, 311179, 171710, -27770, -204067, -326858, -443162, -572319, -634482, -562354, -396589, -186171, 67402, 253204, 145516, -232252, -447759, -174802, 288555, 381726, 55978, -220008, -182555, -58443, -87230, -189771, -233417, -252656, -255594, -128828, 124329, 330576, 431018, 533572, 618152, 523232, 300536, 214005, 283647, 217446, -78070, -323305, -344631, -301454, -269234, -63254, 296561, 430353, 207312, 47749, 272104, 592451, 637420, 547130, 599418, 646891, 431906, 128857]
33180A28857p6370M8651j03171j62732L4019J37721J1303K8212L15986M16991
33170G79467Q3291k58548k34179q2535r1903r0791Q0435J73584K6406j00756o4132
33159B20339j34524l82148l93297k2459K22388J9028j99313l4062J84705Q4043
33149d35300l2933J71746L37884P1101k30451m1549K94469J30606l19824l28094
33139c82345J07796L13073Q9888r0762k0898j9587j91709k00697N9413K26939
33129a08889J00199n0942K858R1537J610j66312j81440J413K07114J94297j06346
33118a4901m00611k77547J88851L98362N4891l33743j90274K55946L56940M0471
33108G8385j80862n1287J59768J95744J16246M3665K731K0280Q5123O7600p4955
$$ y = [128857, 52487, 101138, -2033, -164765, -130746, 6975, 18278, 46490, 362476, 779467, 862758, 604210, 370031, 287496, 195593, 104802, 185237, 358821, 385227, 284471, 220339, 85815, -296333, -689630, -712089, -489701, -470673, -669986, -704048, -519343, -435300, -468233, -296487, 41397, 112498, -117953, -159502, 134967, 265573, -54251, -382345, -274549, 38524, 128412, 37650, 16752, -2835, -194544, -395241, -335828, -108889, -8690, -59632, -56774, 34763, 36373, -129939, -311379, -309966, -102852, 91445, -14901, -415512, -693059, -504208, -105846, -50955, -384698, -574972, -319026, 37914, 78385, -102477, -153764, 6004, 201748, 317994, 361659, 364390, 384670, 469793, 537393, 462438]
33097D62438j62612j00667q3097k19292k68347o7995J28533J14211J13316K65398
33087A81886K02758k80306o15628k47449L71500M05254m6595j73467J78935L42164
33077C19052K4739k71048j89533l0511o9429j02618M0101J49366Q3419L2939J05195
33066I1672J24763L2777J5456Q8517L1729j40416j45719J3511M054j98610k01062
33055b83328R0603K37050J0794k00069o6759J35448O0244r8947M567K38506K35180
33044C63289J7136r1761k6287j2668j10189j19475K5034J02323m3550k30822j91073
33033c18043K2925Q9119j04421k43707k6742L35078L64123K8670j87474l1636
33023g2108J28637p7462m02814l65220J9985L13722K91042J08884m8518j28811
$$ y = [462438, 299826, 199159, 116062, -103230, -371577, -439572, -311039, -196828, -83512, 181886, 384644, 104338, -511290, -758739, -387239, 18015, -28580, -202047, -23112, 319052, 343791, 72743, -116790, -147301, -216730, -319348, -279247, -129881, -46462, -13523, 91672, 216435, 249212, 264668, 353185, 384914, 244498, 98779, 112290, 116344, -82266, -283328, -192725, 44325, 55119, -144950, -211709, -76261, -16017, -114964, -110397, 128109, 363289, 380425, 288664, 262377, 249709, 139520, 20045, 45079, 147402, 103852, -126970, -318043, -295118, -205999, -310420, -554127, -580869, -245791, 118332, 147002, -40472, -72108, 56529, -20933, -423747, -788967, -768982, -455260, -164218, -55334, -103852, -232663]
33013b32663r6102L3011J14210Q1255R0773K27122K66578J9544l04253l84280
33003a84805k36887o7313R1696K61489K87815R3689p9701m8176k9765k24895l56558
32992d93411r3984L39019M77871L01710J10466l6961k36095l20499r2803K09674
32982A64987K18432K3911n5411o8219k27273l47559j29177J89246J46395j07998
32972a92666j9464L84935M62381j4122m67873l52383J52796M82009L40535j19378
32962F56770n05520n11497k17702N480J9644P9540K93362L46742Q9731p9238J32500
32951C09812L49316J54041j88975k36738j33057k09217k67266J0157L40678K88879
32941D17630N6148O6506J49178p6606l84075l21985m4529M1496L7831J50388M8770
$$ y = [-232663, -328765, -295754, -181544, -100289, -9516, 217606, 484184, 503728, 199475, -184805, -421692, -489005, -397309, -135820, 151995, 245684, 165983, 117807, 88042, -136853, -493411, -587395, -248376, 229495, 531205, 641671, 604710, 368615, 48116, -44687, 164987, 383419, 407330, 351919, 283700, 56427, -291132, -420309, -231063, -84668, -192666, -212130, 172805, 635186, 621064, 153191, -199192, -46396, 435613, 776148, 656770, 151250, -360247, -577949, -572469, -552825, -473285, -179923, 166819, 256550, 177312, 309812, 659128, 813169, 624194, 387456, 254399, 45182, -222084, -211927, 128751, 417630, 473778, 540284, 689462, 612856, 228781, -93204, -137733, -96237, -58406, 91982, 140752]
32930A40752m48173o35312M2660P94258N66582j93409k62704L00584L82438j57753
32920E29923l40461P5932K34890j52085l42708o0293K3659l17127l77138J30504
32910e94904N25474M18133K98166M19983K98453k03253m40611j54655K2310k59028
32900C30068m37230j13902K40503J89708K6673O6999R6349l6009p1945N1765L5052
32889C78031j02965P365K75282K04167j31935j48910J24603O7709k92389k44978
32879A35980K39669L54515r7932l57928r6091J03853l1636j7756K63427K42784
32869G38885j55812k47016J36319L18442P3681r088K20353J55181k85183l61839
32859E83923J34940N24866N12306N01952M47740j47854q87221p32018J36265L90334
$$ y = [140752, -307421, -942733, -900073, -105815, 460767, 267358, 4654, 305238, 687676, 529923, 189462, 265394, 500284, 348199, 5491, -54802, -31143, -348270, -725408, -594904, -69430, 348703, 646869, 1066852, 1365305, 1162052, 721441, 566786, 589096, 330068, -107162, -221064, 19439, 209147, 235820, 302819, 399168, 363159, 291214, 342979, 378031, 275066, 282431, 557713, 761880, 629945, 481035, 605638, 673347, 380958, 135980, 375649, 730164, 632232, 274304, 178213, 282066, 250430, 232674, 496101, 738885, 583073, 336057, 472376, 790818, 864499, 855411, 1075764, 1230945, 945762, 583923, 718863, 1243729, 1756035, 2257987, 2705727, 2557873, 1670652, 938634, 1074899, 1465233]
32849A465233k13720m67256P0163L79058M14j89519J68156K15765k97352m16375
32839G14567R8903K11307l22913l53513M17676O98021j1331m33720J09365M95927
32829A624289J9745l49351j8894Q4682m39098m86547L11470O26625q3886m50678
32819H38357K06332N66274q1666m23503K59576O23882p6947m88676J28639M03946
32809A956214l11595m69277O25375J284844P12722N64799J376227J022170j064227
32800E697252j991940l38659J005113r4761j224823j30890J005062n2013j106270
32791B768071J60179J483562L99426p60595N81502J887993L86558r84546J092272
32782G014422L398200J874054j07211K410039N949342M323115R39576L784750
$$ y = [1465233, 1251513, 784257, 854420, 1233478, 1233892, 1044373, 1212529, 1428294, 1130942, 714567, 813470, 1024777, 701864, 348351, 766027, 1464048, 1452717, 1018997, 1128362, 1624289, 1644034, 1294683, 1275789, 1360471, 921373, 434826, 746296, 1372921, 1289035, 838357, 1044689, 1610963, 1529297, 1105794, 1365370, 1989252, 1912305, 1423629, 1552268, 1956214, 1644619, 1175342, 1800717, 3085561, 3798283, 4363082, 5739309, 6761479, 5697252, 3705312, 3366653, 4371766, 4277005, 3052182, 2921292, 3926354, 3874341, 2768071, 2928250, 4411812, 4811238, 4050643, 4632145, 6520138, 6906696, 5922150, 7014422, 10412622, 12286676, 12179465, 14589504, 20538846, 24861961, 25801537, 29586287]
32774B9586287J0145304R997093N899131J5274828M6543771Q2706183R5262601
32767B95415198O9019365J1773067n1029309q8607182q4307525n1282005k1560955
32760G9420654j3366301j6381989j3463425m967781j841721n020848n912918k397126
32752A6068545o57685k569980l127893o91726M02321j377179k142987l14433P06203
32743F295186o73899j553484m49846J88346q17792j181337P8613P04524k80228
32734B310083p72360J34007M68807n40968r28576M9727M57136m18349o42530M66147
32724E83124Q77819k15636p66397K29866Q28130j44292r19118j99376M98949j21935
32714F51134p52766j35542N94907K31054k89255Q3213M88371J4560m73634j09058
$$ y = [29586287, 39731591, 49728684, 55627815, 70902643, 117446414, 200152597, 295415198, 364434563, 376207630, 325178321, 236571139, 152263614, 100981609, 79420654, 66054353, 49672364, 36208939, 31241158, 29399437, 24378589, 18465671, 16068545, 15410860, 12840880, 9712987, 9021261, 9423582, 8046403, 5903416, 5588983, 6295186, 5621287, 4067803, 3617957, 3806303, 2988511, 1807174, 1885787, 2590311, 2310083, 1537723, 1671730, 2140537, 1599569, 670993, 720720, 1177856, 759507, 116977, 583124, 1460943, 1245307, 478910, 708776, 1536906, 1392614, 473496, 274120, 773069, 651134, -101632, -237174, 357733, 588787, 299532, 382745, 871116, 885676, 412042, 302984]
32704C02984K76694j39798n49878j34048L68602J49692j84167O1730L48027R5732
32694E95570k14770j52290j32505k90116n8628M45396K82818m45187m44773M16492
32684B007O41048k44521p40367m4511N47792R3872l42291J30577N06057r5533
32674D54130o37542j07376N37699J51377m92275k17521L75319J55857l67421o4643
32664b12396O43703N38277k40311n58902k37400j7489m7196J43621M93457M95160
32654A000524J65505p4503j64262k39519j53966J23033J84429j00698k17277O6111
32644E89377K09626n3766j38781K35205L51434k03558n96971r0163O45305O17217
32634A564925O4905j57192J1800J10067J50815L28032L54121M9269m1930M44886
$$ y = [302984, 579678, 439880, -109998, -244046, 124556, 274248, 90081, 151811, 499838, 595570, 380800, 228510, 96005, -194111, -252739, 192657, 475475, 30288, -414485, 2007, 643055, 398534, -341833, -386344, 161448, 255320, -86971, 43606, 549663, 454130, -183412, -290788, 246911, 398288, -93987, -311508, 63811, 219668, -147753, -212396, 431307, 969584, 729273, 170371, -67029, -84518, -131714, 11907, 505364, 1000524, 1166029, 1091526, 927264, 687745, 533779, 656812, 841241, 740543, 523266, 589377, 799003, 745237, 606456, 841661, 1193095, 989537, 392566, 302403, 947708, 1564925, 1629830, 1472638, 1484438, 1594505, 1745320, 2073352, 2427473, 2476742, 2434812, 2879698]
32624B879698Q36909M50971j55052O530Q13535J326460J213232R42984Q89356
32615I204623J064419J436341J806976J712965J050836L82027Q0366k68355j030788
32606A5439410j727372j775578j447981j335442j367131j125124o98795m90187
32598E471800n11589n09432m70359m81126m27996k73990k51025m14804m56487
32589A674992k57667j05024r8634K3578K31818J13459k97991m18608j29368n897
32579G30658k21796k14151J78523L21700m053j31443J95641K43853l12062o36764
32569A50106j98236K27975k9910l06785J21174O25309L29056l21590l83881j9834
32559A93384J4640j98508q7970J93695J14114j65159j60652k4326j02474r4286
$$ y = [2879698, 3716607, 4167578, 4012526, 4019056, 4832591, 6159051, 7372283, 8315267, 9204623, 10269042, 11705383, 13512359, 15225324, 16276160, 16658187, 16738553, 16470198, 15439410, 13712038, 11936460, 10488479, 9153037, 7785906, 6660782, 5961987, 5471800, 4960211, 4450779, 3980420, 3499294, 3071298, 2797308, 2546283, 2131479, 1674992, 1417325, 1312301, 1213667, 1237245, 1469063, 1582522, 1284531, 865923, 736555, 730658, 508862, 294711, 473234, 794934, 790881, 659438, 855079, 1098932, 786870, 150106, -48130, 179845, 149935, -156850, -35676, 589633, 918689, 597099, 213218, 193384, 208024, 9516, -78454, 115241, 229355, 64196, -96456, -120782, -223256, -317542]
32549c17542L08679N45733N9162n47132l92785J82981K35979j58738j80603K10921
32539e3345L16361K7631r9249M1565K9841j55844j42487L5722M9817o135J28619
32528A72496K00217r9044l54583p0019L13976R2750l89457k55487L66558N37998
32518E15405P9975k59619j60374q6089k34809k14139R7468L04610K42875J62859
32508D48162J16788p3245k54093j12554J47923N9778k64918k99315J007K16371
32498a4096K31894K33964J33095k17428m46116j46572K85051J73455k96784l91345
32488d54882o9585O2498j11801j37481N0635P7544j7926J42810L91676J85481
32478A18969l41756m68973o0377K80827K52738J39665N8882j52389k99265j8579
$$ y = [-317542, -8863, 536870, 596032, 48900, -343885, -160904, 75075, -83663, -264266, -53345, 263016, 290647, 191398, 232963, 262804, 106960, -35527, 195, 50012, 43877, 172496, 372713, 273669, -80914, -150933, 163043, 255793, -133664, -389151, -22593, 515405, 595380, 335761, 175387, 89298, -145511, -359650, -262182, 42428, 285303, 448162, 564950, 491705, 237612, 125058, 272981, 332759, 67841, -231474, -230467, -14096, 217798, 451762, 584857, 367429, -78687, -225259, 59792, 233247, -63537, -454882, -524467, -461969, -573770, -711251, -660616, -583072, -600998, -458188, -66512, 118969, -222787, -691760, -752137, -471310, -218572, -78907, -20025, -172414, -471679, -490258]
32468d90258L90929K81136k02151k78075J47924L56620Q1303j55727j09839j58167
32458a36305l70696k75234J72174L61246Q0753j22692N2102J91921K7743r7581
32448a16569L3689J09429m5627j41157m4682j1733o7129R3426L85110L10936j34661
32437C71032l52226j40247K4783p3655o0780J63703J47991j94791l05241M511
32427d14920J55257j41321l24952l525L20697J36320k18128k09777J6670M2595
32417f41084q7998j06108l4009K3121J74527M18412M41263J08419k46429l15075
32407b64961j95521p2460L6169O5466p1884j59513P3298L60657K20560j57669
32397a65858j54255J66058J47764j94299j38518L29434L28828k97517n05901J71378
$$ y = [-490258, -99329, 181807, -20344, -298419, -150495, 206125, 287428, 131701, 21862, -136305, -507001, -782235, -610061, -248815, -168062, -290754, -238652, -46731, -18988, -116569, -82880, 26549, -19078, -160235, -204917, -216650, -283779, -190353, 194757, 505693, 371032, 18806, -121441, -96658, -170313, -231093, -67390, 80601, -114190, -419431, -414920, -259663, -400984, -725936, -729461, -408764, -272444, -490572, -700349, -683679, -641084, -729082, -835190, -869199, -846078, -671551, -253139, 188124, 296543, 50114, -264961, -460482, -532942, -496773, -431307, -503191, -662704, -589406, -228749, -8189, -165858, -320113, -154055, -6291, -200590, -339108, -9674, 319154, 21637, -484264, -312886]
32387c12886O79048J50784o21485n11166J53313L24555l1570j88227n1917p2267
32377d81818j71456O8749M29879L39718p3350j93090K338J7965j57967p8530K25874
32366g1688K56864j4923q5466J59960K63482L5860j56403r2494k5236j27499j87707
32355d5250o0987N4983q346j25137j39504q6694m0783O408N5472Q8400J36790
32344a64648J93290J48225j2004j04481m4825k7964j78640k74970j14916R4664
32334d86269N6105j33756j65462J0701K20535L71776M11778K09251j91701m29402
32324a26444k68111M6335J79970J77128K05216J64351m8398j99334p6759J02074
32314A56028P1869j2241N2689L7129k73020m89394j40797M67898O12361K08897
$$ y = [-312886, 366162, 516946, -104539, -615705, -462392, -137837, -169407, -357634, -409551, -481818, -653274, -584525, -154646, 185072, 111722, -81368, -79030, -61065, -219032, -297562, -71688, 185176, 170253, 84787, 244747, 508229, 544089, 387686, 295192, 269956, 142457, -45250, -106237, -51254, -59600, -184737, -324241, -410935, -451718, -445310, -389838, -301438, -164648, 28642, 176867, 164863, 60382, 15557, -12407, -191047, -466017, -580933, -486269, -430164, -563920, -729382, -718681, -498146, -126370, 285408, 494659, 302958, -126444, -394555, -348220, -168250, 8878, 214094, 378445, 330047, 130713, 53954, 156028, 227897, 215656, 268345, 305474, 32454, -456940, -597737, -129839, 482522, 691419]
32304F91419j70986k44032k68333l72726l30239q7787Q8394J12023J86436L24703
32294g1128K82596O3126l1396M1298k6240k81167l33867l401L27269K59273r3568
32283A32795l60294l74898j79982J25501L46635K77831K946j47468p4786n4694
32273c06414k45604l75100j54360K52513M48756L30517J40572R0567J39680J20504
32263D41631m3289k35635k34197L5487L37910L53776Q4858j33155p6294Q6396
32253F17488O8689j21178k14214p5096J01927M6198k25772m05653k64522P1999
32243d00134L01100L06685K00987P1580r1132k13926j44303Q2506K03344O3581
32233C80288j96020l72223m08605l00826n3388J71406J52813j9879o246K18380
$$ y = [691419, 520433, 276401, 8068, -364658, -694897, -782684, -694290, -582267, -395831, -71128, 211468, 274594, 243198, 284496, 258256, -22911, -356778, -360179, -32910, 226363, 132795, -227499, -602397, -782379, -656878, -310243, -32412, -29466, -176934, -251720, -306414, -552018, -927118, -1081478, -828965, -380209, -49692, 90880, 181447, 321127, 441631, 398342, 162707, -71490, -36003, 301907, 655683, 740541, 607386, 531092, 617488, 686177, 564999, 350785, 275689, 377616, 423814, 198042, -207611, -472133, -400134, -99034, 207651, 408638, 480218, 389086, 175160, 30857, 113363, 316707, 380288, 184268, -187955, -596560, -897386, -950774, -779368, -626555, -646434, -652680, -434300]
32223d34300K58812j8925j68934J12323M02258J98500k29032k55061Q6504J97784
32213A49929p5797k39753j2305K55249K09277R392m3166K0962Q874q7884j49923
32202D4855j23660m737J83780L07470K18174o977j37619j23517j09841j16843
32192A31085p999J86229K36955Q1341r1000j77905k54191k60425j1798L45489
32182A77781L31285j63967n78941m20642M4184K31961Q5818P585J35736K07558
32172E8358R6178m087L897n6657k53323l45437j62709J07453K27211K52906L21211
32161B45001L07545K4713l55354m36915j60645R2753L4701j78347k48870j38191
32151h13609J8032J74851L24995L39989J24978j57519k56220j52971R74J62618
$$ y = [-434300, -175488, -194413, -363347, -251024, 151234, 349734, 120702, -134359, -47855, 149929, 74132, -165621, -177926, 77323, 286600, 295992, 252826, 273788, 282662, 194778, 44855, -78805, -83542, 100238, 407708, 625882, 618905, 481286, 357769, 247928, 131085, 123086, 309315, 546270, 627611, 536611, 358706, 104515, -155910, -167708, 177781, 509066, 345099, -233842, -654484, -610300, -378339, -292521, -284936, -149200, 58358, 154536, 150449, 154346, 97689, -155634, -501071, -663780, -556327, -329116, -76210, 245001, 552546, 577259, 221905, -215010, -375655, -282902, -248201, -426548, -675418, -813609, -795577, -620726, -295731, 44258, 169236, 11717, -244503, -397474, -396500, -233882]
32141b33882L37180L48713L8496l39582l38974P118J69926p6318l00075j23607
32131e11005J54088O4323k43391k53597O2193K25743O2374m7191J32006K64813
32121h9644L2218k70463j64201K24127L13229l6766k97370r3736K11968J08648
32111f1990k31918k22115J85185L98818J27837j68774n6534J70581L0855k89252
32101a17307k28297J95229L69776L3027l64632l69848j01150Q4467R5965N3353
32091c49417L3443P0363J80434K59649J67225l8512j80786k54119l29164k53329
32081f94213J13226M21579J66232m59288o72119k21786K52288K34542L0662Q6959
32071g41918K65370K68770K01561J89795K937l87559m46241P6229M94979J74994
$$ y = [-233882, 103298, 452011, 490507, 150925, -188049, -180931, -11005, -87323, -387398, -511005, -356917, -292594, -535985, -789582, -727389, -501646, -439272, -486463, -354457, -89644, -57426, -327889, -492090, -267963, 45266, 8500, -288870, -382606, -170638, -61990, -293908, -516023, -330838, 67980, 195817, 27043, -29491, 141090, 171945, -117307, -345604, -150375, 219401, 252428, -112204, -482052, -583202, -498735, -402770, -349417, -315974, -245611, -65177, 194472, 361697, 323185, 142399, -111720, -440884, -694213, -580987, -159408, 6824, -452464, -1124583, -1346369, -1094081, -859539, -828877, -741918, -476548, -207778, -6217, 183578, 186515, -201044, -647285, -571056, -76077, 98917]
32061I8917l51905j90232M02194M00143k69453n80430q4602M06571J91708k62187
32051b39276k11676J84910K81714K3894j04937N4324J68788L7965j19398n7244
32041A9064J53620K62709J33830j54130l89642l86204j36965J51909K16800j5682
32031a44691l00997k65126J58367N37106M01776j16591m18308k54324j4702l5473
32021d52963q7264J02577K62783K5818l57487l41376N8661L16730K06800L07r9853
32010c65267j68493j91403k0787K40629K86058R9642k9598j4833l8105r6091J8703
31999b79545K31289K00894p7841k07092m4132R2415K5864p251J06542R3593j57234
31988b2498k95008r7912J00963l0968k50968j55684J52263K61679Q8274j07857
$$ y = [98917, -252988, -443220, -41026, 359117, 89664, -490766, -575368, -168797, 22911, -239276, -450952, -266042, 15672, 39566, -65371, -11047, 157741, 195706, 76308, 19064, 172684, 435393, 569223, 415093, 25451, -360753, -497718, -345809, -129009, -144691, -445688, -710814, -552447, -15341, 386435, 269844, -148464, -402788, -417490, -452963, -540227, -437650, -174867, -149049, -506536, -847912, -789251, -472521, -265721, -265414, -365267, -533760, -725163, -745950, -505321, -219263, -119621, -149219, -164052, -202157, -298248, -279545, -48256, 152638, 74797, -132295, -176427, -84012, -58148, -65399, 41143, 134736, -22498, -317506, -415418, -314455, -345423, -596391, -752075, -599812, -338133, -249859, -357716]
31978c57716j78826j81809j27164K5395J80835J93184R2489K6738M5190J01458
31968a80226J73586K30536J93164O8556n603J9628k266j54195k62284j50676N3445
31957a6335Q1862r5731k52601k22177o7479O1979J15851J47838J88646J70834
31947A12687K5892j64750k32656j63967j08811q4101Q1954L56946L78202J6355
31937B17751k58625j8732L82006K78712k58398n07992j99242J58884J57453K7250
31927b0933O9212J46608N7876p9466j27921j80944k44115j01903K30171L72131
31917A20716J82797L2160J58904K40147k3762l63165m03997k49954j56348m2078
31907e04580J91616K65653j0537k44838k3144L55203L31847Q851p1476J22462
$$ y = [-357716, -536542, -718351, -845515, -820120, -639285, -446101, -353612, -326874, -281684, -180226, -6640, 223896, 417060, 485616, 480013, 499641, 497375, 343180, 80896, -69780, -16335, 65527, -30204, -282805, -504982, -572461, -510482, -394631, -246793, -58147, 112687, 138579, -26171, -258827, -422794, -531605, -615706, -533752, -176806, 201396, 217751, -40874, -59606, 322400, 601112, 342714, -165278, -364520, -205636, -48183, -20933, 48279, 194887, 252763, 173297, 45376, -135568, -379683, -481586, -251415, 120716, 303513, 335673, 494577, 734724, 710962, 347797, -56200, -306154, -462502, -504580, -312964, -47311, -57848, -302686, -325830, 29373, 361220, 370071, 298595, 421057]
31897D21057J15029j83396l18600j05040P3393l8918j47601M5928L28007L14751
31887E04610J1906k48078k52127q2238N6947N7823j0321k0613J0650m3634j50652
31876a65727j06554Q4303J20159q8462j68702J13294L62029J49263k15596j38218
31866e4211K45702K41808k59877n80575l25655O1729R5780m5453M062J43223Q2514
31855c90953j02731j45409m4443L7812J05078K02012J81714m6435k33785j18019
31845e55159J36292J85853M8546R291J00569R6436k4087m2721M5065j5833k21252
31834b37000j83486K33719N37219K36586l83732n68706j08860L80791L01132j72917
31824C4746m13618j88558J29256J40015r0275k05317m0694K18391L02524J60757
$$ y = [421057, 536086, 352690, 34090, -70950, 2443, -36475, -184076, -138148, 189859, 504610, 516516, 268438, 16311, -65927, -8980, 48843, 38522, 17909, 28559, -15075, -165727, -272281, -187978, -67819, -156281, -324983, -211689, 150340, 299603, 84007, -54211, 191491, 433299, 173422, -407153, -732808, -671079, -575299, -620752, -616690, -473467, -390953, -493684, -639093, -683536, -645724, -540646, -338634, -156920, -203355, -437140, -555159, -418867, -233014, -184468, -175177, -74608, 21828, -2259, -44980, 85, -15748, -237000, -420486, -186767, 350452, 587038, 203306, -365400, -474260, -93469, 207663, 34746, -378872, -567430, -438174, -298159, -388434, -593751, -634445, -416054, -113530, 47227]
31814D7227l0197j09924j15202j65330k21723j15555J47772L04077J91386J6487
31804e0982L5557J22138k4452l21565l52175p378L25369L45365K13687J38761
31794D24325j2466l57569n88322l56502J28337L35753J49488o3556p5041m2993
31784d58546q8530m8506J82580L83345K91586l3493l04505l33029j56317M5879
31774e19536R3256k0833p3546J20507L88131L63700K0919k22439o3533K58932
31764C45558L01666R040k71270k71577o7049J16761J47253J8114j75088k40859
31754h7451l9345K85300L65944N2109l14459k71661J37642L64324P7070l58491
31744B10982l66749L7006K88232R5790j78262j16287J34880J48531j10056k78167
$$ y = [47227, 17030, -92894, -208096, -373426, -595149, -710704, -562932, -258855, -67469, -50982, -15425, 106713, 82261, -239304, -591479, -598857, -273488, 71877, 285564, 424325, 411859, 54290, -534032, -890534, -762197, -426444, -276956, -340512, -415553, -458546, -547076, -595582, -413002, -29657, 261929, 228436, -76069, -409098, -565415, -519536, -426280, -447113, -520659, -400152, -12021, 351679, 372598, 150159, 86626, 345558, 647224, 656264, 384994, 113417, 46368, 163129, 310382, 328496, 153408, -87451, -126796, 158504, 524448, 576557, 262098, -9563, 128079, 492403, 569473, 210982, -155767, -118761, 169471, 265261, 86999, -29288, 105592, 254123, 144067, -134100]
31734a34100j76228j6278J749l2923J2091O1245P035n7260N120R9528J3335k18685
31722d35371k79774J7882M27573N06841J24078l85766n84104l59869L2128K70696
31712f65686K32982L3951r1729J8344K81943M19203K62809k7059j67856j03444
31702A93458Q312P7282J24310R2066r6391k74899j59093J74304K76728l0506l41431
31691D4140k52142M5029J04546p2946j13143P6375J72703j5069k49892k35098
31681d95497j108K09004K46881J36830j7276j14260j28482j30315j63641j41424
31671e99288J7442J95664J85464k2752k15535k24506q4778O9685J38703R3027
31661d46874K069O336J46926K65407K03163M0889k0235L7993N1675n1318j71064
$$ y = [-134100, -310328, -326606, -324857, -357780, -345689, -284444, -277409, -334669, -329549, -230021, -216686, -435371, -715145, -697263, -269690, 237151, 361229, -24537, -608641, -968510, -936382, -665686, -432704, -398753, -490482, -472138, -190195, 229008, 491817, 464758, 296902, 193458, 201770, 279052, 403362, 495428, 399037, 124138, -34955, 139349, 416077, 385571, 44140, -208002, -162973, -58427, -131373, -244516, -168141, 4562, -10507, -260399, -495497, -496605, -287601, -40720, 96110, 78834, -35426, -163908, -294223, -457864, -599288, -581846, -386182, -200718, -223470, -439005, -663511, -748289, -678604, -539901, -446874, -444805, -438469, -291543, -26136, 177027, 217916, 197681, 235674, 287349, 236031, 64967]
31650F4967k24262k30878k03563j16819K277R7686J85867K85064K87951J00598
31640B48888j24498j34662L0750N5617j68592l29496j27166K65290L88934P7029
31630A82094l39538m22804j07524K70481L76752K16215L1036m3879p9455j37815
31620e4437j61824j34401j48030k13371j92515m6634N9258M8923R0501K56995
31610d95535L02711P0279j44870k7480J83364M4767k98119k50085K74252O10254
31600B69538K72045l50995n39321j65820K56806K77439k7078k39288r4629K21771
31590a19532K80151l8691l21056j47791K99017M83002K78552P0321Q4137Q8483
31580I56593j05608k90142k35094o1161Q397k6168q4763j89470k85217j74622
$$ y = [64967, -159295, -390173, -593736, -710555, -708278, -610592, -424725, -139661, 148290, 248888, 124390, -10272, 20478, 76095, -92497, -421993, -549159, -283869, 105065, 182094, -157444, -580248, -687772, -417291, -40539, 175676, 206712, 162833, 83378, -54437, -216261, -350662, -498692, -712063, -904578, -951212, -891954, -843031, -752530, -495535, -192824, -122545, -267415, -294895, -111531, -66764, -364883, -614968, -340716, 269538, 541583, 190588, -348733, -514553, -257747, 19692, -7386, -246674, -341303, -119532, 160619, 121928, -199128, -346919, -47902, 435100, 713652, 783973, 868110, 956593, 850985, 560843, 325749, 264588, 272985, 246817, 162054, -27416, -312633, -487255]
31570d87255J30466K88846J20272q6784n1732L3184j06608k64262p0308K96926
31560a97255K71453k24467n70643k74581L70466O86658M34190j8199k38095j97614
31550D1913j44876j74320j26674N8966J27581j27886m28607k99376K03988M74238
31540c95053K07881j34691k1782L47798L67372n5778l85660k43449J16383K24554
31530B7575j0133k86997l22083j23180Q7719J43145R5463R0414J22159N3707j09596
31519b31807j66660k3098J53054J93748J45097Q5465l8380k12133k31658j5557
31509c41929J83175J45042M1944J13321K04391K8157k68400k64952N4026K49583
31499A44358J05830q2371l4111R5336L8945j26519j20654R8155K72471J91210
$$ y = [-487255, -356789, -67943, 52329, -34455, -86187, -53003, -159611, -423873, -494181, -197255, 74198, -150269, -720912, -995493, -625027, 61631, 495821, 477622, 239527, 41913, -102963, -277283, -403957, -344991, -217410, -345296, -773903, -1073279, -869291, -395053, -187172, -321863, -343645, 4153, 371525, 315747, -69913, -313362, -196979, 27575, 17442, -269555, -591638, -714818, -627099, -483954, -388491, -298077, -175918, -122211, -231807, -398467, -421565, -268511, -74763, 70334, 155799, 117419, -94714, -326372, -341929, -158754, -13712, 28232, 141553, 345944, 374101, 105701, -159251, -105225, 144358, 250188, 167817, 133706, 229042, 267987, 141468, 20814, 118969, 391440, 582650]
31489E82650o0462k21581j67000m6956o7941j75781j19813J34786K94949J76756
31479C29607J881K6791J16584N000k20634k73526j59552j00894p4818J12647L44409
31468A07495K82401l2986j76329k0541P6543q1486k07954r0077K8355n5373p5125
31457b45077K15493M90732K80211k75308n77406l69609L8184K83144K94843J37024
31447B72231j25450l29797k78764j8808J39098r788k87551l23436J5451M36767
31437e10047N09766J69894j59269r6218J55217R5400k75145l96607k6061L21563
31427b11507J54098k10536j55777K35818L33742m523k25891n160K50048R7763
31417B58075k31677k33603Q1303K41980L4514k40329k53056p9028j2992j29629
$$ y = [582650, 522188, 300607, 133607, 86651, 18710, -157071, -276884, -142098, 152851, 329607, 331488, 358279, 474863, 479863, 259229, -14297, -173849, -274743, -349561, -236914, 107495, 389896, 356910, 180581, 160040, 236583, 155097, -52857, -142934, -114579, -169952, -245077, -29584, 461148, 741359, 466051, -111355, -480964, -442780, -159636, 135207, 272231, 146781, -183016, -461780, -480588, -341490, -351278, -638829, -962265, -946814, -510047, -281, 169613, 10344, -85874, 69343, 164743, -110402, -507009, -533070, -211507, -57409, -267945, -423722, -187904, 145838, 141315, -84576, -89736, 160312, 258075, 26398, -207205, -125902, 116078, 150592, -89737, -342793, -421821, -434813, -564442]
31407e64442k14517j02897Q0413J16812L1851N4311K36176L32044J61389j10787
31397B0353k24711j79709j24650o0035P9497J73191N8974j45410j86853q6037
31387f75390o0511q9329M0980K56078K20644o6806j84067L7771K27301J16078
31377a77251j4471J09517K09271m4552l61333k56551J07255J64295r7690j32325
31367d93835J86265L06163n8082l88938j77007K58959K86899o4195k33684n0882
31357d28337Q0613o9500j86283K3087L22714L12180K1755j88654j69222p8154
31347c59801P49J77100M16731M19462M7525l55225l58142l4394J52453R988j70702
31336e4256j19626L3984N7634L900M9185J42406R9511o3795j60258j25168m6359
$$ y = [-564442, -778959, -881856, -801443, -684631, -652780, -598469, -362293, -30249, 131140, 20353, -204358, -384067, -508717, -568752, -489255, -316064, -257090, -402500, -589353, -675390, -735901, -825230, -784250, -528172, -307528, -374334, -558401, -520630, -293329, -177251, -191722, -82205, 127066, 82514, -278819, -535370, -428115, -263820, -361510, -493835, -307570, -1407, -59489, -448427, -625434, -366475, -79576, -143771, -377455, -428337, -347724, -417224, -603507, -580420, -257706, 54474, 76229, -112425, -281647, -359801, -359052, -181952, 234779, 654241, 701766, 346541, -11601, -45995, 106458, 116446, -54256, -173882, -139898, -82264, -78364, -29179, 113227, 212738, 148943, -11315, -136483, -182842]
31325a82842L5914J26106J37938J3771q2220L1295K06174J43278j04260j76168
31315A48986P311J08944m7704j77981m3214J25248M0691j10549K8937L48937L82576
31304H12182K93m12379n04634l42480j55701m462J47140K36786J69689j3059j61067
31293b27692j72084n8853J01643K33709K87303K22046P970k89370m45314k52921
31283e93563J67469M01752K26841q5720j41509L9660J25868K4841j5671J04824
31273B54792J20752j39213l68081j73661K92955M66490J40661k29871j69604J41062
31263C36282J38830k84817o01668l86621J07411L47212K27158N0518j8531p8052
31253a62278j31676m4619J11452R5700l9783K3709K55052K03636k09907l97959
$$ y = [-182842, -146928, -20822, 117116, 130887, 48667, 79962, 286136, 429414, 325154, 148986, 156297, 265241, 217537, 39556, -3658, 121590, 162281, 51732, 80669, 429606, 812182, 812475, 400096, -104538, -447018, -602719, -607181, -460041, -223255, -53566, -66625, -227692, -399776, -458629, -356986, -123277, 164026, 386072, 394042, 104672, -340642, -593563, -426094, -24342, 202499, 116779, -24730, 14930, 140798, 165639, 149968, 254792, 375544, 236331, -131750, -305411, -12456, 454034, 594695, 364824, 195220, 336282, 475112, 190295, -411373, -797994, -690583, -343371, -116213, -65695, -84226, -162278, -293954, -338573, -227121, -131421, -171204, -147495, 107557, 311193, 101286, -296673]
31243b96673j3231L91120J97095k42554j59851L47041M70173K7494k88800j15502
31233C16312M5542j76459l30381J4915M17438K32522l18893m67921l9622L81037
31223G4490L29347n2167l84433m39487j55073L22527N88176L41058j71444m05010
31213D7984k22828p07r698r0272m7773J7709j3407L164J99381L56716J69249k53472
31201A56046m58606k35887J26814K50300J10260o4305j62485k29543k18330k486
31191g28222L11091L86118J42577m2704J04805K60547j5405m76364m42888J34187
31181c66258M96460J83338k84698k36147J44648K11046r1668k34373k2920J63024
31171c7548Q7632O074J20679K06264M8224j49292j13462L6945K6068q7549k4169
$$ y = [-296673, -309904, 81216, 278311, 35757, -124094, 222947, 693120, 720614, 431814, 316312, 361854, 185395, -144986, -130071, 287367, 519889, 200996, -266925, -306547, 74490, 403837, 351670, -32763, -472250, -627323, -304796, 283380, 624438, 452994, 47984, -174844, -175551, -185249, -275521, -323294, -305585, -318992, -315828, -116447, 240269, 409518, 156046, -302560, -538447, -411633, -161333, -51073, -115378, -277863, -507406, -725736, -728222, -417131, -31013, 111564, 68860, 173665, 434212, 418807, -57557, -500445, -366258, 130202, 313540, 28842, -207305, -62657, 148389, 56721, -177652, -200572, -37548, 50084, 56158, 176837, 383101, 431325, 282033, 168571, 205516, 231584, 144035, 119866]
31160A19866J96419K17575j03554m04232k71450J67099L65079O9976l45584m08565
31150c97371j76306n3064j17039n5826K08170L15981R4382q9227O1291K26992
31140A7983J6187l02782k11097J56936K11096r2074j86665J06894K77665L1736
31130B5879k10050p5607J38553P1187m1012J40156L56965J89050j53166j46265
31120B95690J41820J55707k13560m64425l00346l870J33614K12021L51041L84233
31110F91925J78656r5733k46799l10311l32055k10685M1730J87214J26760Q1954
31100A12656J87664K23240K9006j35600j5255J48532l810k94019k47269J17906
31090A23051K92022P9755j42750r7775j0411j07242j79324P057K25430J23750
$$ y = [119866, 316285, 533860, 430306, 26074, -245376, -78277, 286802, 356778, 11194, -397371, -573677, -626741, -743780, -799606, -591436, -275455, -181073, -270300, -209009, 17983, 34170, -268612, -479709, -322773, -111677, -203751, -390416, -283522, -5857, 25879, -184171, -259778, -121225, -50038, -91050, 49106, 406071, 595121, 441955, 295690, 437510, 593217, 379657, -84768, -385114, -388984, -255370, -43349, 307692, 691925, 870581, 774848, 528049, 217738, -114317, -325002, -283272, -96058, 30702, 112656, 300320, 523560, 552566, 416966, 401711, 550243, 546433, 252414, 5145, 123051, 415073, 494828, 352078, 254303, 243892, 136650, -42674, -35617, 189813, 313563]
31080C13563j92828l17399j34662J06998K10975J75794J3901k20364k86835j0627
31070c41484L51926L70909O1964j44386p4456j0698j23953j80276k7087O9669
31060d7872j14851l31955k43810M8378K23091K37763K42679K25657J28805J04032
31050D71917K38895K46052r6150l99633j49981L89146M35159j28000n37267l06082
31040A64056J00403Q9057j77470k05074l806N6282q3567j80408j73280j71406
31030e85213j07910J31488L46611K49635j4756l3643K08282K83478q150l52651
31020A17171m17052k52059n4468J31326K85921K75339O4790j24503q1018J03517
31010D8964J73169M6338j16439j24035M4366K08478J54681r4939k43089q8413
$$ y = [313563, 120735, -196664, -331326, -224328, -13353, 162441, 176342, -44022, -330857, -341484, 10442, 381351, 443315, 298929, 224473, 213775, 89822, -90454, -117541, -47872, -162723, -494678, -738488, -690110, -467019, -229256, 13423, 239080, 367885, 471917, 710812, 956864, 860714, 461081, 311100, 700246, 1135405, 1007405, 470138, 164056, 264459, 353516, 176046, -29028, -32834, 23448, -60119, -240527, -413807, -585213, -693123, -561635, -215024, 34611, 19855, -13788, 194494, 477972, 469822, 117171, -299881, -551940, -606408, -475082, -189161, 86178, 150968, 26465, -54553, 48964, 222133, 268471, 152032, 27997, 72363, 280841, 435522, 340583, 97494, 9081]
31000I081J52179J25984j15592j82105L8568K00356N7511j57005j27130P3616
30990G5463J69392J05416Q664q0885j63081j32101L7510J16078o1991k42609o7862
30979b36006L36143M67406J43711k68176l77807k02532K4137J81884K51297J96175
30969E16232K6071j51650k44521k42047j50114j195P5301j6744j40230p6496J22596
30958b82797J96878J01355M5468O5099n1395k81416k53577J31341L95250J73212
30948B39418j72719j12334J91064J72600j68108k71663K1122K03392l3986l02832
30938b34046j97979N5914O5881l6916J12830L89078L04507j92482n57800l85664
30928f76677P7296L15606J77868o6110j45098o8127j8181r0609j84325j40468
$$ y = [9081, 161260, 287244, 171652, -10453, 28115, 228471, 285982, 128977, 1847, 75463, 244855, 350271, 358935, 278050, 114969, -17132, 20378, 136456, 74465, -168144, -236006, 100137, 567543, 711254, 443078, 65271, -137261, -113124, 68760, 320057, 516232, 542303, 390653, 146132, -95915, -246029, -247224, -171923, -188667, -328897, -405393, -282797, -85919, 15436, 60904, 126003, 74608, -206808, -460385, -329044, 66206, 239418, 66699, -45635, 145429, 318029, 149921, -121742, -100620, 102772, 68786, -234046, -432025, -376111, -310230, -347146, -234316, 154762, 459269, 266787, -291013, -676677, -599381, -283775, -105907, -172017, -317115, -385242, -403423, -494032, -678357, -818825]
30918h18825M8100K27232K83081K53187J91995N2735j83504l62474l01045m0645
30908f50163J84455K22416J32038M6495K1210K4171p628j03545j95920j61532
30898d88003O642J40297J10153J8760L5815J15759P7972o1249p4138J10910K51161
30887B44079J22031j60272l01879k05453k5204P9442Q6231L7064k6358m4838J4379
30876a80778P0474J628j51692j75955L0082K53424J95499j23436l45337k05164
30866f31255J45934L34445J94208r5133k37860r1737K40623M85362M05625M6887
30856G97099k62668k65609p5885L451j09505k32338k29855j33016L7182K87618
30846a83526M53603K85992j38145l76936j83753J38354J67544n8852j63080J6572
$$ y = [-818825, -770725, -543493, -260412, -7225, 184770, 237505, 54001, -308473, -609518, -650163, -465708, -243292, -111254, -64759, -43549, -19378, -27006, -130551, -326471, -488003, -481361, -341064, -230911, -212151, -176336, -60577, 17395, -43854, -117992, -7082, 244079, 366110, 205838, -96041, -301494, -326698, -247256, -161025, -123961, -150319, -195157, -180778, -110304, -108676, -260368, -436323, -406241, -152817, 42682, -80754, -426091, -631255, -485321, -150876, 43332, -51801, -289661, -381398, -140775, 344587, 750212, 797099, 534431, 268822, 192937, 196388, 86883, -145455, -375310, -508326, -471144, -183526, 270077, 556069, 417924, 40988, -142765, -4411, 163133, 104281, -58799, -42227]
30836d2227K59086K88863N9441k50200l78769j96232J13614K04650K883j91328
30826a30219j50652j9632Q243J3066Q6239N8119j55928k32867Q4839M41145L20396
30815C22749j27433k98287o5788J28936R3702J10598K51988J66481k16864m10779
30805d4697j35316J91225J16841j66105k27750p2383L9359R1660J87020K04506
30795A84360J8505j81320j85111j31641j93905j75140J32688M46089L56935P660
30785B79120j33172k5936k9662j99644k11371p378O7853r0307j11645K07345M79070
30774B24273K63888k65846n27830k51996K43460M45263J78434k38056l44541o5842
30764c38793K16077J96733N3118Q7430J88431M1049k53039k58167P1197K51418
$$ y = [-42227, 216859, 505722, 565163, 314963, -63806, -260038, -146424, 58226, 61109, -130219, -280871, -300503, -292260, -279194, -192955, -134836, -290764, -523631, -438792, 2353, 322749, 195316, -102971, -168759, -39823, 53879, 164477, 416465, 582946, 366082, -44697, -180013, 11212, 128053, -38052, -265802, -338185, -298826, -207166, -20146, 184360, 202865, 21545, -163566, -295207, -489112, -664252, -531564, -85475, 271460, 279120, 145948, 120012, 90350, -109294, -320665, -328043, -260190, -350497, -462142, -254797, 224273, 488161, 222315, -305515, -557511, -314051, 131212, 309646, 71590, -272951, -338793, -122716, 74017, 127135, 214565, 402996, 444045, 191006, -67161, 4036, 255454]
30754B55454O164l13792k91497l3200J16112J26217J71105J83824m8595m10804
30744b39012m82009j13087L18135L84324J43883n697Q8303J55406l4719k77202
30734f1675k27456N1885J70600J7635r7410o736L8933j09212j39730J61724L89571
30723A88129J02005l60865l10627J81146L49182o0917m06822j79866K65398L64140
30713A30903J52118m125l6045q0302j01920m1658o1999k46492l08476j656M00288
30702a99364M42842J37363j23973j61155j30512j51779j74183j70249j60775q3629
30692g75414J13884L07079L31429K09480O4217o3102j36407n3133J48385K21490
30682C67908P0774o5868l0798k9395j91083k15418J01315L36701K2277n03133
$$ y = [255454, 261618, -52174, -343671, -376871, -260759, -134542, 36563, 220387, 171792, -239012, -721021, -834108, -515973, -131649, 12234, 6537, 94840, 250246, 215527, -61675, -289131, -237246, -66646, -49011, -146421, -153157, -114224, -223436, -363166, -201442, 188129, 290134, -70731, -381358, -200212, 148970, 88053, -318769, -498635, -233237, 130903, 283021, 278896, 242851, 162549, 60629, 18971, -43028, -289520, -597996, -599652, -199364, 243478, 380841, 256868, 95713, -34799, -186578, -360761, -531010, -691785, -775414, -661530, -354451, -23022, 186458, 250675, 187573, 51166, -1967, 146418, 367908, 438682, 372814, 342016, 312621, 121538, -93880, 7435, 344136, 366413, -136720]
30672a36720m95613O3466M46493K87592M656n296Q5289L0686l8723J7057K0111
30661B78998j44675k22180p8K96371L35197J29620j05717k79428l55979k37077
30651c04948L3269J92516J19392J7097L0505j1935k19433l29609j14881J77945
30641d10082J71958o6082j76078o6189N2675P5894Q3688Q5988K4886k0295O3324
30630a80313J63307Q0953j16711j75795n1929N9576O4329M8191K4272r8733k61117
30619d43970k46628m128K57360L58208L17893J84427o6200l54297m30521j51143
30609e78999K84118M96957K97586j53140m90234m40480n3167L37434M30227K35555
30599C65857R82q3327l2435J4979o8721k87230m52449l17171J07419M65274M38602
$$ y = [-136720, -632333, -568867, -122374, 165218, 169874, 164578, 249867, 280553, 241830, 258887, 278998, 134323, -87857, -87935, 208436, 543633, 673253, 567536, 288108, -67871, -304948, -271679, -79163, 40229, 57326, 87831, 75896, -143537, -473146, -588027, -410082, -238124, -304206, -480284, -546473, -493798, -417904, -334216, -248228, -223342, -243637, -180313, -17006, 63947, -52764, -228559, -280488, -220912, -156583, -108392, -84120, -182853, -443970, -690598, -694726, -437366, -79158, 238735, 423162, 356962, 2665, -427856, -578999, -294881, 202076, 499662, 346522, -143712, -584192, -637359, -299925, 130302, 365857, 366839, 283512, 251077, 266056, 197335, -89895, -542344, -859515, -752096, -286822, 151780]
30588A51780J27893j25326k01865k58145l62328l55114j37993J23950K14064J45659
30578f77425J06892J86417K58587J55124r1663k40115j25551J03034J66767M9572
30568a08361P60J16197J78882L5243j36922j29084l0024k2440p0200n7322k3733
30557b47004k971J29050L42624K83507j84567n53832l05691K57410M12949R0709
30547B22184j36470o0225o4656k69251k46352J45482L86840J42586j65110q0461
30537a25433J64782J59985L3789R9887K11361O2392k03406k64194j95645j99991
30527b56473p4687L89573P45399L86040m15093p44342l41671J02919O5884j43818
30517b86269r8204N1704M611r0494N4520L02661L00155L9989j72306j81536r1849
$$ y = [151780, 279673, 154347, -47518, -305663, -667991, -1023105, -1161098, -1037148, -823084, -677425, -570533, -384116, -125529, 29595, -62068, -302183, -427734, -324700, -157933, -108361, -107601, 8596, 187478, 222721, 85799, -43285, -73309, -95749, -165949, -223271, -247004, -249975, -120925, 221699, 505206, 320639, -233193, -538884, -281474, 131475, 222184, 85714, 25489, -39167, -308418, -554770, -409288, -22448, 120138, -44972, -125433, 39349, 199334, 233123, 333010, 544371, 606763, 403357, 139163, -56482, -256473, -331160, 58413, 803812, 1189852, 774759, 30417, -311254, -208335, -142451, -286269, -384473, -332769, -328158, -418652, -364132, -61471, 238684, 278673, 106367, -75169, -167018]
30506a67018j2663L3379J9724m4858m5667Q9983K39040K33285R2397m1774j29500
30495B66328k29337l14748k60428l2163K15580K78895J17810q4093r5774R8259
30485c9671K54906J58578j03543k57618j86280j8859Q6789R0892J1701j08839
30475a11944j64939p3280Q1872J36959P7390J5623k7101j02715j25606M1764K66140
30464A4163K21830j09606l33741j96736O0903J19812N5690J02335J88707Q6351
30454B09708j28896j60731Q973Q3636n9865j97275j55740o2962n4037j8147J55069
30443c80267L04667K24339L460j17295j19966j56487j92021l7479K37158K79871
30433D5980j0554k56527j44699Q8495M6345j78319j75792P2833J60154m5949j69548
$$ y = [-167018, -179681, -146302, -126578, -171436, -217103, -127120, 111920, 345205, 437602, 395828, 266328, 36991, -277757, -538185, -570348, -354768, -75873, 41937, -42156, -137930, -39671, 215235, 373813, 270270, 12652, -173628, -192487, -105698, -14806, -3105, -111944, -276883, -350163, -268291, -131332, -53942, -38319, -65420, -168135, -293741, -251977, 14163, 235993, 126387, -207354, -404090, -343187, -223375, -167685, -65350, 123357, 209708, 80812, -79919, -70946, 12690, -47175, -244450, -400190, -463152, -517189, -535336, -380267, -75600, 148739, 152199, 34904, -85062, -241549, -433570, -471049, -233891, 45980, 35426, -221101, -365800, -277305, -230960, -409279, -585071, -512238, -352084, -398033, -567581]
30422e67581L8650K90126K46418L3546m7492q08J5327L3926J10970P6586j51799
30411G7869k61178N549L17953J89725k32125l73542j21021J01254J05604J46234
30401d3678K84376K07262j26124k65158K3550L43672K72369o9729l38093m23015
30391a34568l13628L9989M17111L49918j70824m75037j32330L55554K98249j50567
30381H3867l19708q2829Q6211j9941q8539P8499K39423J42470j21351l03059k57546
30370e62503K000K81892K97365Q742k53764k30751r3106p6772l9777K05994L93254
30359f7426J60259k73146l66273q3350J26648J04012J13160K15953J55922o0489
30349B5270r7623P1276P8291j26211j11102K47389M41545J27088l19743m16586
$$ y = [-567581, -528931, -238805, 7613, 41159, -6333, -7141, 8186, 42112, 153082, 229668, 77869, -183309, -177760, 140193, 329918, 97793, -275749, -396770, -295516, -189912, -43678, 240698, 447960, 321836, 56678, 80228, 423900, 696269, 626540, 288447, -134568, -448196, -408207, 8904, 358822, 187998, -287039, -419369, -63815, 234434, 83867, -235841, -318670, -232459, -252400, -340939, -262440, -23017, 119453, -1898, -304957, -562503, -560503, -278611, 18754, 27496, -226268, -457019, -550125, -626897, -666674, -460680, -67426, 92833, -180313, -546586, -629936, -503288, -399276, -286116, -70163, 85759, 25270, -72353, -1077, 77214, -48997, -160099, 87290, 528835, 655923, 336180, -80406]
30339h0406k44651j10567j0029J40316J60509m4241j62008L8960K40925O7474
30329c718k68221l05661o1579R8962R1123Q9785O8398j04523k43480o2301K67060
30318d34155L00148K7132j20477L2427K08666K17263J84724J63117j869k66223
30308C10753l06341m0269J64687K5064k58806l58770k70007j70101q6851M5057
30298i45584J81611K32932J93623Q3150q2894j82175o7544J52505J79253j5295
30288b70418r2845J21985L38555K61524M5510j7101R513j06818k87881k65913
30278b63889o5077M3519J0744L5476J30767O8802j70776k74140o0294K31300K93626
30267a9942J46839J245o6587j02920r4587m17J13037J26743K8716p1606n8878
$$ y = [-80406, -325057, -435624, -445653, -305337, -144828, -189069, -351077, -312117, -71192, -3718, -271939, -577600, -639179, -540217, -449094, -359309, -290911, -395434, -638914, -701215, -434155, -134007, -106875, -227352, -194925, 13741, 231004, 415728, 578845, 576976, 310753, 4412, -35857, 128830, 153894, -104912, -463682, -733689, -903790, -990641, -945584, -763973, -531041, -337418, -254268, -337162, -519337, -586881, -434376, -255123, -270418, -363263, -241278, 97277, 358801, 404311, 387210, 396723, 289905, 2024, -263889, -328966, -285447, -274703, -239227, -108460, -39658, -210434, -484574, -544868, -313568, -19942, 126897, 128142, 61555, -41365, -135952, -136369, -23332, 103411, 132127, 60521, 1643]
30256A643Q1916K10389J10549k34353m82718k81180K11406M35306J63268j91781
30246B4445j91106K4495M9217j24054j59322L3122J87489J52174Q2703R6644O7407
30235B43214j11634l08052l28604j45165J33713L56325L64201J31218j05421p1909
30225A57886J50615K04439k6659k53726k30083p8984k8851q0267j14600j11996
30215d12226p8836M5623K36041L15514J98593K2303q4074j44302j51809k8679
30205h1852J10096J0866k26942j54135K57646L59240k06777p73376n34422K16439
30195a023217N21404K09230K0073L01831N07777K12977k07955l01429k24079k49122
30185b32510j95004J16516L37130J17000k35513k19292M2605P2226j13690r3699
$$ y = [1643, 83559, 293948, 404497, 170144, -312574, -593754, -382348, 52958, 216226, 24445, -166661, -142166, -92949, -217003, -376325, -343203, -155714, -3540, 79163, 175807, 243214, 131580, -176472, -505076, -650241, -516528, -160203, 203998, 335216, 229795, 157886, 308501, 512940, 486281, 232555, 2472, -76512, -105363, -185630, -300230, -412226, -491062, -445439, -209398, 106116, 304709, 327012, 242938, 98636, -53173, -81852, 28244, 39110, -187832, -341967, -84321, 274919, 68142, -705234, -1239656, -1023217, -501813, -292583, -272510, 29321, 537098, 750075, 542120, 240691, 16612, -232510, -427514, -310998, 26132, 143132, -92381, -311673, -269068, -196842, -310532, -404231]
30175d04231J39880J52116j16540j86168J25177L23541L7390l21566j77860K73963
30165a54298L39543r5513l74538r0180K67636Q0386l77817l06164L44761O78749
30155C12565J66748n08276m44270J42181L23682n7004k19611J91616M99519J18348
30145E25498m82346n14882k5981L27611K82823J07858k0697j55362k25001j08900
30135b89379J7534p8794j96923J7792L74391L16469j67535m24091q6075M00233
30125a16378M53560J17567j59605j69958n8216n165n9333j64458k02272j07497
30115d71755J6313L9564L5384J42239K56031J73167j470J7688J64958Q5540k07884
30104B49775k72535L373J42271j22223l39057p4514L22980K51366j93911m04203
$$ y = [-404231, -264351, -112235, -228775, -414943, -289766, 33775, 71165, -250401, -428261, -154298, 185245, 89732, -284806, -374986, -107350, -26964, -404781, -710945, -366184, 312565, 479313, -28963, -473233, -331052, -7370, -64374, -283985, -92369, 407150, 525498, 43152, -471730, -497711, -170100, 112723, 220581, 199884, 44522, -180479, -289379, -271845, -350639, -547562, -529770, -155379, 161090, -6445, -430536, -516611, -116378, 337182, 454749, 295144, 125186, 66970, 61805, 2472, -161986, -364258, -471755, -455442, -415878, -380494, -238255, 17776, 190943, 189473, 207161, 372119, 457659, 249775, -22760, -19387, 122884, 661, -338396, -412910, -89930, 161436, -32475, -436678]
30094d36678j86982Q8042J71064J86145K10612J23715o2679j65320j84191k87858
30084e44130l99662k36512J51862L33803J40152p3321j4213J15232N5656k9041
30074e00174J13364L05262J98286j20793k32786l9244J09604j6842k09200j96095
30064e88618l6560O0924Q9958J74820K68209J81774q0340k42517j13784J21423
30054a64711J28769j11823k54422n5634K69198L16989M1026j91941j17162P1177
30044f8534K7604k20691k91605Q964L84624M22474J37070p1287M776Q2388j72187
30033B43596n75036n92181q1539M45233M68654J20580p5449L7870J14255r0977
30023A5006l45917l09636n444K67581L26043K17810N5346r5754k08403k77281
$$ y = [-436678, -623660, -535618, -364554, -178409, 32203, 155918, 93239, -72081, -256272, -544130, -943792, -1180304, -1028442, -694639, -554487, -627808, -642021, -526789, -471133, -500174, -386810, -81548, 116738, -4055, -236841, -276085, -166481, -183323, -392523, -588618, -625178, -564254, -474296, -299476, -31267, 150507, 70167, -172350, -286134, -164711, -35942, -147765, -402187, -457821, -188623, 128366, 169392, -22549, -139711, -68534, -40930, -261621, -553226, -544262, -159638, 262836, 399906, 328619, 333395, 415783, 243596, -331440, -923621, -1005160, -559927, -91273, 29307, -46142, -8272, 105983, 15006, -330911, -640547, -645991, -378410, -52367, 165443, 220789, 125035, -83368, -360649]
30013c60649k71151q6844L14685O94680O68460J71823l86698n81435m07820j33825
30003c78774O8802J54849Q8584n6390o9281P5861Q3140j95688m13514k33283P9769
29992g95925P4641r8876M3053L92852L56127q1976k28463J46533L52207o7443
29982I2730n02853k45401L58064M92778J40973q7042n8881j54326l50348j91170
29972e05476K92889M87456J77763j30931j01802n1751k32897l09057N031L37172
29962c1603K11432j88480l26454j12196R4296J05156Q1386J45379J81906O4979
29952B25801j29921j95262k3329K13451J84749j53775l77141j46247K04227J01911
29942i5536l27862l96240K8685K85017M4857j19483K31227N60620K40895l36934
$$ y = [-360649, -631800, -718644, -403959, 290721, 959181, 1131004, 744306, 162871, -244949, -378774, -309972, -155123, -66539, -122929, -192210, -116349, -33209, -228897, -642411, -875694, -795925, -721284, -820160, -777107, -384255, -28128, -110104, -338567, -192034, 160173, 92730, -410123, -655524, -297460, 195318, 336291, 249249, 190368, 36042, -314306, -505476, -212587, 274869, 452632, 321701, 219899, 168148, -64749, -373806, -368775, -31603, 179829, -8651, -335105, -447301, -353005, -247849, -166463, -21084, 160822, 225801, 95880, -99382, -122711, 90740, 275489, 121714, -255427, -401674, -197447, -95536, -423398, -819638, -790953, -505936, -461079, -580562, -349335, 211285, 452180, 115246]
29932A15246l80648R039Q3133k62316l83469l3487K80756K02650J0724j186L3313
29921c26245l3210o4008J6421N4593K0988P2260J37216m8835l57197k79240K51983
29910e55274O14688L76396r3285k40513r3580j1516o0543p0833k2448J2588P5111
29899f9209J51620O3746j85958k63269j5993J87805R716k84657k38504P1810K06180
29888c66713P0523k8920O2302J86838K13126J50392j0355k22980k57962j0410
29878b14159J98776M6821k07590p4596L19888L41646j46043n09928k91920J37566
29868c99539K06316m0986j67238n1393P7278J10661J40504J67348J04074K1660
29858A68685O3306J40562L2735k05292k54779j6005K20660K03975M9715k7505
$$ y = [115246, -265402, -256363, -173230, -435546, -819015, -852502, -571746, -369096, -358372, -359558, -326245, -359455, -423463, -407042, -352449, -331461, -259201, -121985, -170820, -528017, -807257, -555274, 59414, 435810, 342525, 102012, 8432, -3084, -63627, -134460, -156908, -144320, -69209, 82411, 146157, -39801, -303070, -319063, -131258, -121542, -406199, -644703, -572893, -366713, -296190, -325110, -262808, -75970, 137156, 287548, 277193, 54213, -203749, -214159, -15383, 31438, -176152, -250748, 69140, 410786, 264743, -245185, -537105, -399539, -193223, -234209, -401447, -452840, -375562, -264901, -124397, 42951, 147025, 168685, 231991, 372553, 405288, 199996, -54783, -70788, 149872, 353847, 403562, 376057]
29848C76057o1746j74420k50911q1276K52023M21977K95685P1581m5627o0168
29838G43175l4954J2002o388j80546l32425j48420K58153L24161j29818m70827
29828C4113j34664M31386L66496k78254o00429k28745J85140P5282k29682k21729
29818f01086m8538o8052j15674J24913M08748K76596j30987k68198l5174J92768
29808b64684K64370L36810L32656l3m50245m54185J2126K96096M6031k87192k26224
29797c94474L2544R4394L7221J17944K00063J7122k48972j95809J27311K74136
29787F1480Q1314j50441j65466n0283L3983P5591Q0738M552q5283k1126J76507
29776D1566K35198j3238l72112n03810l04283M2674K84357K85122Q8209j13247
$$ y = [376057, 314311, 139891, -111020, -192296, 59727, 481704, 777389, 848970, 803343, 743175, 708221, 720223, 713835, 533289, 200864, 52444, 310597, 634758, 504940, 34113, -100551, 330835, 697331, 419077, -181352, -410097, -224957, -149675, -379357, -601086, -649624, -717676, -833350, -708437, -299689, -23093, -154080, -422278, -457452, -264684, -314, 336496, 669152, 669119, 218874, -235311, -223185, 72911, 118942, -168250, -394474, -361930, -267536, -230315, -112371, 87692, 104814, -144158, -339967, -212656, 61480, 142794, -7647, -173113, -223396, -189413, -113822, -33084, -28532, -113815, -134941, 41566, 276764, 263526, -108586, -612396, -916679, -874005, -589648, -304526, -216317, -329564]
29766c29564j31308J6251J18052L4483j31637k01191j58949j09345o8424L2150
29756i29482J53324J55832N3256O2334K64348L86327J47223k72544l94156q2874
29746d56412K65088K74520M8093j04700j32922j69195j86303o1520J20700J68973
$$ y = [-329564, -460872, -444621, -326569, -292086, -423723, -624914, -783863, -893208, -961632, -929482, -776158, -620326, -567070, -504736, -240388, 145939, 293162, 20618, -373538, -456412, -191324, 83196, 131289, 26589, -106333, -275528, -461831, -523351, -402651, -233678]
$$ [...]
##END NTUPLES=NMR SPECTRUM
##END=
