##TITLE=31Pdec_LY-6.1.Dix.1.B
 CD3CN, 24 sc
 31.03.2021
##JCAMPDX= 6.0         $$ Bruker NMR JCAMP-DX V2.0
##DATA TYPE= NMR SPECTRUM
##DATA CLASS= NTUPLES
##ORIGIN= UXNMR, Bruker Analytische Messtechnik GmbH
##OWNER= root
$$ XWIN-NMR		Version 3.5
$$ Wed Mar 31 11:16:35 2021 Russian Standard Time (UT+4h)  she@DPX200
##.OBSERVE FREQUENCY= 81.013821
##.OBSERVE NUCLEUS= ^31P
##.ACQUISITION MODE= SIMULTANEOUS
##.ACQUISITION SCHEME= undefined
##.AVERAGES= 24
##.DIGITISER RES= 16
##SPECTROMETER/DATA SYSTEM= spect
##.PULSE SEQUENCE= zgpg30
##.SOLVENT NAME= CDCl3
##.SHIFT REFERENCE= (INTERNAL, CDCl3, 0, 248.564)
##AUDIT TRAIL= $$ (NUMBER, WHEN, WHO, WHERE, WHAT)
$$ ##TITLE= Audit trail, XWIN-NMR		Version 3.5
$$ ##JCAMPDX= 5.01
$$ ##ORIGIN= Bruker BioSpin GmbH
$$ ##OWNER= she
$$ F:/spectra/data/she/nmr/P31/1/pdata/1/auditp.txt
$$ ##AUDIT TRAIL=  $$ (NUMBER, WHEN, WHO, WHERE, WHAT)
(   1,<2021-03-31 11:15:09.70 +0400>,<she>,<DPX200>,
      <created by zg, POWCHK disabled, PULCHK disabled
       configuration hash MD5:
       00 E9 B6 7A A2 85 ED C7 34 08 36 98 17 FE 4E 26
       data hash MD5: 32K
       C6 F0 9C EB 7B 58 FD E8 3D 53 BD C4 A8 ED 2A 64>)
(   2,<2021-03-31 11:15:21.78 +0400>,<she>,<DPX200>,
      <Start of raw data processing
       efp BC_mod = 2 LB = 1 FT_mod = 6 PKNL = 1 PHC0 = -4525.5 PHC1 = 341.801 SI = 64K 
       data hash MD5: 64K
       B7 F0 3C 80 28 F7 63 EF 47 8C 78 F6 9F 85 7D B9>)
(   3,<2021-03-31 11:15:55.73 +0400>,<she>,<DPX200>,
      <pk PHC0 = -79.0656 PHC1 = 101.2 
       data hash MD5: 64K
       CE 36 DF 2E 82 47 9F AD 94 BC BD BC 7D 4F C6 B5>)
(   4,<2021-03-31 11:15:59.26 +0400>,<she>,<DPX200>,
      <abs ABSG = 5 
       data hash MD5: 64K
       3A 8A 45 E4 52 78 57 0F E3 78 60 4A 4C BD C5 DD>)
$$ ##END=
$$ 
$$ hash MD5
$$ 3C 4B 92 68 C7 14 DD 06 64 8A B0 72 5B D1 E6 6D
##$RELAX= 
##$RELAX= 
##$RELAX= 
##$RELAX= 
##$RELAX= 
##$RELAX= 
##$RELAX= 
##$RELAX= 
$$ Bruker specific parameters
$$ --------------------------
##$DU= <F:/spectra>
##$EXPNO= 1
##$NAME= <P31>
##$PROCNO= 1
##$TYPE= <nmr>
##$USER= <she>
##$AMP= (0..31)
100 100 100 100 100 100 100 100 100 100 100 100 100 100 100 100 100 100 
100 100 100 100 100 100 100 100 100 100 100 100 100 100 
##$AQSEQ= 0
##$AQ_mod= 1
##$AUNM= <au_zg>
##$AUTOPOS= <>
##$BF1= 81.014009
##$BF2= 200.13
##$BF3= 200.13
##$BF4= 200.13
##$BF5= 200.13
##$BF6= 200.13
##$BF7= 200.13
##$BF8= 200.13
##$BYTORDA= 1
##$CFDGTYP= 0
##$CFRGTYP= 5
##$CHEMSTR= <none>
##$CNST= (0..31)
1 1 145 1 1 1 1 1 1 1 1 1 1 1 1 1 1 1 1 1 1 1 1 1 1 1 1 1 1 1 1 1 
##$CPDPRG= <waltz16>
##$CPDPRG1= <>
##$CPDPRG2= <waltz16>
##$CPDPRG3= <>
##$CPDPRG4= <mlev>
##$CPDPRG5= <mlev>
##$CPDPRG6= <mlev>
##$CPDPRG7= <mlev>
##$CPDPRG8= <mlev>
##$CPDPRGB= <>
##$CPDPRGT= <>
##$D= (0..31)
0 1 0 0 0 0 0 0 0 0 0 0.03 2e-05 3e-06 0 0 0 0 0 0 0 0 0 0 0 0 0 0 0 0 
0 0 
##$DATE= 1617174909
##$DBL= (0..7)
120 120 120 11 120 120 24 19 
##$DBP= (0..7)
150 150 150 150 150 150 150 150 
##$DBP07= 0
##$DBPNAM0= <>
##$DBPNAM1= <>
##$DBPNAM2= <>
$$ [...]
##$SUBNAM3= <"">
##$SUBNAM4= <"">
##$SUBNAM5= <"">
##$SUBNAM6= <"">
##$SUBNAM7= <"">
##$SUBNAM8= <"">
##$SUBNAM9= <"">
##$SW= 501.771253377433
##$SWIBOX= (0..15)
0 1 3 0 0 0 0 0 0 0 0 0 0 0 0 0 
##$SW_h= 40650.406504065
##$TD= 32768
##$TD0= 1
##$TE= 0
##$TE2= 300
##$TE3= 300
##$TEG= 300
##$TL= (0..7)
0 120 53 12 22 120 120 120 
##$TP= (0..7)
150 150 150 150 150 150 150 150 
##$TP07= 0
##$TPNAME0= <>
##$TPNAME1= <>
##$TPNAME2= <>
##$TPNAME3= <>
##$TPNAME4= <>
##$TPNAME5= <>
##$TPNAME6= <>
##$TPNAME7= <>
##$TPOAL= (0..7)
0.5 0.5 0.5 0.5 0.5 0.5 0.5 0.5 
##$TPOFFS= (0..7)
0 0 0 0 0 0 0 0 
##$TUNHIN= 0
##$TUNHOUT= 0
##$TUNXOUT= 0
##$USERA1= <user>
##$USERA2= <user>
##$USERA3= <user>
##$USERA4= <user>
##$USERA5= <user>
##$V9= 5
##$VALIST= <valist>
##$VCLIST= <CCCCCCCCCCCCCCC>
##$VD= 0
##$VDLIST= <DDDDDDDDDDDDDDD>
##$VPLIST= <PPPPPPPPPPPPPPP>
##$VTLIST= <TTTTTTTTTTTTTTT>
##$WBST= 1024
##$WBSW= 4
##$XGAIN= (0..3)
0 0 0 0 
##$XL= 0
##$YL= 0
##$YMAX_a= 4558
##$YMIN_a= -18323
##$ZGOPTNS= <>
##$ZL1= 120
##$ZL2= 120
##$ZL3= 120
##$ZL4= 120
##$ABSF1= 248.5645
##$ABSF2= -253.2056
##$ABSG= 5
##$ABSL= 3
##$ALPHA= 0
##$AQORDER= 0
##$ASSFAC= 0
##$ASSFACI= 0
##$ASSFACX= 0
##$ASSWID= 0
##$AUNMP= <proc_1d>
##$AZFE= 0.1
##$AZFW= 0.5
##$BCFW= 0
##$BC_mod= 2
##$BYTORDP= 0
##$COROFFS= 0
##$CY= -3
##$DATMOD= 1
##$DC= 0
##$DFILT= <>
##$DTYPP= 0
##$F1P= 0
##$F2P= 0
##$FCOR= 1
##$FTSIZE= 65536
##$FT_mod= 6
##$GAMMA= 0
##$GB= 0
##$INTBC= 1
##$INTSCL= 5.30512e-09
##$ISEN= 30
##$LB= 1
##$LEV0= 0
##$LPBIN= 0
##$MAXI= 10000
##$MC2= 0
##$MEAN= 0
##$ME_mod= 0
##$MI= 50
##$NCOEF= 0
##$NC_proc= -3
##$NLEV= 6
##$NOISF1= 182.463
##$NOISF2= 159.3651
##$NSP= 0
##$NTH_PI= 0
##$NZP= 0
##$OFFSET= 248.5645
##$PC= 4
##$PHC0= -4604.565
##$PHC1= 443.001
##$PH_mod= 1
##$PKNL= yes
##$PPARMOD= 0
##$PSCAL= 0
##$PSIGN= 0
##$REVERSE= no
##$SF= 81.014009
##$SI= 65536
##$SIGF1= 159.3651
##$SIGF2= -187.1042
##$SINO= 113.3802
##$SIOLD= 16384
##$SREGLST= <1H.CDCl3>
##$SSB= 0
##$STSI= 65536
##$STSR= 0
##$SW_p= 40650.406504065
##$SYMM= 0
##$S_DEV= 0
##$TDeff= 32768
##$TDoff= 0
##$TI= <>
##$TILT= no
##$TM1= 0
##$TM2= 0
##$TOPLEV= 0
##$USERP1= <user>
##$USERP2= <user>
##$USERP3= <user>
##$USERP4= <user>
##$USERP5= <user>
##$WDW= 1
##$XDIM= 65536
##$YMAX_p= 340379686
##$YMIN_p= -7304331
$$ End of Bruker specific parameters
$$ ---------------------------------
##NTUPLES= NMR SPECTRUM
##VAR_NAME=  FREQUENCY,     SPECTRUM/REAL,   SPECTRUM/IMAG
##SYMBOL=    X,             R,               I
##VAR_TYPE=  INDEPENDENT,   DEPENDENT,       DEPENDENT
##VAR_FORM=  AFFN,          ASDF,            ASDF
##VAR_DIM=   65536,         65536,           65536
##UNITS=     HZ,            ARBITRARY UNITS, ARBITRARY UNITS
##FACTOR=    0.620285442955139, 1,           1
##FIRST=     20137.2065510759, 0,            0
##LAST=      -20513.1999529892, 0,           0
##MIN=       -20513.1999529892, -7304331,    0
##MAX=       20137.2065510759, 340379686,    0
$$ Real data points
##PAGE= N=1
##DATA TABLE= (X++(R..R)), XYDATA
$$ [...]
35796A41331l93308l32257P1136K83565J22382o207J52624K72787O1501k07475
$$ 141331 -251977 -584234 -513098 -229533 -107151 -113358 39266 312053 373554 166079
35786A66079j84493k4348j1115n106K03908L41189N6768l53116k80050K55366
$$ 166079 -18414 -42762 -53877 -58983 144925 486114 542882 189766 -90284 165082
35776A65082O01098L86671q9193l84925l61280r8786K02248K45726n0712l19312
$$ 165082 766180 1152851 1063658 678733 317453 218667 420915 666641 615929 296617
35766B96617j91340J30712J81330k5678q1567Q6316J44567n969j05306q5096j61763
$$ 296617 105277 235989 417319 391641 310074 396390 540957 534988 429682 344586 182823
35755A82823k98968j63364K39860M46522K37453n0888j16224r2481j47144j60883
$$ 182823 -116145 -279509 -39649 406873 644326 593438 477214 384733 237589 76706
35745G6706n5732n295q2664j10461n4516j20044k71006j62876K11872L54649L7960
$$ 76706 20974 15679 -66985 -177446 -231962 -352006 -623012 -785888 -574016 -219367 -181407
35734a81407k92437k45759o4044n5010j3297K68025M37583J62280j85847j01145
$$ -181407 -473844 -719603 -783647 -838657 -851954 -583929 -146346 15934 -169913 -271058
35724b71058J82187J27034j22543k6321K93731J89332l50478n77236j69797K86984
$$ -271058 -88871 38163 -84380 -110701 183030 372362 21884 -555352 -725149 -438165
35714d38165K74142M3811L959O7904M7655J13968L65844M26160J6415m45859m04181
$$ -438165 -164023 -120212 -116253 -48349 -694 113274 479118 905278 921693 475834 71653
35703G1653l5363M2200k44131l61776p0055K40319K28816Q9318J08244J63072
$$ 71653 36290 78490 -165641 -527417 -597472 -357153 -128337 -39019 69225 232297
35693B32297k053k71858k92244N635L13304L54123J60585o4147j77046j48548
$$ 232297 230244 -41614 -333858 -328223 -14919 339204 499789 435642 258596 110048
35683A10048k9288P0159N3158n4129j22495p8339J5524O4529O0216M7770L5361
$$ 110048 80760 150919 204077 149948 27453 -50886 -35362 29167 89383 137153 172514
35672A72514r83n7591j04577j17338o1365R9452L01581L47475J07227k50064l77042
$$ 172514 171531 113940 9363 -107975 -169340 -69888 231693 579168 686395 436331 59289
35661E9289j55787J45813K19076J02848Q0199K43158L40832J11197l54415o73406
$$ 59289 -96498 49315 268391 371239 451438 694596 1035428 1146625 792210 118804
35651A18804n70760j59830J79296J85708k4431j02657J19667M10665L96399K5954
$$ 118804 -451956 -611786 -432490 -246782 -271213 -373870 -254203 156462 552861 578815
35641E78815l22675k65628J17333L48489J12823l48289n15160k27495J24244J26245
$$ 578815 256140 -9488 107845 456334 569157 220868 -294292 -521787 -397543 -271298
35631b71298j04161j10468K19987M69253K85613j17804l00201k19648j78985k42103
$$ -271298 -375459 -485927 -265940 203313 488926 371122 70921 -148727 -327712 -569815
35621e69815j23497K64069N48427M09452N4514j08488n8486q1778k35305k68739
$$ -569815 -693312 -429243 119184 528636 583150 474662 416176 334398 99093 -169646
35611a69646p4190J34498J66959R5783M7747L121p0360r1311r270Q6784J12890
$$ -169646 -243836 -109338 57621 153404 201151 204272 133912 42601 33331 120115 233005
35600B33005R1353L6443p5433j57442o5228J20511J39521j1046k2157J71166J80132
$$ 233005 324358 360801 285368 127926 62698 183209 322730 311684 289527 460693 640825
35589F40825j91771n02954l20331M5127K6855k37560j34933L43049N16753J10912
$$ 640825 449054 -53900 -374231 -329104 -302249 -539809 -674742 -331693 185060 295972
35579B95972l03610k18353J03688J85530N9711R983K1336o8474j89693k05042
$$ 295972 -7638 -225991 -122303 63227 122938 132921 154257 85783 -103910 -308952
35569c08952j73139j25931Q3621L86351L59588j00177m04221j04629L21326J91435
$$ -308952 -482091 -608022 -524401 -138050 221538 121361 -282860 -387489 -66163 125272
35559A25272k38987j90199K97897M00325q5903l64990L2662M60777K18397l37966
$$ 125272 -113715 -303914 -6017 394308 308405 -56585 -23923 436854 655251 317285
35549C17285m22564l8422J76790J2958j45796r6896p0999j64950j21484J58026
$$ 317285 -105279 -143701 33089 46047 -99749 -196645 -267644 -432594 -554078 -396052
35539c96052L56395K27501j8821o9984K7942L3765o3867p7220L3614J25203J42948
$$ -396052 -39657 187844 169023 99039 126981 160746 96879 19659 53273 178476 321424
35528C21424J65238J65307J256k66065l09592J3392L47940K53702j77370m27705
$$ 321424 486662 651969 653225 387160 77568 90960 438900 692602 515232 87527
35518H7527k57682L1349J10292N9296J02303J89137J24719n8494j49325r0760
$$ 87527 -170155 -138806 -28514 30782 133085 322222 446941 388447 239122 148362
35508A48362q673L5427Q8237J39385J22219M9981k8647j50181l23152l80881j82779
$$ 148362 139689 175116 263353 402738 524957 574938 546291 396110 72958 -307923 -490702
35497d90702J06131J98492J00749O6109J58060J71181J4087j36656j43381r8275
$$ -490702 -384571 -186079 -85330 -19221 138839 310020 324107 187451 44070 -54205
35487e4205j13930j55386j62035j25958n330K07835L19929J32800j57743j21207
$$ -54205 -168135 -323521 -485556 -611514 -616844 -409009 -89080 43720 -114023 -235230
35477b35230K54137M65734K30992r9085j34902m5812j60429l16167j38288K33667
$$ -235230 18907 484641 715633 616548 481646 435834 275405 -40762 -179050 54617
35467E4617K88301k3742j79420P5588L11221J04943k89875l56514r8881M9222
$$ 54617 342918 319176 139756 215344 526565 631508 341633 -14881 -113762 -64540
35457f4540m0860m7295J69817K68532o643l26672k27218J56364K58217n6208k77699
$$ -64540 -105400 -152695 17122 285654 279011 -47661 -274879 -118515 139702 83494 -194205
35446a94205m3983K91810J97261k37966m48056k03781J35708J95355N1642M455
$$ -194205 -238188 53622 250883 12917 -435139 -638920 -503212 -307857 -256215 -251760
35436b51760J25553K10420R0895j26661j64575P0808K92890J56781k21120l45525
$$ -251760 -126207 84213 175108 48447 -116128 -45320 247570 404351 183231 -162294
35426a62294n5442J97440L9290k27978j38171J50222J40823j32570j82030O0387
$$ -162294 -217736 -20296 18994 -208984 -347155 -196933 -56110 -188680 -370710 -310323
35416c10323J38698r3704k24435m0003J24071M7144P928J74646K15336o6287k60617
$$ -310323 -171625 -265329 -489764 -529767 -405696 -358552 -350624 -175978 39358 -26929 -287546
35405b87546r639L47315L23446O9748M2252K23765K63880J37660J03248K10745
$$ -287546 -297185 50130 373576 443324 485576 709341 973221 1110881 1214129 1424874
35395A424874L58798N97201Q56122O73225j77753j039405j073285m53182r7919
$$ 1424874 1783672 2380873 3236995 3910220 3732467 2693062 1619777 1166595 1068676
35386A068676k96935m31242j19908K13738J68700j0803j5492l1911k78077m87686
$$ 1068676 771741 340499 220591 434329 603029 592226 576734 544823 266746 -220940
35376b20940l30375J8389J52965J4647j48760j63972l959K75166M50500K69947
$$ -220940 -551315 -532926 -379961 -365314 -514074 -678046 -682005 -406839 43661 313608
35366C13608j28128k70285l3547J28893p4543k64486l3964L11710K07212k54950
$$ 313608 185480 -84805 -118352 10541 -64002 -328488 -362452 -50742 156470 -98480
35356i8480m51492j50655K43647L45833J95233k9057k59543m01590k99122J4932
$$ -98480 -549972 -700627 -456980 -111147 84086 55029 -204514 -606104 -905226 -890294
35346h90294K68115K55738N0517j18839p2675J86054M09398K90379j24291l80990
$$ -890294 -622179 -366441 -315924 -434763 -507438 -321384 88014 378393 254102 -126888
35336a26888j99015J18925J61478L7445Q8619K01867O846l36563k44945L07611
$$ -126888 -325903 -206978 -45500 -8055 80564 282431 289277 -47286 -292231 15380
35326A5380O12908K81550j78564k12113m3845j38238l34282j78695J94906K29803
$$ 15380 628288 909838 731274 519161 475316 337078 2796 -175899 19007 248810
35316B48810j31043l51539j55514J13975J06485o4767j40190r3289j418J25954
$$ 248810 117767 -233772 -389286 -275311 -168826 -233593 -373783 -467072 -468490 -342536
35306c42536K13647J16893r2914j38817J7966P7161p7208j24414J47608M02906
$$ -342536 -128889 -11996 -104910 -243727 -225761 -148600 -225808 -350222 -202614 200292
35296B00292K46817j26245k26267k2251Q8918k1133o6971O9572J22316m5424j64828
$$ 200292 447109 320864 94597 72346 161264 140131 73160 142732 265048 219624 54796
35285E4796l8829R1838l3346k27454j71731L8485P4203m8582j8321J84580K13088
$$ 54796 15967 107805 74459 -152995 -324726 -286241 -212038 -260620 -278941 -94361 118727
35274A18727m6631k33874p5572J76968J63630k5846p4566q332r7820k81088j84536
$$ 118727 72096 -161778 -237350 -60382 103248 77402 2836 -5496 -103316 -384404 -568940
35263e68940K04503L76286M7727l42601k51829J66812L35506J30101l5661M7555
$$ -568940 -364437 11849 59576 -283025 -534854 -368042 -32536 97565 61904 109459
35253A09459J11696j1250o7168J10233K25166K2648k04839p3323J97552Q8555
$$ 109459 221155 209905 142737 252970 478136 500784 295945 222622 420174 508729
35243E08729l45037m90386j16958K59690J62266j72144k29411J6840J81536J09905
$$ 508729 163692 -326694 -443652 -183962 -21696 -193840 -423251 -406411 -224875 -114970
35233a14970K5168Q5984J63092J17354K7044K6199R0894R3293l1175k28223l52599
$$ -114970 -89802 -3818 159274 276628 303672 329871 420765 514058 482883 254660 -97939
35222i7939k41937J08648M21250L53731o6845l90592k75228O3800J48940r5282
$$ -97939 -339876 -231228 190022 543753 476908 86316 -188912 -125112 23828 -71454
35212g1454k61982p9669J96063J83984o7981j96858n9744J36432J90971J15339
$$ -71454 -333436 -413105 -217042 -33058 -101039 -297897 -357641 -221209 -30238 85101
35202H5101j3714j35181j18316J15259L33656J80489k70237m86537j98943J85144
$$ 85101 71387 -63794 -182110 -66851 266805 447294 177057 -309480 -508423 -323279
35192c23279J69185j25063k07910K7498K24267J45525n3101j40425q7415N479
$$ -323279 -154094 -279157 -487067 -459569 -235302 -89777 -142878 -283303 -370718 -365239
35182c65239L7556k9745q3539O0099L21606L27520k2224k47450M0092M45503L40149
$$ -365239 -327683 -357428 -440967 -380868 -59262 268258 246034 -1416 38676 484179 824328
35171H24328j21575k52500L192N014l94140n11422k3754L84001J19846l26713
$$ 824328 702753 450253 453445 458459 64319 -447103 -470857 -86856 32990 -293723
35161b93723k24245J85292J75961j79571j78340K41208L64637q5604m70361k43056
$$ -293723 -517968 -332676 -156715 -336286 -514626 -273418 91219 5615 -464746 -707802
35151g07802K53651L85557J15938j25742j34078p3024q2561p1494R6333L65392
$$ -707802 -454151 -68594 47344 -78398 -212476 -285500 -368061 -439555 -343222 22170
35141B2170M76738K21876k44714m70827k41218J04396J38519l3792J730K35904
$$ 22170 498908 720784 476070 5243 -235975 -131579 6940 -26852 -25122 210782
35131B10782K25800j44549m15467k54220N5768J13082m278N817J23009J20243
$$ 210782 436582 292033 -123434 -377654 -321886 -208804 -213082 -207265 -84256 35987
35121C5987K7588O1539J84485J33852j09342k36952p8556J36022J12172j14956
$$ 35987 63575 125114 309599 443451 334109 97157 18601 154623 266795 151839
35111A51839k77395k41468j15106k7233N3724K19968M09496M11170J42859j64191
$$ 151839 -125556 -367024 -482130 -509363 -455639 -235671 173825 584995 727854 563663
35101E63663k03216M002J21078l5614k43848k24013n3720n818r3542p6577R1642
$$ 563663 360447 364449 485527 449913 206065 -17948 -71668 -77486 -171028 -247605 -155963
35090a55963J42848o7260k74884j74226J21872K49039J15586k7488k5327l2244
$$ -155963 -13115 -80375 -355259 -529485 -407613 -158574 -42988 -70476 -95803 -128047
35080a28047j92159l51181k65321M6989L29103L82099K08591n6268k31210j84672
$$ -128047 -320206 -671387 -936708 -889719 -560616 -178517 30074 -26194 -257404 -442076
35070d42076K6010J76161J41732N0407M6539M2380j08884l09478l22802j20660
$$ -442076 -416066 -239905 -98173 -47766 -1227 41153 -67731 -377209 -700011 -820671
35060h20671R9100J91153J51317J3896r8807N2803M78268O92217K31687n86632
$$ -820671 -721571 -530418 -379101 -365205 -464012 -411209 67059 759276 990963 404331
35050D04331r18131m77872J24276K91335J54936J09411J42415N1703o3718p633
$$ 404331 -513800 -991672 -867396 -576061 -421125 -311714 -169299 -117596 -181314 -188947
35040a88947Q8432O69j36126m9698J74794K49014J71894J33519Q0583j48463l65050
$$ -188947 -100515 -99846 -235972 -285670 -110876 138138 310032 443551 524134 375671 10621
35029A0621k25181J45131K41611m3904k43086m6369K42066K17136k8536j14913
$$ 10621 -214560 -69429 172182 128278 -114808 -161177 80889 298025 269489 154576
35019A54576M8603J89328Q6067j52983k39457n7209J68875J18971j92064l91705
$$ 154576 203179 392507 478574 325591 86134 28925 197800 316771 124707 -266998
35009b66998k55546k0330P703p3480J2985K14743K53377J18905M9261P2568j2131
$$ -266998 -522544 -542874 -535171 -608651 -595666 -380923 -127546 -8641 40620 113188 101057
34998A01057k05113k67406j40065j3187N7856K12770M16610M29610K15900k654
$$ 101057 -104056 -371462 -511527 -524714 -466858 -254088 162522 592132 808032 805378
34988H05378j50493l37582m52080k14537K44728L97604J08102j28584o309R7204
$$ 805378 654885 317303 -134777 -349314 -104586 293018 401120 272536 266227 363431
34978C63431j57974l97694j35782L57163M34313P5528j56942o2870l4878k80745
$$ 363431 205457 -192237 -328019 29144 463457 538985 382043 319173 284295 3550
34968C550m32494j71786K26413L10550J07557K316J25403K20239J01478p3781
$$ 3550 -428944 -600730 -374317 -63767 43790 46106 171509 391748 493226 419445
34958D19445r9163l6313m0956m6571R0006K12548J6235l74143m14883M5513M00790
$$ 419445 320282 283969 243013 196442 286448 498996 515231 141088 -273795 -228282 172508
34947A72508J25964l95925m32611q209K26854Q6432K7484K00777J54251k56557
$$ 172508 298472 -97453 -530064 -538273 -311419 -224987 -197503 3274 157525 -99032
34937i9032m43547j9636M95033M51877L6378j50596n7605p6284k51036k50854
$$ -99032 -542579 -562215 -67182 384695 421073 270477 212872 136588 -114448 -365302
34927c65302mK27609K78079K22556Q6099j08990j61062K4669J32568j17421m07310
$$ -365302 -365306 -137697 140382 362938 449037 340047 178985 203654 336222 218801 -188509
34916a88509k51988J62901K11780j67376l93057k12858l8463j22623j07013K58747
$$ -188509 -440497 -277596 -65816 -233192 -626249 -839107 -877570 -1000193 -1107206 -848459
34906h48459N58356L45496j13550k44428K356K16949K09976J48424J38262J11663
$$ -848459 -290103 55393 -58157 -302585 -300229 -83280 126696 275120 413382 525045
34896E25045P9223J13210J02645j21364m11894m06191o3666K10615J02527k03494
$$ 525045 604268 717478 820123 698759 286865 -119326 -182992 27623 130150 -73344
34886g3344l03706p2951K67129M33150K93482p7772m14580m31137j31912J37544
$$ -73344 -377050 -450001 -182872 250278 543760 465988 51408 -379729 -511641 -374097
34876c74097J03292p3634n3086J52302K01810o394j45130J0217J88046M8073k42671
$$ -374097 -270805 -344439 -397525 -245223 -43413 -49807 -194937 -184720 3326 51399 -191272
34865a91272k49918L6751J91474L6710j05540J3720J57384L2448j82442j05130
$$ -191272 -441190 -404439 -212965 -176255 -281795 -268075 -110691 -78243 -260685 -365815
34855c65815K24682L74083J49862j31002r8986J71377K84626M6923k95371l75792
$$ -365815 -141133 232950 382812 251810 152824 324201 608827 655750 360379 -15413
34845a5413j75347l5084j69319l38687j93868J73177L25124J28424m0353J25916
$$ -15413 -190760 -225844 -395163 -733850 -927718 -754541 -429417 -300993 -341346 -215430
34835b15430L94452L46139k3741l34712l14297j6209L39028N04129K96351j88787
$$ -215430 179022 525161 501420 166708 -147589 -163798 175230 679359 975710 786923
34825G86923n23778l67122R6509L62051K12078j12527l07719k99886j40028J05366
$$ 786923 263145 -103977 -7468 354583 566661 454134 146415 -153471 -293499 -188133
34815a88133K76873J90645q4922k24210o7908J19508R153k90003l33574M4765
$$ -188133 88740 279385 194463 -29747 -97655 21853 31006 -258997 -592571 -547806
34805e47806M50003L97338o0919l96406k89136l797N8546m0928O5881L95910N08163
$$ -547806 -97803 299535 238616 -157790 -446926 -450723 -392177 -433105 -367224 28686 536849
34794E36849J48056l53302n34743l85245j97235n4885J81709M69207N19312K13603
$$ 536849 684905 331603 -203140 -588385 -785620 -840505 -658796 -189589 329723 543326
34784E43326j67711k59119l5756J73174P0765k51619l92763j32834K30479K29746
$$ 543326 375615 116496 80740 253914 324679 73060 -319703 -452537 -222058 7688
34774G688j09472k59805M5719L92315K94417p6901j89490J5426R1955j21457k06594
$$ 7688 -101784 -361589 -315870 76445 370862 293961 104471 119897 211852 90395 -116199
34763a16199J44508N55373M26774k26460p48953o36531r4747K77448K02312l3205
$$ -116199 28309 583682 1010456 783996 35043 -601488 -696235 -418787 -216475 -249680
34753b49680k7990J98387K61537l0764l68028l08030J38628M77266L17107j42807
$$ -249680 -277670 -79283 182254 151490 -216538 -524568 -385940 91326 408433 265626
34743B65626l46473q0837K31257Q8288l60412m68520l1203L48230J29847l09028
$$ 265626 -80847 -161684 69573 157861 -202551 -671071 -702274 -354044 -224197 -533225
34733e33225k28380K99826M77251L5256l55955j66153K23008K45414L2121N809
$$ -533225 -761605 -461779 15472 50728 -305227 -471380 -248372 -2958 29163 34972
34723C4972Q4504n4528k54219j11001K60103L50357N9371k24120k87211k60849
$$ 34972 119476 64948 -189271 -300272 -40169 310188 369559 145439 -141772 -402621
34713d02621j58749J47683M62600L83511l579j34294J55004L36013L8695l53801
$$ -402621 -561370 -413687 48913 432424 428845 294551 449555 785568 824263 470462
34703D70462l36130n2160K7577j22164j40321N1124J30774o4383k65566j76335
$$ 470462 134332 82172 109749 -12415 -152736 -101612 29162 -35221 -300787 -477122
34693d77122J15920K94459K32904R4333N5529Q2122K9102j30362k77220l05496
$$ -477122 -361202 -66743 166161 260494 316023 398145 427247 296885 19665 -285831
34683b85831k01300K485K15997K73207J06698q0331m3961J17303J04625o2960
$$ -285831 -487131 -484646 -268649 4558 111256 30925 -13036 104267 208892 145932
34673A45932p1859Q7769M9874k27790k67420R6757K94480o2042m09438q3941N23853
$$ 145932 74073 161842 211716 -16074 -283494 -186737 107743 45701 -363737 -447678 76175
34662G6175N20673p4904m03590j41492J46364Q8962J7857J68425K19648k0492
$$ 76175 596848 521944 118354 -23138 123226 212188 230045 398470 618118 597626
34652E97626j97855p9013k26k22825m02820j67694K44612L83206K35989O2467
$$ 597626 399771 320758 320532 97707 -305113 -472807 -228195 155011 391000 453467
34642D53467p4257k01250j81461K9137J43955m8347k78712j67672K00150M19272
$$ 453467 379210 177960 -3501 25636 169591 121244 -157468 -325140 -124990 294282
34632B94282L25370J04627m4954j04906j51640k30728k65817j02546K06826K86074
$$ 294282 619652 724279 679325 574419 422779 192051 -73766 -176312 30514 316588
34622C16588p1814m34517k57010K11479K18958k59996l97539J52929O50918M45774
$$ 316588 244774 -189743 -446753 -235274 -16316 -276312 -673851 -520922 129996 575770
34612E75770m5334j54001l5200j60085l29079p8622L33900K70841j90332l77986
$$ 575770 530436 376435 341235 181150 -147929 -226551 107349 378190 187858 -190128
34602a90128j29291N5838n7493j38851P060J39048J08140Q2666J12954J9588j59046
$$ -190128 -319419 -263581 -321074 -459925 -452865 -313817 -205677 -123011 -10057 9531 -149515
34591a49515j31981R9335J69650k2966j15541R5093K91079J57924j16586j63281
$$ -149515 -281496 -182161 -12511 -35477 -151018 -55925 235154 393078 276492 113211
34581A13211K9247J78493J28221l1967j66847k42029k89772k95889j56892J58531
$$ 113211 142458 320951 449172 417205 250358 8329 -281443 -577332 -734224 -575693
34571e75693M13540L07598l4900j18601J71834K89117j30275n67380l51915K43203
$$ -575693 -162153 145445 110545 -8056 163778 452895 322620 -244760 -596675 -353472
34561c53472L78049n5256l23236m6593L08822L02031J21144L9917m9333k12172
$$ -353472 24577 -30679 -353915 -400508 -91686 210345 331489 371406 322073 109901
34551A09901j92620M9061P6954l02862n75293k64946K86892M35552J64812o2078
$$ 109901 -82719 -33658 43296 -259566 -834859 -1099805 -812913 -377361 -212549 -274627
34541b74627r8456j56210k26554p1225K43555L45629J40402m7473R964J62240
$$ -274627 -373083 -529293 -755847 -827072 -583517 -237888 -97486 -144959 -134995 27245
34531B7245J96300J07789k5817j56237j78232o662J94218J41931j15967j84109
$$ 27245 223545 331334 305517 149280 -28952 -35614 158604 300535 184568 459
34521D59J01898L69657K20609j80405l41525j52061O402j14098k45176m9514K99227
$$ 459 102357 472014 692623 512218 170693 18632 25034 -89064 -334240 -383754 -84527
34510h4527L21076n5625l49821j96518J65752L00527J95462J32427J16268j01111
$$ -84527 236549 180924 -168897 -365415 -199663 100864 296326 428753 545021 443910
34500D43910m37951m33319L1852M12050K33751j86522k06196J72986L29996m735
$$ 443910 5959 -427360 -395508 16542 250293 63771 -142425 30561 360557 355822
34490C55822l42360j82368K67809M42473K09581o3650j10024n0253p0987j38050
$$ 355822 13462 -168906 98903 541376 750957 687307 577283 527030 456043 317993
34480C17993j41470r5522n6511q614L6125k3158j84599k31703o586L06357L87144
$$ 317993 176523 81001 24490 15876 52001 28843 -155756 -387459 -394045 -87688 299456
34469B99456K07524K0760l9498q5355j78856j92401o9285J9831o4593j99363j81429
$$ 299456 506980 527740 488242 402887 224031 31630 -37655 -17824 -82417 -281780 -463209
34458d63209L08K06422L18470K58076Q557k52680k43151L3963K00496K4561j90165
$$ -463209 -462901 -256479 61991 320067 328624 75944 -167207 -133244 67252 91813 -98352
34447i8352m4423L05665L37714n4297l84546k59228J18418K88383J20734j29958
$$ -98352 -142775 162890 500604 446307 61761 -197467 -79049 209334 330068 200110
34437B00110j95014l8635J82217K73561J56932o1782j99300j84685r7238l0489
$$ 200110 5096 -33539 148678 422239 579171 517389 318089 133404 36166 5677
34427E677J823K6371N4644P2516L9697o8392j73639j28555P9693K46130J85227
$$ 5677 7500 33871 88515 161031 200728 132336 -41303 -169858 -90165 155965 341192
34416C41192k6214j70447j72273j15071n4480Q637K8366k5907m6964Q2515K59689
$$ 341192 314978 144531 -27742 -142813 -197293 -188656 -160290 -186197 -233161 -150646 109043
34405A09043K51442J9743k21556k93678k28470j24631R116J89245L35130L01396
$$ 109043 360485 380228 158672 -135006 -363476 -488107 -478991 -289746 45384 346780
34395C46780L9310k78731l50415p5832K25080J40255k42233l52756R0559O25790
$$ 346780 386090 107359 -243056 -318888 -93808 46447 -195786 -548542 -457983 167807
34385A67807O33647J36985l23080m21942k81336r2773P8157J52817P6303j7487
$$ 167807 801454 938439 615359 193417 -87919 -180692 -102535 50282 126585 109098
34375A09098P469M831j98157l59672j02013L93440M99361N3268l59253k43184
$$ 109098 116567 121398 -76759 -436431 -538444 -145004 354357 407625 48372 -194812
34365a94812J42596K57923M5186j41038j25592o7565j20175k19894k14167m9620
$$ -194812 -52216 205707 250893 109855 -15737 -83302 -203477 -423371 -637538 -687158
34355f87158J72815K86972K30825R8264k6434j63798k58868j21389K16898L34843
$$ -687158 -514343 -227371 3454 101718 75284 -88514 -347382 -468771 -251873 82970
34345H2970j1161l83210k31243K15848K69452r2154j81765K26479N05936K39901
$$ 82970 71809 -311401 -542644 -326796 -57344 -149498 -331263 -104784 401152 641053
34335F41053j19477j08248l6116k98589n19067j45057N06690O14094P2656l87318
$$ 641053 521576 413328 377212 78623 -440444 -585501 -78811 535283 607939 220621
34325B20621k68530J42886L43864K09346p7725k97314l02173j28425o580n3097
$$ 220621 -47909 94977 438841 648187 570462 273148 -29025 -157450 -164030 -217127
34315b17127o2550J39063L13898J39090k31243l36945p3449K08441K39610J14090
$$ -217127 -279677 -140614 173284 312374 81131 -255814 -329263 -120822 118788 232878
34305B32878K7808L5745Q2058N6941j22942l21991k44283J08328L01353Q8826
$$ 232878 260686 296431 378489 435430 312488 -9503 -253786 -145458 155895 244721
34295B44721j48765n142K41871Q6369l01890l17706O8120K78095J06242k6297
$$ 244721 95956 90814 332685 419054 117164 -200542 -132422 145673 251915 225618
34285B25618Q7304Q9276j96658l59451j16959J45426j422l31317l57487p5692
$$ 225618 312922 402198 205540 -153911 -270870 -125444 -126866 -458183 -815670 -891362
34275h91362J45996J65909J31707J17226O6983k647k9171m1291p4285o7653O788
$$ -891362 -745366 -579457 -447750 -330524 -263541 -266188 -295359 -336650 -410935 -478588 -471800
34264d71800O8864Q8236J18029J00138p9644k64311j31704K28950K90757j15176
$$ -471800 -402936 -314700 -196671 -96533 -176177 -440488 -572192 -343242 -52485 -167661
34254a67661m44808k41573J59068K04158Q061O2740L34501L28848l5028k74719
$$ -167661 -612469 -854042 -694974 -490816 -482755 -420015 -85514 243334 208306 -66413
34244f6413j29956P7342K2696j55633j76092l1512J19275J98239J76045L1535
$$ -66413 -196369 -119027 -96331 -251964 -428056 -459568 -340293 -142054 33991 65526
34234F5526j16408o2095J67238K58570K8169k91182l38322p5311J94334J96710
$$ 65526 -50882 -112977 54261 312831 341000 49818 -288504 -363815 -169481 27229
34224B7229k2058j65861l1902K22937K49647j8687k37348j34117Q3786N6183j76365
$$ 27229 5171 -160690 -192592 30345 279992 261305 23957 -110160 -26374 29809 -146556
34213a46556k78879j59157j7444P1737K08766L12595J65216j25932j61897J23107
$$ -146556 -425435 -584592 -602036 -530299 -321533 -8938 156278 30346 -131551 -8444
34203h444L03994J06089k07926k96480j84750k8777J55911K73538Q6798l09822
$$ -8444 295550 401639 193713 -102767 -287517 -316294 -160383 113155 199953 -109869
34193a09869l96765Q366L46900J52015j69186l471M12687L76172q6625k69818
$$ -109869 -506634 -498268 -151368 647 -168539 -172010 240677 616849 530224 260406
34183B60406J6851J79727r7255l50042j83761J03589J31959M6389Q0315O8670
$$ 260406 277257 456984 359729 9687 -174074 -70485 61474 107863 188178 256848
34173B56848j25241j94723P3353K87525N3555k94713k05229J55323J82050j37452
$$ 256848 131607 -63116 10237 297762 351317 56604 -148625 6698 188748 51296
34163E1296k25044R1262L24704J83504q234K9816O2129j48893l60769k70929l0728
$$ 51296 -173748 -82486 242218 425722 417488 447304 509433 360540 -229 -271158 -301886
34152c01886O1409P0552K05173L19732J05087l19429m51348r0174L64741M16443
$$ -301886 -240477 -169925 35248 354980 460067 140638 -310710 -400884 -36143 380300
34142C80300M1880l58515m30124j68076J58377K79983J45304p5839j81976j21460
$$ 380300 422180 63665 -366459 -534535 -376158 -96175 49129 -26710 -208686 -330146
34132c30146N987P8435N2492k4964o3864r887R3732J38138O2892p0865j30736
$$ -330146 -324159 -245724 -193232 -218196 -282060 -291947 -198215 -60077 2815 -68050 -198786
34121a98786l8540J41217K44681J80774N0733J6202N1928k6154k38122l34519
$$ -198786 -237326 -96109 148572 329346 380079 396281 448209 422055 183933 -150586
34111a50586j50760J08629J42734l1703j76929k14112k14483j17439J74691M51115
$$ -150586 -301346 -192717 -49983 -81686 -258615 -472727 -687210 -804649 -629958 -178843
34101a78843L53424m8277k45222p475K72925J85825r9516j59425K6642J22030
$$ -178843 174581 126304 -118918 -126393 146532 332357 232841 73416 100058 222088
34091B22088p48j07844n160J93298K53017J05810j01144j74009r2301n4120j99970
$$ 222088 221340 113496 108336 301634 554651 660461 559317 385308 293007 238887 38917
34080C8917l23093r3620L83960N62386J81144l11745l59475n5062P8809j05543
$$ 38917 -284176 -377796 6164 568550 749694 437949 78474 23412 102221 -3322
34070c322k35504m5013K57685L30906J17065j73512k92587j21162K15419L92074
$$ -3322 -238826 -283839 -26154 304752 421817 248305 -44282 -165444 49975 442049
34060D42049K23566o5743j20269L9476N8460j95284m16258l06590J4551J99830
$$ 442049 665615 599872 479603 519079 577539 382255 -34003 -340593 -326042 -126212
34050a26212J08432q8783j42201L0086K65283K99386O1382k03629k22216n0734
$$ -126212 -17780 -106563 -248764 -218678 46605 345991 407373 203744 -18472 -69206
34040f9206K9649o4358j30562l1547J09297J36992P9712L2275J39l0258q979Q1247
$$ -69206 -39557 -103915 -234477 -266024 -156727 -19735 59977 92252 92391 62133 53154 134401
34028A34401J54671J32750L5963q1282j88388k44186k17255j56824j24733o7086
$$ 134401 289072 421822 457785 376503 188115 -56071 -273326 -430150 -554883 -621969
34018f21969R3560K58586K48987J05904O0754J62163J83967m722k21740k51476
$$ -621969 -528409 -269823 -20836 85068 145822 307985 491952 487230 265490 14014
34008A4014j22932L0748J77776K91861K53645M1423j41971j24585j0369Q466n5325
$$ 14014 -108918 -78170 99606 391467 645112 686535 544564 419979 409610 418076 362751
33997C62751o6885j8784Q57j0306n706j9838q9100j30173o0105N0886R3189P5844
$$ 362751 295866 277082 277939 267633 261927 242089 152989 22816 -37289 13597 106786 182630
33985A82630L2756p8662k20045j97207L8432K02912O8047j45082r4016J24361
$$ 182630 215386 136724 -83321 -280528 -242096 -39184 28863 -116219 -210235 -85874
33975h5874J44866m0955r5942M7663P8766j12003k30768j15508m237m7484j1688
$$ -85874 58992 18037 -77905 -30242 48524 -63479 -294247 -409755 -413992 -461476 -473164
33964d73164K28156L35702N3508k75790k06651Q1127Q7175j78500k56895m1207
$$ -473164 -245008 90694 144202 -131588 -338239 -257112 -169937 -348437 -605332 -646539
33954f46539R4259n101m5799J04383J54098k5919r1982J58269L40363Q9108k84671
$$ -646539 -552280 -557381 -603180 -498797 -344699 -370618 -462600 -304331 36032 125140 -159531
33943a59531k59467O8095J91395M2386Q991J63155J27548j76102k71648R7399
$$ -159531 -418998 -350903 -159508 -117122 -108131 55024 182572 6470 -265178 -167779
33933a67779M60419K90671j93540l63902q8330J79414J29645m4154p2736j1652
$$ -167779 292640 583311 389771 25869 -62461 116953 246598 202444 129708 118056
33923A18056l7191r7302o551K03524K51750j7953l57833l61928Q390L19476K10822
$$ 118056 80865 -16437 -22988 180536 432286 414333 56500 -305428 -297038 22438 233260
33912B33260j13839j84139N2246J98192O8798l9527R7208K24360O0552j85330
$$ 233260 119421 -64718 -12472 185720 254518 214991 312199 536559 597111 411781
33902D11781j40734J31803K77992K08665Q4574r4174m01555n96461l56744J13263
$$ 411781 271047 402850 680842 889507 974081 879907 478352 -118109 -474853 -361590
33892c61590K52050l0652k43337j33637k9206j47816j67654J56453M73915L88901
$$ -361590 -109540 -140192 -383529 -517166 -546372 -694188 -861842 -705389 -231474 157427
33882A57427J05890L3278R3628l7974k79498k89061q7840J6400J0587J32119L11012
$$ 157427 263317 296595 390223 352249 72751 -216310 -304150 -287750 -277163 -145044 165968
33871A65968K20966j00395k34130o5247M1874j03542j99236r406K11600J57648
$$ 165968 386934 286539 52409 -12838 29036 -74506 -273742 -283148 -71548 86100
33861H6100k6924j8984J63878K39185R6805j07773k01771j50931m8271n0754k15639
$$ 86100 59176 40192 204070 443255 540060 432287 230516 79585 31314 -19440 -235079
33850b35079l58739k52151K1138J63165J31613J75505L33416L14889M7886j05774
$$ -235079 -593818 -845969 -824831 -661666 -530053 -354548 -21132 293757 341643 235869
33840B35869M8634J69682k3287k18329n1737K07462J03271j76949j02926K43158
$$ 235869 284503 454185 430898 212569 160832 368294 471565 294616 191690 434848
33830D34848K59682j48547l96682j99472P918j04986j99445O1404L51858K18750
$$ 434848 694530 545983 149301 -50171 -42253 -147239 -346684 -285280 66578 285328
33820B85328j39970j94966Q2335K53689J32987l3219n2475j2571n348J5515N8086
$$ 285328 145358 -49608 32727 286416 419403 386184 333709 321138 315790 331305 389391
33809C89391N1049j651n1177j47541l08209l24178j7488L52649L19650j13719
$$ 389391 440440 438789 387612 240071 -68138 -392316 -409804 -57155 262495 148776
33799A48776m12338k44448Q9238J69049N9734Q1252K17873J64536j07462k34515
$$ 148776 -263562 -508010 -418772 -249723 -189989 -108737 109136 273672 166210 -68305
33789f8305o752K82187K35004q8064k59223p1321K12877K44198P281k62562m09969
$$ -68305 -75057 207130 442134 354070 94847 23526 236403 480601 487882 225320 -184649
33778a84649m20664k73053K4305K83577K82513Q3939l1726J1332J4784o4393K7376
$$ -184649 -605313 -878366 -854061 -570484 -287971 -204032 -235758 -224426 -209642 -274035 -246659
33767b46659L47850M87837J47612k98247k73933J29878K91050J7244k03976m3914
$$ -246659 101191 589028 736640 438393 164460 294338 585388 602632 398656 354742
33757C54742J41028n6810l81914l00123J52823M05892J74639j95502k79161j04765
$$ 354742 495770 438960 57046 -243077 -90254 315638 490277 294775 15614 -89151
33747h9151K3796j7394j05934j17494l4597J19135K78012L02980J21313j08020
$$ -89151 -65355 -82749 -188683 -306177 -340774 -221639 56373 359353 480666 372646
33737C72646j45820j5299P662j72988k81346r3051J58321Q9948k39610l92335
$$ 372646 226826 211527 219189 46201 -235145 -328196 -169875 -79927 -319537 -711872
33727g11872j65198K05484M51899N05664K95213k19651o80986n23480J89541O26171
$$ -711872 -877070 -671586 -219687 285977 581190 361539 -319447 -842927 -653386 -27215
33717b7215K79943k76032k52812J78188K65319q0327k53261o5819k2267l45831
$$ -27215 252728 -23304 -276116 -97928 167391 87064 -166197 -232016 -254283 -600114
33707f00114n27529j71100L43233M40548J33158j57873k02762n0857J80815L20622
$$ -600114 -1127643 -1298743 -955510 -514962 -381804 -539677 -742439 -793296 -612481 -291859
33697b91859K05083n3311j29551L0259J26573N1228Q5479L36141M39431J48220
$$ -291859 -86776 -140087 -269638 -239379 -112806 -61578 23901 360042 799473 947693
33687I47693k11500k46202p8627l1325q0536n1147l4707j58355k12755K6031L37311
$$ 947693 736193 489991 411364 380039 299503 248356 213649 55294 -157461 -131430 205881
33676B05881L67672J81046N5338l2987k36582l71736j66770J76994K19275k4893
$$ 205881 573553 754599 809937 776950 540368 168632 1862 178856 398131 373238
33666C73238j61190j08272j50709l14851k67407P1874L28035K37338L660o9264
$$ 373238 212048 103776 -46933 -361784 -629191 -557317 -229282 8056 11716 -57548
33656e7548L2702J49249J79569R9571m7316j44428j52384j88677k75269j97048
$$ -57548 -24846 124403 303972 403543 356227 211799 59415 -129262 -404531 -601579
33646f01579J17937L29179J72325n3986K6865J75040n0446m02711k40369L63441
$$ -601579 -483642 -154463 17862 -36124 -9259 165781 115335 -287376 -527745 -164304
33636a64304O27495K55295j85959k53893j90397k10445l8553M06161N81867J35825
$$ -164304 463191 718486 532527 278634 88237 -122208 -160761 245400 827267 963092
33626I63092m30539m81337j54271K1127r537N1442J88864J47469l5403j17574
$$ 963092 532553 51216 -103055 -81928 -91465 -40023 148841 296310 260907 143333
33616A43333j22019k32322l47527j98773J71519M36481M21442K07857p8322l01051
$$ 143333 21314 -211008 -558535 -757308 -585789 -149308 272134 479991 401669 100618
33606A00618k99096j09910j6186j18658j32732J06971K87891J39273o2267K1603
$$ 100618 -198478 -308388 -324574 -443232 -575964 -468993 -181102 -41829 -104096 -82493
33596h2493J67561K4378j72461p609K68567J04607l03592k31432L01061M30632
$$ -82493 85068 109446 -63015 -70624 197943 302550 -1042 -232474 68587 499219
33586D99219j57635o67908m41790O4540J36556o9831J1301K86694K23881j44350
$$ 499219 341584 -326324 -768114 -703574 -567018 -636849 -625548 -338854 -114973 -259323
33576b59323k51235N4856L26366L10140K53075K91837J67437k08795m51692k99553
$$ -259323 -510558 -455702 -129336 180804 433879 725716 893153 684358 232666 -66887
33566f6887p0695j37356l09517j89987J31925K46534J22398J05250K60594K59444
$$ -66887 -137582 -274938 -584455 -774442 -642517 -395983 -273585 -168335 92259 351703
33556C51703N249j43791J7758J76109L4334j83695j36374N3745N2657r2334q3176
$$ 351703 356952 213161 230919 407028 441362 257667 121293 175038 227695 135361 52185
33545E2185O2442O5197p1169o2540J07799J23848j10390k92138k00412L7519K53758
$$ 52185 114627 179824 108655 46115 153914 277762 167372 -124766 -325178 -287659 -33901
33534c3901M20853M45819K19529k7813R4322M63335M98323J03109o8303L52542
$$ -33901 386952 832771 1052300 1024487 1118809 1582144 2080467 2183576 2115273 2467815
33524B467815Q09384P92208Q34299J677432K774296K625735P11152j699071k930268
$$ 2467815 3277199 4069407 4903706 6581138 9355434 11981169 12692321 10993250 8062982
33515H062982k561785j449454n77832k73091k97694l29615k94689l29599m79915
$$ 8062982 5501197 4051743 3473911 3200820 2903126 2573511 2278822 1949223 1469308
33506A469308n56210l84518o2285J90066K87710K19194o7859m57805n56221j51877
$$ 1469308 913098 528580 466295 656361 944071 1163265 1095406 637601 81380 -70497
33496g0497L52169L71134o9365l76764k11921J25923J85382r4395m05396m09019
$$ -70497 281672 652806 583441 206677 -5244 120679 306061 211666 -193730 -602749
33486f02749l8638L68564L50196p7674l22668j8066L84232K85746r8387j02272
$$ -602749 -641387 -272823 77373 -301 -322969 -341035 43197 328943 230556 128284
33476A28284K63694L35196p3780l80683k23867L9993Q0455Q9978K01608J26672
$$ 128284 391978 727174 653394 272711 48844 88837 169292 259270 460878 587550
33466E87550k05812l21074K980K46808J0153k59856n8359K37712J8053m24767
$$ 587550 381738 60664 63644 310452 320605 60749 2390 240102 258155 -166612
33456a66612l10853L35099P15860M89689J07395q4992k47464m28503l37141J7702
$$ -166612 -477465 -142366 573494 1063183 1170578 1085586 838122 409619 72478 90180
33446I0180J49435j22949l09162l3081L36628K73639j01669k81763j57492o2992
$$ 90180 239615 116666 -192496 -225577 111051 384690 283021 1258 -156234 -219226
33436b19226j64693k34697m9584K77575M40482K79722n5864k43554j10053J73891
$$ -219226 -383919 -618616 -668200 -390625 49857 329579 273715 30161 -79892 93999
33426I3999K98997J97446P7978Q5562J13822J6230j59231k42723j56346J1504
$$ 93999 392996 590442 668420 753982 867804 884034 724803 482080 325734 337238
33416C37238J05091P2658M6334J51929K28934j4736m57301n30895k8459M36906
$$ 337238 442329 514987 561321 713250 942184 927448 470147 -60748 -89207 347699
33406C47699K63680j82156j15779L86463N06336N9649k05039Q3327K75079j33794
$$ 347699 611379 429223 313444 699907 1206243 1265892 1060853 1144180 1419259 1285465
33396A285465n58422k71372L81925N54421K11635L241J32152K25921J70337K23733
$$ 1285465 727043 455671 837596 1392017 1603652 1606893 1739045 1964966 2135303 2359036
33386B359036L46042K11384p0761P279M94266Q58939Q63279Q78396J137093J331448
$$ 2359036 2705078 2916462 2845701 2852980 3347246 4206185 5069464 5947860 7084953 8416401
33376H416401J228900J100442J225301J478967J693460J916597K028779J643664
$$ 8416401 9645301 10745743 11971044 13450011 15143471 17060068 19088847 20732511
33368B0732511P45087r1457n03033q51144j480555j995940j881139j419239j290312
$$ 20732511 21477598 21386141 20883108 20031964 18551409 16555469 14674330 13255091 11964779
33359A1964779j504669j458793r60889n09630m85524o51552o31922m44396l42234
$$ 11964779 10460110 9001317 8040428 7530798 7045274 6393722 5761800 5317404 4975170
33350D975170m16270n37405n38794l76416k03388k35556m28635m40875j10144
$$ 4975170 4558900 4021495 3482701 3106285 2902897 2667341 2238706 1797831 1687687
33341A687687K32569K18494J2175L0244K25892J42805l14261o53084m85262n0606
$$ 1687687 1920256 2138750 2150925 2181169 2407061 2549866 2235605 1582521 1097259 1046653
33331A046653J64911N3464j03061o9879J02726K10284J34579l8237j19622n0417
$$ 1046653 1211564 1265028 1161967 1092088 1194814 1405098 1539677 1501440 1381818 1331401
33321A331401M0157N9277R5274K12149K60707J00427j16609j22948Q6937K85519
$$ 1331401 1371558 1430835 1526109 1738258 1998965 2099392 1982783 1859835 1946772 2232291
33311B232291L44786L18563K65030K02832J76932J83438J26468P799j1459Q7083
$$ 2232291 2577077 2895640 3160670 3363502 3540434 3723872 3850340 3858139 3846680 3933763
33301C933763O8611j28342j82170N2028J44097k50880o73790m55946J96844M58519
$$ 3933763 4002374 3874032 3691862 3743890 3887987 3637107 2963317 2507371 2704215 3162734
33291C162734J20110k11921j70871p3206j58963j82996l8022n3711l23000m03441
$$ 3162734 3282844 3070923 2900052 2826846 2667883 2484887 2446865 2393154 2070154 1666713
33281A666713r1695J43602l6333k18239L0102L49543J64238l43801n21125k37873
$$ 1666713 1575018 1718620 1682287 1464048 1494150 1843693 2007931 1664130 1143005 905132
33271I05132N6732J07382O8475L0409j03307k62144k13555K5088J60284N8024
$$ 905132 961864 1069246 1137721 1168130 1064823 802679 589124 614212 774496 832520
33261H32520j03550j47449r6814l5530R824K9471L0248N9357J17814J21615M0864
$$ 832520 728970 581521 484707 449177 459001 488472 518720 578077 695891 817506 858370
33250H58370m0442q3264j46194k03901j31257M2862J26291J04583J73033L02730
$$ 858370 817928 734664 588470 384569 253312 296174 422465 527048 700081 1002811
33240A002811J64108l01798o34249m70298n4564J83952K14789K22424J87033L8970
$$ 1002811 1166919 865121 230872 -239426 -293990 -110038 104751 327175 514208 553178
33230E53178p1312l9102m3774j63863j13772K27675M31525J66021j72309p7970
$$ 553178 481866 442764 398990 235127 121355 349030 780555 946576 774267 696297
33220F96297J84346L3237l89638m44352r6399N9656j36923j84403J15042K75648
$$ 696297 880643 913880 524242 79890 -16509 43147 -93776 -278179 -163137 112511
33210A12511k364k89130j37330K17827K91887P5416p9419j9682J02922J18626
$$ 112511 110147 -178983 -316313 -98486 193401 268817 189398 169716 272638 391264
33200C91264K172j31674j02785J08818K20850j7683l82760m03703l5999K79149
$$ 391264 393436 261762 158977 267795 488645 470962 88202 -315501 -351500 -72351
33190g2351K66365J10710J8364p4466j97361j75010K0513J16062l0077j75710
$$ -72351 194014 304724 323088 248622 51261 -123749 -103236 12826 -17251 -192961
33180a92961j12904j2902p6526j34677P1927M21363N49729L44264J9391k17596
$$ -192961 -305865 -318767 -395293 -529970 -458043 -36680 513049 857313 876704 659108
33170F59108l28798l21182j88171N933J38727J66167J59711J78431J62864J2233
$$ 659108 330310 9128 -179043 -173110 -34383 131784 291495 469926 632790 645023
33160F45023k32252l57931k25027J2771R4911L5816P6055K26383J96847q1271
$$ 645023 412771 54840 -170187 -157416 -62505 -26689 49366 275749 472596 391325
33150C91325k37132k5905K40829J82310n4011j02926j60m063n2100M9964J02734
$$ 391325 154193 128288 369117 551427 497416 394490 394330 390267 338167 388131 490865
33139D90865j92561n42548l56207K80496O22997L55526j4454k8471J00400J2919
$$ 490865 298304 -244244 -600451 -319955 303042 658568 644114 615643 716043 728962
33129G28962k10546l20137l01433k07574J6378K76419K85280K6750j19893L7449
$$ 728962 518416 198279 -103154 -310728 -294350 -17931 267349 294099 174206 211655
33119B11655J94189Q1503r7572o4688P9644J18984R1809Q0311l3205k64957l16147
$$ 211655 405844 487347 389775 325087 404731 523715 615524 695835 662630 397673 81526
33108H1526l0067K35540R1190k74623l71610j00312K21461L66423L47855J81605
$$ 81526 51459 286999 378189 103566 -268044 -368356 -146895 219528 567383 748988
33098G48988j16269l44704k75177J934J61424Q3625k2683L3977J53385R2608j95988
$$ 748988 632719 288015 12838 14772 176196 259821 237138 271115 424500 517108 321120
33087C21120m43071l23219J26742M56747L33971J6510Q957L01198L57646n6734
$$ 321120 -121951 -445170 -318428 138319 472290 488800 497757 798955 1156601 1099867
33077A099867m83393m36776q5776O5867q9739k28529j37791O1000J83589J86003
$$ 1099867 616474 179698 93922 159789 70050 -158479 -296270 -235270 -51681 134322
33067A34322Q6909r1626k56948k59536m3243K55030L92986K50000j6618j24195
$$ 134322 221231 129605 -127343 -386879 -430122 -175092 217894 467894 451276 327081
33057C27081k2646M5695n2429j04841N7102J84139o175k72635j67147J99196K70090
$$ 327081 304435 350130 297701 192860 249962 434101 427926 155291 -11856 187340 457430
33046D57430o7393l00115j22573J24136Q1837q0394o5982M8802O3682L6724O7871
$$ 457430 390037 89922 -32651 91485 173322 92928 26946 75748 139430 176154 244025
33035B44025J8252j98075l12831o5367L26028M04117P6543k96285l54075q9876
$$ 244025 262277 64202 -248629 -313996 12032 416149 492692 196407 -157668 -247544
33025b47544J97169K07918k8886j50506O6409L20599J71851k60959m05588o3699
$$ -247544 -50375 157543 128657 -21849 44560 365159 537010 276051 -129537 -193236
33015a93236L17710L08612M383k65182l34046j71029J55378L63764K06236r4599
$$ -193236 124474 433086 437469 172287 -161759 -332788 -177410 186354 392590 297991
33005B97991r5666J44892J46805j35724k10892M5575J38718j11540j82224J75997
$$ 297991 202325 347217 494022 358298 147406 192981 331699 220159 37935 213932
32995B13932L67980m3256m86593k76163K42604K76807j25525k52437P1237L17826
$$ 213932 581912 538656 52063 -224100 18504 295311 169786 -82651 -11414 306412
32985C06412J93272j9143o1085j8178J2100O9923J11630L3541r1717j17201p2000
$$ 306412 499684 480541 419456 401278 413378 483301 594931 628472 536755 419554 347554
32974C47554l6842M5237J51989N2150k67832l81305m9137K82369J25494k43201
$$ 347554 310712 355949 507938 560088 292256 -89049 -138186 144183 269677 26476
32964B6476k30368R6028J65774j16083k60491l6600K24553K27423P0974n6895
$$ 26476 -203892 -107864 57910 -58173 -318664 -355264 -130711 96712 167686 110791
32954A10791r0854K4252K41526K59183r3581m10666j77506L75567M90770j0011
$$ 110791 19937 44189 285715 544898 451317 40651 -136855 238712 729482 719471
32944G19471m55545l18136J00342K39825O1754q1123k3207J05275J62251J20216
$$ 719471 263926 -54210 46132 285957 347711 266588 243381 348656 510907 631123
32934F31123L333j31824k06158j85686r2255M5491J72844J96122J04272K8573
$$ 631123 634456 502632 296474 110788 18533 64024 236868 432990 537262 565835
32924E65835M7862L8555j08983k40341j34046J23439K13712L3579j61107j11351
$$ 565835 613697 652252 543269 302928 168882 292321 506033 539612 378505 267154
32914B67154J13431K31712J17235n5506o9955r90j21274m32084n42785k23156
$$ 267154 380585 612297 729532 674026 604071 603081 481807 49723 -493062 -716218
32904g16218J81765K29012M0640L2139J68765Q3851j54313q8372K64800L24218
$$ -716218 -534453 -305441 -264801 -232662 -63897 19954 -134359 -222731 42069 366287
32894C66287q5199l69434q4261L98482N09545K42589o0721k22244k07346k2877
$$ 366287 281088 -88346 -172607 225875 735420 978009 917288 695044 487698 464821
32884D64821J18564k9057k57471j20505K61109K91040p1516j87764J24031K45686
$$ 464821 583385 554328 296857 176352 437461 728501 656985 469221 593252 838938
32874H38938q3600k41968J21152L77077L5459l43237j35910K71367K48174P314
$$ 838938 755338 513370 634522 1011599 1047058 703821 567911 839278 1087452 1094766
32864A094766M0415J47447m9086k22514R4175N71908N91271K22741q7962l07423
$$ 1094766 1135181 1282628 1233542 1011028 1105203 1677111 2268382 2491123 2403161 2095738
32854B095738n29520m77843p6177R9014k54764m62378K6866N54258K77429l93200
$$ 2095738 1566218 1088375 1012198 1111212 856448 394070 420936 975194 1252623 859423
32844H59423m84290q483K91218K39369J76706Q1508j92572k59221J89047N86723
$$ 859423 375133 366650 657868 897237 1073943 1155451 962879 703658 892705 1479428
32834A479428L07985k54065l96971k71315l15513k55857J99833M39455l9832m76107
$$ 1479428 1787413 1533348 1136377 865062 549549 293692 493525 932980 893148 417041
32824D17041m3021N89137L60974k85262k31391L02583K85357j75891j72784K07020
$$ 417041 374020 963157 1324131 1038869 807478 1110061 1395418 1219527 1046743 1253763
32814A253763J72628j13860R4802N28179L83294j8734K28486Q89994J088410R36682
$$ 1253763 1426391 1312531 1407333 1935512 2318806 2300072 2528558 3418552 4506962 5443644
32804E443644R43319N70062o82756j628510j007563J40001Q0276n90773j88355
$$ 5443644 6386963 6957025 6274269 4645759 3638196 3778197 3858473 3267700 3079345
32795C079345P59545M93385m90146k57229Q51703Q59420M5197M26678J655241
$$ 3079345 3838890 4332275 3842129 3584900 4436603 5296023 5341220 5767898 7423139
32786G423139J488449K53776M94887K087073K416261J702096K871229N450014
$$ 7423139 8911588 9165364 9660251 11747324 14163585 15865681 18736910 24186924
32778B4186924N553141L410491M289007R301310J2533326J2059351J6994036L5959860
$$ 24186924 29740065 33150556 37439563 46740873 59274199 71333550 88327586 124287446
32770A24287446O1792221P4672264N9925744J9702011k9227694o4790661p1803193
$$ 124287446 186079667 260751931 320677675 340379686 311151992 246361331 174558138
32763A74558138n3250361k8783892j6211113j5331671j4390083q554230l751130
$$ 174558138 121307777 92523885 76312772 60981101 46591018 38036788 34285658
32756C4285658m048347n358806l765223j712271k173565l127166j994292n13634
$$ 34285658 30237311 24878505 21113282 19401011 17227446 14100280 12105988 11592354
32748A1592354j049651k078934j300044P2415j52752j083918p45880J85133l3847
$$ 11592354 10542703 8463769 7163725 7236140 7083388 5999470 5253590 5438723 5404876
32739E404876q28047o09513J45685m871o59106n02438J23531K0846n20017m13896
$$ 5404876 4576829 3967316 4113001 4108130 3449024 2946586 3070117 3090963 2570946 2157050
32729B157050R0975L0602l62242k44095J29613J3145k84758p8809K44963p820
$$ 2157050 2248025 2278627 1916385 1672290 1801903 1815048 1530290 1451481 1696444 1688624
32719A688624m03069j86529K25518J0222n10094m72489M269J93169N5061q436
$$ 1688624 1285555 1099026 1324544 1334766 824672 352183 356452 549621 604682 596246
32709E96246p4979k96425k49383K78764N76971R2844n22906m42017N0913K61837
$$ 596246 521267 224842 -24541 254223 831194 924038 401132 -40885 10028 271865
32699B71865K58410L58201K89170j43863l88766j02451J00363k10624l75940J11300
$$ 271865 530275 888476 1177646 1033783 645017 542566 642929 432305 56365 167665
32689A67665N15391J45092l20722m7313M15501J60085m17626l93911L7522J00642
$$ 167665 683056 828148 507426 460113 875614 1035699 618073 224162 261684 362326
32679C62326r6350m611J35857j29640l38725P6432N20134J87952l78991j90723
$$ 362326 265976 261365 397222 267582 -71143 5289 525423 713375 334384 143661
32669A43661L65175J99235m80049n20580J38994M49486J10687j26518K7744O8575
$$ 143661 508836 708071 228022 -292558 -153564 295922 406609 280091 307835 376410
32659C76410r9270l509K85288J70710k73452l34133O1463K58037R0118M4025J93052
$$ 376410 277140 273631 558919 729629 456177 122044 183507 441544 531662 575687 768739
32648G68739J21078p6641J18960N28467M22248j32176k67510J94328M42079R6241
$$ 768739 889817 813176 932136 1460603 1882851 1750675 1483165 1677493 2119572 2215813
32638B215813k17278l5948K47960K31203J06888R0957Q3026J60625N73953J031829
$$ 2215813 1998535 1962587 2210547 2441750 2548638 2639595 2722621 2883246 3457199 4489028
32628D489028Q74829K02196p4755M01689R05214Q13687M73649M48534O64282P71949
$$ 4489028 5363857 5566053 5491298 5892987 6798201 7611888 8085537 8534071 9198353 9970302
32618I970302P30268O02124L14407l2617j29534p496j01021n23406q27528p32246
$$ 9970302 10700570 11302694 11617101 11584484 11454950 11447454 11346433 10823027 9995499 9263253
32608I263253n35862n43768o13157n43808m38702m08946l52734k53270k87242
$$ 9263253 8727391 8183623 7570466 7026658 6587956 6179010 5826276 5573006 5285764
32599E285764m51396m79872k85478r9998p0607r8866j31154k06475k15499n2433
$$ 5285764 4834368 4354496 4069018 3969020 3898413 3799547 3668393 3461918 3246419 3193986
32589C193986M0118k16529n50838m55997l7740J15574j00382j94087J2100J27239
$$ 3193986 3234104 3017575 2466737 2010740 1973000 2088574 1988192 1794105 1806205 1933444
32579A933444j3790p4339N3190R095k60665k57923J73968M43001J48512k47069
$$ 1933444 1919654 1845315 1898505 1907600 1646935 1389012 1562980 2005981 2154493 1907424
32569A907424k12210o14r9226l26657j78672K44291L47880l2337m00007l22864
$$ 1907424 1695214 1694600 1595374 1268717 1090045 1334336 1682216 1649879 1249872 927008
32559I27008K7977J72247o9812l74179k99365J39919M20830J89568k06548k06911
$$ 927008 954985 1127232 1057420 683241 383876 523795 944625 1134193 927645 720734
32549G20734J15901K10128l0395j36799N3039P9935k82838n07234j07718N28603
$$ 720734 836635 1046763 1016368 879569 932608 1012543 729705 222471 114753 643356
32539F43356O53060J87821k72134l11259q5288O3651O882j57488k46038j44859
$$ 643356 1296416 1484237 1212103 900844 815556 879207 886089 728601 482563 337704
32529C37704M8254J05629k6236j47357j11011j5807K0162O0657J71506K37699
$$ 337704 385958 491587 465351 317994 206983 191176 211338 271995 443501 681200
32519F81200J44122j2568o7336k9989l9888j58627l02820l14285p5211L30440
$$ 681200 825322 812754 745418 715429 675541 516914 214094 -100191 -175402 155038
32509A55038N79645M11460k0785k87249j89673O1441J80456R4145j12610k90518
$$ 155038 734683 1146143 1125358 838109 648436 709877 890333 984478 871868 581350
32499E81350k42053R1657M21154L63294l7563l28385k54042l3858O4172Q0339
$$ 581350 339297 430954 852108 1215402 1177839 849454 595412 561554 625726 706065
32489G06065J19540P8265j27545l08672k53594n8167N2336P7879J48494J95323
$$ 706065 825605 903870 776325 467653 214059 155892 208228 286107 434601 629924
32479F29924L2938k56184l34528r1718J43705M4072k43962l02037l9001J93664
$$ 629924 662862 406678 72150 -19568 124137 168209 -75753 -377790 -416791 -223127
32469b23127J31254m6531n9774K7352n35o3405P5573L15890L11338O1053o3991
$$ -223127 -91873 -138404 -198178 -170826 -171361 -234766 -159193 156697 468035 529088 465097
32458D65097L4571K1901k12242k72312O5641L99049L18568L5517o4266p7994k64874
$$ 465097 499668 521569 309327 37015 102656 501705 820273 855790 791524 713530 448656
32447D48656m24168k03618K17128L67188K39399J99838K67581J11911k68285m69439
$$ 448656 24488 -179130 37998 405186 644585 844423 1112004 1223915 955630 486191
32437D86191l35634j50361r9461k6409J73043L32661L06745J52264l3816j77985
$$ 486191 150557 196 -99265 -125674 47369 380030 686775 839039 805223 627238
32427F27238j62037J4938R7916p8634k53492j25323J07157N6093j76221j70925
$$ 627238 465201 480139 578055 499421 245929 120606 227763 283856 107635 -63290
32417f3290P3403J61290l914j24601q1251l0143L6172K29730L11141m1176n08640
$$ -63290 10113 171403 167489 42888 -38363 -68506 -32334 197396 508537 467361 -41279
32406d1279m16187J78442M54692P8968k99874j23513K49064K35430p6063k40752
$$ -41279 -457466 -279024 175668 254636 -45238 -168751 80313 315743 239680 -1072
32396a072j80412q4287L6627K30638L33680K10390J4251r7013k15597l78361l52677
$$ -1072 -181484 -265771 -229144 1494 335174 545564 559815 462802 247205 -131156 -483833
32385d83833m8062J96304R6379j06099l9118J97121K33358M2975o8555R517N6740
$$ -483833 -531895 -335591 -239212 -345311 -384429 -187308 46050 89025 20470 29987 86727
32374H6727q5140k67277k47506l61K43538K43953M1757n8386J14695L30644K71361
$$ 86727 1587 -265690 -513196 -513557 -270019 -26066 15691 -42695 72000 402644 674005
32363F74005q441k01588k19654k05167j55347N8033L11305L06019O6967o0439
$$ 674005 665564 463976 244322 39155 -116192 -58159 253146 559165 626132 565693
32353E65693K2532L6775j36108k26760n7481J49169J45675J7540k8246K5626N6685
$$ 565693 588225 625000 488892 262132 204651 353820 499495 517035 488789 514415 571100
32342E71100l0411k33026l66548j50558L51822N81019J87964l28970k70548J73230
$$ 571100 540689 307663 -58885 -209443 142379 723398 911362 582392 311844 485074
32332D85074K18103k23174m22269r3990J56773o7187l00264j05656J69771Q9044
$$ 485074 703177 480003 57734 -36256 120517 53330 -246934 -352590 -182819 -93775
32322i3775r8329J2790K25318J40151j21943j96086j11613r7305o3383J82821
$$ -93775 -192104 -179314 46004 186155 64212 -131874 -243487 -340792 -404175 -221354
32312b21354M55610M23730J35985r7454j68480j76006j65200j49158j79599j79059
$$ -221354 234256 657986 793971 696517 528037 352031 186831 37673 -141926 -320985
32302c20985K8992L50761M30946J94351l6116j14190k44145l95741j84183L58874
$$ -320985 -291993 58768 489714 684065 647949 533759 289614 -106127 -290310 68564
32292F8564N73857J62389k75376k01125K8620r9775l30870j88333J04754O6414
$$ 68564 642421 804810 529434 328309 356929 257154 -73716 -262049 -157295 -90881
32282i0881j31693l5252J72837k046l84661l56451Q8496L56695K46804J30820
$$ -90881 -222574 -257826 -84989 -87035 -471696 -828147 -739651 -382956 -136152 -5332
32272e332J71885J26914l7615m6840R4880P3008j02594o1611K27715L31727O8420
$$ -5332 166553 293467 255852 209012 303892 376900 274306 212695 440410 772137 840557
32261H40557k07340k09483j06915j09358j16851o879R0550L0191q9920q0717Q7700
$$ 840557 633217 423734 316819 207461 90610 83731 174281 204472 114552 33835 121535
32250A21535K65062K44358m3229l43801k64149J79949M51499K01216k01823k21221
$$ 121535 386597 630955 587726 243925 -20224 159725 611224 812440 610617 389396
32240C89396N8860J75625O6933L6798R7480l5491l20863l53891k4995K81133K52206
$$ 389396 448256 623881 690814 727612 825092 789601 468738 114847 89852 370985 623191
32229F23191R916j80382k13921j05243N5260R0786n5417j69515q4400J2334q3667
$$ 623191 633107 452725 238804 133561 188821 279607 224190 54675 -29725 -17391 -101058
32218a01058j62249N7653L48829K67171j04372k68669j14330k3337j64234k48154
$$ -101058 -263307 -205654 143175 410346 305974 37305 -77025 -100362 -264596 -512750
32208e12750q4265J34373K30271K78919L16896K16256k0001j85918j95562j69469
$$ -512750 -597015 -462642 -232371 46548 363444 579700 559699 373781 178219 8750
32198H750j53686o4215P2638J34594J40154J61791Q2008j98712m10196k08076
$$ 8750 -144936 -209151 -136513 -1919 138235 300026 382034 183322 -226874 -434950
32188d34950K35253L94916J34729j56877j64245M5680K82170L74193J21817m28321
$$ -434950 -199697 195219 329948 173071 8826 54506 336676 710869 832686 404365
32178D04365p42574l68427L16065N02018P2107l05566k26600q849K0006P616J11837
$$ 404365 -338209 -706636 -390571 111447 183554 -122012 -348612 -357461 -337455 -329839 -218002
32167b18002J55646L4442l8084M9296R6829J5024j1737L6758p9327l23612k92602
$$ -218002 -62356 -27914 -65998 -16702 80127 95151 83414 120172 40845 -282767 -575369
32156e75369R8567L85302K89560J39829K27655K92492N5872k28258k21976q4942
$$ -575369 -476802 -91500 198060 337889 565544 858036 913908 685650 463674 378732
32146C78732j33090k70170k31398r0547n7845l3665J70780L81378K93567O443
$$ 378732 245642 -24528 -255926 -346473 -404318 -437983 -267203 114175 407742 414185
32136D14185j10275J5573J18452N9888k7117l6468k0619j4647K0402N7366L235
$$ 414185 303910 319483 437935 497823 470706 434238 413619 398972 419374 476740 479975
32125D79975j34455k27771k04458j47526j79150k74206k36151O5408M33798M93792
$$ 479975 345520 117749 -86709 -234235 -413385 -687591 -923742 -858334 -424536 69256
32115F9256J93849o3127K1833K09561J36076j06605k04179j88512k66811k85335
$$ 69256 263105 199978 221811 431372 567448 460843 256664 68152 -198659 -483994
32105d83994L2032M36044M11741L6423j26928J1929k654k24398j63183K03220
$$ -483994 -451962 -15918 395823 432246 305318 317247 314593 90195 -72988 130232
32095A30232K10343l08641n40103K7529O73445N34581p5291k84873n6376k4685
$$ 130232 340575 31934 -508169 -480640 192805 727386 652095 367222 310846 286161
32085B86161k91472l28004L0242L28164K70321Q9482M8483R2843Q3294j6259k06988
$$ 286161 -5311 -333315 -303073 25091 295412 384894 433377 526220 609514 593255 386267
32074C86267m02306l72199l3992L21874L78254J87617m3131k85098m78394l46191
$$ 386267 -16039 -388238 -422230 -100356 277898 465515 422384 137286 -341108 -687299
32064f87299J34410M24339J32746k77043j24937M01774N30580J20457j92533o8582
$$ -687299 -552889 -128550 4196 -272847 -397784 3990 534570 655027 462494 393912
32054C93912R8086k9797k07269j43520J2372L4384J0245O0557L7932j90865m34029
$$ 393912 491998 462201 254932 111412 123784 158168 168413 228970 266902 76037 -357992
32043c57992m02785o7110L64112O36313N58260J54781k33958k60603k0267P9954
$$ -357992 -760777 -827887 -463775 172538 730798 885579 651621 391018 370751 450705
32033D50705p9244j90863m4875J60769J61100k3675k11132k74663j40105J69905
$$ 450705 371461 180598 135723 296492 457592 433917 222785 -51878 -191983 -22078
32023b2078M01254K63178j40010l55681j68074J47848K61756J69978J7497j34698
$$ -22078 379176 642354 502344 146663 -21411 126437 388193 558171 575668 440970
32013D40970j95441k2046K70011K78923j40877n67394n26144j02619K47027L04899
$$ 440970 245529 223483 493494 772417 631540 64146 -461998 -564617 -317590 -12691
32003a2691J97126M4510j38616k55933j72117L3824J19810K4048o4628k4323K7368
$$ -12691 184435 228945 90329 -165604 -337721 -303897 -184087 -160039 -224667 -248990 -221622
31992b21622k9645q7161L6640K96094M18593K20248j56079l66872k24691J06181
$$ -221622 -251267 -338428 -301788 -5694 412899 633147 477068 110196 -114495 -8314
31982h314K93796J89283n6699k08727j92986j05702n6311o2598o2194J8862J81083
$$ -8314 285482 474765 418066 209339 16353 -89349 -145660 -208258 -270452 -251590 -70507
31971g0507L05244K37931k2523k58579k30259M4226K66748J76561j31795k92282
$$ -70507 234737 472668 450145 191566 -38693 5533 272281 448842 317047 24765
31961B4765j06267J91249K19945l7207j97961q754K81408K47253j22948l98135
$$ 24765 -81502 109747 329692 292485 94524 85770 367178 614431 491483 93348
31951I3348k73779M8289J62397q439j67312r2519P1473O9052o3831n8777J37346
$$ 93348 -180431 -132142 30255 21816 -145496 -238015 -166542 -97490 -161321 -220098 -82752
31940h2752K17335m4671l92915l77927L0709L92145L70660J01055j03369j57446
$$ -82752 134583 89912 -303003 -680930 -650221 -258076 112584 213639 110270 -47176
31930d7176j61771j47243o5032O5607J63590J86988J32170J3408q4367n0769P3801
$$ -47176 -208947 -356190 -421222 -355615 -192025 -5037 127133 140541 56174 5405 79206
31919G9206J11180J9989k6068M7924M8977j45578k98012j34318J96700L00048
$$ 79206 190386 210375 184307 232231 281208 135630 -162382 -296700 -100000 200048
31909B00048Q5704j60058k07968r5673P1472K30055K62671Q9859j09169o2078
$$ 200048 285752 125694 -82274 -177947 -106475 123580 386251 476110 366941 304863
31899C04863J63240K05113l3297k20956j47624o8548k27006l54860n8050M76213
$$ 304863 468103 673216 639919 418963 271339 202791 -24215 -379075 -437125 39088
31889C9088O17831J42405m52891n87691k44501J68073L40641K60244O9661o0021
$$ 39088 656919 799324 346433 -241258 -485759 -317686 22955 283199 352860 292839
31879B92839k4257Q3964M4735j51131k06266L5950K47103N2072l26554l12572
$$ 292839 268582 352546 397281 246150 39884 75834 322937 375009 48455 -264117
31869b64117J45063M47868K46719n0968K1337K52958J77302j25780k14648o6322
$$ -264117 -119054 328814 575533 524565 545902 798860 976162 850382 635734 569412
31859E69412o6139k78325l24171n9118J67860R1469q9188j00626J7807J06285
$$ 569412 503273 224948 -99223 -158341 9519 100988 11800 -88826 -71019 35266
31849C5266J26163M8201j65594l29783j57660K28285L21528k0553k87650o9551
$$ 35266 161429 209630 44036 -285747 -443407 -215122 106406 85853 -201797 -271348
31839b71348L15813L27761m782k22941j25697R3337K24030J92852j7669k92300
$$ -271348 44465 372226 367444 144503 18806 112143 336173 529025 511356 219056
31829B19056l72121j80936K1576M0613L2244J28902J28562p9106j47818J76507
$$ 219056 -153065 -334001 -312425 -271812 -239568 -110666 17896 -61210 -209028 -32521
31819c2521M72694K10751l34627m14624N4826L85785J83178j57141j79846l776
$$ -32521 440173 650924 316297 -98327 -43501 342284 525462 368321 188475 184699
31809A84699M5348k8591l1663N8040J25733J05609k1846k20351l15493j59584
$$ 184699 230047 201456 169793 227833 353566 459175 437329 216978 -98515 -258099
31799b58099Q1331Q5747j35075k22517j7578K06168J79315P165n1677O1052K14145
$$ -258099 -176768 -91021 -226096 -448613 -466191 -260023 -80708 -73543 -125220 -64168 149977
31788A49977K68724J57628n7741j83817j16883k5115q8619j55248K2675K92254
$$ 149977 418701 576329 518588 334771 217888 192773 104154 -51094 -28419 263835
31778B63835K55569q8977l06867j82529L4321J25642J76650K10431M6855k49081
$$ 263835 519404 430427 123560 -58969 -24648 100994 277644 488075 534930 285849
31768B85849k61302J23320L91468J19355l50113l87128K6306L34542K05023j30914
$$ 285849 24547 147867 539335 658690 308577 -78551 -52245 282297 487320 356406
31758C56406k94175j83504L1659J26578K0426j27337q4295J24360K12684N8076
$$ 356406 62231 -121273 -89614 36964 57390 -69947 -154242 -29882 182802 240878
31748B40878r0027P865K04474J98991q746j37519j6700K26614L25526J23478k47118
$$ 240878 150851 158716 363190 562181 553435 415916 399216 625830 951356 1074834 827716
31737H27716m06790j26735K87650K82003j93833n49939l47553J24106L36657K55980
$$ 827716 420926 294191 581841 863844 670011 120072 -227481 -103375 233282 489262
31727D89262J94863J78761m6035m31995n39891j59762L12620L40211p3164l85662
$$ 489262 684125 862886 816851 384856 -155035 -314797 -2177 338034 264870 -120792
31717a20792j99838K35430L60886P5501j26123Q7496L37022J13170l67673m52195
$$ -120792 -320630 -85200 275686 351187 225064 312560 649582 762752 395079 -57116
31707e7116p8797J52723p772j06150J28731K72039q090l04839j63006J40025J27358
$$ -57116 -135913 16810 9038 -97112 31619 303658 295568 -9271 -172277 -32252 95106
31696I5106l3227R1123L49991K78658n3609k02309j52959k26614l42385j56103
$$ 95106 61879 153002 502993 781651 728042 525733 372774 146160 -196225 -352328
31686c52328J55819P0925l16317l37888J34929M43029K11333j16931j10479K7188
$$ -352328 -196509 -125584 -441901 -779789 -644860 -201831 9502 -107429 -217908 -190720
31676a90720L3118R1671L23866L87165P3736k30649j80368n6597k00790l52456
$$ -190720 -157602 -65931 257935 645100 718836 488187 307819 251222 50432 -302024
31666c02024j43723J76448J63946k5541M6782K64248J68931j54062j71151J59343
$$ -302024 -445747 -269299 -105353 -130894 -84112 180136 349067 195005 23854 183197
31656A83197K93016K8841j80680m4097J04535l7400k01296p6224R2497p0246l72566
$$ 183197 476213 505054 324374 280277 384812 347412 146116 69892 162389 92143 -280423
31645b80423l29840L1698J94756l0458k23524m5923K28563J93937M997J24907
$$ -280423 -610263 -578565 -383809 -414267 -637791 -683714 -455151 -261214 -256217 -131310
31635a31310M94433N02636o3897n58177l54948J87190K28786k77926n25480j05375
$$ -131310 363123 865759 801862 243685 -111263 75927 304713 26787 -498693 -604068
31625f04068M09658M17827J43647P0128R9493q5505k65857m1787L28464K42465
$$ -604068 -194410 223417 367064 437192 536685 451180 185323 143536 472000 714465
31615G14465k10964l38724J7016K39458k147k41841p5832J84625J45977R94N9860
$$ 714465 503501 164777 181793 421251 419104 177263 101431 286056 432033 433027 492887
31604D92887J29805p3153l00722j57272J83202K33217l0184k00049j25131l6990
$$ 492887 622692 549539 248817 91545 274747 507964 477780 277731 152600 115610
31594A15610n8732o4470o273K8407N6869J37068J37727n7552k22356p6010K04323
$$ 115610 56878 -7592 -13865 14542 71411 208479 346206 288654 66298 -9712 194611
31583A94611K17549k018o8093N9958K5466k43351l77310k16218n9078p8663j9797
$$ 194611 412160 410142 342049 402007 427473 184122 -193188 -409406 -468484 -547147 -566944
31572e66944K67294M84677L77499J34749m789j35285l49425m24417k12340J4402
$$ -566944 -299650 185027 562526 697275 692486 557201 207776 -216641 -428981 -414579
31562d14579o922q7256K5639J46585j103k26105j62368R5310J71659O5164P9869
$$ -414579 -421501 -508757 -483118 -336533 -337636 -563741 -726109 -630799 -459140 -393976 -314107
31551c14107K04523J29399j21073j34706K03919M71536L26419l8157k60381k82680
$$ -314107 -109584 19815 -101258 -235964 -32045 439491 765910 727753 467372 184692
31541A84692k37705j48949Q455J40648J45864P0042N35p7177j87897k46678j67789
$$ 184692 -53013 -201962 -193507 -52859 93005 163047 163582 86405 -101492 -348170 -515959
31530e15959k1804L6535k9596r0237q057J83291K87548J68862n3952j33408k1256
$$ -515959 -537763 -501228 -530824 -621061 -629118 -445827 -158279 10583 -43369 -176777 -198033
31519a98033P4389R865r0924n7644P2386J54372J37339M2097r3562j40987K0967
$$ -198033 -123644 -113779 -204703 -262347 -189961 -35589 101750 143847 50285 -90702 -69735
31508f9735K12095O5068l69361n02743k0781N46568N14621O222l02275j73879
$$ -69735 142360 207428 -161933 -664676 -685457 -138889 375732 381954 79679 -94200
31498i4200L5818Q4897Q9285R1033k9800j78343j13897P6276R4716J6775J64751
$$ -94200 -58382 26515 115800 206833 177033 -1310 -115207 -38931 55785 72560 237311
31487B37311L92428J90228l79874n95878j74404K59850J63238j46646j62909k5577
$$ 237311 629739 819967 440093 -155785 -330189 -70339 92899 -53747 -216656 -242233
31477b42233j15679l02232k08155J13301L28839L79937L88610K75705l3595k66022
$$ -242233 -357912 -660144 -868299 -754998 -426159 -46222 342388 618093 584498 318476
31467C18476j48281J15034J68613Q2658J29167K13877N5102k44639l35018k05504
$$ 318476 170195 285229 453842 536500 665667 879544 934646 690007 354989 149485
31457A49485j35351j59988q0748P7177J02711K9441N8643J21366m748k07129j69299
$$ 149485 14134 -145854 -226602 -149425 -46714 -17273 41370 162736 157988 -49141 -218440
31446b18440N1258R6542m9170k7647K37621L84545K10583n8791k06321k62565
$$ -218440 -167182 -70640 -119810 -147457 90164 474709 685292 626501 420180 157615
31436A57615k13221M5707L35902K77186r5574k83849p8430J41169Q4795K61J27859
$$ 157615 -55606 -9899 326003 603189 507615 223766 145336 286505 371300 371561 499420
31425D99420K14541o780k73473k00089R1106K11517J15060N940j25001l71582
$$ 499420 713961 707181 433708 233619 324725 536242 651302 657242 532241 160659
31415A60659m95846j85693L30717M60083Q2778k62264j59123J43843J87616m1442
$$ 160659 -335187 -520880 -190163 269920 352698 90434 -68689 75154 262770 221328
31405B21328j97910j23557j1979p0147k28991k46840k1780K55709K92353M3912
$$ 221328 23418 -100139 -112118 -182265 -411256 -658096 -679876 -424167 -131814 -87902
31395h7902j96997j47823J04661K42741J70218J08123J99216K61615R7360j43780
$$ -87902 -284899 -432722 -328061 -85320 84898 193021 392237 653852 751212 607432
31385F07432j58271M4420J52086L2106q8343k7405M6734p2530k40408j85221J5251
$$ 607432 449161 493581 645667 677773 589430 562025 608759 536229 295821 110600 125851
31374A25851L9554j34653j76875M3419K26179J23585q0983j06183l547J9008k2168
$$ 125851 165405 30752 -146123 -102704 123475 247060 166077 59894 56347 75355 53187
31363E3187J5447Q7431M8068o8174j22193j18926j31962j10462j7510j918j39314
$$ 53187 68634 156065 204133 135959 13766 -105160 -237122 -347584 -365094 -367012 -506326
31352e06326j80483Q3947L73995K64650j33814l10377j13353J12704J42074J11391
$$ -506326 -686809 -602862 -228867 35783 -98031 -408408 -521761 -409057 -266983 -155592
31342a55592J06469K6067n3273R3235L21386J95512k36587l60550K5841K88660
$$ -155592 -49123 -23056 -76329 16906 338292 533804 297217 -63333 -37492 251168
31332B51168n0150m95390l49837J78238L51561P4029q0652J15257K44383K1139
$$ 251168 201018 -294372 -644209 -465971 -114410 -40381 -121033 -5776 238607 259746
31322B59746k63595k46803K9402L09862M21757K64925j29830m29912k60117K35583
$$ 259746 -3849 -250652 -221250 88612 510369 775294 645464 215552 -44565 191018
31312A91018M54943J27314l09614l42802o4467Q1246j9777r4000P019J06569N2880
$$ 191018 645961 773275 463661 120859 56392 137638 117861 23861 30880 137449 190329
31301A90329k4367M7950J72597J11494j20705k12278R466K75953K10075j36242
$$ 190329 165962 213912 386509 498003 377298 165020 174486 450439 660514 524272
31291E24272l42806k05495M5599J71076K15755K23626L9046l24656m70655j66732
$$ 524272 181466 -24029 21570 192646 408401 632027 671073 346417 -124238 -290970
31281b90970J85439J01991k05272j71341J65005K19803j34030l38821q3633K19837
$$ -290970 -105531 -3540 -208812 -380153 -215148 4655 -129375 -468196 -551829 -331992
31271c31992J86935O5080J87829L62111K76715P4551J0984n7448k93480l69616
$$ -331992 -145057 -79977 107852 469963 746678 821229 832213 774765 481285 111669
31261A11669J1161L97606J60109m03947l98211K35205N23911l8168o74278n07941
$$ 111669 122830 520436 680545 276598 -121613 113592 637503 599335 -74943 -582884
31251e82884J50311L85237N5684j93647n9044P8534n0870j69289k0442J61849
$$ -582884 -432573 -47336 8348 -185299 -244343 -165809 -216679 -385968 -406410 -244561
31241b44561P3545j31359q3660K24011M21843K63302r3688l13719k49138n0807
$$ -244561 -171016 -302375 -386035 -162024 259819 523121 429433 115714 -133424 -184231
31231a84231K4053r7850k16379j10544J46300K53156Q4771j34707j49903q631
$$ -184231 -160178 -258028 -474407 -584951 -438651 -185495 -100724 -235431 -385334 -393965
31221c93965P5542O9676J09107J87189J20364j07277k06825K0408L09614K25819
$$ -393965 -318423 -248747 -139640 47549 167913 60636 -146189 -125781 183833 409652
31211D09652j99645m25403j11388L81731M49991M5863l06635k63136n8626m3051
$$ 409652 210007 -215396 -326784 54947 504938 550801 244166 -18970 -77596 -120647
31201a20647j60904j47357L322Q9596P9136R4736J00151m3256k15747j10544K55545
$$ -120647 -281551 -428908 -425586 -335990 -256854 -162118 -61967 -105223 -320970 -431514 -175969
31190a75969M61193K64765n0308j20029L27M6654R975N4136J25348J4025k31269
$$ -175969 285224 549989 499681 379652 379979 426633 436608 490744 616092 630117 398848
31179C98848k94098n4610K05382J79452n9703j69583K5435L09722L02418r9844
$$ 398848 104750 50140 255522 434974 375271 205688 231123 540845 843263 743419
31169G43419n40826n55844j13797L31442L85902J40644n5474n9904P965K6078
$$ 743419 202593 -353251 -467048 -135606 250296 390940 335466 275562 283527 309605
31159C09605k7861j35046k10987j23479R7390K08698J00306M752J18706K30097
$$ 309605 281744 146698 -64289 -187768 -90378 118320 218626 223378 342084 572181
31149E72181N9451k21317k36721m1729k3535k25718k89943j00249M2805k740J0997
$$ 572181 631632 410315 173594 131865 108330 -117388 -407331 -507580 -464775 -467515 -456518
31138d56518K04780L15061J77473J3126p952m2819j60157j19245J30583K13928
$$ -456518 -251738 63323 240796 253922 245970 203151 42994 -76251 54332 268260
31128B68260l6737k00978K4418K28024m3738m55537m03603k7457N9177j66696
$$ 268260 231523 30545 54963 282987 239249 -216288 -619891 -647348 -588171 -754867
31118g54867j53006K12811M13036K05920j7063M2883J65189J30006P4466Q8779
$$ -754867 -907873 -695062 -282026 -76106 -93169 -50286 114903 244909 319375 408154
31108D08154K343j77246j37133J63068L00771O7026j74352j21166j0843r3570
$$ 408154 410497 233251 96118 259186 559957 626983 452631 331465 320622 227052
31098B27052j40995O8640K46298Q7065j40617m9579J80647J49521n2060q7018
$$ 227052 86057 154697 400995 488060 347443 297864 478511 628032 575972 488954
31088D88954m9090k30651m37177k52346J50117K07411p6401j46842J06364J82355
$$ 488954 439864 209213 -227964 -480310 -330193 -122782 -199183 -346025 -239661 -57306
31078e7306o5266j29601J92621L51117m068l43748j17682L11348K73909j21354
$$ -57306 -122572 -252173 -59552 291565 287497 -56251 -173933 137415 411324 289970
31068B89970k49172j5518J11836k0714p4908P7328J33367m2356j60684l1153J16404
$$ 289970 40798 25280 137116 116402 41494 118822 252189 209833 49149 17996 134400
31057A34400M7217j09950j30234m4184j8470r3255j87333j98252l0695K76578
$$ 134400 181617 71667 -58567 -102751 -121221 -214476 -401809 -600061 -630756 -354178
31047c54178M33152J80302k65694l81128m5091K69134J78846r3327j49707l6631
$$ -354178 78974 259276 -6418 -387546 -432637 -163503 15343 -77984 -227691 -264322
31037b64322p3117k78010l61972j96715N6367K51602L88181M37480L20104R4385
$$ -264322 -337439 -615449 -977421 -1174136 -1117769 -866167 -477986 -40506 279598 373983
31027C73983n5302n9467j3756J8643O3345Q7917J0557j09121r6572O0393J58417
$$ 373983 318681 259214 245458 264101 327446 415363 425920 316799 220227 280620 439037
31016D39037P7077o5808j47744k13999k72051j38988K54037N56235L34655k81064
$$ 439037 516114 450306 302562 88563 -183488 -322476 -68439 487796 822451 541387
31006E41387o16974k61507L80252N59627Q6325m88267n68171j61099K40896K53907
$$ 541387 -75587 -337094 43158 602785 689110 200843 -367328 -528427 -287531 -33624
30996c3624m7159k77230j37973K80482N46521L25024j97860m81577k92253K3528
$$ -33624 -80783 -358013 -495986 -215504 331017 656041 458181 -23396 -315649 -292121
30986b92121Q3807K0347J58340L60635J81272l54803o48546l53184J49562L38483
$$ -292121 -208314 -187967 -29627 331008 512280 157477 -491069 -844253 -694691 -356208
30976c56208K21108J06706N9259l8406j25505p2922J3561k9393r0361M550J03733
$$ -356208 -135100 -28394 30865 -7541 -133046 -205968 -192407 -221800 -312161 -307611 -203878
30965b03878k9811k23197j19076J70591J69235j69252l18087R321M07167L98065
$$ -203878 -233689 -456886 -575962 -405371 -236136 -405388 -723475 -714154 -306987 91078
30955I1078Q8105j07727n9935P9038K02381K48312R4610k21959l67843j27872
$$ 91078 179183 71456 11521 90559 292940 541252 635862 413903 46060 -81812
30945h1812J92152J31320k52115m39837j74349K27652L53612J93365K3508O386
$$ -81812 110340 241660 -10455 -450292 -624641 -396989 -43377 149988 173496 179882
30935A79882P5463J04759L2042j44685l56477m35833k24280J97520M63304K78413
$$ 179882 255345 360104 392146 247461 -109016 -544849 -769129 -571609 -108305 170108
30925A70108j60300l15982j275L18316J56506k69048l35645O3059L79221K45996
$$ 170108 9808 -306174 -307449 10867 167373 -101675 -437320 -374261 4960 250956
30915B50956m7160j06270k262J4301j5628N2528J03553j4173j28045q378J82022
$$ 250956 203796 97526 95264 109565 93937 146465 250018 235845 107800 99422 281444
30904B81444J18514j37374k37897j08577O218M024J9034P5326N0338r271O2812
$$ 281444 399958 262584 24687 -83890 -77672 -73648 -54614 20712 71050 61779 124591
30893A24591J66575K1415l07190m12671j91943k7714j40390k12199N6870M22712
$$ 124591 291166 312581 5391 -407280 -599223 -626937 -767327 -979526 -922656 -499944
30883d99944M94533L35951K49968K04576n1076m11593m48375o3639L01160K58696
$$ -499944 -5411 330540 580508 785084 734008 322415 -125960 -189599 111561 370257
30873C70257k9746j49432o393J28977N0365j47455k72185k84683k45151j31727
$$ 370257 340511 191079 184686 313663 364028 216573 -55612 -340295 -585446 -717173
30863g17173J11849L63687L55553J7556l51818m08768j59855J23715K82490L37415
$$ -717173 -605324 -241637 113916 131472 -220346 -629114 -788969 -665254 -382764 -45349
30853d5349K59475k2658l49766l76167l0454L06065K65630l4082j77669N460K75318
$$ -45349 214126 191468 -158298 -534465 -564919 -258854 6776 -27306 -204975 -199515 75803
30842G5803L06366L9719k71398l11070m0516K21620J79031k6143j8768J89851
$$ 75803 382169 421888 150490 -160580 -201096 20524 199555 173412 154644 344495
30832C44495J58810k58151n56231k85224K21588K99434o5492k56804O311K90456
$$ 344495 503305 245154 -311077 -596301 -374713 -75279 -140771 -397575 -391264 -100808
30822a00808J74688j37728k05347J4178K26735K60714J65018J3358j23476j34073
$$ -100808 73880 -63848 -269195 -255017 -28282 232432 397450 410808 287332 153259
30812A53259k5233k068j72039l12898j89630M1015N8877r0687p3496J51747K41921
$$ 153259 128026 125958 -46081 -358979 -548609 -507594 -448717 -539404 -612900 -461153 -219232
30801b19232M4908j34351l0225J70778J71718L1141j9899K311n7942j36669p0719
$$ -219232 -174324 -308675 -338900 -168122 3596 34737 14838 17149 -40793 -177462 -248181
30790b48181L4926m1218j72647p600M04987N54544J85918l05907m14512j44105
$$ -248181 -213255 -254473 -427120 -434720 -29733 524811 710729 404822 -9690 -153795
30780a53795J37145J93735L5193k17203l31643q2712L70564M90266N9983l94138
$$ -153795 -16650 177085 212278 -4925 -336568 -419280 -48716 441550 501533 107395
30770A07395k88408J57484K61793o8828k42978M1478L46115K18945j45984k90631
$$ 107395 -181013 -23529 238264 169436 -73542 -32064 314051 532996 387012 96381
30760I6381j50942J4744Q7691J34061J47922N0954j20838k36910k30996j26935
$$ 96381 -54561 -39817 47874 181935 329857 380811 259973 23063 -207933 -334868
30750c34868J1170R0761P3416O5113J50271J65949o9692l22799j64382K93961
$$ -334868 -323698 -232937 -159521 -94408 55863 221812 152120 -170679 -335061 -41100
30740d1100M05940l7300l99036j64067K23964Q3222l86550m56609p3686J32008
$$ -41100 364840 327540 -71496 -235563 -11599 71623 -314927 -771536 -845222 -713214
30730g13214l2205p1787J98976K76519q1488l05218O6920N46676M23788j14036
$$ -713214 -745419 -817206 -618230 -341711 -423199 -728417 -661497 -114821 308967 194931
30720A94931l07022o026K12788M6620j32596K919K24476K12123O5453K4813K5024
$$ 194931 -112091 -118117 94671 141291 8695 11614 236090 448213 513666 538479 563503
30709E63503j08521k45396j21584J72178K47446j6133k86578k68492j01864p7973
$$ 563503 454982 209586 88002 260180 507626 491493 204915 -63577 -165441 -243414
30699b43414j60954p8107J86066L01789P5166k44081l05237j18288M8798J06243
$$ -243414 -404368 -482475 -296409 5380 80546 -163535 -468772 -587060 -538262 -432019
30689d32019J95424L35363L17597N0952k26259k44502o2717M4294l4025j48457
$$ -432019 -236595 98768 416365 467317 241058 -3444 -66161 -21867 -55892 -204349
30679b04349j35080j346J37404J88861J27591m681j10256j06129j5435M9824K3889
$$ -204349 -339429 -340775 -203371 -14510 113081 108400 -1856 -107985 -123420 -73596 -49707
30668d9707k6405R639J20935J54081J9k34958l24804j92750O855J03831J01210
$$ -49707 -76112 -66473 54462 208543 208562 -26396 -351200 -543950 -537095 -433264 -332054
30657c32054Q7468P8941N5011M2809L8848m4799k03110k33177j7568K07394J46967
$$ -332054 -244586 -165645 -110634 -67825 -28977 -73776 -276886 -510063 -527631 -320237 -173270
30646a73270p4507q0930J35487J77018r3302k85689r7411K01277K09270N725o0110
$$ -173270 -247777 -328707 -193220 -16202 -109504 -395193 -492604 -291327 -82057 -76332 -136442
30635a36442M0257N6565l1268K5695K80622M53959L32369L7288j80861k23135
$$ -136442 -96185 -39620 -70888 -45193 235429 689388 1021757 1059045 878184 655049
30625F55049j65690j43180k18007k72010j08565K24733L80206J71389j03642q4888
$$ 655049 489359 346179 128172 -143838 -252403 -27670 352536 523925 420283 335395
30615C35395R1380L7600k22137k99569j06513K8552m4551q9629M336P414j45318
$$ 335395 426775 464375 242238 -57331 -163844 -135292 -179843 -269472 -265136 -257722 -403040
30604d03040j21091K28636M86321K55236k17176m19424l01126j78042j31973J4036
$$ -403040 -524131 -295495 190826 446062 228886 -190538 -491664 -669706 -801679 -787643
30594g87643K35617K88746J35201m504k7355k9498j6419J09495K47207J54912
$$ -787643 -552026 -263280 -128079 -132583 -159938 -189436 -205855 -96360 150847 305759
30584C05759j06694j52978J43168L73319J40697l46645n23610k04546K12311K91781
$$ 305759 199065 46087 189255 562574 703271 356626 -166984 -371530 -159219 132562
30574A32562P5304q3221m7905k8010j51333j81206J03943M23148K79564k60338
$$ 132562 207866 124645 76740 48730 -102603 -283809 -179866 243282 522846 262508
30564B62508n16367j08083M81529N60295J09453l62860n55853n05346k19509K55483
$$ 262508 -253859 -361942 119587 679882 789335 426475 -129378 -634724 -854233 -598750
30554e98750N29352K31566l17717l95926Q0837M10531J72845j81219j26568J34900
$$ -598750 -69398 162168 -155549 -551475 -470638 -60107 112738 -68481 -195049 -60149
30544f0149J45406n763O1507K61115J72816j86879l25044m3767K52638J63797
$$ -60149 85257 79494 141001 402116 574932 388053 63009 19242 271880 435677
30534D35677j76720l60019k19082Q8407L21916L27940J05220j64475k37818o3451
$$ 435677 258957 -101062 -320144 -231737 90179 418119 523339 358864 121046 57595
30524E7595J43052J44283m8546k05412j45189P4773K38593K17995R9786L6538
$$ 57595 200647 344930 296384 90972 -54217 20556 259149 477144 576930 613468
30514F13468K2487p4530k62910l50139j80517J49797L84920L52001Q8841j81564
$$ 613468 635955 561425 298515 -51624 -232141 -82344 302576 654577 743418 561854
30504E61854k04697M4235K55260J19600k24761l29517o7718J78965J04881q0216
$$ 561854 357157 401392 656652 776252 551491 221974 154256 333221 438102 357886
30494C57886n4658O8839k8861k88578l36057p3011J78764J54705m1107j59220
$$ 357886 303228 372067 343206 54628 -281429 -354440 -175676 -20971 -62078 -221298
30484b21298r2299J08000K91029K61781j9481k86185k27714R5900L25529K81821
$$ -221298 -313597 -205597 85432 347213 327732 41547 -186167 -90267 235262 517083
30474E17083J13441m0784k22403l98116l54096l8327K35491J68436r0353j37457
$$ 517083 630524 589740 367337 -30779 -384875 -423202 -187711 -19275 -109628 -247085
30464b47085J25565L60049K46804r7696k74816j17024R6940L0667k06181j78267
$$ -247085 -121520 238529 485333 387637 112821 -4203 92737 123404 -82777 -261044
30454b61044K06456M49154J24927m40204n48350r1676L18715K45077j6651J199
$$ -261044 -54588 394566 519493 79289 -469061 -560737 -242022 3055 -13596 -12397
30444a2397K02647J43299k21581m40439k24730J54314K77464J46374R7613K37975
$$ -12397 190250 333549 111968 -328471 -553201 -398887 -121423 24951 122564 360539
30434C60539K62743m7604l93548l18999Q6378K49010m1014k84694n4212K95369
$$ 360539 623282 575678 182130 -136869 -50491 198519 157505 -127189 -181401 113968
30424A13968J77210k53553l15057J01715L46817N1661l07840k01619J58969K56161
$$ 113968 291178 37625 -277432 -175717 171100 222761 -85079 -286698 -127729 128432
30414A28432P8041r614O4731M2802j55521l27497l34571k05840L1855L01258L49513
$$ 128432 206473 196859 261590 304392 148871 -178626 -513197 -719037 -687182 -385924 -36411
30403c6411L9155l05391k36197J50022K93581k2836l60193k65606J24506L49806
$$ -36411 2744 -302647 -538844 -388822 -95241 -118077 -478270 -743876 -619370 -269564
30393b69564K40285J9677n2768O5431K22760K11586m0667l39126l93726j87184
$$ -269564 -29279 -9602 -62370 3061 225821 437407 396740 57614 -336112 -523296
30383e23296q072k7277m9921J38110L72316L23123j114k56604k44887j08252j4024
$$ -523296 -531368 -558645 -608566 -470456 -98140 224983 223869 -32735 -277622 -385874 -399898
30372c99898O7644J61694J36032n0689j60144R545K56594K16837r1641k78721
$$ -399898 -332254 -170560 -34528 -85217 -245361 -235816 20778 237615 145974 -132747
30362a32747j51614M5592N9702r444L7113J32518R0129m7200p3660M3120J25161
$$ -132747 -284361 -238769 -179067 -188511 -151398 -18880 71249 24049 -49611 -6491 118670
30351A18670M2737j67092l78686m24159j80466K06026L41625Q4233j51238O9742
$$ 118670 161407 -5685 -384371 -808530 -988996 -782970 -441345 -357112 -508350 -438608
30341d38608N03939N24044O2808k61100o5383K60836J91738j91010m22150l16410
$$ -438608 65331 589375 652183 391083 325700 586536 778274 587264 165114 -151296
30331a51296o6661J13531J40783J0860j48149j16912J04141J97066l6163l27079
$$ -151296 -217957 -104426 36357 47217 -100932 -217844 -113703 83363 47200 -279879
30321b79879k94937J2125K12371J16389j04713k01377q1425J59783K85226J17956
$$ -279879 -574816 -562691 -350320 -233931 -338644 -540021 -621446 -461663 -176437 -58481
30311e8481j68263j67593J80579M14955K08792j12530q5241J50690J18950j77331
$$ -58481 -226744 -394337 -213758 201197 409989 297459 212218 362908 481858 304527
30301C04527k78920n3937J15334Q27j33744k5776J83378K38429J31723n349j05400
$$ 304527 25607 -28330 87004 87831 -45913 -71689 111689 350118 481841 476492 371092
30290C71092j29386p5332r4961l20636n31016l42351J79161M91400L23705N3557
$$ 371092 241706 166374 71413 -249223 -780239 -1122590 -943429 -452029 -128324 -74767
30280g4767R8347L03370K66571j1752j84404j04896K8001J5606j13078k05024
$$ -74767 23580 326950 593521 581769 397365 292469 320470 336076 222998 17974
30270A7974j52774J0495J11132K8215q2028M5590L32085L53440n0725m60450m14682
$$ 17974 -134800 -124305 -13173 15042 -66986 -21396 310689 664129 613404 152954 -261728
30259b61728k5170K33414J50777j00846l10291l72759k19242P9812K37453Q6890
$$ -261728 -286898 -53484 97293 -3553 -313844 -686603 -905845 -826033 -588580 -501690
30249e01690j02180K4885L36571L91017J40427M336J69490K81655M5161k69310
$$ -501690 -603870 -578985 -242414 148603 289030 293366 462856 744511 789672 520362
30239E20362k37476P1079K22504N4167j67466j86014m9128O9524R5023K4386j25319
$$ 520362 282886 353965 576469 630636 463170 277156 228028 297552 392575 416961 291642
30228B91642k43876j70583O2634J69454m1398l48699l59283l8578K30777J71383
$$ 291642 47766 -122817 -60183 109271 67873 -280826 -640109 -678687 -447910 -276527
30218b76527m3179j00937O882Q5887J19530K39367L75565K82433l8631k66033
$$ -276527 -319706 -420643 -413761 -327874 -208344 31023 406588 689021 650390 384357
30208C84357k22046j02126p5333J9616L02534M61707J39441m40062o64360l37822
$$ 384357 162311 60185 -15148 4468 307002 768709 908150 468088 -196272 -534094
30198e34094J07603K56021J67613O6171m4618k00827k22906J9923K74919J94437
$$ -534094 -426491 -170470 -2857 63314 18696 -182131 -405037 -385114 -110195 84242
30188H4242j21381k21374M9632L31795K72667j8773k05968j84555q6476J9424
$$ 84242 -37139 -258513 -208881 122914 395581 376808 170840 -13715 -100191 -80767
30178h0767J64630K74346J87652p4770k72532k56765j50070j12463q5864O5074
$$ -80767 83863 358209 545861 471091 198559 -58206 -208276 -320739 -406603 -341529
30168c41529K59471K55300k58k48939k21771L9513K43274J85160m3515j78699
$$ -341529 -82058 173242 172984 -75955 -297726 -258213 -14939 170221 126706 -51993
30158e1993p4756J43548K17373L0286k72306m40178l59219j19058J16298K54647
$$ -51993 -126749 16799 234172 264458 -7848 -448026 -807245 -926303 -810005 -555358
30148e55358K97882K60796J14658j39867l45401k48214J94030O31705O37367K12064
$$ -555358 -257476 3320 117978 -21889 -367290 -615504 -421474 210231 847598 1059662
30138A059662k10191l05946j90235j02781k6258J50131K77643Q9599l37927n62737
$$ 1059662 849471 543525 353290 250509 224251 374382 652025 741624 403697 -159040
30128a59040k94340K42924N49678L66737q6956l48270j94054J05710J16531j82465
$$ -159040 -453380 -210456 339222 705959 619003 270733 76679 182389 298920 116455
30118A16455l66720j84474R6674J61001J32650K47486L28849P2792l25317l80817
$$ 116455 -250265 -434739 -338065 -177064 -44414 203072 531921 604713 279396 -101421
30108a01421r3635N0220j25708k57920j07973J06349K10845L38876M60726K33001
$$ -101421 -195056 -144836 -270544 -528464 -636437 -530088 -319243 19633 480359 713360
30098G13360l29565n82972j28376M93949N20407J9710l32088k58552o4107K4935
$$ 713360 383795 -199177 -327553 166396 686803 706513 374425 115873 51766 76701
30088G6701R3590J51735N9256j16503j17096O9092J60346K3527j69958k58345
$$ 76701 170291 322026 381282 264779 147683 216775 377121 400648 230690 -27655
30078b7655k44629j27257J05124K93367K34010J0834q6315K0700J43382J63827
$$ -27655 -272284 -399541 -294417 -1050 232960 243794 157479 178179 321561 485388
30068D85388J14841m1612l51142n81493m00447R0392L81475K31082l6823n4702
$$ 485388 600229 558617 207475 -374018 -774465 -684073 -302598 -71516 -108339 -163041
30058a63041R9676J32344p961j14022j6688K36632M05894K49687j71716m54952
$$ -163041 -63365 68979 61018 -53004 -69692 166940 572834 822521 650805 195853
30048A95853l29754o3995q1393k95785k60624P6146K90548J99303R8478J46045
$$ 195853 -133901 -197896 -279289 -575074 -835698 -759552 -469004 -269701 -171223 -25178
30038b5178Q5846j63596k18341J03257L40010Q5859l01010k29640K00335L85434
$$ -25178 60668 -102928 -321269 -218012 121998 207857 -93153 -322793 -122458 262976
30028B62976J38155j43944j53947j6228N5283K3305q8619k50965l37823k39647
$$ 262976 401131 257187 103240 87012 142295 165600 76981 -173984 -511807 -751454
30018g51454n5270M6808Q6675J67392K28992J68081P2198N0562j6684k29044l27821
$$ -751454 -806724 -759916 -673241 -505849 -276857 -108776 -36578 13984 -2700 -231744 -559565
30007e59565j9748M66436N95611K62643j23395k73509k75092j98478L8453K95416
$$ -559565 -579313 -112877 482734 745377 621982 348473 73381 -125097 -86644 208772
29997B08772K04327k42037n29952l13376J14220L09246K75540K42667J71777j00080
$$ 208772 413099 171062 -358890 -672266 -558046 -248800 26740 269407 441184 341104
29987C41104m20081m47073j53903J35730J92441R3996R083O549Q1453J70209J35528
$$ 341104 -78977 -526050 -679953 -544223 -351782 -257786 -248703 -242154 -160701 9508 145036
29976A45036q9089l34501l33286m1199K98472M21118K79484L1675j18726q7606
$$ 145036 55947 -278554 -611840 -653039 -354567 66551 346035 377710 258984 171378
29966A71378J4176M995j20277j59296j467J65557J02450j20509k06031m3295J57006
$$ 171378 185554 190549 70272 -89024 -90491 75066 177516 57007 -149024 -192319 -35313
29955c5313J62736j1486j86670k37561j64413m0924M9623P9228R4868J25731J05632
$$ -35313 127423 115937 -70733 -308294 -472707 -513631 -464008 -384780 -289912 -164181 -58549
29944e8549r993r2948J5367K02244J54690j62847l41649o9041L46566L33688j20421
$$ -58549 -68542 -161490 -146123 56121 210811 47964 -293685 -362726 -16160 317528 197107
29933A97107m18029k19481O6875m3679l16183j63893L72013O14538K74221j17729
$$ 197107 -220922 -440403 -373528 -417207 -733390 -897283 -525270 89268 363489 245760
29923B45760n7195J80638P1399k78308l48452q0477Q1124k8239p2429J29044K81067
$$ 245760 188565 369203 440602 162294 -186158 -266635 -185511 -213750 -286179 -157135 123932
29912A23932J61457N467M9350J00332p7914k78650j64383J55231K79855J27619
$$ 123932 285389 290856 340206 440538 362624 83974 -80409 74822 354677 482296
29902D82296j4135N060K0067r7583k28861k25104j03177M2046J40839J34423K3310
$$ 482296 468161 473221 493288 395705 166844 -58260 -161437 -119391 21448 155871 179181
29891A79181o3376j1001Q2614L1972j36061k13873j35822m2648r469M6011J30162
$$ 179181 115805 104804 187418 219390 83329 -130544 -266366 -309014 -318483 -272472 -142310
29880a42310R6424r0378k25750j39918O1331J61691J08581P718l7004K0250J50857
$$ -142310 -45886 -136264 -362014 -501932 -440601 -278910 -170329 -162611 -199615 -179365 -28508
29869b8508K08513M5938k34874l23325j19347Q0995J2547j32411N043L41372L95931
$$ -28508 180005 225943 -8931 -332256 -451603 -370608 -358061 -490472 -485429 -144057 251874
29858B51874j3011m55598m44280n5132K40604K15605Q0040P5312J53186J42424
$$ 251874 238863 -216735 -661015 -716147 -475543 -259938 -179898 -104586 48600 191024
29848A91024K1133j24134k64626l79182l41284p3762K23250K42503M610j20508
$$ 191024 212157 88023 -176603 -555785 -897069 -970831 -747581 -505078 -500468 -620976
29838f20976O6359K87636J93746j16156k43166n5774J82167K35470J66866J16691
$$ -620976 -554617 -266981 -73235 -189391 -432557 -488331 -306164 -70694 96172 212863
29828B12863N9794p8305k24918k37406j03890M7137J03684O7024J1512j5006m7387
$$ 212863 272657 194352 -30566 -267972 -371862 -324725 -221041 -154017 -142505 -157511 -204898
29817b04898j32773j95403p5352K12547L83765K18152j05695k28925j00087J9452
$$ -204898 -337671 -533074 -608426 -395879 -12114 206038 100343 -128582 -228669 -209217
29807b09217O686J2983J02835R8832p3436j97261j16795K083m935J3809K12945
$$ -209217 -202531 -189548 -86713 12119 -61317 -258578 -375373 -373290 -378225 -364416 -151471
29796a51471L49918Q9513m00391n68492k19362K18216K68368j7420k14996p7099
$$ -151471 198447 287960 -112431 -680923 -900285 -682069 -413701 -431121 -646117 -723216
29786g23216K35134L92207K49265l3030j80110j01028M6940R5076N2574j689o6332
$$ -723216 -488082 -95875 153390 120360 -59750 -160778 -113838 -18762 33812 32123 -34209
29775c4209j20263l2551K12363L21988L1000m08222m26919P3203M77739K41376
$$ -34209 -154472 -187023 25340 347328 378328 -29894 -456813 -383610 94129 335505
29765C35505l43495n14095p6427L33309J45013l45077m03523Q8485M72443K75571
$$ 335505 -7990 -522085 -598512 -265203 -120190 -465267 -868790 -780305 -307862 -32291
29755c2291j23995j15380K13543K78832k5742j84091M1834K03568m7342l24239
$$ -32291 -156286 -271666 -58123 220709 194967 10876 52710 256278 208936 -115303
29745a15303j33867K76619K91968r1447k81064j3094L20023L19277N4044k21906
$$ -115303 -249170 27449 319417 227970 -53094 -66188 253835 573112 627156 405250
29735D05250l91650l73542r2007K77760L68641R9923j83203j90689k9932O9155
$$ 405250 13600 -359942 -451949 -174189 194452 294375 111172 -79517 -109449 -40294
29725d0294Q2502P8224L4043n2703q2882k6482J8090K4333O9934J11274J5167
$$ -40294 42208 120432 154475 101772 18890 -7592 10498 34831 104765 216039 231206
29714B31206j19710l0834K09296J79475k07165m42046j49303L18112L94400R0952
$$ 231206 111496 80662 289958 469433 262268 -179778 -329081 -10969 383431 474383
29704D74383j49607j32467p771J13839K08399J49249j14940l17895k07859J5174
$$ 474383 324776 192309 184538 298377 506776 656025 541085 223190 15331 30505
29694C0505J2117r6159N8321L72832L42297j17828m79768l85512j14080l8201
$$ 30505 42622 -53537 4784 377616 719913 602085 122317 -263195 -377275 -415476
$$ [...]
##END NTUPLES=NMR SPECTRUM
##END=
