##TITLE=31Pdec_LY-5.70+TMF
 D2O, 24 sc
 28.2.2020
##JCAMPDX= 6.0         $$ Bruker NMR JCAMP-DX V2.0
##DATA TYPE= NMR SPECTRUM
##DATA CLASS= NTUPLES
##ORIGIN= UXNMR, Bruker Analytische Messtechnik GmbH
##OWNER= root
$$ XWIN-NMR		Version 3.5
$$ Fri Feb 28 15:45:57 2020 Russian Standard Time (UT+4h)  she@DPX200
##.OBSERVE FREQUENCY= 81.013821
##.OBSERVE NUCLEUS= ^31P
##.ACQUISITION MODE= SIMULTANEOUS
##.ACQUISITION SCHEME= undefined
##.AVERAGES= 24
##.DIGITISER RES= 17
##SPECTROMETER/DATA SYSTEM= spect
##.PULSE SEQUENCE= zgpg30
##.SOLVENT NAME= CDCl3
##.SHIFT REFERENCE= (INTERNAL, CDCl3, 0, 182.463)
##AUDIT TRAIL= $$ (NUMBER, WHEN, WHO, WHERE, WHAT)
$$ ##TITLE= Audit trail, XWIN-NMR		Version 3.5
$$ ##JCAMPDX= 5.01
$$ ##ORIGIN= Bruker BioSpin GmbH
$$ ##OWNER= she
$$ F:/spectra/data/she/nmr/P31/1/pdata/1/auditp.txt
$$ ##AUDIT TRAIL=  $$ (NUMBER, WHEN, WHO, WHERE, WHAT)
(   1,<2020-02-28 15:44:23.62 +0400>,<she>,<DPX200>,
      <created by zg, POWCHK disabled, PULCHK disabled
       configuration hash MD5:
       00 E9 B6 7A A2 85 ED C7 34 08 36 98 17 FE 4E 26
       data hash MD5: 32K
       D6 7A 28 D0 CB 34 FB 2B C5 CD 2D B3 05 92 87 38>)
(   2,<2020-02-28 15:44:29.45 +0400>,<she>,<DPX200>,
      <Start of raw data processing
       efp BC_mod = 2 LB = 1 FT_mod = 6 PKNL = 1 PHC0 = -1613.908 PHC1 = 671.0013 SI = 64K 
       data hash MD5: 64K
       96 9A 53 9A 6E 38 44 17 BF 84 E7 18 6E 29 21 8B>)
(   3,<2020-02-28 15:44:42.78 +0400>,<she>,<DPX200>,
      <pk PHC0 = 2.466882 PHC1 = 0 
       data hash MD5: 64K
       AF 75 4B AC 19 9C C7 AF 4F 78 ED 97 EB 6C E4 97>)
(   4,<2020-02-28 15:44:45.46 +0400>,<she>,<DPX200>,
      <abs ABSG = 5 
       data hash MD5: 64K
       DA B3 BA 15 CA C5 78 C7 F5 90 0E 2E A5 FF BC 80>)
(   5,<2020-02-28 15:45:01.04 +0400>,<she>,<DPX200>,
      <pk PHC0 = -5.000319 PHC1 = 0 
       data hash MD5: 64K
       25 76 21 13 87 B0 F8 F2 75 B9 41 9F 3C 69 A0 11>)
(   6,<2020-02-28 15:45:23.40 +0400>,<she>,<DPX200>,
      <pk PHC0 = 3 PHC1 = 0 
       data hash MD5: 64K
       2D D8 89 85 A8 EC 95 E2 D9 19 71 47 90 46 2C 78>)
$$ ##END=
$$ 
$$ hash MD5
$$ 19 12 70 F4 3D 31 2F A4 EB E1 C1 54 70 45 B9 25
##$RELAX= 
##$RELAX= 
##$RELAX= 
##$RELAX= 
##$RELAX= 
##$RELAX= 
##$RELAX= 
##$RELAX= 
$$ Bruker specific parameters
$$ --------------------------
##$DU= <F:/spectra>
##$EXPNO= 1
##$NAME= <P31>
##$PROCNO= 1
##$TYPE= <nmr>
##$USER= <she>
##$AMP= (0..31)
100 100 100 100 100 100 100 100 100 100 100 100 100 100 100 100 100 100 
100 100 100 100 100 100 100 100 100 100 100 100 100 100 
##$AQSEQ= 0
##$AQ_mod= 1
##$AUNM= <au_zg>
##$AUTOPOS= <>
##$BF1= 81.014009
##$BF2= 200.13
##$BF3= 200.13
##$BF4= 200.13
##$BF5= 200.13
##$BF6= 200.13
##$BF7= 200.13
##$BF8= 200.13
##$BYTORDA= 1
##$CFDGTYP= 0
##$CFRGTYP= 5
##$CHEMSTR= <none>
##$CNST= (0..31)
1 1 145 1 1 1 1 1 1 1 1 1 1 1 1 1 1 1 1 1 1 1 1 1 1 1 1 1 1 1 1 1 
##$CPDPRG= <waltz16>
##$CPDPRG1= <>
##$CPDPRG2= <waltz16>
##$CPDPRG3= <>
##$CPDPRG4= <mlev>
##$CPDPRG5= <mlev>
$$ [...]
##$SUBNAM3= <"">
##$SUBNAM4= <"">
##$SUBNAM5= <"">
##$SUBNAM6= <"">
##$SUBNAM7= <"">
##$SUBNAM8= <"">
##$SUBNAM9= <"">
##$SW= 369.568048894756
##$SWIBOX= (0..15)
0 1 3 0 0 0 0 0 0 0 0 0 0 0 0 0 
##$SW_h= 29940.119760479
##$TD= 32768
##$TD0= 1
##$TE= 0
##$TE2= 300
##$TE3= 300
##$TEG= 300
##$TL= (0..7)
0 120 53 12 22 120 120 120 
##$TP= (0..7)
150 150 150 150 150 150 150 150 
##$TP07= 0
##$TPNAME0= <>
##$TPNAME1= <>
##$TPNAME2= <>
##$TPNAME3= <>
##$TPNAME4= <>
##$TPNAME5= <>
##$TPNAME6= <>
##$TPNAME7= <>
##$TPOAL= (0..7)
0.5 0.5 0.5 0.5 0.5 0.5 0.5 0.5 
##$TPOFFS= (0..7)
0 0 0 0 0 0 0 0 
##$TUNHIN= 0
##$TUNHOUT= 0
##$TUNXOUT= 0
##$USERA1= <user>
##$USERA2= <user>
##$USERA3= <user>
##$USERA4= <user>
##$USERA5= <user>
##$V9= 5
##$VALIST= <valist>
##$VCLIST= <CCCCCCCCCCCCCCC>
##$VD= 0
##$VDLIST= <DDDDDDDDDDDDDDD>
##$VPLIST= <PPPPPPPPPPPPPPP>
##$VTLIST= <TTTTTTTTTTTTTTT>
##$WBST= 1024
##$WBSW= 4
##$XGAIN= (0..3)
0 0 0 0 
##$XL= 0
##$YL= 0
##$YMAX_a= 54902
##$YMIN_a= -61272
##$ZGOPTNS= <>
##$ZL1= 120
##$ZL2= 120
##$ZL3= 120
##$ZL4= 120
##$ABSF1= 182.463
##$ABSF2= -187.1042
##$ABSG= 5
##$ABSL= 3
##$ALPHA= 0
##$AQORDER= 0
##$ASSFAC= 0
##$ASSFACI= 0
##$ASSFACX= 0
##$ASSWID= 0
##$AUNMP= <proc_1d>
##$AZFE= 0.1
##$AZFW= 0.5
##$BCFW= 0
##$BC_mod= 2
##$BYTORDP= 0
##$COROFFS= 0
##$CY= -3
##$DATMOD= 1
##$DC= 0
##$DFILT= <>
##$DTYPP= 0
##$F1P= 0
##$F2P= 0
##$FCOR= 1
##$FTSIZE= 65536
##$FT_mod= 6
##$GAMMA= 0
##$GB= 0
##$INTBC= 1
##$INTSCL= 5.30512e-09
##$ISEN= 30
##$LB= 1
##$LEV0= 0
##$LPBIN= 0
##$MAXI= 10000
##$MC2= 0
##$MEAN= 0
##$ME_mod= 0
##$MI= 50
##$NCOEF= 0
##$NC_proc= -2
##$NLEV= 6
##$NOISF1= 182.463
##$NOISF2= 159.3651
##$NSP= 0
##$NTH_PI= 0
##$NZP= 0
##$OFFSET= 182.463
##$PC= 4
##$PHC0= -1613.441
##$PHC1= 671.0013
##$PH_mod= 1
##$PKNL= yes
##$PPARMOD= 0
##$PSCAL= 0
##$PSIGN= 0
##$REVERSE= no
##$SF= 81.0140089999434
##$SI= 65536
##$SIGF1= 159.3651
##$SIGF2= -187.1042
##$SINO= 113.3802
##$SIOLD= 16384
##$SREGLST= <1H.CDCl3>
##$SSB= 0
##$STSI= 65536
##$STSR= 0
##$SW_p= 29940.119760479
##$SYMM= 0
##$S_DEV= 0
##$TDeff= 32768
##$TDoff= 0
##$TI= <>
##$TILT= no
##$TM1= 0
##$TM2= 0
##$TOPLEV= 0
##$USERP1= <user>
##$USERP2= <user>
##$USERP3= <user>
##$USERP4= <user>
##$USERP5= <user>
##$WDW= 1
##$XDIM= 65536
##$YMAX_p= 398174417
##$YMIN_p= -1409247
$$ End of Bruker specific parameters
$$ ---------------------------------
##NTUPLES= NMR SPECTRUM
##VAR_NAME=  FREQUENCY,     SPECTRUM/REAL,   SPECTRUM/IMAG
##SYMBOL=    X,             R,               I
##VAR_TYPE=  INDEPENDENT,   DEPENDENT,       DEPENDENT
##VAR_FORM=  AFFN,          ASDF,            ASDF
##VAR_DIM=   65536,         65536,           65536
##UNITS=     HZ,            ARBITRARY UNITS, ARBITRARY UNITS
##FACTOR=    0.456856943014862, 1,           1
##FIRST=     14782.0589164792, 0,            0
##LAST=      -15158.0608439998, 0,           0
##MIN=       -15158.0608439998, -1409247,    0
##MAX=       14782.0589164792, 398174417,    0
$$ Real data points
##PAGE= N=1
##DATA TABLE= (X++(R..R)), XYDATA
$$ [...]
##PAGE= N=2
##DATA TABLE= (X++(I..I)), XYDATA
$$ plain form
36969 321351 221799 170468 151688 159846 238853 365432 408759 310552 211934 277912 458948
36958 458948 553976 477005 342396 292415 340489 400593 404108 364415 348843 385935 408880
36947 408880 339730 224616 192888 257632 273350 156801 30852 44000 149513 199020 178993
36936 178993 196270 266151 279321 188827 89747 76990 131165 185762 222118 254448 282136
36925 282136 295401 292621 275678 255560 257673 290140 323130 332525 334156 337677 314649 267318
36913 267318 271028 368056 471502 473397 405290 376180 382503 318420 175614 87083 129509 206880
36901 206880 199063 130482 110368 169073 236424 255833 255030 301273 414800 533858 572222 519239
36889 519239 455315 441133 433166 364106 267402 240149 300418 368131 386113 379664 392498 438980
$$ packed form
36969C21351r9552n1331j8780Q158P9007J26579M3327r8207r8618O5978J81036
36958D58948R5028p6971j34609m9981M8074O0104L515l9693j5572L7092K2945
36947D08880o9150j15114l1728O4744J5718j16549j25949J3148J05513M9507k0027
36936A78993J7277O9881J3170r0494r9080j2757N4175N4597L6356L2330K7688
36925B82136J3265k780j6943k0118K113L2467L2990R395J631L521k3028m7331
36913B67318L710R7028J03446J895o8107k9110O323o4083j42806q8531M2426P7371
36901B06880p817o8581k0114N8705O7351J9409q03M6243J13527J19058L8364n2983
36889E19239o3924j4182p967o9060r6704k7253O0269O7713J7982o449J2834M6482
$$ plain form
36877 438980 520869 613941 639910 538938 376136 287733 311498 358031 354590 315497 259498
36866 259498 176733 111129 153701 295683 395785 361917 271658 244511 286918 337723 375441
36855 375441 393942 354834 260236 204308 256894 356471 410240 435135 495163 558954 541334
36844 541334 450254 374827 350955 348495 365851 416947 440926 358504 226419 203511 331024
36833 331024 467072 486159 431556 405489 409434 382151 325975 298540 312385 324657 315541 316803
36821 316803 364378 457905 554791 578991 466528 244196 40346 -29139 24408 98585 135288
36810 135288 172548 261647 380502 454310 443487 389699 370813 412344 453436 418318 317761
36799 317761 247455 275218 366370 443297 478622 489132 473892 420513 359494 347672 391367
$$ packed form
36877D38980Q1889R3072K5969j00972j62802q8403K3765M6533l441l9093n5999
36866B59498q2765o5604M2572J41982J00102l3868r0259k7147M2407N0805L7718
36855C75441J8501l9108r4598n5928N2586R9577N3769K4895O0028O3791j7620
36844E41334r1080p5427k3872k460J7356N1096K3979q2422j32085k2908J27513
36833C31024J36048J9087n4603k6067L945k7283n6176k7435J3845J2272r116J262
36821C16803M7575R3527R6886K4200j12463k22332k03850o9485N3547P4177L6703
36810A35288L7260Q9099J18855P3808j0823n3788j8886M1531M1092l5118j00557
36799C17761p0306K7763R1152P6927L5325J0510j5240n3379o1019j1822M3695
$$ plain form
36788 391367 440554 468937 503886 557806 585539 544290 455133 372735 329312 333935 381325 426589
36776 426589 402225 309666 245535 275214 327913 299694 223699 230958 347475 442792 409393
36765 409393 296890 221751 223728 265588 306673 316388 270195 192140 153361 173331 177241 116889
36753 116889 74499 154233 311860 404022 397220 410419 521179 634596 611679 459993 315349
36742 315349 263187 257799 224488 172364 163228 207107 251217 271282 308470 383714 434883 402908
36730 402908 338790 339178 395965 410452 356255 311869 306010 261013 154919 111294 218146 357587
36718 357587 350412 204826 82346 59949 72416 73406 103511 178980 241291 256086 264391 302318
36706 302318 351421 390256 417693 414978 368388 333834 382737 475392 495035 425920 382915 433235
$$ packed form
36788C91367M9187K8383L4949N3920K7733m1249q9157q2398m3423M623M7390M5264
36776D26589k4364r2559o4131K9679N2699k8219p5995P259J16517R5317l3399
36765D09393j12503p5139J977M1860M1085R715m6193p8055l8779J9970L910o0352
36753A16889m2390P9734J57627R2162o802J3199J10760J13417k2917j51686j44644
36742C15349n2162n388l3311n2124r136M3879M4110K0065L7188P5244N1169l1975
36730D02908o4118L88N6787J4487n4197m4386n859m4997j06094m3625J06852J39441
36718C57587p175j45586j22480k2397J2467R90L0105P5469O2311J4795Q305L7927
36706C02318M9103L8835K7437k715m6590l4554M8903R2655J9643o9115m3005N0320
$$ plain form
36694 433235 508349 540204 563382 613595 639470 603591 570584 591385 584681 453972 267254
36683 267254 194883 287760 424656 480501 457910 436351 457668 488944 468735 378869 277177
36672 277177 240525 268030 281952 244539 219192 273905 375336 437712 440472 432014 436426 421914
36660 421914 364237 293531 264963 305378 393297 480557 534481 557149 555869 516056 436185 366966
36648 366966 360849 396043 415384 426128 473641 520144 464772 315106 220416 269937 362843
36637 362843 364209 301067 298234 381673 457758 457742 404648 348677 314895 309227 317107 306004 272005
36624 272005 258021 285408 309610 294610 282382 321272 369076 349079 278789 262527 357949
36613 357949 507971 603655 575524 437838 279928 196482 199692 227051 247958 303026 408781
$$ packed form
36694D33235P5114L1855K3178N0213K5875l5879l3007K0801o704j30709j86718
36683B67254p2371R2877J36896N5845k2591k1559K1317L1276k0209q9866j01692
36672B77177l6652K7505J3922l7413k5347N4713J01431O2376K760q458M412j4512
36660D21914n7677p0706k8568M0415Q7919Q7260N3924K2668j280l9813p9871o9219
36648C66966o117L5194J9341J0744M7513M6503n5372j49666r4690M9521R2906
36637C62843J366o3142k833Q3439P6085j6n3094n5971l3782n668P880j1103l3999
36624B72005j3984K7387K4202j5000j2228L8890M7804j9997p0290j6262R5422
36613C57949J50022R5684k8131j37686j57910q3446L210K7359K0907N5068J05755
$$ plain form
36602 408781 498116 509796 471775 438878 417217 413763 481424 627894 747224 738185 636746
36591 636746 540665 463991 370752 294817 301721 363689 390241 362339 330329 304667 259627 222769
36579 222769 243600 285041 261061 177966 127954 143417 166870 169538 191843 252084 310670 339244
36567 339244 343518 317412 258340 219218 253876 321607 341755 327166 354691 415371 416318 336396
36555 336396 261067 248106 269693 301495 359432 432151 482039 524062 598058 660953 626829
36544 626829 523337 481843 551322 640482 661145 611838 515677 409395 394536 540548 721165
36533 721165 719644 529652 372929 376054 426613 414799 401974 440144 432131 320513 236273
36522 236273 293937 395442 409374 396280 464518 536076 471962 330582 279555 322196 331367
$$ packed form
36602D08781Q9335J1680l8021l2897k1661l454O7661J46470J19330r039j01439
36591F36746r6081p6674r3239p5935O904O1968K6552k7902l2010k5662m5040l6858
36579B22769K0831M1441k3980q3095n0012J5463K3453K668K2305O0241N8586K8574
36567C39244M274k6106n9072l9122L4658O7731K0148j4589K7525O0680R47p9922
36555C36396p5329j2961K1587L1802N7937P2719M9888M2023P3996O2895l4124
36544F26829j03492m1494O9479Q9160K0663m9307r6161j06282j4859J46012J80617
36533G21165j521j89992j56723L125N0559j1814j2825L8170q013j11618q4240
36522B36273N7664J01505J3932j3094O8238P1558o4114j41380n1027M2641R171
$$ plain form
36511 331367 300535 332201 403400 376525 254577 204054 282176 344453 289814 215226 236638
36500 236638 309389 332256 311894 314678 339167 339161 321032 333441 390756 465735 533835 584019
36488 584019 607138 598971 557321 476268 375884 322896 362243 431972 417305 301279 194169
36477 194169 194766 286273 389902 454416 461608 407600 326114 287219 327458 404936 451806 447546
36465 447546 420821 405696 414802 433351 429212 393707 374881 433765 558533 660537 671826
36454 671826 613975 555665 535876 547559 565012 561936 524707 473108 454969 498705 574026 611223
36442 611223 562757 451115 359870 363953 453849 540061 548542 496433 452827 445698 443121 414333
36430 414333 367659 328447 317886 356796 448799 546112 572953 512416 442078 445512 503138 518137
$$ packed form
36511C31367l0832L1666P1199k6875j21948n0523P8122O2277n4639p4588K1412
36500B36638P2751K2867k0362K784K4489oj8129J2409N7315P4979O8100N0184
36488E84019K3119q167m1650q1053j00384n2988L9347O9729j4667j16026j07110
36477A94169N97R1507J03629O4514P192n4008q1486l8895M0239P7478M6870m260
36465D47546k6725j5125R106J8549m139l5505j8826N8884J24768J02004J1289
36454F71826n7851n8310j9789J1683J7453l076l7229n1599j8139M3736P5321L7197
36442F11223m8466j11642r1245M083Q9896Q6212Q481n2109m3606p129k577k8788
36430D14333m6674l9212j0561L8910R2003R7313K6841o0537p0338L434N7626J4999
$$ plain form
36418 518137 457423 413057 478927 601645 631054 523836 409959 409375 463249 436824 335317
36407 335317 296600 380218 487694 516079 477151 422071 357391 300747 321562 440428 561136
36396 561136 586241 535571 470643 379060 241325 145899 199888 351635 438066 409033 375315
36385 375315 413289 451727 408656 331184 312660 340489 322782 239391 181302 233479 378399
36374 378399 534073 642406 688813 667676 581534 472631 399132 356281 276094 151496 102470
36363 102470 232296 453318 570712 540110 515514 604475 705394 671096 530853 439483
36353 439483 469099 558601 629651 652107 617982 542066 479464 470449 480020 454244 415706 436215
36341 436215 528853 627451 663605 620163 530149 460290 459461 487342 449639 347460 311592 413909
$$ packed form
36418E18137o0714m4366O5870J22718K9409j07218j13877n84N3874k6425j01507
36407C35317l8717Q3618J07476K8385l8928n5080o4680n6644K0815J18866J20708
36396E61136K5105n0670o4928r1583j37735r5426N3989J51747Q6431k9033l3718
36385C75315L7974L8438m3071p7472j8524K7829j7707q3391n8089N2177J44920
36374C78399J55674J08333M6407k1137q6142j08903p3499m2851q0187j24598m9026
36363A02470J29826K21022J17394l0602k4596Q8961J00919l4298j40243r1370
36353D39483K9616Q9502P1050K2456l4125p5916o2602r015R571k5776l8538K0509
36341D36215R2638R8598L6154m3442r0014o9859q29K7881l7703j02179l5868J02317
$$ plain form
36329 413909 528729 492949 342142 256856 307448 388404 402728 380673 385294 403459 381787
36318 381787 315600 265893 304919 438396 569523 585413 507073 483261 586088 699843 688717
36307 688717 580398 480047 399088 306475 266679 359473 511411 573633 536449 507170 507735
36296 507735 467395 394155 369230 378293 337748 291353 376548 569516 674898 623218 571306
36285 571306 628400 684203 618092 497203 434724 404454 338350 284317 322220 412946 458509
36274 458509 443178 414771 396432 400653 452273 522265 527992 472544 479827 604727 714863 663722
36262 663722 489095 338919 287823 323863 422468 524734 529661 422490 336530 382938 497590
36251 497590 559853 572597 604053 638202 620746 584307 587497 585488 499417 366378 283948 249727
$$ packed form
36329D13909J14820l5780j50807q5286N0592Q0956J4324k2055M621J8165k1672
36318C81787o6187m9707L9026J33477J31127J5890p8340k3812J02827J13755j1126
36307F88717j08319j00351q0959r2613l9796R2794J51938O2222l7184k9279N65
36296E07735m0340p3240k4925R063m0545m6395Q5195J92968J05382n1680n1912
36285E71306N7094N5803o6111j20889o2479l0270o6104n4033L7903R0726M5563
36274D58509j5331k8407j8339M221N1620O9992N727n5448P283J24900J10136n1141
36262F63722j74627j50176n1096L6040R8605J02266M927j07171q5960M6408J14652
36251D97590O2263J2744L1456L4149j7456l6439L190k009q6071j33039q2430l4221
$$ plain form
36239 249727 196234 146543 184406 287706 339831 308579 280991 312639 365776 408258 454458
36228 454458 488331 457675 374354 324578 351733 413525 474987 552712 635169 645387 534491
36217 534491 357779 216266 159966 174873 228158 296922 370597 442983 501588 535411 558485
36206 558485 597200 638873 630609 554831 465445 417007 399219 376765 351260 344644 359931 392136
36194 392136 438216 474202 476643 482657 550759 638005 617202 464743 325312 322183 407186 474692
36182 474692 509931 527685 484709 382403 350535 478631 649268 695497 647700 654264 723882
36171 723882 741493 703701 729325 826507 843747 697920 491902 353653 293725 273908 295145
36160 295145 356780 420377 462257 494175 515227 514453 516768 542737 540785 461915 379665 410018
$$ packed form
36239B49727n3493m9691L7863J03300N2125l1252k7588L1648N3137M2482M6200
36228D54458L3873l0656q3321m9776K7155O1792O1462P7725Q2457J0218j10896
36217E34491j76712j41513n6300J4907N3285O8764P3675P2386N8605L3823K3074
36206E58485L8715M1673q264p5778q9386m8438j7788k2454k5505o616J5287L2205
36194C92136M6080L5986K441O014O8102Q7246k0803j52459j39431l129Q5003O7506
36182D74692L5239J7754m2976j02306l1868J28096J70637M6229m7797O564O9618
36171G23882J7611l7792K5624R7182J7240j45827k06018j38249n9928j9817K1237
36160B95145O1635O3597M1880L1918K1052p74K315K5969j952p8870q2250L0353
$$ plain form
36148 410018 522494 569967 510474 452648 461068 470002 434203 417218 461946 500525 470457 416660
36136 416660 404875 422068 427614 423727 420739 410678 421847 515967 680495 801055 789324 672774
36124 672774 532201 432686 434796 563634 722920 748683 609572 461089 445346 532712 619672
36113 619672 676401 713893 697752 597952 469413 397487 399748 437082 473805 481574 445620 413716
36101 413716 468010 596389 670168 613375 516342 505698 574504 628213 635464 633773 629937 598550
36089 598550 559756 562953 591851 564477 444189 296423 216573 236692 320255 425269 543813
36078 543813 669267 747632 715658 607272 557666 642205 767490 804979 777020 791815 832969
36067 832969 769433 581283 417097 383790 423065 452913 487273 534606 516922 403386 315203
$$ packed form
36148D10018J12476M7473n9493n7826Q420Q934l5799j6985M4728L8579l0068n3797
36136D16660j1785J7193N546l887k988j0061J1169R4120J64528J20560j1731j16550
36124F72774j40573r9515K110J28838J59286K5763j39111j48483j5743Q7366Q6960
36113F19672N6729L7492j6141r9800j28539p1926K261L7334L6723P769l5954l1904
36101D13716N4294J28379P3779n6793r7033j0644O8806N3709P251j691l836l1387
36089E98550l8794L197K8898k7374j20288j47766p9850K0119Q3563J05014J18544
36078E43813J25454P8365l1974j08386m9606Q4539J25285L7489k7959J4795M1154
36067H32969o3536j88150j64186l3307L9275K9848L4360M7333j7684j13536q8183
$$ plain form
36056 315203 370652 501778 546925 472003 386140 371931 402647 414796 387300 354082 376350
36045 376350 475301 573358 561924 450170 362413 354231 339630 260535 205830 260898 347278
36034 347278 342460 278481 279016 354562 410341 430561 501511 638764 725140 667120 522753 423827
36022 423827 425466 473706 493698 478906 488395 555342 620800 604507 533178 524213 625151 748911
36010 748911 796993 761738 673382 550596 459124 505173 683102 829523 826088 752049 728643
35999 728643 715985 607533 444980 372322 417039 475664 496744 525086 566444 556352 486770
35988 486770 440442 469125 535712 595785 645238 675327 670865 663432 699837 752211 746836 684279
35976 684279 639001 637502 634453 614500 610784 606974 536168 416122 377522 493669 660972 716064
$$ packed form
36056C15203N5449J31126M5147p4922q5863j4209L0716J2149k7496l3218K2268
36045C76350R8951R8057j1434j11754q7757q182j4601p9095n4705N5068Q6380
36034C47278m818o3979N35P5546N5779K0220P0950J37253Q6376n8020j44367r8926
36022D23827J639M8240J9992j4792R489O6947O5458j6293p1329q965J00938J23760
36010G48911M8082l5255q8356j22786r1472M6049J77929J46421l435p4039k3406
35999G28643j2658j08452j62553p2658M4717N8625K1080K8342M1358j0092o9582
35988D86770m6328K8683O6587O0073M9453L0089m462p433L6405N2374n375o2557
35976F84279m5278j499l049j9953l716l810p0806j20046l8600J16147J67303N5092
$$ plain form
35964 716064 621312 483174 427727 497622 635278 733764 729814 661808 608573 577708 508967
35953 508967 389624 294894 285774 327431 350633 351330 382619 467656 558862 585758 530876 453945
35941 453945 430766 463499 476972 422617 351888 347961 414040 482421 517813 552571 618245 693805
35929 693805 736090 729431 695172 671085 679164 697118 673168 589299 496960 469975 532213 641375
35917 641375 725869 734430 679908 637405 661264 706382 685967 605141 561204 598308 648064 643271
35905 643271 602684 565644 535123 532014 606441 732431 787325 708740 583561 510877 471936
35894 471936 411920 347564 306351 264319 237567 318147 505662 623455 540168 368432 300698
35883 300698 355264 438181 538969 677549 761306 708941 639039 714033 858438 864132 728581
$$ packed form
35964G16064r4752j38138n5447O9895J37656R8486l950o8006n3235l0865o8741
35953E08967j19343r4730r120M1657K3202O97L1289Q5037R1206K6896n4882p6931
35941D53945k3179L2733J3473n4355p0729l927O6079O8381L5392L4758O5674P5560
35929F93805M2285o659l4259k4087Q079J7954k3950q3869r2339k6985O2238J09162
35917F41375Q4494Q561n4522m2503K3859M5118k0415q0826m3937L7104M9756m793
35905F43271m0587l7040l0521l109P4427J25990N4894p8585j25179p2684l8941
35894D71936o0016o4356m1213m2032k6752Q0580J87515J17793q3287j71736o7734
35883C00698N4566Q2917J00788J38580Q3757n2365o9902P4994J44405N694j35551
$$ plain form
35872 728581 640057 650092 623994 530076 513459 625500 718713 690380 623538 606098 600264
35861 600264 570346 561393 575097 538737 466023 475578 583766 660830 662353 708302 842355 913476
35849 913476 817630 675827 635995 657791 634832 586968 583983 597279 568911 534483 560302
35838 560302 643050 755450 886233 965809 890257 702025 593711 636409 672364 591654 526681
35827 526681 611592 728565 699708 589427 587485 689217 724903 654087 611261 671326 753384
35816 753384 763048 687508 552379 403597 318645 335665 401076 468232 578185 743996 847685
35805 847685 786727 643815 567892 561601 537398 505350 530472 567347 525872 457763 485357
35794 485357 575406 583476 509000 495844 567283 576435 470363 399795 477932 599689 608497 512570
$$ packed form
35872G28581q8524J0035k6098r3918j6617J12041R3213k8333o6842j7440n834
35861F00264k9918q953J3704l6360p2714R555J08188P7064J523M5949J34053P1121
35849I13476r5846j41803l9832K1796k2959m7864k985J3296k8368l4428K5819
35838E60302Q2748J12400J30783P9576p5552j88232j08314M2698L5955q0710o4973
35827E26681Q4911J16973k8857j10281j942J01732L5686p0816m2826O0065Q2058
35816G53384R664p5540j35129j48782q4952J7020O5411O7156J09953J65811J03689
35805H47685o0958j42912p5923o291k4203l2048K5122L6875m1475o8109K7594
35794D85357R0049Q070p4476j3156P1439R152j06072p0568P8137J21757Q808r5927
$$ plain form
35782 512570 427997 408081 432141 487037 561649 608465 590639 539837 516378 540087 594370
35771 594370 662537 726107 757041 741083 691319 628641 570001 534772 533975 554788 580804 617617
35759 617617 671076 715638 715034 662750 582919 512396 489809 518197 527850 442645 307385 268507
35747 268507 387926 562238 674374 722871 736143 680825 558824 480064 507753 535351 468296
35736 468296 426722 575484 821862 903061 757724 593489 563417 585183 545641 496300 537431
35725 537431 643149 719448 752925 799023 867542 897458 831186 679921 527504 467627 511217
35714 511217 576727 604337 630541 693476 733651 684469 600731 578652 599630 589669 588435 693976
35702 693976 857147 908221 802171 669263 596969 535495 463851 468010 571795 651861 626174
$$ packed form
35782E12570q4573j9916K4060N4896P4612M6816j7826n0802k3459K3709N4283
35771E94370O8167O3570L0934j5958m9764o2678n8640l5229p97K0813K6016L6813
35759F17617N3459M4562o04n2284p9831p0523k2587K8388R653q5205j35260l8878
35747B68507J19419J74312J12136M8497J3272n5318j22001p8760K7689K7598o7055
35736D68296m1574J48762K46378Q1199j45337j64235l0072K1766l9542m9341M1131
35725E37431J05718P6299L3477M6098O8519K9916o6272j51265j52417n9877M3590
35714E11217O5510K7610K6204O2935M0175m9182q3738k2079K0978r961j234J05541
35702F93976J63171N1074j06050j32908p2294o1474p1644M159J03785Q0066k5687
$$ plain form
35691 626174 590980 654308 748179 735485 621401 530551 523645 549583 553349 538213 527598 529079
35679 529079 536779 540752 545341 579920 653827 708741 681922 616807 627511 739821 856512 902037
35667 902037 904766 902483 870640 800180 752713 769165 798817 784942 753245 751785 766609 760001
35655 760001 734433 700224 639478 562111 536813 598980 681503 705235 687530 687736 691910 639626
35643 639626 541487 482185 503446 552796 563936 535288 503690 477018 433032 380076 378034 466140
35631 466140 587888 640237 604201 567006 592913 645207 680583 735011 835412 905055 868439
35620 868439 790772 784359 818858 769928 637039 559255 608040 712502 808103 906100 977922
35609 977922 927723 753271 605446 604679 698714 773218 805399 833218 860978 875660 890536
$$ packed form
35691F26174l5194O3328R3871j2694j14084r0850o906K5938L766j5136j0615J481
35679E29079P700L973M589L4579P3907N4914k6819o5115J0704J12310J16691M5525
35667I02037K729k283l1843p0460m7467J6452K9652j3875l1697j460J4824o608
35655G60001k5568l4209o0746p7367k5298O2167Q2523K3732j7705K06M174n2284
35643F39626r8139n9302K1261M9350J1140k8648l1598k6672m3986n2956k042Q8106
35631D66140J21748N2349l6036l7195K5907N2294L5376N4428J00401O9643l6616
35620H68439p7667o413L4499m8930j32889p7784M8785J04462R5601R7997P1822
35609I77922n0199j74452j47825p67R4035P4504L2181K7819K7760J4682J4876
$$ plain form
35598 890536 906509 886267 814672 729056 660569 612617 614373 706127 845205 921781 901170
35587 901170 857193 838642 811270 767024 772927 856770 947255 979063 962577 914899 831128 755900
35575 755900 758680 802309 773923 684524 676505 777309 827981 745389 668089 716790 788599 748148
35563 748148 666504 685973 771594 791123 749069 747207 777382 740972 638365 574497 598470
35552 598470 672480 764661 844674 834140 699759 557420 548228 643577 699975 668140 616127
35541 616127 584637 561447 573069 658734 761812 774388 685352 575882 488796 415535 385043
35530 385043 437564 522816 548547 527014 559174 675200 796509 852089 833794 748761 620406
35519 620406 526779 535622 606699 648723 654383 681921 724916 708555 607979 475526 362058
$$ packed form
35598H90536J5973k0242p1595q5616o8487m7952J756R1754J39078P6576k0611
35587I01170m3977j8551k7372m4246N903Q3843R0485L1808j6486m7678q3771p5228
35575G55900K780M3629k8386q9399q019J00804N0672q2592p7300M8701P1809m0451
35563G48148q1644J9469Q5621J9529m2054j862L0175l6410j02607o3868K3973
35552E98470P4010R2181Q0013j0534j34381j42339r192R5349N6398l1835n2013
35541F16127l1490k3190J1622Q5665J03078J2576q9036j09470q7086p3261l0492
35530C85043N2521Q5252K5731k1533L2160J16026J21309N5580j8295q5033j28355
35519F20406r3627Q843P1077M2024N660K7538M2995j6361j00576j32453j13468
$$ plain form
35508 362058 297340 320707 433180 545336 573056 558277 595208 674274 713791 711669 737185
35497 737185 793565 819584 816215 840730 876879 840859 729197 644553 656538 733272 816041
35486 816041 869456 863594 802308 759602 793073 839657 797185 684432 612578 625867 685403
35475 685403 777413 906823 1010837 1020081 988399 1019893 1083924 1054614 924487 817764 788858
35464 788858 772679 748319 780057 860622 879336 801143 733308 757416 823434 861671 879077
35453 879077 896314 899713 894072 901737 893361 830392 774413 821514 934446 993547 1003887 1064706
35441 1064706 1132572 1045131 827096 726945 846977 968646 890372 730808 714044 823282
35431 823282 876286 828056 789267 809386 827309 807674 778195 751039 722144 721974 770244 816755
$$ packed form
35508C62058o4718K3367J12473J12156K7720j4779L6931P9066L9517k122K5516
35497G37185N6380K6019l369K4515L6149l6020j11662q4644J1985P6734Q2769
35486H16041N3415n862o1286m2706L3471M6584m2472j12753p1854J3289N9536
35475F85403R2010J29410J04014R244l1682L1494O4031k9310j30127j06723k8906
35464G88858j6179k4360L1738Q0565J8714p8193o7835K4108O6018L8237J7406
35453H79077J7237L399n641P665q376o2969n5979M7101J12932N9101J0340O0819
35441A064706O7866q7441k18035j00151J20032J21669p8274j59564j6764J09238
35431H23282N3004m8230l8789K0119J7923j9635k9479k7156k8895j70M8270M6511
$$ plain form
35419 816755 815333 810280 860585 927084 927106 859083 786238 736340 699549 687939 719068 771464
35407 771464 818369 866318 906368 881761 768061 634212 560809 546863 553641 581329 636449
35396 636449 678637 670700 641409 643074 686739 757631 839496 890417 867340 813354 834159 936606
35384 936606 984049 880964 715615 642586 701099 825199 954851 1052033 1075766 1029700 985733
35373 985733 994634 1026374 1045433 1068454 1097949 1092582 1061800 1084136 1161475 1173066 1063931 956176
35361 956176 959405 987805 902905 740204 646997 672694 761723 879170 998940 1041963 981928
35350 981928 943669 1029205 1109785 982954 699357 526561 584378 713533 740822 691714 675168
35339 675168 712000 763002 815659 863986 882060 874271 883108 910449 905045 859692 842242 892870
$$ packed form
35419H16755j422n053N0305O6499K2o8023p2845m9898l6791j1610L1129N2396
35407G71464M6905M7949M0050k4607j13700j33849p3403j3946O778K7688N5120
35396F36449M2188p937k9291J665M3665P0892Q1865N0921k3077n3986K0805J02447
35384I36606M7443j03085j65349p3029N8513J24100J29652R7182K3733m6066m3967
35373I85733Q901L1740J9059K3021K9495n367l0782K2336P7339J1591j09135j07755
35361I56176L229K8400q4900j62701r3207K5697Q9029J17447J19770M3023o0035
35350I81928l8259Q5536Q0580j26831k83597j72796N7817J29155K7289m9108j6546
35339F75168L6832N1002N2657M8327J8074p789Q837K7341n404m5353j7450N0628
$$ plain form
35327 892870 963046 995271 998208 1004468 1012194 1006466 990723 965635 919514 864231 838462 851882
35315 851882 864212 841673 802217 785837 806065 846793 890207 937149 1002164 1080652 1126055
35304 1126055 1095352 1023366 995365 1019059 991868 851131 694542 669861 783201 903005
35294 903005 935806 914914 915555 954503 990407 980906 929734 894011 924990 985139 970428 850169
35282 850169 729633 719763 797031 858789 869346 871043 884544 884743 864555 851121 859877 880093
35270 880093 893936 876217 808151 727507 717057 798322 892823 938633 974303 1040032 1076680
35259 1076680 1021285 936073 925682 970549 963937 889837 843275 875224 922813 907441 825357
35248 825357 735494 715036 809954 969352 1058800 1006006 897865 863687 910656 958901 984525
$$ packed form
35327H92870P0176L2225K937O260P726n728j5743k5088m6121n5283k5769J3420
35315H51882J2330k2539l9456j6380K0228M0728M3414M6942O5015P8488M5403
35304A126055l0703p1986k8001K3694k7191j40737j56589k4681J13340J19804
35294I03005L2801k0892O41L8948L5904r501n1172l5723L0979O0149j4711j20259
35282H50169j20536r870P7268O1758J0557J697J3501J99k0188j3434Q756K0216
35270H80093J3843j7719o8066q0644j0450Q1265R4501M5810L5670O5729L6648
35259A076680n5395q5212j0391M4867o612p4100m6562L1949M7589j5372q2084
35248H25357q9863k0458R4918J59398Q9448n2794j08141l4178M6969M8245K5624
$$ plain form
35237 984525 1018525 1042231 1002909 917993 858448 840694 829734 826921 852879 866187 809638 724356
35225 724356 710109 781430 866756 936215 1018568 1099935 1123817 1097821 1090455 1110721 1093108 1015148
35213 1015148 934810 897524 890966 898910 919093 925959 891035 835011 795533 773763 781916 880464
35201 880464 1061144 1160570 1039646 810710 725038 849574 1017593 1096357 1127003 1170213
35191 1170213 1185118 1130005 1055065 1026641 1048138 1092716 1132749 1127489 1070486 1036790 1078392
35180 1078392 1105047 1005977 855401 824307 906668 935164 876020 881665 1001584 1075190 1009664
35169 1009664 945060 1005001 1073440 990093 824067 772652 881709 1027744 1111409 1127425 1090965
35158 1090965 1018547 954620 930033 926042 934314 990172 1088933 1146839 1113301 1046398 1010729 983822
$$ packed form
35237I84525L4000K3706l9322q4916n9545j7754j0960k813K5958J3308n6549q5282
35225G24356j4247P1321Q5326O9459Q2353Q1367K3882k5996p366K0266j7613p7960
35213A015148q0338l7286o558P944K0183O866l4924n6024l9478k1770Q153R8548
35201H80464J80680R9426j20924k28936q5672J24536J68019P8764L0646M3210
35191A170213J4905n5113p4940k8424K1497M4578M0033n260n7003l3696M1602
35180A078392K6655r9070j50576l1094Q2361K8496n9144N645J19919P3606o5526
35169A009664o4604N9941O8439q3347j66026n1415J09057J46035Q3665J6016l6460
35158A090965p2418o3927k4587l991Q272N5858R8761N7906l3538o6903l5669k6907
$$ plain form
35146 983822 938892 934847 1029706 1164298 1218087 1143996 997347 879139 877033 986627 1069081
35135 1069081 989824 826675 806459 983014 1133138 1065879 883512 802489 844851 871663
35125 871663 834423 819877 883713 985208 1068756 1097786 1035595 899322 804801 852052 984686
35114 984686 1057010 1022138 963312 952177 965011 947038 897000 871595 924614 1030881 1078195
35103 1078195 990403 855720 841613 964267 1054884 999084 888656 864644 927927 998090 1051659
35092 1051659 1093993 1088585 1028383 994405 1031208 1047717 961723 859759 876546 984620 1050494
35081 1050494 1048537 1067508 1134141 1178069 1164694 1132643 1098638 1041067 981155 974703 1015492 1036067
35069 1036067 1006260 954265 903286 865878 877825 948576 999816 949183 840472 794548 841345
$$ packed form
35146I83822m4930m045R4859J34592N3789p4091j46649j18208k106J09594Q2454
35135A069081p9257j63149k0216J76555J50124o7259j82367q1023M2362K6812
35125H71663l7240j4546O3836J01495Q3548K9030o2191j36273r4521M7251J32634
35114I84686P2324l4872n8826j1135J2834j7973n0038k5405N3019J06267M7314
35103A078195q7792j34683j4107J22654R0617n5800j10428k4012O3283P0163N3569
35092A051659M2334n408o0202l3978L6803J6509q5994j01964J6787J08074O5874
35081A050494j957J8971O6633M3928j3375l2051l4005n7571n9912o452M0789K0575
35069A036067k9807n1995n0979l7408J1947P0751N1240n0633j08711m5924M6797
$$ plain form
35058 841345 898181 909784 908785 929354 957406 986750 1038397 1096015 1098156 1033416 985776 1039640
35046 1039640 1168016 1250185 1195957 1039931 909236 894148 961777 1018038 1031512 1041357 1055647
35035 1055647 1026021 943018 875296 877299 927394 990771 1068912 1148745 1180720 1152935 1115512
35024 1115512 1092668 1048215 973953 923588 918797 914574 895750 904589 938035 940996 939216 1025943
35012 1025943 1159328 1155349 982156 871923 993470 1190206 1228154 1149225 1156445 1263366
35002 1263366 1300877 1211251 1103608 1041262 983825 938299 979785 1105799 1220884 1272232 1273642
34991 1273642 1216665 1094321 984458 965279 977679 921970 857947 936935 1146200 1295517
34981 1295517 1273355 1162645 1081438 1048851 1034952 1022964 1000025 981289 1033313 1172757 1275758
$$ packed form
35058H41345N6836J1603r99K0569K8052K9344N1647N7618K141o4740m7640N3864
35046A039640J28376Q2169n4228j56026j30695j5088O7629N6261J3474R845J4290
35035A055647k9626q3003o7722K003N0095O3377P8141P9833L1975k7785l7423
35024A115512k2844m4453p4262n0365m791m223j8824Q839L3446K961j780Q6727
35012A025943J33385l979j73193j10233J21547J96736L7948p8929P220J06921
35002A263366L7511q9626j07643o2346n7437m5526M1486J26014J15085N1348J410
34991A273642n6977j22344j09863j9179J2400n5709o4023P8988K09265J49317
34981A295517k2162j10710q1207l2587j3899j1988k2939j8736N2024J39444J03001
$$ plain form
34970 1275758 1214845 1055813 977443 1017263 1048034 1000504 957080 1007065 1136106 1275819 1362386
34959 1362386 1355116 1293177 1297990 1413170 1502927 1441807 1332171 1362654 1509581 1574519 1486105
34948 1486105 1365995 1311279 1308392 1353789 1458318 1528420 1442589 1258388 1154751 1168110 1184378
34937 1184378 1182482 1251866 1355617 1331407 1178745 1095574 1154488 1186717 1085180 983794 1007968
34926 1007968 1065147 1034835 981996 1022063 1122434 1186610 1213134 1243793 1264795 1263120 1269269
34915 1269269 1264180 1176670 1048025 1039419 1182417 1292959 1250966 1194399 1288143 1453654 1499862
34904 1499862 1405743 1303272 1268683 1287236 1351060 1444306 1488698 1435272 1361859 1366298 1413197
34893 1413197 1393877 1294268 1204526 1193118 1246308 1301754 1292889 1202873 1103794 1082299 1115018
$$ packed form
34970A275758o0913j59032p8370L9820L0771m7530m3424M9985J29041J39713Q6567
34959A362386p270o1939M813J15180Q9757o1120j09636L0483J46927O4938q8414
34948A486105j20110n4716k887M5397J04529P0102q5831j84201j03637J3359J6268
34937A184378j896O9384J03751k4210j52662q3171N8914L2229j01537j01386K4174
34926A007968N7179l0312n2839M0067J00371O4176K6524L0659K1002j675O149
34915A269269n089q7510j28645q606J42998J10542m1993n6567R3744J65511M6208
34904A499862r4119j02471l4589J8553O3824R3246M4392n3426p3413M439M6899
34893A413197j9320r9609q9742j1408N3190N5446q865r0016r9079k1495L2719
$$ plain form
34882 1115018 1106074 1051792 1043827 1093824 1109588 1085235 1141080 1299585 1395667 1316511 1173845
34871 1173845 1117917 1126487 1110449 1090635 1117828 1132069 1062662 983506 1015747 1137062 1224402
34860 1224402 1239120 1249496 1303004 1371391 1396783 1337038 1211592 1130324 1194607 1346229 1426892
34849 1426892 1411526 1433754 1538335 1590215 1510910 1418078 1416534 1431773 1386094 1360446 1419185
34838 1419185 1443861 1331295 1210190 1253561 1395214 1445138 1388812 1354277 1356433 1295916 1171856
34827 1171856 1089364 1070245 1036329 976120 971368 1057361 1183508 1299891 1374107 1357147 1245004
34816 1245004 1134994 1116145 1155953 1194563 1267534 1405938 1500679 1430414 1271734 1218245 1317121
34805 1317121 1432655 1454536 1409298 1370751 1367745 1376704 1337219 1212415 1084163 1100120 1255637
$$ packed form
34882A115018q944n4282p965M9997J5764k4353N5845J58505R6082p9156j42666
34871A173845n5928Q570j6038j9814K7193J4241o9407p9156L2241J21315Q7340
34860A224402J4718J0376N3508O8387K5392n9745j25446q1268O4283J51622Q0663
34849A426892j5366K2228J04581N1880p9305r2832j544J5239m5679k5648N8739
34838A419185K4676j12566j21105M3371J41653M9924n6326l4535K156o0517j24060
34827A171856q2492j9119l3916o0209m752Q5993J26147J16383P4216j6960j12143
34816A245004j10010j8849L9808L8610P2971J38404R4741p0265j58680n3489R8876
34805A317121J15534K1881m5238l8547l006Q959l9485j24804j28252J5957J55517
$$ plain form
34794 1255637 1348680 1256685 1125144 1139792 1245206 1272403 1232608 1266437 1370335 1399231 1319141
34783 1319141 1253539 1274245 1320311 1337086 1345969 1361433 1363072 1356892 1363847 1361904 1328242 1298177
34771 1298177 1290912 1242076 1119271 1030367 1089878 1247465 1378998 1469780 1563283 1609736 1536265
34760 1536265 1411128 1369036 1410840 1428702 1389574 1350035 1334762 1338582 1393988 1499268 1547327
34749 1547327 1471171 1384613 1423159 1525202 1539019 1466670 1421044 1416084 1389710 1367409 1408809
34738 1408809 1453351 1414731 1369206 1449862 1607412 1676096 1628774 1574187 1556514 1548426 1574405
34727 1574405 1642082 1631110 1463131 1293540 1304180 1403798 1392598 1322370 1391750 1561927 1608779
34716 1608779 1517408 1485031 1541802 1512455 1374528 1315859 1391691 1450542 1453640 1540085 1703410
$$ packed form
34794A255637R3043r1995j31541J4648J05414K7197l9795L3829J03898K8896q0090
34783A319141o5602K0706M6066J6775Q883J5464J639o180O955j943l3662l0065
34771A298177p265m8836j22805q8904N9511J57587J31533R0782R3503M6453p3471
34760A536265j25137m2092M1804J7862l9128l9539j5273L820N5406J05280M8059
34749A547327p6156q6558L8546J02043J3817p2349m5626m960k6374k2301M1400
34738A408809M4542l8620m5525Q0656J57550O8684m7322n4587j7673q088K5979
34727A574405O7677j0972j67979j69591J0640R9618j1200p0228O9380J70177M6852
34716A608779r1371l2377N6771k9347j37927n8669P5832N8851L098Q6445J63325
$$ plain form
34705 1703410 1730897 1562902 1408207 1402492 1447357 1480489 1590996 1750979 1752079 1557824 1420169
34694 1420169 1486449 1579554 1536869 1476053 1526578 1573572 1495249 1412463 1464318 1543731 1492314
34683 1492314 1378531 1355145 1401055 1423971 1472501 1626193 1794417 1829924 1746955 1653588 1566874
34672 1566874 1457310 1380765 1410785 1515644 1619866 1700593 1735943 1680138 1579812 1573616 1679121
34661 1679121 1731502 1634830 1510057 1483175 1501687 1488074 1497497 1577677 1640150 1623177 1622837 1708917
34649 1708917 1769987 1702464 1599519 1585924 1613866 1593417 1580970 1657131 1747048 1742473 1687743
34638 1687743 1677227 1684256 1654235 1644323 1700028 1714233 1589558 1431981 1400638 1463072 1481928
34627 1481928 1457478 1497745 1609517 1690244 1688307 1637372 1576899 1543876 1577152 1637631 1613011
$$ packed form
34705A703410K7487j67995j54695n715M4865L3132J10507J59983J100j94255j37655
34694A420169O6280R3105m2685o0816N0525M6994p8323q2786N1855P9413n1417
34683A492314j13783k3386M5910K2916M8530J53692J68224L5507q2969r3367q6714
34672A566874j09564p6545L0020J04859J04222Q0727L5350n5805j00326o196J05505
34661A679121N2381r6672j24773k6882J8512j3613R423Q0180O2473j6973l40Q6080
34649A708917O1070o7523j02945j3595K7942k0449j2447P6161Q9917m575n4730
34638A687743j0516P029l0021r912N5705J4205j24675j57577l1343O2434J8856
34627A481928k4450M0267J11772Q0727j937n0935o0473l3023L3276O0479k4620
$$ plain form
34616 1613011 1493122 1432077 1535318 1700022 1774653 1761531 1753665 1787318 1859051 1966329 2037742
34605 2037742 1961363 1774367 1669436 1719615 1772441 1716430 1648288 1650563 1625367 1511237 1447530
34594 1447530 1532956 1624328 1580427 1512260 1574405 1694774 1741979 1781010 1913959 2029710 1973236
34583 1973236 1826764 1768341 1776932 1726586 1650264 1658030 1706072 1693877 1680205 1758355 1831035
34572 1831035 1761170 1639094 1647860 1765660 1846937 1883505 1930297 1900026 1718231 1569211 1680052
34561 1680052 1944334 2064514 1994191 1930915 1937191 1897352 1817162 1837299 1943299 1961675 1863195
34550 1863195 1798332 1817078 1812929 1758532 1749184 1801810 1846933 1918126 2106940 2326763 2362382
34539 2362382 2171426 1925848 1759368 1678045 1689596 1798133 1900726 1907832 1916933 2039157
$$ packed form
34616A613011j19889o1045J03241J64704P4631j3122p866L3653P1733J07278P1413
34605B037742p6379j86996j04931N0179N2826n6011o8142K275k5196j14130o3707
34594A447530Q5426R1372m3901o8167O2145J20369M7205L9031J32949J15751n6474
34583A973236j46472n8423Q591n0346p6322P766M8042j2195j3672P8150P2680
34572A831035o9865j22076Q766J17800Q1277L6568M6792l0271j81795j49020J10841
34561A680052K64282J20180p0323o3276O276l9839q0190K0137J06000J8376r8480
34550A863195o4863J8746m149n4397r348N2626M5123P1193J88814K19823L5619
34539B362382j90956k45578j66480q1323J1551J08537J02593P106R101J22224
$$ plain form
34529 2039157 2132811 1983836 1684576 1528517 1570937 1611719 1586956 1635286 1764974 1802195
34519 1802195 1724387 1722425 1857957 1957683 1927663 1890155 1925229 1946209 1917934 1942071 2037938
34508 2037938 2078948 2027182 2001284 2042745 2042804 1962691 1900338 1887724 1851147 1810175 1871175 1987280
34496 1987280 1985104 1871458 1841050 1931666 1960977 1871702 1838376 1936116 1998512 1923853 1844435
34485 1844435 1860638 1869472 1796824 1755461 1830767 1932710 1987195 2054262 2140802 2125932 1995639
34474 1995639 1925231 2002152 2086130 2066619 2036931 2086119 2137058 2121784 2107964 2128415 2095787
34463 2095787 2003610 1993613 2104729 2179347 2138475 2113835 2177423 2190771 2080007 2014115 2124396
34452 2124396 2269911 2277154 2210449 2206231 2227137 2187609 2159208 2241699 2361031 2386017 2336942
$$ packed form
34529B039157R3654j48975k99260j56059M2420M0782k4763M8330J29688L7221
34519A802195p7808j962J35532R9726l0020l7508L5074K0980k8275K4137R5867
34508B037938M1010n1766k5898M1461N9q0113o2353j2614l6577m0972O1000J16105
34496A987280k176j13646l0408R0616K9311q9275l3326R7740O2396p4659p9418
34485A844435J6203Q834p2648m1363P5306J01943N4485O7067Q6540j4870j30293
34474A995639p0408P6921Q3978j9511k9688M9188N0939j5274j3820K0451l2628
34463B095787r2177r997J11116P4618m0872k4640O3588J3348j10764o5892J10281
34452B124396J45515P243o6705m218K0906l9528k8401Q2491J19332K4986m9075
$$ plain form
34441 2336942 2315671 2332006 2339556 2342066 2346797 2319242 2277852 2308696 2403456 2427613 2333354 2248093
34429 2248093 2265840 2314086 2314874 2308139 2324211 2303577 2232287 2189855 2187788 2139866 2057968 2075175
34417 2075175 2201326 2270160 2211628 2159476 2207384 2285107 2354412 2480627 2624006 2626477 2507150
34406 2507150 2492764 2638805 2712852 2590771 2465155 2495269 2553420 2509884 2471572 2523454 2522740
34395 2522740 2388651 2323008 2483423 2685442 2695493 2592288 2570028 2597945 2551727 2490483
34385 2490483 2525014 2575370 2522133 2450049 2495657 2592043 2593808 2524533 2496327 2517218 2553231
34374 2553231 2626813 2696501 2625417 2425900 2321287 2403374 2474033 2405198 2376364 2532860 2695587
34363 2695587 2676401 2611113 2686851 2790964 2740760 2630338 2632346 2671856 2615354 2570817 2671567
$$ packed form
34441B336942k1271J6335P550K510M731k7555m1390L0844R4760K4157r4259q5261
34429B248093J7747M8246P88o735J6072k0634p1290m2432k067m7922q1898J7207
34417B075175J26151O8834n8532n2152M7908P7723O9305J26215J43379K471j19327
34406B507150j4386J46041P4047j22081j25616L0114N8151m3536l8312N1882p14
34395B522740j34089o5643J60415K02019J0051j03205k2260K7917m6218o1244
34385B490483L4531N0356n3237p2084M5608R6386J765o9275k8206K0891L6013
34374B553231P3582O9688p1084j99517j04613Q2087P0659o8835k8834J56496J62727
34363B695587j9186o5288P5738J04113n0204j10422K008L9510n6502m4537J00750
$$ plain form
34352 2671567 2767638 2673685 2530906 2570862 2698461 2672274 2540615 2529551 2629996 2658939
34342 2658939 2621227 2663128 2760618 2777742 2742045 2762970 2787501 2727751 2697145 2817846 2939871
34331 2939871 2870267 2732619 2764928 2907896 2944055 2903320 2961223 3062055 3026775 2930588 2986278
34320 2986278 3134274 3129611 2973718 2893218 2941829 2971516 2945291 2944067 2926112 2809702 2722066
34309 2722066 2836506 3044403 3119075 3103803 3186924 3302945 3243449 3074447 3043477 3137128
34299 3137128 3127308 3002540 2957045 2998116 2963919 2894934 2983667 3173452 3205260 3061663 2985313
34288 2985313 3059034 3134622 3166859 3249279 3330898 3267396 3144901 3190834 3377578 3470529 3438064
34277 3438064 3447228 3494398 3427405 3300590 3315069 3436549 3462957 3425091 3508803 3633193 3553481
$$ packed form
34352B671567R6071r3953j42779L9956J27599k6187j31659j1064J00445K8943
34342B658939l7712M1901R7490J7124l5697K0925K4531n9750l0606J20701J22025
34331B939871o9604j37648L2309J42968L6159m0735N7903J00832l5280r6187N5690
34320B986278J47996m663j55893q0500M8611K9687k6225j224j7955j16410q7636
34309B722066J14440K07897P4672j5272Q3121J16021n9496j69002l0970R3651
34299C137128r820j24768m5495M1071l4197o8985Q8733J89785L1808j43597p6350
34288B985313P3721P5588L2237Q2420Q1619o3502j22495M5933J86744R2951l2465
34277C438064R164M7170o6993j26815J4479J21480K6408l7866Q3712J24390p9712
$$ plain form
34266 3553481 3348912 3340845 3534660 3616219 3511238 3467801 3555593 3567270 3465391 3447666 3509476
34255 3509476 3423741 3227464 3240622 3505358 3684663 3628847 3572968 3651130 3682208 3580514
34245 3580514 3532991 3618740 3672396 3657782 3757132 3961967 3997622 3785314 3570920 3485895 3401275
34234 3401275 3311593 3408532 3658800 3771284 3708608 3762715 3993918 4087336 3924383 3801448
34224 3801448 3894046 3986246 3932096 3911456 4015628 4042327 3920809 3888421 4028448 4082911 3940274
34213 3940274 3855942 3969336 4058295 3994781 3980796 4103728 4132323 3997243 3991855 4230959 4388872
34202 4388872 4256777 4090045 4113840 4155974 4072624 4065035 4249845 4375964 4300516 4290440 4511070
34191 4511070 4673266 4549683 4391069 4448443 4519854 4374974 4215456 4295158 4461432 4482343
$$ packed form
34266C553481k04569q067J93815Q1559j04981m3437Q7792J1677j01879j7725O1810
34255C509476q5735j96277J3158K64736J79305n5816n5879P8162L1078j01694
34245C580514m7523Q5749N3656j4614R9350K04835L5655k12308k14394q5025q4620
34234C401275q9682R6939K50268J12484o2676N4107K31203R3418j62953j22935
34224C801448R2598R2200n4150k0640J04172K6699j21518l2388J40027N4463j42637
34213C940274q4332J13394Q8959o3514j3985J22932K8595j35080n388K39104J57913
34202D388872j32095j66732K3795M2134q3350p589J84810J26119p5448j0076K20630
34191D511070J62196j23583j58614N7374P1411j44880j59518P9702J66274K0911
$$ plain form
34181 4482343 4470626 4586117 4667921 4555085 4436604 4506170 4604046 4564479 4569073 4781444 4976646
34170 4976646 4916696 4769567 4787107 4883998 4882326 4848056 4856992 4774875 4590371 4588427 4861658
34159 4861658 5050104 4914952 4752126 4863413 5049201 5034139 4967580 5061204 5140596 5017501
34149 5017501 4920261 5087203 5297979 5269172 5157389 5214043 5299106 5197581 5068958 5127960
34139 5127960 5224414 5177637 5164696 5342147 5470446 5360988 5286558 5478582 5645009 5494189
34129 5494189 5307625 5444460 5687496 5658212 5501750 5571653 5781417 5846526 5838638 5938893
34119 5938893 5977535 5774928 5598202 5726860 5917134 5845681 5704653 5790269 5906292 5780995
34109 5780995 5667733 5889810 6187003 6181199 6099899 6339495 6685189 6693390 6506457 6548467
$$ packed form
34181D482343j1717J15491Q1804j12836j18481O9566R7876l9567M594K12371J95202
34170D976646n9950j47129J7540R6891j672l4270Q936q2117j84504j944K73231
34159D861658J88446j35152j62826J11287J85788j5062o6559R3624P9392j23095
34149E017501r7240J66942K10776k8807j11783N6654Q5063j01525j28623N9002
34139E127960R6454m6777j2941J77451J28299j09458p4430J92024J66427j50820
34129E494189j86564J36835K43036k9284j56462O9903K09764O5109p888J00255
34119E938893L8642k02607j76726J28658J90274p1453j41028Q5616J16023j25297
34109E780995j13262K22077K97193n804q1300K39596L45694Q201j86933M2010
$$ plain form
34099 6548467 6726788 6676225 6501873 6543095 6680192 6603559 6492761 6701307 7042831 7110959
34089 7110959 7021873 7118729 7250969 7099411 6901898 7070473 7385190 7366926 7161447 7239333
34079 7239333 7499137 7501372 7331818 7397655 7615451 7626577 7556767 7730902 7917566 7718402
34069 7718402 7419796 7566801 7975621 8083514 7987662 8177848 8516680 8491707 8243922 8325944
34059 8325944 8644701 8666533 8480282 8622026 9013432 9107333 8931286 8966082 9161118 9102807
34049 9102807 8968969 9249233 9706824 9710703 9411931 9475240 9838242 9892646 9703858 9847109
34039 9847109 10203825 10156676 9831408 9892373 10252046 10265489 10051840 10284864 10810044 10860946
34029 10860946 10539237 10647000 11134873 11196408 10849241 10898273 11346214 11405671 11110869 11313187
$$ packed form
34099F548467J78321n0563j74352M1222J37097p6633j10798K08546L41524O8128
34089G110959q9086R6856J32240j51558j97513J68575L14717j8264k05479P7886
34079G239333K59804K235j69554O5837K17796J1126o9810J74135J86664j99164
34069G718402k98606J47005M08820J07893r5852J90186L38832k4973k47785Q2022
34059H325944L18757K1832j86251J41744L91406R3901j76047L4796J95036n8311
34049I102807j33838K80264M57591L879k98772O3309L63002N4404j88788J43251
34039I847109L56716m7149l25268O0965L59673J3443k13649K33024N25180N0902
34029A0860946l21709J07763M87873O1535l47167M9032M47941N9457k94802K02318
$$ plain form
34019 11313187 12007622 12290082 12077633 12220136 12783622 12921718 12610002 12765067 13434173
34010 13434173 13639166 13264544 13295974 13902280 14125844 13802227 13901990 14592914 14880810 14592266
34000 14592266 14761461 15585760 15983274 15684299 15742660 16436183 16731204 16406715 16577809
33991 16577809 17477404 17900106 17535623 17623303 18554497 19115966 18899080 19094839 20047382
33982 20047382 20465006 19997706 20088059 21239925 22005803 21776622 21941028 23110995 23915154
33973 23915154 23790764 24166942 25553623 26369697 26069825 26392336 27992136 29028634 28739985
33964 28739985 29064335 30905903 32305425 32302379 32927316 35170383 36840600 36854279 37600317
33955 37600317 40370794 42688014 43109563 44203561 47509068 50318823 51087136 52927290
$$ packed form
34019A1313187O94435K82460k12449J42503N63486J38096l11716J55065O69106
34010A3434173K04993l74622L1430O06306K23564l23617R9763O90924K87896k88544
34000A4592266J69195Q24299L97514k98975N8361O93523K95021l24489J71094
33991A6577809Q99595M22702l64483Q7680R31194N61469k16886J95759R52543
33982B0047382M17624m67300R0353J151866P65878k29181J64406J169967Q04159
33973B3915154j24390L76178J386681Q16074k99872L22511J599800J036498k88649
33964B8739985L24350J841568J399522l046O24937K243067J670217J3679P46038
33955C7600317K770477K317220M21549J093998L305507K809755P68313J840154
$$ plain form
33947 52927290 57659454 61854304 63407035 66141196 72606705 78742820 81839639 86733289
33939 86733289 96792724 106525593 111902867 119268838 133116391 145349174 151502031 165218150
33931 165218150 192102738 196425786 128069519 -8340565 -140090825 -199515821 -190096154
33924 -190096154 -162809124 -148387393 -139330835 -125170621 -112385751 -106998100 -102465400
33917 -102465400 -93313452 -84713846 -81227738 -78434062 -72240406 -66306297 -64196592 -62718302
33909 -62718302 -58615801 -54553963 -53293658 -52317121 -49051882 -45795403 -44949691 -44398839
33901 -44398839 -41851679 -39232485 -38744363 -38678859 -36940769 -34996660 -34707873 -34664354 -33107272
33892 -33107272 -31352272 -31041624 -30912354 -29409895 -27779782 -27568705 -27619474 -26433437 -25093170
$$ packed form
33947E2927290M732164M194850J552731K734161O465509O136115L096819M893650
33939H6733289J0059435R732869N377274P365971J3847553J2232783O152857J3716119
33931A65218150K6884588M323048o8356267j36410084j31750260n9424996R419667
33924a90096154K7287030J4421731R056558J4160214J2784870N387651M532700
33917a02465400R151948Q599606L486108K793676O193656N934109K109705J478290
33909f2718302M102501M061838J260305R76537L265239L256479Q45712N50852
33901d4398839K547160K619194M88122O5504J738090J944109K88787M3519J557082
33892c3107272J755000L10648J29270J502459J630113K11077n0769J186037J340267
$$ plain form
33883 -25093170 -25036669 -25223230 -24249408 -23113895 -23191215 -23495197 -22604062 -21408713 -21350948
33874 -21350948 -21689767 -21056505 -20093662 -20067641 -20363401 -19766104 -18846535 -18756526 -18955947 -18368919
33864 -18368919 -17555110 -17562942 -17816506 -17259897 -16455392 -16464863 -16752691 -16262631 -15519898 -15601679
33854 -15601679 -16006392 -15601739 -14789497 -14695513 -15022672 -14709268 -13992962 -13862981 -14104347
33845 -14104347 -13785351 -13118671 -13010550 -13278362 -13070970 -12569057 -12566508 -12832080 -12552008 -11963096
33835 -11963096 -11921382 -12254893 -12126068 -11645323 -11579884 -11823941 -11667179 -11236118 -11196716 -11369106
33825 -11369106 -11089237 -10604881 -10663471 -11035599 -10891613 -10347745 -10204472 -10425841 -10312420
33816 -10312420 -9937802 -9974599 -10289908 -10138683 -9608441 -9481513 -9773043 -9764766 -9401667 -9312661
$$ packed form
33883b5093170N6501j86561R73822J135513p7320l03982Q91135J195349N7765
33874b1350948l38819O33262R62843K6021k95760N97297R19569R0009j99421N87028
33864a8368919Q13809p832k53564N56609Q04505r471k87828M90060P42733q1781
33854a5601679m04713M04653Q12242R3984l27159L13404P16306J29981k41366
33845a4104347L18996O66680J08121k67812K07392N01913K549k65572K80072N88912
33835a1963096M1714l33511J28825M80745O5439k44057J56762M31061L9402j72390
33825a1369106K79869M84356n8590l72128J43986N43868J43273k21369J13421
33816a0312420L74618l6797l15309J51225N30242J26928k91530Q277L63099Q9006
$$ plain form
33806 -9312661 -9501982 -9346149 -8876735 -8774780 -9071054 -9100416 -8782160 -8723612 -8993891 -8990723
33796 -8990723 -8617561 -8445924 -8602745 -8595454 -8342437 -8307185 -8509465 -8446961 -8096867 -7977592
33786 -7977592 -8130783 -8053212 -7720151 -7658791 -7904984 -7896940 -7532067 -7346758 -7506268 -7565564
33776 -7565564 -7368875 -7260012 -7279981 -7082955 -6764702 -6837713 -7252868 -7379816 -7100003 -6980578
33766 -6980578 -7203370 -7272751 -6997367 -6831029 -6978588 -7039280 -6814738 -6651233 -6711342 -6681994
33756 -6681994 -6453120 -6342926 -6435083 -6420046 -6266888 -6308788 -6514061 -6450206 -6123247 -6047955
33746 -6047955 -6314581 -6409382 -6159607 -6022271 -6197642 -6282304 -6076271 -5935300 -6029572 -6023932
33736 -6023932 -5789669 -5680203 -5806682 -5787796 -5514484 -5413341 -5642397 -5774490 -5604872 -5526578
$$ packed form
33806i312661j89321J55833M69414J01955k96274k9362L18256N8548k70279L168
33796h990723L73162J71637j56821P291K53017L5252k02280O2504L50094J19275
33786g977592j53191P7571L33061O1360k46193Q044L64873J85309j59510n9296
33776g565564J96689J08863j9969J97026L18253p3011m15155j26948K79813J19425
33766f980578k22792o9381K75384J66338j47559o0692K24542J63505o0109K9348
33756f681994K28874J10194r2157J5037J53158m1900k05273O3855L26959P5292
33746f047955k66626r4801K49775J37336j75371q4662K06033J40971r4272N640
33736f023932K34263J09466j26479J8886K73312J01143k29056j32093J69618P8294
$$ plain form
33726 -5526578 -5754077 -5909767 -5756098 -5624916 -5733238 -5770403 -5563153 -5463295 -5655892 -5750970
33716 -5750970 -5498977 -5265303 -5344387 -5431355 -5245839 -5076654 -5209060 -5368526 -5241310 -5044964
33706 -5044964 -5088233 -5222029 -5191528 -5103948 -5117070 -5082795 -4901203 -4809325 -4938791 -5012575 -4845862
33695 -4845862 -4708614 -4825121 -4959938 -4873622 -4745823 -4769714 -4768306 -4595868 -4484640 -4605354
33685 -4605354 -4706939 -4575206 -4428815 -4480352 -4529120 -4378271 -4236584 -4310317 -4406245 -4334681
33675 -4334681 -4296134 -4464004 -4589656 -4439617 -4235721 -4242650 -4298855 -4179627 -4053514 -4144273
33665 -4144273 -4289198 -4262705 -4205291 -4311841 -4420707 -4326528 -4181893 -4184077 -4185890 -4022593 -3898067
33654 -3898067 -4026857 -4204310 -4151730 -3991114 -3968682 -4006317 -3936700 -3884373 -3997244 -4090569
$$ packed form
33726e526578k27499j55690J53669J31182j08322l7165K07250R9858j92597r5078
33716e750970K51993K33674p9084q6968J85516J69185j32406j59466J27216J96346
33706e044964m3269j33796L0501Q7580j3122L4275J81592R1878j29466p3784J66713
33695d845862J37248j16507j34817Q6316J27799k3891J408J72438J11228j20714
33685d605354j01585J31733J46391n1537m8768J50849J41687p3733r5928P1564
33675d334681L8547j67870j25652J50039K03896o929n6205J19228J26113r0759
33665d144273j44925K6493N7414j06550j08866R4179J44635k184j813J63297J24526
33654c898067j28790j77453N2580J60616K2432l7635O9617N2327j12871r3325
$$ plain form
33644 -4090569 -3974112 -3847913 -3957549 -4139913 -4130349 -4037424 -4082542 -4144499 -4008149 -3811536
33634 -3811536 -3800220 -3871206 -3796490 -3672554 -3713052 -3811454 -3744709 -3611926 -3642759 -3753978 -3714456
33623 -3714456 -3584392 -3591261 -3718413 -3780380 -3755742 -3721982 -3638537 -3494957 -3461145 -3601570 -3692825
33612 -3692825 -3607310 -3565398 -3697114 -3725636 -3466490 -3250929 -3395556 -3620757 -3512681 -3230712
33602 -3230712 -3197617 -3373226 -3420206 -3354899 -3438785 -3606862 -3584251 -3425063 -3387531 -3419026 -3302617
33591 -3302617 -3160099 -3254367 -3438204 -3372508 -3162030 -3180454 -3370838 -3342251 -3103238 -3064372
33581 -3064372 -3304624 -3448032 -3329032 -3207572 -3231846 -3218752 -3083400 -3008420 -3070568 -3123520
33571 -3123520 -3134261 -3231298 -3369329 -3356488 -3248056 -3292037 -3459847 -3472705 -3323762 -3307143
$$ packed form
33644d090569J16457J26199j09636j82364R564R2925m5118o1957J36350J96613
33634c811536J1316p0986P4716J23936m0498r8402O6745J32783l0833j11219L9522
33623c714456J30064o869j27152o1967K4638L3760Q3445J43580L3812j40425r1255
33612c692825Q5515M1912j31716k8522K59146K15561j44627k25201J08076K81969
33602c230712L3095j75609m6980O5307q3886j68077K2611J59188L7532l1495J16409
33591c302617J42518r4268j83837O5696K10478j8424j90384K8587K39013L8866
33581c064372k40252j43408J19000J21460k4274J3094J35352P4980o2148n2952
33571c123520j0741r7037j38031J2841J08432m3981j67810j2858J48943J6619
$$ plain form
33561 -3307143 -3467997 -3497929 -3280318 -3087577 -3104193 -3169084 -3131060 -3076836 -3070549 -3022088 -2934332
33550 -2934332 -2944379 -3024330 -2981310 -2833189 -2826234 -2995631 -3078006 -2961181 -2851684 -2876526 -2880485
33539 -2880485 -2760177 -2661017 -2687949 -2723466 -2677131 -2637774 -2653661 -2630616 -2558385 -2574216 -2701137
33528 -2701137 -2778398 -2737607 -2696994 -2712976 -2693499 -2617889 -2588650 -2617497 -2609717 -2582255 -2635225
33517 -2635225 -2710580 -2669292 -2592342 -2680170 -2866379 -2889924 -2752952 -2720823 -2841864 -2874184 -2746596
33506 -2746596 -2676412 -2738980 -2731709 -2583088 -2497537 -2560310 -2586028 -2500349 -2485760 -2595215 -2609085
33495 -2609085 -2451718 -2371958 -2514472 -2671863 -2665306 -2621850 -2663032 -2662017 -2539042 -2473163 -2581186
33484 -2581186 -2686604 -2640398 -2579070 -2630722 -2655264 -2526347 -2401019 -2450642 -2563542 -2562009 -2493932
$$ packed form
33561c307143j60854k9932K17611J92741j6616o4891L8024N4224O287M8461Q7756
33550b934332j0047p9951M3020J48121O955j69397q2375J16825J09497k4842l959
33539b880485J20308R9160k6932l5517M6335L9357j5887K3045P2231j5831j26921
33528b701137p7261M0791M0613j5982J9477P5610K9239k8847P780K7462n2970
33517b635225p5355M1288P6950q7828j86209k3545J36972L2129j21041l2320J27588
33506b746596P0184o2568P271J48621Q5551o2773k5718Q5679J4589j09455j3870
33495b609085J57367P9760j42514j57391O557M3456m1182J015J22975O5879j08023
33484b581186j05418M6206O1328n1652k4542J28917J25328m9623j12900J533O8077
$$ plain form
33473 -2493932 -2479301 -2482527 -2455728 -2494460 -2637431 -2718285 -2619241 -2468421 -2400683 -2344112 -2231616
33462 -2231616 -2187843 -2296182 -2405103 -2381120 -2339191 -2407740 -2477627 -2407533 -2281599 -2243535 -2258348
33451 -2258348 -2244861 -2261258 -2358362 -2429780 -2399471 -2374775 -2431861 -2447395 -2330619 -2217514 -2235768
33440 -2235768 -2277394 -2208064 -2108413 -2105931 -2155698 -2181016 -2240052 -2368944 -2462063 -2483042 -2565106
33429 -2565106 -2720159 -2715006 -2459556 -2240294 -2296831 -2431566 -2352516 -2162009 -2148222 -2280921
33419 -2280921 -2291202 -2130511 -1995083 -1970395 -1969258 -1966640 -2010122 -2044693 -1983605 -1905103 -1947215
33408 -1947215 -2064851 -2108218 -2073512 -2063710 -2075190 -2036052 -1988121 -2027503 -2123099 -2169854 -2152799
33397 -2152799 -2108540 -2024835 -1924559 -1921142 -2037896 -2119717 -2079242 -2052658 -2138382 -2191525 -2093876
$$ packed form
33473b493932J4631l226K6799l8732j42971q0854R9044J50820O7738N6571J12496
33462b231616M3773j08339j08921K3983M1929o8549o9887P0094J25934L8064j4813
33451b258348J3487j6397r7104p1418L0309K4696n7086j5534J16776J13105j8254
33440b235768m1626O9330R9651K482m9767k5318n9036j28892r3119k0979q2064
33429b565106j55053N153K55450K19262n6537j34735P9050J90507J3787j32699
33419b280921j0281J60691J35428K4688J137K618m3482l4571O1088P8502m2112
33408a947215j17636m3367L4706R802j1480L9138M7931l9382r5596m6755J7055
33397b152799M4259Q3705J00276L417j16754q1821M0475K6584q5724n3143R7649
$$ plain form
33386 -2093876 -2010459 -2116446 -2270871 -2253286 -2143472 -2152931 -2238491 -2214138 -2114124 -2106236 -2151841
33375 -2151841 -2092163 -1984251 -2009400 -2116225 -2096952 -1970707 -1953224 -2075457 -2163299 -2179150
33365 -2179150 -2252471 -2367117 -2344835 -2172662 -2046906 -2049936 -2060349 -2021889 -2028297 -2090312 -2074589
33354 -2074589 -1935531 -1785356 -1692083 -1618783 -1582577 -1651575 -1765199 -1782507 -1727909 -1762604 -1894779
33343 -1894779 -1952852 -1874348 -1787619 -1769130 -1747612 -1694693 -1691589 -1754938 -1798242 -1806846 -1852993 -1909295
33331 -1909295 -1859036 -1726097 -1678289 -1758098 -1823718 -1804771 -1796770 -1839094 -1819391 -1689011 -1579341
33320 -1579341 -1603655 -1703018 -1773465 -1801921 -1807866 -1788761 -1779504 -1832410 -1898581 -1868198 -1756936
33309 -1756936 -1700741 -1736537 -1749732 -1679159 -1613604 -1633064 -1698190 -1744550 -1755201 -1709082 -1593921
$$ packed form
33386b093876Q3417j05987j54425J7585J09814r459q5560K4353J00014P888m5605
33375b151841N9678J07912k5149j06825J9273J26245J7483j22233q7842j5851
33365b179150p3321j14646K2282J72173J25756l030j0413L8460o408o2015J5723
33354b074589J39058J50175R3273P3300L6206o8998j13624j7308N4598l4695j32175
33343a894779n8073P8504Q6729J8489K1518N2919L104o3349m3304q604m6147n6302
33331a909295N0259J32939M7808p9809o5620J8947Q001m2324J9703J30380J09670
33320a579341k4314r9363p0447k8456n945J9105R257n2906o6171L0383J11262
33309a756936N6195l5796j3195P0573O5555j9460o5126m6360j0651M6119J15161
$$ plain form
33298 -1593921 -1495689 -1534465 -1685592 -1800858 -1822711 -1834079 -1884192 -1920263 -1913960 -1904142 -1888339
33287 -1888339 -1815174 -1705081 -1639882 -1622213 -1586936 -1552339 -1605402 -1732074 -1819816 -1837154 -1856396
33276 -1856396 -1894455 -1889028 -1837333 -1804403 -1795945 -1773315 -1772200 -1840889 -1895734 -1828716 -1724749 -1756599
33264 -1756599 -1885423 -1900587 -1756848 -1629661 -1614945 -1615863 -1566989 -1537717 -1561293 -1576216 -1580768
33253 -1580768 -1635461 -1684888 -1604561 -1451807 -1425131 -1538294 -1593803 -1527469 -1503296 -1595847 -1661655
33242 -1661655 -1622644 -1598297 -1642023 -1623109 -1503718 -1459538 -1570094 -1651510 -1567973 -1458166 -1469479
33231 -1469479 -1513360 -1485848 -1491706 -1619884 -1713334 -1615169 -1462301 -1474419 -1600966 -1638741 -1578542
33220 -1578542 -1570555 -1628644 -1624154 -1533892 -1472452 -1491086 -1522393 -1516310 -1491572 -1468812 -1459804 -1488404
$$ packed form
33298a593921R8232l8776j51127j15266k1853j1368n0113l6071O303R818J5803
33287a888339P3165J10093O5199J7669L5277L4597n3063j26672q7742j7338j9242
33276a856396l8059N427N1695L2930Q458K2630J115o8689n4845O7018J03967l1850
33264a756599j28824j5164J43739J27187J4716r18M8874K9272k3576j4923m552
33253a580768n4693m9427Q0327J52754K6676j13163n5509O6334K4173r2551o5808
33242a661655L9011K4347m3726J8914J19391M4180j10556q1416Q3537J09807j1313
33231a469479m3881K7512n858j28178r3450R8165J52868j2118j26547l7775O0199
33220a578542P987n8089M490R0262O1440j8634l1307O083K4738K2760R008k8600
$$ plain form
33208 -1488404 -1539775 -1551501 -1524118 -1541942 -1608718 -1595593 -1458403 -1362592 -1450410 -1613574 -1658106
33197 -1658106 -1583963 -1530635 -1538894 -1546718 -1557002 -1633860 -1763092 -1858437 -1882412 -1852135 -1767040
33186 -1767040 -1632656 -1508548 -1440317 -1395948 -1344346 -1323229 -1355822 -1394042 -1425343 -1524637 -1700659
33175 -1700659 -1808330 -1737451 -1584761 -1508999 -1510910 -1492554 -1447642 -1449302 -1513479 -1603107 -1708239
33164 -1708239 -1807701 -1819300 -1705297 -1565133 -1514357 -1533874 -1537576 -1513637 -1493099 -1454787 -1374909
33153 -1374909 -1308435 -1318378 -1381171 -1444374 -1507581 -1571688 -1593798 -1568041 -1558112 -1580543 -1565434 -1500784
33141 -1500784 -1482588 -1541011 -1565580 -1498980 -1444875 -1471439 -1481066 -1410747 -1380018 -1471473 -1539884
33130 -1539884 -1439231 -1284312 -1268810 -1358016 -1392912 -1385763 -1470167 -1639225 -1765134 -1814452 -1830607
$$ packed form
33208a488404n1371j1726K7383j7824o6776J3125J37190R5811q7818j63164m4532
33197a658106P4143N3328q259p824j0284p6858j29232r5345k3975L0277Q5095
33186a767040J34384J24108O8231M4369N1602K1117l2593l8220l1301r9294j76022
33175a700659j07671P0879J52690P5762j911J8356M4912j660o4177q9628j05132
33164a708239r9462j1599J14003J40164N0776j9517l702K3939K0538L8312P9878
33153a374909O6474r943o2793o3203o3207o4107k2110K5757R929k2431J5109O4650
33141a500784J8196n8423k4569O6600N4105k6564r627P0319L0729r1455o8411
33130a539884J00653J54919J5502q9206l4896P149q4404j69058j25909m9318j6155
$$ plain form
33119 -1830607 -1776010 -1613325 -1472611 -1500220 -1595251 -1540588 -1360004 -1291197 -1408544 -1523034
33109 -1523034 -1489944 -1390812 -1350539 -1361534 -1360807 -1340474 -1320956 -1311342 -1321029 -1338358 -1321162 -1281128
33097 -1281128 -1305384 -1395986 -1396343 -1222620 -1053366 -1099632 -1287582 -1388081 -1374708 -1402725 -1490849
33086 -1490849 -1498911 -1409851 -1365116 -1399800 -1395981 -1335029 -1349650 -1469836 -1550407 -1519442 -1478193
33075 -1478193 -1479671 -1428065 -1294817 -1227294 -1320936 -1457174 -1491415 -1452616 -1435434 -1427606 -1371747
33064 -1371747 -1297030 -1271873 -1294555 -1315745 -1309204 -1264844 -1180991 -1105889 -1112011 -1195066 -1274061 -1311033
33052 -1311033 -1343619 -1384379 -1388151 -1343589 -1302108 -1291534 -1285825 -1271420 -1258900 -1231861 -1174257 -1131364
33040 -1131364 -1142884 -1147118 -1072613 -985794 -1000031 -1074681 -1080677 -1043093 -1113309 -1290773 -1390664
$$ packed form
33119a830607N4597J62685J40714k7609r5031N4663J80584O8807j17347j14490
33109a523034L3090R9132M0273j0995P27K0333J9518R614r687j7329J7196M0034
33097a281128k4256r0602l57J73723J69254m6266j87950j00499J3373k8017q8124
33086a490849q062Q9060M4735l4684L819O0952j4621j20186q0571L0965M1249
33075a478193j478N1606J33248O7523r3642j36238l4241L8799J7182P828N5859
33064a371747P4717K5157k2682k1190O541M4360Q3853P5102o122q3055p8995l6972
33052a311033l2586m0760l772M4562M1481J0574N709J4405J2520K7039N7604M2893
33040a131364j1520m234P4505Q6819j4237p4650n996L7584p0216j77464r9891
$$ plain form
33029 -1390664 -1335412 -1264903 -1279857 -1282331 -1184373 -1091910 -1135923 -1258217 -1313747 -1286465 -1262092
33018 -1262092 -1255746 -1202572 -1093153 -1011997 -1032780 -1127146 -1189356 -1150075 -1071650 -1092096 -1238260
33007 -1238260 -1361028 -1333137 -1233742 -1216260 -1266118 -1252547 -1172028 -1148215 -1201122 -1212301 -1137744
32996 -1137744 -1069397 -1053917 -1030976 -992004 -1021853 -1130424 -1211155 -1219963 -1231055 -1266403 -1245194
32985 -1245194 -1162580 -1138864 -1213314 -1258621 -1185147 -1072237 -1016320 -1007290 -1034220 -1144090 -1301258
32974 -1301258 -1355954 -1262272 -1174936 -1219917 -1317096 -1342305 -1316665 -1311009 -1300227 -1244595 -1196360
32963 -1196360 -1199384 -1191610 -1123275 -1064536 -1084016 -1126951 -1122305 -1104846 -1125099 -1144830 -1125978 -1115299
32951 -1115299 -1138614 -1124767 -1042673 -999193 -1082593 -1212107 -1259849 -1227737 -1194550 -1180947 -1172139
$$ packed form
33029a390664N5252P0509j4954k474R7958R2463m4013j22294n5530K7282K4373
33018a262092O346N3174J09419Q1156k0783r4366o2210L9281P8425k0446j46164
33007a238260j22768K7891R9395J7482m9858J3571Q0519K3813n2907j1179P4557
32996a137744O8347J5480K2941L8972k9849j08571q0731q808j1092l5348K1209
32985a245194Q2614K3716p4450m5307P3474J12910N5917R030k6930j09870j57168
32974a301258n4696R3682Q7336m4981r7179k5209K5640N656J0782N5632M8235
32963a196360l024P774O8335N8739j9480m2935M646J7459k0253j9731J8852J0679
32951a115299k3315J3847Q2094M3480q3400j29514m7742L2112L3187J3603Q808
$$ plain form
32940 -1172139 -1184954 -1216650 -1215704 -1181602 -1189893 -1249518 -1263800 -1208195 -1196051 -1273256 -1308415 -1204038
32928 -1204038 -1058415 -988117 -949149 -879039 -856678 -954503 -1076818 -1118145 -1146180 -1251851 -1355150
32917 -1355150 -1348405 -1299210 -1309472 -1302301 -1171178 -1025235 -1042045 -1161165 -1171625 -1046680 -950178
32906 -950178 -948617 -953896 -935060 -961085 -1030769 -1063892 -1067442 -1122718 -1204544 -1195999 -1088491 -992962
32894 -992962 -948926 -895857 -840906 -878388 -1014844 -1127243 -1124810 -1031245 -906191 -806879 -806919 -917282
32882 -917282 -1014745 -991667 -938987 -1016784 -1181182 -1232362 -1120961 -1006072 -995830 -1026308 -1031589
32871 -1031589 -1048784 -1101560 -1140945 -1155993 -1201441 -1271044 -1277706 -1196853 -1101510 -1029547 -947142
32860 -947142 -859927 -817465 -791325 -703823 -601132 -631306 -809228 -968502 -1001031 -982012 -991816
$$ packed form
32940a172139j2815l1696R46L4102q291n9625j4282N5605J2144p7205l5159J04377
32928a204038J45623P0298L8968P0110K2361r7825j22315m1327k8035j05671j03299
32917a355150O745M9195j0262P171J31123J45943j6810j19120j0460J24945R6502
32906i50178J561n279J8836k6025o9684l3123l550n5276q1826Q545J07508R5529
32894i92962M4036N3069N4951l7482j36456j12399K433R3565J25054R9312m0j10363
32882i17282r7463K3078N2680p7797j64398n1180J11401J14889J0242l0478n281
32871a031589j7195n2776l9385j5048m5448o9603o662Q0853R5343P1963Q2405
32860i47142Q7215M2462K6140Q7502J02691l0174j77922j59274l2529J9019r804
$$ plain form
32849 -991816 -980211 -904266 -857528 -942079 -1107201 -1217021 -1210538 -1123626 -1021427 -968887 -1004872
32838 -1004872 -1099482 -1190974 -1276232 -1385568 -1468611 -1419540 -1239948 -1063431 -984602 -971338 -976497
32827 -976497 -1016270 -1088804 -1126011 -1086144 -1008887 -940575 -893765 -903333 -1010652 -1155119 -1194640
32816 -1194640 -1083056 -929522 -846422 -843310 -899493 -1014789 -1140687 -1187704 -1161612 -1173474 -1253211
32805 -1253211 -1278454 -1166149 -1016712 -975027 -1045588 -1134211 -1184867 -1189259 -1142454 -1074683 -1057644
32794 -1057644 -1105250 -1133778 -1079143 -978082 -882732 -790479 -718939 -740289 -856345 -943207 -919022
32783 -919022 -871511 -910272 -984024 -973324 -890569 -843032 -844320 -815074 -755940 -766783 -866717 -928001
32771 -928001 -854800 -737184 -743634 -902929 -1072868 -1122275 -1074798 -1039327 -1050296 -1048778 -1006405
$$ packed form
32849i91816J1605P5945M6738q4551j65122j09820O483Q6912J02199N2540l5985
32838a004872r4610r1492q5258j09336q3043M9071J79592J76517P8829J3264n159
32827i76497l9773p2534l7207L9867P7257O8312M6810r568j07319j44467l9521
32816a194640J11584J53534Q3100L112n6183j15296j25898m7017K6092j1862p9737
32805a253211k5243J12305J49437M1685p0561q8623n0656m392M6805O7771J7039
32794a057644m7606k8528N4635J01061R5350R2253P1540k1350j16056q6862K4185
32783i19022M7511l8761p3752J0700Q2755M7537j288K9246N9134j0843r9934o1284
32771i28001P3201J17616o450j59295j69939m9407M7477L5471j0969J518M2373
$$ plain form
32760 -1006405 -972549 -968049 -930840 -837929 -788847 -859439 -949003 -913785 -801801 -790676 -912411
32749 -912411 -1019058 -1032893 -1040399 -1086991 -1068623 -927449 -795479 -815098 -933689 -1002999 -988592
32738 -988592 -956437 -930067 -889812 -860363 -877952 -904604 -882278 -846911 -885757 -989687 -1040837
32727 -1040837 -962307 -816116 -729434 -756495 -832700 -859359 -821629 -795655 -828303 -865533 -852743
32716 -852743 -843503 -912140 -1007236 -1020241 -970532 -969171 -1004604 -941969 -770155 -668629 -753457
32705 -753457 -916918 -1009099 -1028651 -1030668 -992407 -900155 -846077 -897689 -968114 -951975 -903814
32694 -903814 -942820 -1053227 -1121810 -1121300 -1119825 -1141368 -1140006 -1095186 -1033491 -972845 -921407 -901133
32682 -901133 -905498 -878320 -799697 -737456 -746381 -781842 -786522 -791187 -846500 -924105 -972431 -1005763
$$ packed form
32760a006405L3856M500L7209R2911M9082p0592q9564L5218J11984J1125j21735
32749i12411j06647j3835p506m6592J8368J41174J31970j9619j18591o9310J4407
32738i88592L2155K6370M0255K9449j7589k6652K2326L5367l8846j03930n1150
32727a040837P8530J46191Q6682k7061p6205k6659L7730K5974l2648l7230J2790
32716h52743R240o8637r5096j3005M9709J361l5433O2635J71814J01526q4828
32705g53457j63461r2181j9552k017L8261R2252N4078n1612p0425J6139M8161
32694i03814l9006j10407o8583N10J475k1543J362M4820O1695O0646N1438K0274
32682i01133m365K7178P8623O2241q925l5461m680m665n5313p7605m8326l3332
$$ plain form
32670 -1005763 -1054343 -1092989 -1098925 -1105686 -1120565 -1076552 -953364 -847652 -823541 -801625 -714985
32659 -714985 -660159 -741001 -860752 -844680 -703174 -599724 -604806 -648945 -683579 -723032 -748252
32648 -748252 -722334 -687453 -712400 -772312 -811425 -875600 -1028620 -1185111 -1202332 -1106797 -1048455
32637 -1048455 -1052735 -1011110 -908516 -852856 -860420 -819443 -711248 -667545 -738856 -790849 -722404
32626 -722404 -628523 -644657 -755970 -856145 -892278 -873615 -828712 -811471 -857023 -896765 -831332
32615 -831332 -716832 -732504 -910873 -1059676 -1035919 -940349 -925743 -958626 -922124 -843835 -847443
32604 -847443 -933989 -973386 -901736 -799804 -767823 -814711 -881236 -908018 -875949 -821740 -806055
32593 -806055 -840054 -868591 -846586 -791071 -737541 -699688 -695702 -744926 -804051 -785002 -685371 -621681
$$ packed form
32670a005763m8580l8646n936o761j4879M4013J23188J05712K4111K1916Q6640
32659g14985N4826q0842j19751J6072J41506J03450n082m4139l4634l9453k5220
32648g48252K5918L4881k4947n9912l9113o4175j53020j56491j7221R5535N8342
32637a048455m280M1625J02594N5660p564M0977J08195M3703p1311n1993O8445
32626g22404R3881j6134j11313j00175l6133J8663M4903J7241m5552l9742O5433
32615h31332J14500j5672j78369j48803K3757R5570J4606l2883L6502P8289l608
32604h47443q6546l9397P1650J01932L1981m6888o6525k6782L2069N4209J5685
32593h06055l3999k8537K2005N5515N3530L7853L986m9224n9125J9049R9631O3690
$$ plain form
32581 -621681 -671668 -762878 -793120 -783409 -814385 -873433 -879418 -827152 -795595 -818875 -844887 -828381
32569 -828381 -785892 -747513 -719879 -707834 -717904 -732147 -724371 -703052 -696330 -704596 -716220 -751913
32557 -751913 -826345 -875841 -810154 -653633 -550181 -585243 -676140 -701414 -678040 -720732 -852739
32546 -852739 -959346 -948101 -870417 -835931 -865255 -890708 -870793 -836981 -831790 -853415 -868217
32535 -868217 -843686 -772157 -693618 -679544 -751413 -834877 -850267 -825544 -843129 -893741 -888677 -823221
32523 -823221 -804665 -876418 -935142 -892950 -812614 -793185 -820996 -837907 -864072 -928465 -958042
32512 -958042 -881245 -782123 -790971 -857647 -809151 -632081 -517760 -581784 -698610 -694866 -582921
32501 -582921 -506259 -539117 -638891 -746671 -842939 -915408 -937386 -894896 -816378 -763672 -780081
$$ packed form
32581f21681m9987r1210l0242R711l0976n9048n985N2266L1557k3280k6012J6506
32569h28381M2489L8379K7634J2045j0070j4243P776K1319O722q266j1624l5693
32557g51913p4432m9496O5687J56521J03452l5062r0897k5274K3374m2692j32007
32546h52739j06607J1245P7684L4486k9324k5453J9915L3812N191k1625j4802
32535h68217K4531P1529P8539J4074p1869q3464j5390K4723j7585n0612N064O5456
32523h23221J8556p1753n8724M2192Q0336J9429k7811j6911k6165o4393k9577
32512i58042P6797R9122q848o6676M8496J77070J14321o4024j16826L744J11945
32501e82921P6662l2858r9774j07780r6268p2469k1978M2490P8518N2706j6409
$$ plain form
32490 -780081 -841431 -884777 -897008 -927244 -985455 -998902 -926911 -847295 -845688 -883213 -872823 -826606
32478 -826606 -810460 -804915 -745699 -666203 -655890 -698539 -697382 -646709 -628821 -652668 -658996 -680468
32466 -680468 -810856 -994923 -1046319 -929268 -833561 -890719 -992332 -988009 -901951 -839805 -820267
32455 -820267 -815481 -838340 -882141 -885775 -853035 -884138 -995747 -1048894 -964731 -862846 -852347
32444 -852347 -838395 -704979 -552762 -553812 -672228 -741463 -744195 -790607 -860371 -801876 -601124
32433 -601124 -442880 -458908 -583975 -705290 -796138 -846034 -807731 -695336 -622311 -659360 -735486
32422 -735486 -746850 -693547 -646993 -641027 -655086 -664325 -659586 -648590 -667845 -758956 -904969 -1021821
32410 -1021821 -1040887 -977683 -898647 -840513 -784987 -706619 -628442 -613347 -686138 -778412 -790322
$$ packed form
32490g80081o1350m3346j2231l0236n8211j3447P1991P9616J607l7525J0390M6217
32478h26606J6146N545N9216P9496J0313m2649J157N0673J7888k3847o328k1472
32466f80468j30388j84067n1396J17051R5707n7158j01613M323Q6058O2146J9538
32455h20267M786k2859m3801l634L2740l1103j11609n3147Q4163J01885J0499
32444h52347J3952J33416J52217j050j18416o9235k732m6412o9764N8495K00752
32433f01124J58244j6028j25067j21315r0848m9896L8303J12395P3025l7049p6126
32422g35486j1364N3303M6554N966j4059r239M739J0996j9255r1111j46013j16852
32410a021821j9066O3204P9036N8134N5526P8368P8177J5095p2791r2274j1910
$$ plain form
32399 -790322 -709825 -623844 -601009 -620867 -639871 -658062 -679076 -671800 -627932 -597189 -603511 -587430
32387 -587430 -506347 -435307 -477010 -610192 -720694 -758320 -769980 -789304 -786518 -739327 -682360
32376 -682360 -666777 -710872 -790421 -846999 -826023 -741954 -675461 -667927 -662101 -596277 -506594 -471022
32364 -471022 -497238 -536668 -566651 -584693 -567153 -517564 -512021 -601930 -709426 -723365 -671358
32353 -671358 -684034 -798940 -909804 -916003 -826686 -710448 -629637 -627786 -696971 -755896 -738910
32342 -738910 -693417 -700523 -727497 -682916 -605983 -646090 -820182 -942239 -870593 -701485 -619457
32331 -619457 -652597 -689833 -676612 -669936 -717158 -784929 -822333 -821573 -793773 -738899 -672554 -648704
32319 -648704 -711153 -824305 -890957 -860706 -791482 -764899 -766189 -715322 -611435 -555356 -599864
$$ packed form
32399g90322Q0497Q5981K2835j9858j9004j8191k1014P276M3868L0743o322J6081
32387e87430Q1083P1040m1703j33182j10502l7626j1660j9324K786M7191N6967
32376f82360J5583m4095p9549n6578K0976Q4069O6493P534N826O5824Q9683L5572
32364d71022k6216l9430k9983j8042J7540M9589N543q9909j07496j3939N2007
32353f71358j2676j14906j10864o199Q9317J16238Q0811J851o9185n8925J6986
32342g38910M5493p106k6974M4581P6933m0107j74092j22057P1646J69108Q2028
32331f19457l3140l7236J3221O676m7222o7771l7404P60K7800N4874O6345K3850
32319f48704o2449j13152o6652L0251O9224K6583j290N0867J03887N6079m4508
$$ plain form
32308 -599864 -672807 -707222 -753872 -874403 -1002187 -1024299 -947808 -864865 -796257 -703079 -624851
32297 -624851 -653005 -759986 -801769 -722986 -627067 -600344 -597848 -566705 -557919 -622724 -694126 -678951
32285 -678951 -607277 -586844 -641171 -686747 -664953 -620326 -628856 -691362 -726259 -668637 -567812
32274 -567812 -557568 -700975 -892131 -966432 -893534 -792934 -761909 -771872 -756953 -720927 -704346
32263 -704346 -705166 -692580 -667432 -659068 -681498 -730393 -807204 -910789 -1009772 -1050115 -1000404 -887974
32251 -887974 -784779 -743473 -745242 -733821 -703689 -709287 -765280 -793958 -720268 -574973 -449898
32240 -449898 -393171 -404659 -481791 -591966 -646534 -598323 -537484 -594463 -763606 -911570 -942486
32229 -942486 -865509 -724037 -563960 -459440 -461296 -519465 -550686 -567016 -631962 -715608 -728150
$$ packed form
32308e99864p2943l4415m6650j20531j27784k2112P6491Q2943O8608R3178P8228
32297f24851k8154j06981m1783P8783R5919K6723K496L1143Q786o4805p1402J5175
32285f78951P1674K0433n4327m5576K1794M4627q530o2506l4897N7622J00825
32274e67812J0244j43407j91156p4301P2898J00600L1025r963J4919L6026J6581
32263g04346q20J2586K5148Q364k2430m8895p6811j03585r8983m0343M9711J12430
32251h87974J03195M1306j769J1421L0132n598n5993k8678P3690J45295J25075
32240d49898N6727j1488p7132j10175n4568M8211O0839n6979j69143j47964l0916
32229i42486P6977J41472J60077J04520j856n8169l1221j6330o4946q3646j2542
$$ plain form
32218 -728150 -686834 -698134 -763109 -761466 -667187 -618985 -705382 -818141 -807161 -673899 -530211
32207 -530211 -454643 -457359 -504906 -523561 -456216 -353098 -320214 -363098 -399116 -436239 -576932
32196 -576932 -797740 -906880 -814742 -679787 -670329 -739250 -769296 -786291 -858635 -913874 -846696
32185 -846696 -719795 -670707 -686815 -653700 -570371 -532342 -541742 -521117 -493052 -555995 -678630
32174 -678630 -702691 -582369 -459112 -452338 -515320 -550694 -547583 -546305 -562305 -593045 -625383 -615069
32162 -615069 -540278 -479296 -530953 -648667 -676098 -576196 -493971 -537083 -622374 -624966 -568318
32151 -568318 -553593 -578095 -550697 -454964 -381988 -400525 -483893 -578818 -672374 -762971 -820863
32140 -820863 -818413 -771859 -716547 -652834 -552082 -421054 -328083 -339465 -442851 -560156 -629159
$$ packed form
32218g28150M1316j1300o4975J643R4279M8202q6397j12759J0980J33262J43688
32207e30211P5568k716m7547j8655O7345J03118L2884m2884l6018l7123j40693
32196e76932k20808j09140R2138J34955R458o8921l0046j6995p2344n5239O7178
32185h46696J26901M9088j6108L3115Q3329L8029r400K0625K8065o2943j22635
32174f78630k4061J20322J23257O774o2982l5374L111J278j6000l0740l2338J0314
32162f15069P4791O0982n1657j17714k7431R9902Q2225m3112q5291k592N6648
32151e68318J4725k4502K7398R5733P2976j8537q3368r4925r3556r0597n7892
32140h20863K450M6554N5312O3713J00752J31028R2971j1382j03386j17305o9003
$$ plain form
32129 -629159 -642813 -616770 -567309 -533459 -568231 -672505 -773847 -808602 -796201 -795754 -819729
32118 -819729 -836725 -836966 -842144 -857182 -859019 -836360 -805233 -781315 -764510 -753212 -748837 -740684 -704899
32105 -704899 -629839 -541571 -499157 -547179 -655969 -728632 -705243 -649035 -677309 -804250 -910808
32094 -910808 -889499 -765848 -650013 -616281 -659815 -726806 -751345 -696782 -593238 -512373 -492577
32083 -492577 -517645 -565039 -622890 -658785 -638669 -588808 -570408 -579846 -551591 -476912 -429500 -442693
32071 -442693 -456118 -429299 -415196 -463533 -536027 -579495 -605418 -636525 -648436 -620806 -575036
32060 -575036 -520116 -448254 -415720 -505769 -660384 -694680 -561105 -445639 -488795 -570070 -522431
32049 -522431 -411780 -406690 -484795 -490907 -417939 -406023 -492336 -571443 -597066 -628769 -671169 -649000
$$ packed form
32129f29159j3654K6043M9461L3850l4772j04274j01342l4755J2401M47k3975
32118h19729j6996k41n178j5038j837K2659L1127K3918J6805J1298M375Q153L5785
32105g04899P5060Q8268M2414m8022j08790p2663K3389N6208k8274j26941j06558
32094i10808K1309J23651J15835L3732m3534o6991k4539N4563J03544Q0865J9796
32083d92577k5068m7394n7851l5895K0116M9861J8400r438K8255P4679M7412j3193
32071d42693j3425K6819J4103m8337p2494m3468k5923l1107j1911K7630M5770
32060e75036N4920P1862L2534r0049j54615l4296J33575J15466m3156q1275M7639
32049e22431J10651N090p8105o112P2968J1916q6313p9107k5623l1703m2400K2169
$$ plain form
32037 -649000 -562187 -502799 -498339 -488562 -467983 -496683 -558283 -566039 -526300 -533308 -578549 -534910
32025 -534910 -371420 -221340 -185974 -226305 -302769 -458239 -680326 -827532 -794475 -646583
32015 -646583 -513122 -446187 -448732 -529312 -649604 -714423 -691068 -657222 -671966 -690385 -666245
32004 -666245 -644484 -680372 -746319 -784147 -781220 -746397 -684648 -635447 -653320 -711512 -713060 -634490
31992 -634490 -564120 -562060 -585801 -593306 -605965 -621994 -587748 -513559 -496682 -563052 -610182 -580333
31980 -580333 -556990 -597412 -607954 -510991 -414944 -467332 -624680 -723390 -722475 -722759 -771129 -789076
31968 -789076 -706744 -562822 -447556 -407638 -417265 -411626 -363266 -337586 -420748 -572909 -634807
31957 -634807 -529261 -374230 -327994 -394808 -460882 -460268 -422076 -397489 -413432 -467554 -520003
$$ packed form
32037f49000Q6813N9388M460R777K0579k8700o1600p756L9739p008m5241M3639
32025e34910J63490J50080L5366m0331p6464j55470k22087j47206L3057J47892
32015f46583J33461O6935k545q0580j20292o4819K3355L3846j4744j8419K4140
32004f66245K1761l5888o5947l7828K927L4823O1749M9201j7873n8192j548P8570
31992f34490P0370K060k3741p505j2659j6029L4246P4189J6877o6370m7130K9849
31980e80333K3343m0422j0542R6963R6047n2388j57348r8710R15k84m8370j7947
31968g89076Q2332J43922J15266L9918r627N639M8360K5680q3162j52161o1898
31957f34807J05546J55031M6236o6814o6074O14L8192K4587j5943n4122n2449
$$ plain form
31946 -520003 -528452 -520128 -566373 -657870 -690707 -618585 -526932 -506237 -549185 -624306 -735365 -838822
31934 -838822 -830025 -708274 -634518 -709649 -807441 -758596 -600454 -499360 -507910 -550573 -585951
31923 -585951 -630823 -665722 -655411 -630991 -634857 -629355 -572855 -526309 -560385 -620495 -617333 -584397
31911 -584397 -599797 -622237 -573612 -523386 -599055 -751150 -808981 -753621 -726509 -761682 -730777
31900 -730777 -599755 -527152 -618890 -762267 -806180 -759442 -703430 -634516 -513707 -385440 -335623
31889 -335623 -381131 -475224 -574616 -647605 -668580 -650382 -634254 -622446 -580832 -522920 -510360
31878 -510360 -546821 -560298 -524167 -503607 -536008 -554761 -492775 -389416 -332812 -352464 -420596
31867 -420596 -505996 -576589 -594294 -552374 -486653 -429546 -392990 -399060 -462289 -533000 -536940 -491997
$$ packed form
31946e20003q449Q324m6245r1497l2837P2122R1653K0695m2948p5121j11059j03457
31934h38822Q797J21751P3756p5131r7792M8845J58142J01094q550m2663l5378
31923e85951m4872l4899J0311K4420l866N502N6500M6546l4076o0110L162L2936
31911e84397j5400k2440M8625N0226p5669j52095n7831N5360K7112l5173L0905
31900g30777J31022P2603r1738j43377m3913M6738N6012O8914J20809J28267M9817
31889c35623m5508r4093r9392p2989k0975J8198J6128J1808M1614N7912J2560
31878e10360l6461j3477L6131K0560l2401j8753O1986J03359N6604j9652o8132
31867d20596q5400p0593j7705M1920O5721N7107L6556o070o3229p0711l940M4943
$$ plain form
31855 -491997 -502883 -608314 -715857 -730401 -670716 -611006 -578393 -561880 -560565 -566454 -548671
31844 -548671 -504709 -486340 -533604 -617274 -671963 -650697 -542839 -394811 -312480 -363978 -472700
31833 -472700 -499162 -440916 -436253 -538686 -624208 -592989 -528895 -548373 -603753 -576728 -489179
31822 -489179 -467096 -533985 -589622 -585408 -582298 -619536 -651125 -649247 -664124 -727514 -779332 -752194
31810 -752194 -671615 -611208 -587053 -556542 -501483 -452874 -429448 -401022 -341156 -290183 -323236
31799 -323236 -449911 -584320 -644061 -650561 -684322 -756760 -791949 -744395 -664666 -614644 -583712
31788 -583712 -545529 -541559 -623739 -738091 -757257 -642017 -497690 -443210 -483433 -543868 -574000
31777 -574000 -563680 -501259 -387593 -277618 -238484 -261684 -280558 -284456 -337934 -452595 -525324
$$ packed form
31855d91997j0886j05431j07543j4544N9685N9710L2613J6513J315n889J7783
31844e48671M3962J8369m7264q3670n4689K1266J07858J48028Q2331n1498j08722
31833d72700k6462N8246M663j02433q5522L1219O4094j9478n5380K7025Q7549
31822d89179K2083o6889n5637M214L110l7238l1589J878j4877o3390n1818K7138
31810g52194Q0579O0407K4155L0511N5059M8609K3426K8426N9866N0973l3053
31799c23236j26675j34409n9741o500l3761p2438l5189M7554P9729N0022L0932
31788e83712L8183L970q2180j14352j9166J15240J44327N4480m0223o0435l0132
31777e74000J0320O2421J13666J09975L9134k3200j8874l898n3478j14661p2729
$$ plain form
31766 -525324 -478731 -396089 -412738 -513254 -558915 -505692 -457283 -474473 -471537 -372410 -251099
31755 -251099 -220194 -271333 -331386 -400509 -516159 -635072 -675833 -648202 -622586 -592130 -486887
31744 -486887 -324121 -226536 -265050 -372547 -439789 -428445 -374197 -338748 -365961 -433850 -458911
31733 -458911 -400137 -331648 -347057 -427945 -487475 -504137 -514530 -511412 -464029 -412086 -416341 -437725
31721 -437725 -396749 -331176 -344528 -411683 -410067 -351952 -389935 -546025 -636690 -555518 -444151
31710 -444151 -462749 -556240 -592427 -588879 -633519 -688073 -653769 -567718 -556682 -623869 -642803 -562286
31698 -562286 -476767 -471088 -508643 -509196 -455205 -383108 -323942 -288088 -283666 -327227 -432009 -576018
31686 -576018 -690692 -716727 -671661 -622685 -600629 -594835 -614607 -671553 -711101 -667134 -584535
$$ packed form
31766e25324M6593Q2642j6649j00516m5661N3223M8409j7190K936R9127J21311
31755b51099L0905n1139o0053o9123j15650j18913m0761K7631K5616L0456J05243
31744d86887J62766R7585l8514j07497o7242J1344N4248L5449k7213o7889k5061
31733d58911N8774O8489j5409q0888n9530j6662j0393L118M7383N1943m255k1384
31721d37725M0976O5573j3352o7155J616N8115l7983j56090r0665Q1172J11367
31710d44151j8598r3491l6187L548m4640n4554L4304Q6051J1036o7187j8934Q0517
31698e62286Q5519N679l7555n53N3991P2097N9166L5854M422m3561j04782j44009
31686e76018j14674k6035M5066M8976K2056N794j9772n6946l9548M3967Q2599
$$ plain form
31675 -584535 -561292 -560859 -444637 -235069 -158611 -322117 -519307 -508938 -343659 -247845 -283451
31664 -283451 -336570 -358167 -401100 -441944 -372577 -193609 -49495 -32276 -85007 -136439 -207075
31653 -207075 -330040 -463693 -539738 -541171 -501781 -468900 -469308 -474355 -423000 -324314 -284402 -359830
31641 -359830 -450362 -444091 -406315 -477843 -622097 -651044 -518556 -412149 -486353 -649840 -712138
31630 -712138 -632903 -517605 -439439 -381679 -329601 -316912 -363512 -428251 -455542 -445948 -449572 -483869
31618 -483869 -487688 -398496 -265722 -219598 -303373 -409931 -436654 -430272 -496722 -625373 -706124
31607 -706124 -689780 -625859 -554325 -464913 -368688 -311740 -297624 -278356 -243655 -243208 -294091 -335032
31595 -335032 -309510 -246998 -228995 -300174 -425723 -516359 -501738 -403925 -322094 -318994 -353838
$$ packed form
31675e84535K3243M33J16222K09568P6458j63506j97190J0369J65279R5814l5606
31664b83451n3119k1597m2933m0844O9367J78968J44114J7219n2731n1432p0636
31653b07075j22965j33653p6045j433L9390L2881m08n047N1355R8686L9912p5428
31641c59830r0532O271L7776p1528j44254k8947J32488J06407p4204j63487o2298
31630g12138P9235J15298P8166N7760N2078J2689m6600o4739k7291R594l624l4297
31618d83869l819Q9192J32774M6124q3775j06558k6723O382o6450j28651q0751
31607g06124J6344O3921P1534Q9412R6225N6948J4116J9268L4701M47n0883m0941
31595c35032K5522O2512J8003p1179j25549r0636J4621R7813Q1831L100l4844
$$ plain form
31584 -353838 -361224 -351107 -376882 -446225 -525996 -597452 -643072 -622935 -539081 -480641 -521473 -610451
31572 -610451 -647844 -628340 -613747 -607778 -569870 -520706 -514148 -524892 -485594 -421430 -421282 -480881
31560 -480881 -506094 -477621 -476019 -519900 -514347 -408138 -289228 -266687 -341149 -434990 -480244
31549 -480244 -451426 -379909 -345372 -382329 -407190 -329378 -214081 -212898 -337306 -437369 -423306
31538 -423306 -374070 -393370 -481798 -585928 -656902 -634648 -499543 -363579 -372352 -489088 -528035
31527 -528035 -436308 -367033 -412823 -457112 -391056 -296122 -275312 -264026 -171677 -81218 -129592
31516 -129592 -281775 -394229 -431120 -453139 -453304 -377233 -272029 -246464 -291559 -294469 -238222
31505 -238222 -242322 -370951 -521656 -558386 -474585 -376050 -354081 -411000 -478324 -485091 -421929
$$ packed form
31584c53838p386J0117k5775o9343p9771p1456m5620K0137Q3854N8440m0832q8978
31572f10451l7393J9504J4593N969L7908M9164O558j0744L9298O4164J48n9599
31560d80881k5213K8473J602m3881N553J06209J18910K2541p4462r3841m5254
31549d80244K8818P1517L4537l6957k4861P7812J15297J183j24408j00063J4063
31538d23306M9236j9300q8428j04130p0974K2254J35105J35964q773j16736l8947
31527e28035R1727O9275m5790m4289O6056R4934K0810J1286R2349R0459m8374
31516a29592j52183j12454l6891k2019j65P6071J05204K5565m5095k910N6247
31505b38222m100j28629j50705l6730Q3801R8535K1969n6919o7324o767O3162
$$ plain form
31494 -421929 -342917 -306836 -339481 -445878 -600136 -710695 -675390 -516018 -388172 -401525
31484 -401525 -493369 -538380 -515185 -487801 -479420 -455611 -406039 -368159 -380566 -454464 -562406
31473 -562406 -625440 -565288 -411603 -299186 -311134 -384699 -417434 -393075 -348403 -300175 -277283
31462 -277283 -341403 -486066 -588098 -554995 -456677 -416372 -438251 -450635 -456649 -514137 -602187
31451 -602187 -633459 -588273 -532756 -511957 -512982 -519050 -515877 -463106 -343820 -226709 -200089 -258157
31439 -258157 -320410 -341411 -338018 -339780 -374778 -463576 -565097 -582737 -492064 -395462 -372263 -357853
31427 -357853 -274162 -192616 -230778 -352969 -424325 -420405 -432570 -493686 -547743 -575595 -605898
31416 -605898 -611936 -539404 -430243 -381379 -390287 -382026 -372698 -445167 -566289 -602486 -534947 -486381
$$ packed form
31494d21929P9012L6081l2645j06397j54258j10559L5305J59372J27846j3353
31484d01525r1844m5011K3195K7384Q381K3809M9572L7880j2407p3898j07942
31473e62406o3034O0152J53685J12417j1948p3565l2735K4359M4672M8228K2892
31462b77283o4120j44663j02032L3103R8318M0305k1879j2384o014n7488q8050
31451f02187l1272M5186N5517K0799j025o068L173N2771J19286J17111K6620n8068
31439b58157o2253k1001L393j762l4998q8798j01521j7640R0673R6602K3199J4410
31427c57853Q3691Q1546l8162j22191p1356L920j2165o1116n4057k7852l0303
31416f05898o038P2532J09161M8864q908Q261R328p2469j21122l6197O7539M8566
$$ plain form
31404 -486381 -503515 -490713 -408343 -355521 -378707 -370139 -261504 -169792 -226050 -373806 -463017
31393 -463017 -458708 -439886 -455254 -484619 -502015 -500186 -488781 -512957 -614708 -738504 -757363
31382 -757363 -642195 -517078 -486800 -500627 -458780 -365720 -293558 -269929 -287898 -356108 -450824
31371 -450824 -486165 -428336 -379805 -445257 -559269 -559345 -410940 -256504 -236586 -341816 -454911
31360 -454911 -483105 -436122 -404111 -458425 -562591 -608307 -552147 -467361 -432738 -429235 -395239
31349 -395239 -332592 -296217 -311100 -354370 -395538 -410619 -381956 -324582 -291835 -326323 -426298
31338 -426298 -566411 -704923 -766295 -692097 -536028 -431023 -427498 -447500 -435683 -446576 -513739
31327 -513739 -547815 -472447 -365250 -334497 -336342 -267313 -179730 -223649 -386258 -473898 -389270
$$ packed form
31404d86381j7134J2802Q2370N2822k3186Q568J08635R1712n6258j47756q9211
31393d63017M309J8822j5368k9365j7396J829J1405k4176j01751j23796j8859
31382g57363J15168J25117L0278j3827M1847R3060P2162K3629j7969o8210r4716
31371d50824l5341N7829M8531o5452j14012p6J48405J54436J9918j05230j13095
31360d54911k8194M6983L2011n4314j04166m5716N6160Q4786L4623L503L3996
31349c95239O2647L6375j4883m3270m1168j5081K8663N7374L2747l4488r9975
31338d26298j40113j38512o1372P4198J56069J05005L525k0002J1817j0893o7163
31327e13739l4076P5368J07197L0753j845O9029Q7583m3919j62609q7640Q4628
$$ plain form
31316 -389270 -259234 -219017 -222044 -171573 -119265 -186429 -348420 -446837 -413286 -356118 -392183
31305 -392183 -490172 -539081 -504813 -444276 -398291 -352044 -302331 -288398 -325681 -366827 -373406 -382280
31293 -382280 -445609 -537389 -583614 -565505 -524489 -477198 -403277 -318062 -272408 -263335 -231820 -181859
31281 -181859 -211579 -367275 -542124 -595213 -518134 -409084 -326741 -253877 -179987 -133487 -129952
31270 -129952 -153026 -193613 -259083 -339421 -405113 -442089 -458069 -458326 -443544 -423396 -406285 -388316
31258 -388316 -374996 -390594 -438061 -479690 -494457 -520103 -587046 -642836 -613820 -529164 -502459
31247 -502459 -573161 -637884 -581368 -429886 -323568 -353202 -466918 -540323 -508792 -416379 -350056
31236 -350056 -348447 -380137 -394908 -378077 -356373 -363485 -401736 -434740 -428001 -399624 -403048 -441366
$$ packed form
31316c89270J30036M0217l027N0471N2308o7164j61991r8417L3551N7168l6065
31305c92183r7989m8909L4268O0537M5985M6247M9713J3933l7283m1146o579q874
31293c82280o3329r1780m6225J8109M1016M7291P3921Q5215M5654R073L1515M9961
31281a81859k9720j55696j74849n3089P7079J09050Q2343P2864P3890M6500L535
31270a29952k3074m0587o5470q0338o5692l6976j5980k57J4782K0148J7111J7969
31258c88316J3320j5598m7467m1629j4767k5646o6943n5790K9016Q4656K6705
31247e02459p0702o4723N6516J51482J06318k9634j13716p3405L1531R2413O6323
31236c50056J609l1690j4771J6831K1704p112l8251l3004O739K8377l424l8318
$$ plain form
31224 -441366 -438302 -340153 -213640 -172148 -217659 -240097 -186744 -145354 -215181 -365156 -480933
31213 -480933 -506787 -477900 -439125 -393517 -327529 -244709 -170586 -143562 -190304 -288153 -361046
31202 -361046 -336521 -215075 -84827 -64547 -205293 -422956 -550985 -497899 -337024 -208652
31192 -208652 -171103 -201555 -289667 -426187 -523329 -475518 -319273 -216822 -245074 -310163 -316033
31181 -316033 -302221 -341992 -405782 -421595 -402679 -421871 -497770 -575079 -588193 -506757 -366084
31170 -366084 -276247 -327059 -455932 -503433 -435337 -392555 -464309 -548511 -531806 -472104 -468852
31159 -468852 -468661 -363595 -201576 -127902 -166404 -218854 -244111 -279700 -314717 -304865 -300336 -393658
31147 -393658 -536802 -573709 -477151 -395691 -425673 -486816 -484204 -456736 -480486 -529665 -525506 -456550
$$ packed form
31224d41366L064R8149J26513M1492m5511k2438N3353M1390o9827j49975j15777
31213d80933k5854K8887L8775M5608O5988Q2820P4123K7024m6742r7849p2893
31202c61046K4525J21446J30248K0280j40746k17663j28029N3086J60875J28372
31192b08652L7549l0452q8112j36520r7142M7811J56245J02451k8252o5089n870
31181c16033J3812l9771o3790j5813J8916j9192p5899p7309j3114Q1436J40673
31170c66084Q9837n0812j28873m7501O8096M2782p1754q4202J6705N9702L252
31159d68852J91J05066J62019P3674l8502n2450k5257l5589l5017R852M529r3322
31147c93658j43144l6907R6558Q1460k9982o1143K612K7468k3750m9179M159O8956
$$ plain form
31135 -456550 -375288 -320860 -299251 -303212 -315053 -321252 -339124 -388664 -436952 -428193 -373309 -343525
31123 -343525 -363078 -376690 -345525 -312096 -335936 -407027 -453751 -419997 -329708 -283129 -360604
31112 -360604 -509323 -576910 -498296 -383847 -359253 -395439 -392903 -359915 -375208 -423158 -415636
31101 -415636 -359522 -355221 -425133 -479558 -465854 -427532 -405123 -397965 -425313 -497252 -529204 -432420
31089 -432420 -292948 -296159 -451879 -568002 -536165 -460893 -442131 -418952 -329808 -255237 -272593
31078 -272593 -310535 -281849 -240708 -273965 -341702 -359837 -347555 -358689 -352024 -270285 -179883 -191635
31066 -191635 -289330 -362531 -369813 -356076 -348675 -346918 -377549 -454205 -514106 -492440 -425037 -386177
31054 -386177 -368257 -320488 -262882 -257422 -302076 -353753 -418312 -514297 -586478 -568191 -499776 -472442
$$ packed form
31135d56550Q1262N4428K1609l961j1841o199j7872m9540m8288Q759N4884K9784
31123c43525j9553j3612L1165L3429k3840p1091m6724L3754R0289M6579p7475
31112c60604j48719o7587P8614J14449K4594l6186K536L2988j5293m7950P522
31101d15636N6114M301o9912n4425J3704L8322K2409P158k7348p1939l1952R6784
31089d32420J39472l211j55720j16123L1837P5272J8762K3179Q9144P4571j7356
31078b72593l7942K8686M1141l3257o7737j8135J2282j1134O665Q1739R0402j1752
31066a91635r7695p3201p282J3737P401J757l0631p6656n9901K1666O7403L8860
31054c86177J7920M7769N7606N460m4654n1677o4559r5985p2181J8287O8415K7334
$$ plain form
31042 -472442 -481015 -448821 -376125 -338810 -348911 -342681 -309977 -309881 -343224 -335145 -274984 -253249 -311743
31029 -311743 -366919 -346480 -307073 -334896 -399741 -400712 -321696 -253016 -260334 -302198 -301899 -257547
31017 -257547 -239900 -290474 -363371 -389036 -364402 -338371 -328422 -313347 -305719 -353954 -447852 -497830
31005 -497830 -452395 -370453 -327025 -314666 -302101 -324172 -424972 -551555 -594800 -524327 -417048
30994 -417048 -363908 -396962 -482821 -540400 -499539 -390725 -332740 -378290 -428441 -370423 -243174
30983 -243174 -178315 -222686 -314571 -399565 -469094 -507797 -503937 -502185 -554873 -626723 -629264 -541358
30971 -541358 -422391 -325585 -274558 -295704 -381424 -443707 -401161 -297836 -244218 -260411 -275126
30960 -275126 -258158 -245994 -251176 -256835 -288290 -375570 -458083 -450790 -396303 -417161 -518402 -580829
$$ packed form
31042d72442q573L2194P2696L7315j0101O230L2704R6l3343Q079O0161K1735n8494
31029c11743n5176K0439L9407k7823o4845r71P9016O8680p318m1864K99M4352
31017b57547J7647n0574p2897k5665K4634K6031R949J5075P628m8235r3898m9978
31005d97830M5435Q1942M3428J2359J2565k2071j00800j26583m3245P0473J07279
30994d17048N3140l3054q5859n7579M0861J08814N7985m5550n0151N8018J27249
30983b43174O4859m4371r1885q4994o9529l8703L860J752n2688p1850k541Q7906
30971e41358J18967R6806N1027k1146q5720o2283M2546J03325N3618j6193j4715
30960b75126J6968J2164n182n659l1455q7280q2513P293N4487k0858j01241o2427
$$ plain form
30948 -580829 -557402 -522224 -506492 -454731 -383256 -402231 -509443 -539143 -416072 -294054 -315804
30937 -315804 -387425 -346599 -228153 -185093 -236494 -278319 -286108 -319927 -353890 -286064 -133132
30926 -133132 -55039 -146198 -328271 -487177 -599633 -679819 -710748 -690402 -660455 -630679 -551326
30915 -551326 -419394 -334024 -366523 -435795 -408796 -293743 -234695 -314487 -452750 -524070 -504202
30904 -504202 -458781 -442311 -457279 -475509 -452369 -351896 -208135 -129539 -179147 -274116 -278302
30893 -278302 -178947 -85274 -60426 -66198 -91882 -204894 -404693 -544924 -508243 -376396 -313956
30882 -313956 -347405 -377732 -359876 -339308 -338764 -334360 -329722 -338244 -310033 -200204 -95666 -136924
$$ packed form
30948e80829K3427L5178J5732N1761P1475j8975j07212k9700J23071J22018k1750
30937c15804p1621M0826J18446M3060n1401m1825p789l3819l3963O7826J52932
30926a33132P8093r1159j82073j58906j12456q0186l0929K0346K9947K9776P9353
30915e51326J31932Q5370l2499o9272K6999J15053N9048p9792j38263p1320J9868
30904e04202M5421J6470j4968j8230K3140J00473J43761P8596m9608r4969m186
30893b78302R9355R3673K4848n772k5684j13012j99799j40231L6681J31847O2440
30882c13956l3449l0327J7856K0568N44M404M638q522K8211J09829J04538m1258
$$ [...]
##END NTUPLES=NMR SPECTRUM
##END=
