##TITLE=31Pdec_LY-4Dix.H2O
 CD3CN, 24 sc
 11.03.2021
##JCAMPDX= 6.0         $$ Bruker NMR JCAMP-DX V2.0
##DATA TYPE= NMR SPECTRUM
##DATA CLASS= NTUPLES
##ORIGIN= UXNMR, Bruker Analytische Messtechnik GmbH
##OWNER= root
$$ XWIN-NMR		Version 3.5
$$ Thu Mar 11 11:32:18 2021 Russian Standard Time (UT+4h)  she@DPX200
##.OBSERVE FREQUENCY= 81.013821
##.OBSERVE NUCLEUS= ^31P
##.ACQUISITION MODE= SIMULTANEOUS
##.ACQUISITION SCHEME= undefined
##.AVERAGES= 24
##.DIGITISER RES= 16
##SPECTROMETER/DATA SYSTEM= spect
##.PULSE SEQUENCE= zgpg30
##.SOLVENT NAME= CDCl3
##.SHIFT REFERENCE= (INTERNAL, CDCl3, 0, 248.564)
##AUDIT TRAIL= $$ (NUMBER, WHEN, WHO, WHERE, WHAT)
$$ ##TITLE= Audit trail, XWIN-NMR		Version 3.5
$$ ##JCAMPDX= 5.01
$$ ##ORIGIN= Bruker BioSpin GmbH
$$ ##OWNER= she
$$ F:/spectra/data/she/nmr/P31/1/pdata/1/auditp.txt
$$ ##AUDIT TRAIL=  $$ (NUMBER, WHEN, WHO, WHERE, WHAT)
(   1,<2021-03-11 11:30:51.65 +0400>,<she>,<DPX200>,
      <created by zg, POWCHK disabled, PULCHK disabled
       configuration hash MD5:
       00 E9 B6 7A A2 85 ED C7 34 08 36 98 17 FE 4E 26
       data hash MD5: 32K
       48 F3 E0 2E E4 70 F1 FF 42 2C 79 31 CA 36 29 94>)
(   2,<2021-03-11 11:30:54.09 +0400>,<she>,<DPX200>,
      <Start of raw data processing
       efp BC_mod = 2 LB = 1 FT_mod = 6 PKNL = 1 PHC0 = -4054.696 PHC1 = 37.60099 SI = 64K 
       data hash MD5: 64K
       A4 EF 45 36 16 91 35 E5 FF 7E B4 B1 15 CF 14 07>)
(   3,<2021-03-11 11:31:31.48 +0400>,<she>,<DPX200>,
      <pk PHC0 = 190.3317 PHC1 = -377.2 
       data hash MD5: 64K
       3C EE CA D1 56 DF 58 D3 A4 EC 7E C7 DB 38 97 86>)
(   4,<2021-03-11 11:31:34.81 +0400>,<she>,<DPX200>,
      <abs ABSG = 5 
       data hash MD5: 64K
       85 AD F2 08 39 B7 EB 53 DC AC 21 B6 8B F7 D0 CA>)
$$ ##END=
$$ 
$$ hash MD5
$$ 28 4B 98 D4 27 0A C0 78 FF 0E 78 56 CF 03 97 52
##$RELAX= 
##$RELAX= 
##$RELAX= 
##$RELAX= 
##$RELAX= 
##$RELAX= 
##$RELAX= 
##$RELAX= 
$$ Bruker specific parameters
$$ --------------------------
##$DU= <F:/spectra>
##$EXPNO= 1
##$NAME= <P31>
##$PROCNO= 1
##$TYPE= <nmr>
##$USER= <she>
##$AMP= (0..31)
100 100 100 100 100 100 100 100 100 100 100 100 100 100 100 100 100 100 
100 100 100 100 100 100 100 100 100 100 100 100 100 100 
##$AQSEQ= 0
##$AQ_mod= 1
##$AUNM= <au_zg>
##$AUTOPOS= <>
##$BF1= 81.014009
##$BF2= 200.13
##$BF3= 200.13
##$BF4= 200.13
##$BF5= 200.13
##$BF6= 200.13
##$BF7= 200.13
##$BF8= 200.13
##$BYTORDA= 1
##$CFDGTYP= 0
##$CFRGTYP= 5
##$CHEMSTR= <none>
##$CNST= (0..31)
1 1 145 1 1 1 1 1 1 1 1 1 1 1 1 1 1 1 1 1 1 1 1 1 1 1 1 1 1 1 1 1 
##$CPDPRG= <waltz16>
##$CPDPRG1= <>
##$CPDPRG2= <waltz16>
##$CPDPRG3= <>
##$CPDPRG4= <mlev>
##$CPDPRG5= <mlev>
##$CPDPRG6= <mlev>
##$CPDPRG7= <mlev>
##$CPDPRG8= <mlev>
##$CPDPRGB= <>
##$CPDPRGT= <>
##$D= (0..31)
0 1 0 0 0 0 0 0 0 0 0 0.03 2e-05 3e-06 0 0 0 0 0 0 0 0 0 0 0 0 0 0 0 0 
0 0 
##$DATE= 1615447851
##$DBL= (0..7)
120 120 120 11 120 120 24 19 
##$DBP= (0..7)
150 150 150 150 150 150 150 150 
##$DBP07= 0
##$DBPNAM0= <>
##$DBPNAM1= <>
$$ [...]
##$SUBNAM3= <"">
##$SUBNAM4= <"">
##$SUBNAM5= <"">
##$SUBNAM6= <"">
##$SUBNAM7= <"">
##$SUBNAM8= <"">
##$SUBNAM9= <"">
##$SW= 501.771253377433
##$SWIBOX= (0..15)
0 1 3 0 0 0 0 0 0 0 0 0 0 0 0 0 
##$SW_h= 40650.406504065
##$TD= 32768
##$TD0= 1
##$TE= 0
##$TE2= 300
##$TE3= 300
##$TEG= 300
##$TL= (0..7)
0 120 53 12 22 120 120 120 
##$TP= (0..7)
150 150 150 150 150 150 150 150 
##$TP07= 0
##$TPNAME0= <>
##$TPNAME1= <>
##$TPNAME2= <>
##$TPNAME3= <>
##$TPNAME4= <>
##$TPNAME5= <>
##$TPNAME6= <>
##$TPNAME7= <>
##$TPOAL= (0..7)
0.5 0.5 0.5 0.5 0.5 0.5 0.5 0.5 
##$TPOFFS= (0..7)
0 0 0 0 0 0 0 0 
##$TUNHIN= 0
##$TUNHOUT= 0
##$TUNXOUT= 0
##$USERA1= <user>
##$USERA2= <user>
##$USERA3= <user>
##$USERA4= <user>
##$USERA5= <user>
##$V9= 5
##$VALIST= <valist>
##$VCLIST= <CCCCCCCCCCCCCCC>
##$VD= 0
##$VDLIST= <DDDDDDDDDDDDDDD>
##$VPLIST= <PPPPPPPPPPPPPPP>
##$VTLIST= <TTTTTTTTTTTTTTT>
##$WBST= 1024
##$WBSW= 4
##$XGAIN= (0..3)
0 0 0 0 
##$XL= 0
##$YL= 0
##$YMAX_a= 5806
##$YMIN_a= -26103
##$ZGOPTNS= <>
##$ZL1= 120
##$ZL2= 120
##$ZL3= 120
##$ZL4= 120
##$ABSF1= 248.5645
##$ABSF2= -253.2056
##$ABSG= 5
##$ABSL= 3
##$ALPHA= 0
##$AQORDER= 0
##$ASSFAC= 0
##$ASSFACI= 0
##$ASSFACX= 0
##$ASSWID= 0
##$AUNMP= <proc_1d>
##$AZFE= 0.1
##$AZFW= 0.5
##$BCFW= 0
##$BC_mod= 2
##$BYTORDP= 0
##$COROFFS= 0
##$CY= -3
##$DATMOD= 1
##$DC= 0
##$DFILT= <>
##$DTYPP= 0
##$F1P= 0
##$F2P= 0
##$FCOR= 1
##$FTSIZE= 65536
##$FT_mod= 6
##$GAMMA= 0
##$GB= 0
##$INTBC= 1
##$INTSCL= 5.30512e-09
##$ISEN= 30
##$LB= 1
##$LEV0= 0
##$LPBIN= 0
##$MAXI= 10000
##$MC2= 0
##$MEAN= 0
##$ME_mod= 0
##$MI= 50
##$NCOEF= 0
##$NC_proc= -2
##$NLEV= 6
##$NOISF1= 182.463
##$NOISF2= 159.3651
##$NSP= 0
##$NTH_PI= 0
##$NZP= 0
##$OFFSET= 248.5645
##$PC= 4
##$PHC0= -3864.364
##$PHC1= -339.599
##$PH_mod= 1
##$PKNL= yes
##$PPARMOD= 0
##$PSCAL= 0
##$PSIGN= 0
##$REVERSE= no
##$SF= 81.014009
##$SI= 65536
##$SIGF1= 159.3651
##$SIGF2= -187.1042
##$SINO= 113.3802
##$SIOLD= 16384
##$SREGLST= <1H.CDCl3>
##$SSB= 0
##$STSI= 65536
##$STSR= 0
##$SW_p= 40650.406504065
##$SYMM= 0
##$S_DEV= 0
##$TDeff= 32768
##$TDoff= 0
##$TI= <>
##$TILT= no
##$TM1= 0
##$TM2= 0
##$TOPLEV= 0
##$USERP1= <user>
##$USERP2= <user>
##$USERP3= <user>
##$USERP4= <user>
##$USERP5= <user>
##$WDW= 1
##$XDIM= 65536
##$YMAX_p= 379426167
##$YMIN_p= -1489213
$$ End of Bruker specific parameters
$$ ---------------------------------
##NTUPLES= NMR SPECTRUM
##VAR_NAME=  FREQUENCY,     SPECTRUM/REAL,   SPECTRUM/IMAG
##SYMBOL=    X,             R,               I
##VAR_TYPE=  INDEPENDENT,   DEPENDENT,       DEPENDENT
##VAR_FORM=  AFFN,          ASDF,            ASDF
##VAR_DIM=   65536,         65536,           65536
##UNITS=     HZ,            ARBITRARY UNITS, ARBITRARY UNITS
##FACTOR=    0.620285442955139, 1,           1
##FIRST=     20137.2065510759, 0,            0
##LAST=      -20513.1999529892, 0,           0
##MIN=       -20513.1999529892, -1489213,    0
##MAX=       20137.2065510759, 379426167,    0
$$ Real data points
##PAGE= N=1
##DATA TABLE= (X++(R..R)), XYDATA
$$ [...]
38481 -27391 16115 126716 221651 199352 45164 -135134 -198700 -110444 13363 48307 14636
38470 14636 11991 38417 -2188 -112498 -163815 -87426 26811 81650 94502 94683 29558 -122339
38458 -122339 -255052 -269325 -213733 -178984 -142207 -45959 47167 28005 -77295 -139009 -110750
38447 -110750 -58989 -26543 12341 65526 94118 72124 3448 -101786 -206789 -246070 -207345
38436 -207345 -157095 -122563 -38174 109631 203402 181015 171723 282949 381958 307043 183795
38425 183795 254133 450862 459338 214444 9986 28372 73269 -73013 -293394 -345311 -227092
38414 -227092 -117714 -94126 -112326 -155600 -208358 -181867 -57568 -14575 -208843 -488972 -545846
38403 -545846 -319063 -53101 45917 15093 -16931 6232 101621 265811 387402 294425 -13239
38392 -13239 -295639 -337073 -191542 -75076 -93746 -176564 -216376 -173208 -71224 18987 21602
38381 21602 -44859 -46743 94347 247482 214181 19931 -84380 36154 202334 176501 3013
38370 3013 -75049 13002 81024 6936 -57396 80284 344352 485004 419564 309772 302840
38359 302840 352460 337357 226476 59166 -132415 -293563 -320847 -174684 17103 68638
38349 68638 -52099 -193699 -206030 -88107 60034 167340 234170 280276 295982 248646 124836
38338 124836 -35051 -149273 -158166 -78383 19435 82708 100414 60761 -51924 -177963 -167149
38327 -167149 48929 281675 223340 -172795 -569270 -618399 -368484 -144003 -95150 -85562
38317 -85562 -17458 47 -95440 -147658 -46365 36427 -88051 -275104 -248098 -62565 -45103
38306 -45103 -271958 -440283 -345878 -182129 -195543 -296423 -240941 -27632 138942 187380
38296 187380 239602 351878 400378 261705 -23135 -297083 -417982 -343535 -164314 -44295
38286 -44295 -63026 -137726 -152865 -107841 -61140 -7959 65551 70573 -85064 -308326 -391378
38275 -391378 -281179 -132029 -68854 -55306 -46904 -108933 -272103 -398219 -336599 -149168 -38133
38264 -38133 -74804 -133793 -105293 -44201 -50642 -99876 -89428 -14123 15043 -57995 -139089 -118874
38252 -118874 -34831 -6843 -47511 -56122 -10843 -34052 -197076 -371172 -385278 -259104 -148917
38241 -148917 -104751 -31958 107032 210729 209334 179992 201052 197651 55240 -170628 -288800
38230 -288800 -210770 -45914 58096 72331 41257 -32966 -174714 -337092 -408778 -333219 -164601
38219 -164601 12436 164619 281279 320521 249118 113399 5924 -35411 -42413 -39140 -13926
38208 -13926 30509 70700 117516 201453 285922 285544 205273 160921 205196 242463 201302 175121
38196 175121 259760 354018 303486 181206 206937 388339 472933 322730 120676 80485 137372
38185 137372 104601 232 -2363 111140 155865 37539 -106608 -118911 -27807 42823 65695
38174 65695 109290 200027 278586 282548 215711 136427 104187 127457 151910 123138 66694 64291
38162 64291 135660 198168 178636 112013 74220 59840 638 -111313 -195680 -189382 -122303 -71572
38150 -71572 -85140 -161733 -259141 -305991 -252754 -135285 -45184 -11615 40951 180281 356238
38139 356238 457378 450725 405748 387569 383350 345717 266458 183494 130928 97318 38377 -58015
38127 -58015 -126439 -86297 31846 77838 -44360 -233473 -298567 -196990 -80620 -89323 -178470
38116 -178470 -200884 -109559 -13269 -34884 -161560 -264350 -258010 -200317 -192554 -209696 -122474
38105 -122474 85365 230891 153752 -55833 -171575 -120097 -16554 52226 110018 151651
38095 151651 104120 -16963 -75471 -19149 32352 -4244 -29218 58279 171597 180249 125465
38084 125465 123917 153164 119802 66142 102074 177246 145029 42107 65713 236789 328342
38073 328342 221012 101970 160623 281642 246408 103110 87952 228568 280771 104207
38063 104207 -115720 -138491 -11338 17866 -140412 -313030 -321853 -199204 -88916 -47398
38053 -47398 -37692 -40386 -48169 5069 168087 331373 313162 119815 -27887 8806 113646
38042 113646 133095 110290 151087 189613 90724 -88789 -157175 -79236 -3393 2393 31991
38031 31991 124667 170348 100815 -164 -55504 -97864 -128389 -43955 172520 336624 282400
38020 282400 88630 -52539 -95197 -121213 -142005 -82909 62126 194420 227347 155037 28360
38009 28360 -67883 -56963 40773 112214 104534 95542 141897 165669 99090 28805 49415 72918
37997 72918 -36764 -213036 -269278 -184970 -97014 -31948 112616 299639 322365 131639 -35003
37986 -35003 12179 140186 116080 -48717 -167033 -182105 -199410 -260844 -283190 -226347 -161704
37975 -161704 -144337 -146419 -150015 -186945 -240646 -219950 -101505 -9403 -63660 -210032 -299363
37964 -299363 -299708 -315622 -396703 -450039 -394829 -296450 -248208 -195448 -15855 249497 402469
37953 402469 360120 272256 284251 314630 202228 -15280 -134132 -65398 68791 122540 74348
37942 74348 -29583 -149896 -230385 -209156 -104743 -8808 38395 78112 119757 110760 57129
37931 57129 50317 113697 148066 109989 110311 216187 278758 123884 -164720 -336908 -316276
37920 -316276 -263106 -292590 -318223 -237393 -114564 -75098 -121106 -163056 -167445 -163848 -143001 -59632
37908 -59632 62169 123579 82153 12748 -12973 -43411 -156314 -283670 -255158 -57384 76818
37897 76818 -43892 -274799 -297188 -54140 170698 157275 31207 18329 94436 79579 -28201
37886 -28201 -53128 49561 116557 50263 -27447 20783 143329 199965 154562 70647 1373
37875 1373 -27692 2262 62144 75143 22085 -23781 -26877 -62177 -172788 -248271 -167276 402
37863 402 69204 -10526 -101452 -78769 26908 99309 63896 -66695 -206012 -250055 -179894
37852 -179894 -94183 -78183 -79025 -2187 112016 141856 95221 102392 172539 138006 -71846 -265378
37840 -265378 -237797 -62795 37203 30929 83831 241743 327302 221041 66446 66139 193268
37829 193268 262693 225147 211615 279303 292645 145848 -31369 -38650 91627 133864 20731
37818 20731 -29839 161944 430878 451792 167717 -151525 -280133 -280232 -309145 -352037 -288153
37807 -288153 -127708 -22884 -65628 -198177 -319266 -375579 -352392 -276090 -226567 -243884 -226910
37796 -226910 -55123 175213 203716 -30940 -246439 -175435 62063 132706 -45287 -233528
37786 -233528 -251421 -183225 -149043 -98827 21760 74039 -102093 -398643 -517554 -331882
37776 -331882 -23184 149878 101310 -71925 -216040 -232868 -154068 -116534 -188826 -242378 -108306
37765 -108306 150891 276360 145811 -83873 -221610 -265189 -283043 -236900 -82475 64514
37755 64514 47181 -99048 -194434 -163483 -82110 -4637 85289 145811 70109 -143307 -347870
37744 -347870 -426390 -395134 -292790 -101001 153278 335851 340433 204272 14778 -207094
37734 -207094 -438202 -556390 -444652 -167241 62774 95757 -33479 -180303 -229179 -173786
37724 -173786 -108115 -127873 -217076 -267077 -227400 -171415 -169175 -173981 -110489 -5611 65690 109418
37712 109418 172577 211465 133250 -32710 -137630 -118987 -87716 -157051 -281961 -338519 -286609
37701 -286609 -175053 -44418 82084 142980 78013 -63509 -138676 -79163 11005 -17407 -162615
37690 -162615 -268328 -216570 -59058 68579 100284 54473 -47038 -182558 -274947 -242339
37680 -242339 -123594 -49872 -51120 -442 173115 323502 266692 53707 -90904 -86057 -83982
37669 -83982 -205816 -345965 -342068 -227375 -172811 -228031 -270781 -224918 -188112 -268234 -390783
37658 -390783 -384297 -219897 -46823 16223 7031 -7287 -65518 -216986 -368455 -362450 -189307
37647 -189307 -1618 80245 63831 -8991 -110627 -155822 -32226 226284 425032 448112
37637 448112 390632 366950 332995 231540 172885 279451 442956 450621 307756 216859 247284
37626 247284 253138 152475 61290 65022 61804 -38174 -127759 -79068 22895 9650 -80414 -39133
37614 -39133 185661 374759 308024 38158 -184362 -201427 -84787 2074 6740 8242 61891
37603 61891 100984 38781 -84852 -147099 -121591 -113210 -185457 -252174 -209597 -98846 -39374
37592 -39374 -44399 -17766 66205 100447 18998 -61666 16005 202839 264738 86809 -155154
37581 -155154 -212738 -75161 58984 74898 54056 86565 132201 132267 124214 154305 186022 188429
37569 188429 209736 261704 240850 84798 -98729 -190034 -230851 -288111 -273831 -104984 68781
37558 68781 45552 -97749 -127096 -50555 -83890 -226850 -224241 -18080 110145 -11207 -171068
37547 -171068 -140050 -23087 -22046 -92054 -87600 -48027 -72334 -76450 54798 209819 212825 131198
37535 131198 154968 267477 304542 256248 231614 194792 35074 -141769 -104129 121452 257901
37524 257901 198813 129213 172042 207777 142148 80065 100091 91449 -35831 -176798 -212306
37513 -212306 -185662 -158135 -62740 137543 297069 269845 136210 84077 145265 195925 156401
37502 156401 62897 -14041 -26203 30084 83190 44230 -57799 -95336 -37561 8181 6104
37491 6104 68430 220366 279641 134020 -32161 2023 145678 151456 22658 -10204 112018
37480 112018 180566 61694 -105270 -140636 -68679 -28469 -77822 -175551 -251991 -230122 -80089
37469 -80089 90037 108134 -31983 -123965 -13656 187897 255358 140829 7872 10158 131351
37458 131351 242605 255652 201985 173530 186927 140958 -34639 -222629 -227054 -50907 72892
37447 72892 -7135 -152661 -150789 -22659 44575 4302 -7979 60301 71161 -70704 -236615
37436 -236615 -251747 -150786 -109166 -171801 -208746 -144618 -78709 -114625 -193511 -200472 -153588
37425 -153588 -155275 -194008 -144082 20357 154588 149386 83626 75003 86802 19948 -78574 -70259
37413 -70259 38132 93473 50222 39622 118565 132004 -46365 -282071 -354776 -265837 -189836
37402 -189836 -185685 -161585 -110345 -158731 -327609 -434274 -338298 -144586 -45659 -68838 -102666
37391 -102666 -92661 -76482 -66717 -24264 57834 134419 166737 136229 28544 -121639 -204568
37380 -204568 -145968 -20197 43897 48863 102941 210386 229017 90719 -58184 -36724 119982
37369 119982 198502 79589 -114666 -168486 -21024 165923 185990 15970 -160899 -170530
37359 -170530 -49046 19610 -56322 -173680 -186157 -89818 -8816 -29552 -103158 -123561 -77415
37348 -77415 -76475 -207528 -377484 -395273 -229091 -69190 -54705 -55244 124236 405226 514603
37337 514603 387649 258097 283869 308405 131639 -160302 -319074 -273858 -159248 -71427
37327 -71427 14553 101122 111626 7609 -150358 -283878 -358671 -362993 -301620 -210122 -111101
37316 -111101 20586 175861 235729 87354 -196072 -400865 -407020 -285519 -162240 -89418
37306 -89418 -68642 -93035 -118188 -69123 71653 228939 314995 302743 213098 89642 -3798
37295 -3798 -28047 -30735 -97441 -217986 -273871 -197936 -77013 -34397 -62015 -51472 24536 53048
37283 53048 -59092 -230348 -291595 -214795 -152829 -206581 -258309 -151788 39336 100420 12852
37272 12852 -13125 105905 168691 21384 -163618 -150210 -19715 -30393 -192207 -266403 -163080
37261 -163080 -56228 -66188 -87214 -14013 83459 117350 123122 129087 56050 -123593 -270220
37250 -270220 -254583 -137629 -55366 -34286 -35733 -69949 -135508 -145452 -52031 38461 12317 -66865
37238 -66865 -62271 16879 54775 33706 31982 48191 5659 -65893 -35708 96568 146996 16367
37226 16367 -131063 -95628 45036 27762 -203239 -372534 -225128 120741 313776 215004
37216 215004 39625 28387 143236 198752 169048 188801 296000 357331 274718 120465 16170
37205 16170 -10600 1938 22532 15813 -60325 -193594 -314159 -380604 -405988 -396214 -353940 -342663
37193 -342663 -423513 -511994 -441307 -209491 -11993 33247 30126 83888 109416 2145 -146789
37182 -146789 -185635 -147501 -167174 -218204 -137427 98176 304328 335035 254927 213428 245861
37171 245861 258274 157802 -42405 -229915 -295714 -234323 -123262 -13024 101475 198954
37161 198954 218904 167473 137329 166305 171265 82999 -52782 -171146 -267632 -307936 -199396
37150 -199396 31094 164780 46900 -189372 -303780 -252193 -151498 -50017 73497 163697
37140 163697 152049 117996 184532 291386 279007 170730 150421 259901 340281 299835 225248
37129 225248 179025 95166 -46165 -125304 -61838 60853 139041 186536 244809 274448 226498
37118 226498 132024 46508 -24166 -94946 -166411 -242209 -313035 -328584 -271074 -227421 -272380
37107 -272380 -321409 -252680 -132449 -121064 -181045 -123740 38147 63411 -115751 -247793 -153812
37096 -153812 2417 21342 -5820 80032 167040 55589 -153231 -170285 29833 165491
37086 165491 67654 -117658 -199396 -188496 -183233 -185502 -152624 -121439 -162183 -258063 -319415 -307317
37074 -307317 -288863 -351267 -472408 -511777 -376041 -175438 -125640 -273260 -423266 -393189
37064 -393189 -231356 -98691 -40382 3255 38722 14654 -60450 -117037 -121270 -83571 -12189
37053 -12189 53944 30622 -86461 -157240 -90309 -20190 -119647 -299030 -306226 -105809 75822
37042 75822 112360 141051 272703 365998 253903 32257 -67737 -1692 71770 47552 -18028
37031 -18028 -47561 -51530 -69915 -95808 -86863 -5831 150145 321230 408380 374583 295184 254387
37019 254387 231645 164745 84935 79472 124786 78922 -113076 -300188 -287902 -73295 149301
37008 149301 197539 65836 -107757 -194695 -185422 -161022 -169464 -160676 -78190 19573 17864 -68998
36996 -68998 -84041 40864 149974 73266 -109525 -166958 -43118 83934 83714 37915 59436
36985 59436 108389 101308 80112 132014 217372 218091 121624 37811 49600 137883 232013 260381
36973 260381 188843 77267 38562 73449 43911 -91565 -151394 -5136 158432 79618 -144105
36962 -144105 -176390 32453 166740 49745 -104947 -83518 -5460 -57448 -148972 -90674 71034
36951 71034 164237 197161 285109 371569 293757 77318 -78862 -86085 -22095 57382 148305
36940 148305 179762 93696 11059 79297 185332 95083 -129159 -170779 27811 134844 -47883
36929 -47883 -253245 -164126 100637 196430 68937 -42868 -23791 -6892 -94595 -202766 -218461
36918 -218461 -132858 14121 173813 253279 180255 31454 -27597 40590 98899 30910 -122420
36907 -122420 -249644 -296531 -277164 -238973 -234628 -253535 -189010 25317 258625 299364 140175
36896 140175 -11647 -46374 -88235 -226833 -308679 -175073 38099 68642 -79318 -156237
36886 -156237 -65426 12409 -53949 -134535 -76151 43078 65943 23072 55745 156458 183685
36875 183685 102197 23422 2110 -38333 -143531 -235947 -235725 -156904 -39318 101416 212212
36864 212212 214449 139392 129844 229181 290961 197960 50269 4509 33166 9053 -50262 -21415
36852 -21415 69513 42228 -148626 -302111 -229866 10644 228203 327550 330300 264141 150845
36841 150845 54437 34509 66634 76147 27663 -67927 -189253 -287846 -293782 -219292 -199053 -316772
36829 -316772 -435983 -350999 -102612 29979 -84426 -216681 -87617 228440 401561 302345
36819 302345 145127 135384 182679 99456 -66027 -97732 45101 166744 146843 126488 283098
36808 283098 547048 673264 536518 244185 -15841 -145139 -165873 -162037 -192465 -218114
36798 -218114 -141251 38221 162953 100654 -60364 -113781 -13217 83058 55701 -24568 -38165
36787 -38165 14285 62074 85480 94448 59468 -38835 -139886 -170918 -143005 -97987 -10762 150025
36775 150025 298128 291952 127822 -36032 -71029 -3319 73569 116129 123630 102207 88647
36764 88647 137399 231023 270926 209764 120722 73965 27168 -71999 -153925 -124261 -43553 -61173
36752 -61173 -181723 -255633 -229878 -242430 -381655 -496098 -389820 -127471 21938 -61815
36742 -61815 -201801 -175910 -2243 121170 102378 58339 110335 185461 125921 -46498 -120074
36731 -120074 11536 182252 188263 72783 16027 31151 -9568 -83400 -22867 145244 155150
36720 155150 -73441 -237007 -78853 214151 303564 196960 148821 206405 201243 118574 112196
36709 112196 162271 79333 -110962 -143000 43714 180251 112942 32286 90965 130176 14219
36698 14219 -72942 49334 199231 116160 -101372 -173960 -93743 -54524 -58890 36376 156690
36687 156690 71986 -179755 -287085 -134363 37996 21128 -94222 -135046 -85864 -1073
36677 -1073 114773 231415 269396 233460 208080 171110 5042 -245929 -344450 -183543 52254
36666 52254 153847 129324 72256 -10835 -97996 -62734 134939 312434 297125 173458 120524
36655 120524 115861 4607 -208093 -344778 -318593 -226307 -166973 -124677 -70323 -53634 -126977
36644 -126977 -247193 -313792 -283125 -212693 -189434 -220484 -217151 -113465 26580 77777 12174
36633 12174 -85521 -146911 -167268 -127096 8434 175560 217876 75037 -121786 -205755 -151325
36622 -151325 -43978 46448 97394 97663 39773 -77336 -246140 -408547 -445899 -301318 -89411
36611 -89411 26340 41133 63546 99101 57211 -40289 -70801 -52884 -148592 -368308 -503595
36600 -503595 -435516 -282740 -155935 -15651 113780 70402 -135784 -216843 -29022 160822
36590 160822 88426 -80189 -47404 108935 96889 -73556 -129025 -7504 87852 81063 103738
36579 103738 171042 125159 -41932 -118027 751 174754 275441 320686 299017 121264
36569 121264 -167286 -359904 -359610 -273435 -183519 -50685 96253 119022 3957 -87499 -84379
36558 -84379 -95589 -154760 -125646 27118 119211 36965 -80342 -95367 -89420 -159858 -208019
36547 -208019 -114753 46613 150474 210837 263330 219395 23768 -183403 -238721 -160723 -31246
36536 -31246 165624 407516 509583 363319 164775 166917 308842 329599 166505 -6097
36526 -6097 -82600 -127764 -187898 -218457 -212121 -222812 -251321 -248969 -223947 -213941 -186103 -98332
36514 -98332 -14550 -16325 -50002 -12502 61933 58421 -24462 -96998 -141935 -189755 -187726 -73963
36502 -73963 70263 128343 150069 242370 324184 234511 42316 -27504 26604 -27237 -240773
36491 -240773 -361590 -228071 -19640 32543 -40435 -79014 -51971 -14505 33459 87651 68203
36480 68203 -48523 -144459 -131926 -88296 -97493 -92617 4859 120236 153131 149588 185553 194222
36468 194222 90261 -32299 -22620 79367 116550 78089 78312 106252 24702 -165297 -274526
36457 -274526 -195433 -38818 65616 133799 205448 218881 131007 38942 40805 59028 -50115
36446 -50115 -256927 -377070 -326502 -221431 -188727 -192857 -125674 10185 108447 123100 124331
36435 124331 171048 213227 180022 108514 98737 155543 167412 68765 -56305 -90531 -47774
36424 -47774 -39314 -96625 -119899 -29819 104204 153079 110811 105989 215427 338800 319313
36413 319313 153659 3851 -3312 84351 131843 77490 -40548 -161991 -243188 -252874 -198162
36402 -198162 -140333 -129556 -140194 -121394 -84763 -77056 -87517 -56417 32238 133144 204633
36391 204633 226361 172325 45888 -72161 -95332 -41119 13840 61980 138492 190701 119097
36380 119097 -40990 -131400 -101137 -72469 -124606 -173045 -146621 -119979 -148200 -120565 59494
36369 59494 263619 288542 144233 17853 4558 53839 146599 322098 512030 541278 366146
36358 366146 167993 123019 183205 175171 43331 -98007 -125790 -50379 10101 -27031 -103343
36347 -103343 -80109 78576 230425 221004 87037 5377 51739 113603 67586 -52424 -124150
36336 -124150 -111502 -93784 -135833 -194082 -181006 -97736 -51648 -113584 -199857 -172350 -45000
36325 -45000 18522 -51657 -112915 -26081 116676 118983 -31203 -161189 -175538 -147960 -135083
36314 -135083 -69494 88730 227174 212914 74909 -36139 -27123 66753 154878 172128 108462
36303 108462 13241 -31517 20821 125567 166252 50306 -183023 -351940 -287391 -26593
36293 -26593 212443 287328 270840 266033 209741 14207 -195509 -212448 -91887 -116198 -365791
36282 -365791 -566290 -480519 -240333 -116790 -130761 -111915 -39183 -71334 -246724 -372731
36272 -372731 -282892 -62619 62190 -16780 -200899 -301086 -204742 34500 245079 298891
36262 298891 231154 172670 173109 147652 18286 -144378 -180865 -48130 87133 17434 -247730
36251 -247730 -466265 -447891 -282897 -201243 -261275 -312042 -248828 -144394 -85043 -33893 53526
36240 53526 112451 88182 65206 135602 215155 147079 -48756 -181962 -139433 8160 151552
36229 151552 260128 324584 304433 194764 70236 10576 24611 62508 51143 -76608 -304478
36218 -304478 -477985 -429690 -196525 -14530 -38902 -161726 -190282 -120028 -102829 -185030 -230504
36207 -230504 -135515 10369 60361 18976 5297 55696 92894 93200 147952 297152 412317
36196 412317 345725 128805 -79111 -181860 -172923 -32919 231475 454958 408827 93915
36186 93915 -210037 -271273 -156273 -65874 -55373 -48527 -26465 -42415 -96712 -140623 -182074
36175 -182074 -262922 -344442 -332938 -221847 -108821 -63566 -59351 -37804 27879 128449 216400
36164 216400 227028 158319 92437 75971 40595 -69078 -161978 -124422 -25177 -43370 -210896
36153 -210896 -377941 -431796 -400494 -336111 -255550 -216239 -282717 -380212 -354027 -227651 -211563
36142 -211563 -364740 -447498 -264141 19551 104116 -19790 -109453 -68385 -48140 -131725 -162549
36131 -162549 -3830 206884 222481 16834 -200646 -265019 -210937 -143108 -85329 -20220 16255
36120 16255 -21577 -91300 -104974 -62892 -55199 -116254 -164416 -121846 -16544 79859 139524 148801
36108 148801 74735 -58056 -130761 -69776 35846 59644 19930 14417 32266 -10826 -83212
36097 -83212 -66981 14540 -9311 -180147 -305850 -226316 -37896 58620 17202 -62608 -108726
36086 -108726 -117640 -88365 -29004 11960 8192 7382 52903 114172 165253 253674 394078 465850
36074 465850 339259 64651 -176773 -281897 -279311 -209081 -82631 35011 37660 -74678
36064 -74678 -152354 -67513 117635 211833 108601 -101362 -234729 -203349 -68910 78300
36054 78300 225832 374856 441438 342879 163465 92335 172480 253683 237212 203255 214682
36043 214682 177246 39907 -35074 89855 244445 156139 -127227 -290074 -215693 -119309
36033 -119309 -156163 -172900 5233 258226 341249 237080 140926 163417 225085 220278 141556
36022 141556 43822 -6400 47577 186934 284026 229109 84109 15337 72530 136146 104940
36011 104940 33109 24482 64942 38313 -116408 -323982 -452242 -446174 -378227 -363845 -418909
36000 -418909 -426618 -290418 -94459 -21396 -97420 -133522 9123 202397 226195 87995 -2419
35989 -2419 38878 60787 -48632 -161320 -105281 72693 191917 195625 163760 128106 47986
35978 47986 -47892 -61598 16174 87491 104516 115429 136926 116940 52492 12425 12513 866
35966 866 -9405 49951 125532 61112 -134783 -233060 -106913 74150 112177 61103 62181 68360
35954 68360 -39885 -186069 -195147 -90344 -50548 -109001 -129240 -66473 -21664 -27055 -2297
35943 -2297 49606 23301 -69256 -81064 1947 -4009 -177595 -332852 -298785 -177330 -155910
35932 -155910 -205816 -159788 -6785 81980 5964 -131758 -167026 -68453 32008 -21509 -224218
35921 -224218 -374691 -293533 -73631 9029 -131168 -253881 -126996 136578 227985 53286
35911 53286 -169287 -210907 -91633 -3330 -60871 -186360 -225866 -152002 -105623 -193257 -300088
35900 -300088 -229997 -16048 91186 1259 -54332 118180 334609 281186 -1260 -149346
35890 -149346 15765 264542 305109 143543 -11462 -46543 -9021 31253 53181 56597 57728
35879 57728 89154 141001 137148 34112 -91433 -126395 -69951 -22610 -36260 -59594 -50696 -60002
35867 -60002 -144115 -253509 -285209 -224520 -149352 -93750 -8337 104255 123670 -18608 -178392
35856 -178392 -143106 89956 319004 416990 446464 464378 395839 207525 49438 62036 144825
35845 144825 98151 -61819 -121636 5496 161596 185784 105460 14772 -86899 -217161
35835 -217161 -274365 -128787 169262 387627 345429 90348 -174324 -294204 -268256 -182745
35825 -182745 -102746 -58611 -92944 -230064 -379405 -366726 -141486 112589 177490 67230
35815 67230 -28621 -37566 -74880 -196372 -262587 -154892 16128 69698 29072 59630 173079
35804 173079 187886 19036 -163557 -159980 -6628 97846 61416 -30403 -81320 -94382 -99654
35793 -99654 -82638 -38580 -20172 -61199 -101162 -60246 37352 90907 65980 33307 52442 88367
35781 88367 78188 25551 -14138 -2837 66354 186252 315937 371890 300405 158759 77316
35770 77316 127183 248356 314567 256843 126969 47287 86669 182851 209995 124145 3350
35759 3350 -61358 -57012 -11319 61240 127345 122003 41137 -15725 16087 43726 -54375 -220729
35747 -220729 -279068 -190548 -98093 -91169 -83001 7478 91394 44409 -84471 -128792 -33289 85144
35735 85144 104602 44951 26674 120608 253878 269701 103340 -114211 -185259 -75760 62361
35724 62361 107305 98997 117692 153808 177312 222353 292991 283737 129403 -41803 -54703 67860
35712 67860 163776 191550 248599 341202 338202 200644 77632 91430 171875 192367 141215
35701 141215 61483 -57655 -209592 -285158 -192036 -6476 107037 89666 8853 -68487 -120952
35690 -120952 -123748 -59921 27177 74079 81562 92837 108319 93026 49674 13484 -8839 -27228
35678 -27228 -17100 44621 108258 96923 22985 -12055 57559 190277 292761 305630 243744
35667 243744 187549 212248 293038 322200 256068 176669 150750 119120 24587 -42834 24529
35656 24529 140322 116785 -54780 -197187 -225902 -243930 -312648 -314371 -143862 100303 229861
35645 229861 188444 74765 14910 74446 227647 360899 368235 270787 172700 107714 45486
35634 45486 36088 169663 359946 371961 153467 -54806 -56274 45928 75900 69818 132588
35623 132588 179788 71227 -111672 -177675 -138048 -149906 -201761 -132998 40697 101537 -26044
35612 -26044 -160192 -164033 -126995 -146100 -151003 -84524 -64191 -191838 -342467 -321822 -144229
35601 -144229 10252 53693 50314 54740 42056 6594 5699 63686 111284 69808 -44791 -144823
35589 -144823 -181144 -186217 -194500 -167844 -63552 42409 2726 -195886 -377121 -393643 -301324
35578 -301324 -223082 -152136 -35136 46770 -23383 -165617 -178011 -40296 58447 10705 -92294
35567 -92294 -165475 -241207 -316308 -297735 -188605 -128755 -146188 -69426 179329 397749 378769
35556 378769 208048 102923 97533 87968 69916 108677 149227 76684 -69587 -137081 -92856
35545 -92856 -37792 -9003 52869 141875 164220 94414 5033 -73618 -179679 -289932 -311713
35534 -311713 -238968 -180809 -189722 -186648 -114146 -51204 -97447 -218508 -281156 -204991 -36177
35523 -36177 101580 110887 5650 -101857 -120999 -67009 4826 91038 192354 231759 136630
35512 136630 -19755 -84408 -38894 -25637 -131573 -262674 -291955 -236731 -204667 -215162 -161845
35501 -161845 39416 307028 432530 288661 -7111 -193869 -157968 -49961 -56017 -146388
35491 -146388 -169512 -125503 -168971 -336016 -447094 -356593 -164200 -67415 -87807 -71249 64193
35480 64193 202190 192637 68383 10750 98190 179431 71936 -168504 -303476 -237577 -136894
35469 -136894 -160181 -225359 -173848 -49674 -37989 -177890 -307821 -291063 -158345 -24704
35459 -24704 23137 -34585 -125320 -126838 -30201 8000 -98822 -179177 -42809 179884 196039
35448 196039 7816 -90677 3511 53089 -81796 -187500 -72340 90652 59748 -60720
35438 -60720 -8861 180347 235619 95177 -24609 -5410 17671 -67890 -168977 -177056 -148513
35427 -148513 -180361 -243059 -243476 -159106 -29482 103821 185687 157841 43524 -46654 -43653
35416 -43653 10348 53639 80678 88767 57523 47014 194829 496936 689308 515935 81024
35405 81024 -234779 -220105 -31689 95454 163351 329686 663726 1151219 1826446 2655357
35395 2655357 3308925 3335002 2680271 1844546 1351548 1209828 1079764 834564 674623 709985
35385 709985 732990 530209 216776 87669 237439 477482 582157 497072 327318 219514
35375 219514 256735 400820 523086 517566 382755 197223 55936 30914 126431 246707
35365 246707 269428 180324 77025 24048 -11290 -47552 -18003 117000 266983 305713 217675
35354 217675 85923 -9339 -19785 72445 206993 258796 183392 93873 110259 190376 203720
35343 203720 120672 25046 -21909 -27376 -7706 20781 22807 6267 57684 209222 322021
35332 322021 241018 37839 -55255 44860 184274 219786 196905 216830 263057 255581 184456
35321 184456 98265 25810 -13436 20769 132152 242404 270828 229392 185399 163372 140263
35310 140263 114171 122221 192645 308011 410054 433472 361643 258404 209583 221907 220975
35299 220975 160678 81667 38711 25605 6201 -31389 -89750 -178346 -267306 -278126 -184438
35288 -184438 -79367 -65431 -106719 -82844 15958 54039 -52252 -199741 -244037 -214600 -261995
35277 -261995 -399320 -439673 -266136 -50181 -55271 -264043 -372545 -191898 103998 229351
35267 229351 155376 81417 118197 177717 163204 96476 20125 -80774 -191978 -220108 -114137
35256 -114137 38441 108887 62274 -57737 -208528 -347619 -417403 -408566 -394839 -436772 -491212
35245 -491212 -478747 -396909 -298930 -203214 -100521 -18232 2377 -24420 -48701 -54647 -50357 -19148
35233 -19148 46665 90487 49328 -51689 -139426 -203161 -275088 -320150 -255664 -91514 49761
35222 49761 77790 16604 -71434 -149599 -172244 -89429 67789 193063 240071 267284 306994
35211 306994 294376 195819 106371 120769 182957 170310 74814 -1754 6773 83824 187854
35200 187854 263587 238689 113326 16005 60775 184228 243514 235642 266877 324561 266650
35189 266650 74049 -68019 -23275 110592 169846 147416 129268 114565 36219 -101328 -223279
35178 -223279 -279800 -251023 -121555 51080 117011 9567 -117883 -71930 103792 185922
35168 185922 91841 -19738 7530 132557 219154 211421 138869 38017 -63359 -144921 -219911
35157 -219911 -304599 -342421 -244790 -44389 85134 27168 -129406 -205565 -141403 -26724 32321
35146 32321 10961 -45019 -72443 -39123 32959 97565 134623 145481 116455 42895 -20814 -5882
35134 -5882 76222 153472 196876 217019 176696 34438 -121656 -136880 -23269 32685 -40672
35123 -40672 -79302 42798 194673 195972 90988 30643 10152 -58876 -113204 -24701 122809
35112 122809 100680 -110766 -273347 -237102 -115520 -54126 -37641 -19185 -43712 -119525 -133040
35101 -133040 -30157 50992 -32104 -214351 -330068 -333095 -281234 -200694 -113222 -114961 -261409
35090 -261409 -419361 -393838 -187479 4271 48034 -5560 -51990 -57879 -38389 -17025 -33132
35079 -33132 -106034 -178781 -174416 -109862 -72362 -84996 -85981 -45162 -6206 -47 -8604 -31172 -93032
35066 -93032 -164144 -163302 -78889 -2882 -12115 -95642 -222226 -377117 -489898 -440866 -221886
35055 -221886 -4020 48343 -31327 -93418 -87434 -94331 -174284 -280986 -331558 -299307 -233774
35044 -233774 -220824 -301201 -403042 -401130 -275466 -143139 -84455 -30964 83060 156451 60898
35033 60898 -110185 -118915 80730 263082 246172 125863 92602 147262 147388 60498 1127
35022 1127 17417 -3738 -150371 -305309 -260456 13072 304827 399757 302004 174172 115614
35011 115614 96098 83785 107650 151986 111784 -52749 -203929 -183381 -25363 105058 145154
35000 145154 172472 226030 232286 137236 3169 -60878 6501 190406 381684 414718 238884
34989 238884 28791 -12115 67846 51690 -102696 -217146 -209096 -204845 -264345 -250478 -101172
34978 -101172 17731 3555 18590 183138 302400 184865 33509 166595 473913 539843
34968 539843 270871 13704 10246 103121 90431 39604 75688 124843 73462 -7586 9818
34957 9818 97577 146748 140717 116669 63540 -20404 -76559 -100397 -185281 -339042 -392993 -238682
34945 -238682 -35540 -14747 -162671 -270111 -239177 -172809 -180623 -243000 -276247 -228811 -105140
34934 -105140 39154 137025 185785 238011 283024 228137 64899 -52449 -3673 110685 108435
34923 108435 -16281 -115265 -120406 -103651 -112697 -90342 11503 140258 206529 180795 103050
34912 103050 33503 3010 -3453 -4365 26882 113232 185432 142591 20907 -22274 56856 108634
34900 108634 29601 -59730 145 169289 296944 336509 315202 197736 -28805 -211279
34890 -211279 -177770 7613 124035 96875 35252 -3619 -79620 -194389 -251224 -221969 -179760
34879 -179760 -139623 -42600 70927 58977 -94412 -222740 -218019 -169177 -186658 -245732 -292787
34868 -292787 -359023 -457714 -488770 -363978 -144606 42722 158519 239756 298814 300685 200538
34857 200538 -16526 -273455 -397053 -291675 -107040 -77186 -184631 -180730 15061 167907
34847 167907 92188 -64159 -78627 -2654 -21307 -109093 -90935 30654 78735 15457 -1233
34836 -1233 93593 155603 76837 -46320 -89751 -86335 -115745 -136266 -66765 40759 53543 -42011
34824 -42011 -113214 -61340 66221 169241 218586 235512 208524 116207 17782 23325 134992
34813 134992 199398 95355 -87758 -161910 -98900 -49995 -102567 -157540 -101541 25210 115776
34802 115776 146422 142609 85476 -35588 -147091 -182817 -191674 -239251 -266688 -187204 -70213
34791 -70213 -61888 -143106 -144894 -17350 96307 95708 54072 38809 -23896 -188663 -344357 -374813
34779 -374813 -350386 -396401 -459156 -385042 -181994 -13736 50795 94283 145218 112099 -15552
34768 -15552 -83041 4986 120688 100981 -15459 -77910 -55514 -21147 29753 165027 341517
34757 341517 424567 407171 450339 645032 858453 888693 682009 342911 21143 -155083
34747 -155083 -132437 -1322 59364 -19049 -111882 -79373 43172 108958 48568 -87364 -218910
34736 -218910 -285250 -248093 -129928 -15072 49942 104205 158132 114177 -92888 -341107 -432121
34725 -432121 -324004 -145185 -15199 33105 -5655 -108822 -183885 -159846 -109615 -152305 -251630
34714 -251630 -261864 -169055 -114748 -152792 -158874 -47719 77867 88417 14601 -23389 21443
34703 21443 110982 185897 175316 37141 -143500 -195260 -75062 57003 56674 -17039 -33690
34692 -33690 -7478 -45938 -143787 -167014 -33471 184031 331675 301015 114184 -75989 -127062
34681 -127062 -87645 -151122 -372201 -544015 -464419 -224516 -89950 -159272 -288305 -315674
34671 -315674 -216706 -51082 99423 138892 34823 -96571 -97534 23258 98117 30039 -95805
34660 -95805 -153162 -118418 -39691 36854 69031 35995 -8402 16485 87433 90072 -3204 -79358
34648 -79358 -65041 -42173 -91701 -129547 -29235 159727 261046 212953 121086 69181 17834
34637 17834 -65143 -97599 6621 191733 312695 301450 213179 132672 102054 129340 199767
34626 199767 265219 270204 207961 123931 57048 5277 -46820 -96455 -127201 -124128 -84203 -31811
34614 -31811 -10738 -27333 -18625 72808 203109 268406 240323 190778 175788 173551 154483 126480
34602 126480 84564 11047 -38949 34341 202139 286310 203219 102944 138688 217362 150510
34591 150510 -38643 -162703 -171957 -187772 -245846 -237149 -143155 -108567 -198012 -275573 -232270
34580 -232270 -157397 -154099 -141754 -5069 174190 212901 94836 -18703 -25274 8546 -20138
34569 -20138 -110685 -173328 -125037 34944 209264 273739 191374 35674 -106484 -206785 -261704
34558 -261704 -259810 -212276 -148258 -56886 84645 205006 175453 6665 -109285 -40113 104754
34547 104754 135051 36331 -48683 -31627 46507 114251 137381 105188 31255 -40270 -74450
34536 -74450 -65289 -1614 110616 170993 54399 -178084 -280784 -147351 8307 -45436 -199946
34525 -199946 -168829 59181 179713 5374 -283198 -401804 -311599 -190825 -165225 -191068
34515 -191068 -173149 -105325 -70123 -124195 -212540 -227400 -149791 -75666 -81393 -136393 -189588 -252489
34503 -252489 -323380 -319151 -189465 -33069 11672 -59971 -159867 -253781 -338925 -340069 -192955
34492 -192955 -3871 42664 -61141 -140274 -101185 -45486 -81416 -169696 -220814 -222708 -196767
34481 -196767 -123150 13828 171948 298708 376700 387716 303499 157902 63090 95299 199238
34470 199238 247244 172726 25066 -89064 -111841 -91476 -115977 -185023 -207071 -152924 -120131
34459 -120131 -169218 -196401 -97240 24962 -14643 -189962 -288554 -228304 -151973 -163395 -164231
34448 -164231 -49453 93451 109451 -1838 -108501 -124872 -69763 2688 47639 44360 28862
34437 28862 70202 165340 210884 133723 -1843 -73764 -42265 43666 131420 191672 193208 117826
34425 117826 -4127 -111119 -158929 -139150 -75271 -16699 -5849 -30693 -35176 10027 73262
34414 73262 103647 74536 -16554 -147931 -260466 -283331 -196224 -52204 63076 85817 13883
34403 13883 -77718 -89575 -6792 71310 50359 -47162 -136138 -185372 -213240 -216247 -187234 -168773
34391 -168773 -201535 -250334 -261699 -248757 -228624 -141713 39929 185646 151999 22546 18920
34380 18920 175234 294391 258867 187127 208541 264297 240909 156579 92628 48434 -16239
34369 -16239 -74635 -77290 -47768 -47410 -84825 -119096 -113013 -51729 38244 77707 18300 -62830
34357 -62830 -55157 3251 -22119 -117759 -113940 21021 79464 -72307 -260628 -255056 -115129
34346 -115129 -87996 -241526 -400816 -423343 -357452 -310727 -301788 -286152 -242745 -195536 -186716
34335 -186716 -233858 -295125 -302770 -247838 -186677 -151223 -120666 -94395 -97743 -90494 11505 174984
34323 174984 237899 130395 -20453 -86813 -101146 -123290 -105303 -30134 -32187 -194302 -348691
34312 -348691 -292906 -114765 -74795 -219006 -341328 -314295 -231326 -204492 -226194 -264075 -309549
34301 -309549 -301222 -178842 -40435 -53266 -168896 -138331 113173 339448 320602 163933
34291 163933 102567 156453 180988 135326 99596 91127 56388 14633 30725 55528 -30240 -196986
34279 -196986 -265521 -176318 -94376 -152586 -233772 -147340 73779 220181 209035 161408 158737
34268 158737 103070 -83132 -257600 -216953 3764 151657 79112 -93032 -173325 -141299
34258 -141299 -121608 -198535 -331077 -406193 -328740 -111080 89355 95923 -69822 -178851 -78465
34247 -78465 100024 125886 -11006 -110001 -59827 27976 6412 -121524 -250803 -296103 -212361
34236 -212361 427 237700 323601 199357 23203 -11283 82553 123069 20107 -117436
34226 -117436 -152991 -93771 -30404 11227 61821 95226 40412 -80934 -137131 -62830 31629
34215 31629 10378 -89987 -121539 -54792 -18214 -88960 -166838 -121893 20419 121422 100638
34204 100638 -8091 -127627 -190117 -149889 -20383 109650 152203 105971 32277 -24670 -49438
34193 -49438 -28571 22069 34412 -31434 -103205 -74455 39888 110623 67515 -12782 -13766 94062
34181 94062 255175 387837 411177 288089 93330 -20280 14749 94945 84637 -5543 -61555
34170 -61555 -55741 -81499 -181426 -251490 -186369 -47687 4664 -83267 -215380 -297325 -336927
34159 -336927 -370088 -377469 -335905 -291960 -305928 -346016 -311191 -166135 -3759 45745 -52245
34148 -52245 -202460 -270646 -212138 -108736 -64438 -81029 -78336 -22214 40144 74286 93647
34137 93647 75540 -46493 -247627 -382025 -375129 -336537 -372246 -397901 -286713 -104515 -15342
34126 -15342 -22464 -2678 49076 27873 -49045 -50862 15760 2304 -100556 -126339 -40510 -24203
34114 -24203 -148338 -230230 -163367 -126413 -260165 -380138 -272573 -79356 -86500 -266940 -349941
34103 -349941 -258282 -151098 -71346 109405 361474 435144 236002 4517 -12028 135191
34093 135191 247347 254803 202256 105752 -19745 -87216 -30716 87596 162026 174550 163643
34082 163643 134421 80910 31240 -2445 -49507 -92388 -45967 88394 148388 13128 -196966
34071 -196966 -263184 -159385 -49872 -28876 -31695 -12812 -34923 -118664 -159212 -96205 -46995
34060 -46995 -139571 -290211 -294112 -112068 68579 73338 -66439 -190979 -199990 -125915 -77780
34049 -77780 -140881 -288226 -381062 -305328 -106726 64169 122156 84597 -28227 -200054 -330859
34038 -330859 -303279 -173175 -127421 -194304 -185772 -23830 89124 -11981 -169590 -157017 -43597
34027 -43597 -38138 -106131 -56681 75938 81235 -26290 -11287 147764 184048 -8572 -186736
34016 -186736 -150394 -20930 27017 25584 32427 -33462 -171579 -173523 52658 261421 216321
34005 216321 46989 3232 52556 10418 -97284 -113945 -71862 -118939 -205856 -146286 56861
33994 56861 218079 265714 279727 275259 202472 127147 156856 213464 131637 -41047 -105085
33983 -105085 -54188 -81498 -230362 -321409 -271061 -209740 -213191 -176858 -56709 1692 -99309
33972 -99309 -234030 -239249 -122622 17180 139136 233424 265591 231294 177856 127410 64801
33961 64801 4356 -40072 -128791 -299860 -432742 -385407 -244366 -235748 -392215 -520048 -499618
33950 -499618 -392716 -245962 -42566 122757 97534 -42027 -44600 94648 74766 -217953
33940 -217953 -471354 -396281 -133588 18462 34415 56458 72075 -7800 -99874 -69164 6481
33929 6481 -37491 -150425 -158060 -84566 -104012 -204765 -184803 55 142383 98580 -19875
33918 -19875 -55143 -25230 -36153 -101190 -150781 -147726 -119669 -123322 -209834 -372786 -507390 -477501
33906 -477501 -254866 37789 234105 257326 163030 78714 82615 117896 54793 -142168 -352550
33895 -352550 -429446 -339030 -151435 32177 110036 32730 -107579 -126151 34365 206950
33885 206950 210144 82416 3920 44305 107348 96843 23931 -49118 -85168 -87500 -97438 -166434
33873 -166434 -282820 -353889 -312851 -208753 -132069 -88743 -17741 91436 169069 149609 43973
33862 43973 -64973 -84429 -2938 71625 23427 -109686 -166580 -78970 41712 75548 39325
33851 39325 -5497 -67825 -147388 -149399 -11970 156204 200245 130135 84746 132373 227756
33840 227756 320835 378815 338031 170341 -24741 -124482 -156571 -229243 -308629 -235871 10432
33829 10432 237120 289325 240885 240457 281194 244693 110482 -5301 -12215 54408 119412 176262
33817 176262 252147 304146 234375 32739 -162706 -213166 -147984 -101586 -103599 -47563 112596
33806 112596 262157 287575 228373 172897 96359 -71409 -272469 -350390 -245753 -61854
33796 -61854 58920 42544 -109713 -321288 -452456 -412599 -276680 -211961 -277413 -368688 -371003
33785 -371003 -290607 -214896 -207753 -266461 -328500 -307636 -179318 -42909 -37669 -173779 -303690
33774 -303690 -292843 -169430 -64929 -46933 -67485 -65224 -58998 -107697 -202212 -247749 -173872
33763 -173872 -27760 83236 122789 145090 186707 202447 130507 -25818 -200928 -310618
33753 -310618 -290468 -153595 -20376 -11924 -88725 -84314 57366 178418 118456 -58022 -152180
33742 -152180 -91096 19190 73303 81274 93417 104820 71429 -25212 -150537 -235573 -234850 -186704
33730 -186704 -181146 -231370 -224479 -65174 163607 265299 157365 -29645 -100102 -2427 131212
33719 131212 141809 22051 -85357 -76065 -15612 -19005 -56765 -13416 76210 29180 -188487
33708 -188487 -347031 -259405 -52787 30221 -18035 -21404 53619 57748 -54686 -123131 -33904
33697 -33904 95812 86309 -65620 -208629 -222734 -111021 33469 91018 -2888 -180608 -280805
33686 -280805 -207339 -27633 107424 109463 5327 -112680 -164210 -139256 -100407 -109892 -154854
33675 -154854 -171727 -136998 -94662 -93364 -132108 -169754 -159425 -78690 46888 158808 223084
33664 223084 249817 242448 182146 97853 78589 144416 173616 59380 -114254 -175942 -113152
33653 -113152 -73277 -123133 -160243 -100860 -15114 -3944 -52576 -87844 -94530 -92960 -71938 -26445
33641 -26445 -5250 -40288 -73727 -34483 46014 70966 12669 -54816 -47919 47647 172216 225345
33629 225345 130772 -84195 -294155 -396063 -392742 -327088 -199196 -16751 137509 194975
33619 194975 218456 305706 393392 309773 53199 -142314 -109757 19300 22553 -76758 -68901
33608 -68901 82337 152865 -4473 -213046 -201651 19294 175572 102301 -54773 -58639 110715
33597 110715 258681 234007 84670 -44366 -80886 -47702 24755 127885 224059 242384 158657
33586 158657 34232 -59745 -118675 -166295 -180382 -116678 11024 132906 200045 212131 180207
33575 180207 118925 75139 107904 224201 362823 439314 391296 219438 22087 -66043 -31058
33564 -31058 -13255 -105425 -202526 -175043 -103020 -152565 -272503 -241353 -20125 176666 210612
33553 210612 189672 226423 251457 190900 130709 158728 208579 201277 191957 243546 300019 309988
33541 309988 333957 421477 533380 667923 879976 1114681 1265640 1457074 1955026 2744331
33531 2744331 3634359 4872458 6963191 9478238 10771545 9672324 7043653 4818859
33523 4818859 3771644 3150367 2323915 1643479 1469614 1408837 1042995 646448 605474 714350
33513 714350 612569 440174 496120 636833 569736 429692 516952 702000 617851 278994
33503 278994 31894 12158 73730 142444 242153 271302 125327 -52803 -80809 -69725 -199733
33492 -199733 -309177 -113361 261956 390895 164039 -99754 -164729 -128690 -118366 -78903
33482 -78903 36124 129947 116216 24371 -92699 -205620 -270991 -288977 -343518 -438710 -404059
33471 -404059 -151943 100298 101618 -59760 -113942 -20781 65341 127962 251928 333561 192216
33460 192216 -50934 -68707 170290 335282 226212 16067 -82644 -100356 -144533 -196659
33450 -196659 -202720 -186615 -176362 -153946 -121104 -84697 13825 198736 328298 253814 68699
33439 68699 -15699 2713 -40301 -143030 -133884 -4981 43392 -60023 -152814 -146550 -178240
33428 -178240 -344322 -501139 -457818 -217963 61236 236421 264754 228797 266372 371159
33418 371159 343339 95373 -118655 -23354 238801 298668 119113 4579 68982 82410
33408 82410 -90829 -272597 -302473 -256154 -205600 -80497 83218 66885 -177133 -373183
33398 -373183 -318400 -177153 -174953 -238802 -180058 -38385 12701 -30510 -29864 47383 105910 87360
33386 87360 4642 -127719 -266957 -308387 -200349 -46092 8051 -49062 -95670 -23677 157716
33375 157716 331728 379538 313058 267654 308333 329829 254575 209323 322733 459658 408163
33364 408163 256777 285263 497697 587657 414185 199262 158065 219198 232315 193674 131612
33353 131612 3587 -154529 -191502 -85605 -23285 -108641 -197891 -149158 -32785 40232 98900
33342 98900 182002 220532 191376 200485 273402 257882 86919 -59743 -31986 41127 -22236
33331 -22236 -146948 -142070 -26721 22192 -19136 13003 196153 386280 395895 212982 3094
33320 3094 -78762 -57125 -82328 -192485 -229603 -92284 47762 -25185 -210460 -218232 -35218
33309 -35218 23076 -221564 -553594 -668583 -519076 -263044 -57946 9067 -47368 -90358
33299 -90358 -21782 40215 -61897 -211547 -155590 60750 128388 -20599 -100651 45244 214711
33288 214711 235435 231139 317382 363938 273708 198565 253311 290788 186474 80382 105523
33277 105523 138044 61918 27440 178717 352033 321933 152781 45213 17925 -8936 -1807
33266 -1807 61993 40743 -146507 -315970 -288527 -181046 -172502 -173261 -21750 159905 131931
33255 131931 -56747 -139639 -34426 105716 180230 222990 242725 208560 156457 130557 86636
33244 86636 10476 16783 152756 237453 103305 -126769 -218514 -165067 -127437 -148233 -152453
33233 -152453 -140340 -158185 -156208 -79046 -18063 -82119 -198691 -222167 -151021 -71829 7166
33222 7166 103808 162196 163905 204104 301606 296469 107207 -94142 -153313 -175044 -273335 -303347
33210 -303347 -118802 102730 103884 -45608 -103763 -70453 -108986 -175811 -89069 103256 171193
33199 171193 83576 19594 23486 -39959 -186423 -262606 -215432 -152153 -115894 -40653 56412
33188 56412 63055 -29209 -107820 -119952 -94409 -13159 150816 298753 296789 176223 79702
33177 79702 53689 48246 49874 55155 4570 -96015 -108109 12779 78937 -36246 -151930
33166 -151930 -87924 -24944 -216385 -491580 -447435 -69586 236995 234002 90586 6720 -38114
33155 -38114 -74114 -7666 168190 283337 237890 141129 104486 73175 -46381 -236416 -412333
33144 -412333 -501844 -454733 -289364 -128931 -75038 -69272 -224 103760 130241 72347 8699
33133 8699 -47174 -120464 -163985 -134464 -107302 -152102 -179180 -82908 58646 114090 123586 187992
33121 187992 239986 154896 -583 -64834 -47180 -68091 -116773 -102823 -64860 -85629 -85919 43085
33109 43085 187776 162391 36840 34226 157990 201473 89558 -54993 -146364 -185587 -135388
33098 -135388 -2786 31184 -154940 -345515 -258005 -13204 16971 -215026 -388468 -344907
33088 -344907 -272863 -307164 -320412 -226638 -162678 -223801 -289625 -250200 -174457 -135063 -78229
33077 -78229 21219 67960 12241 -59023 -75932 -72883 -66318 -9277 79478 103559 59594 68010
33065 68010 183140 310266 352919 316471 235513 118541 -6626 -90194 -116905 -96377 -26954
33054 -26954 59297 77857 5310 -60682 -39120 28869 91807 178821 284102 307444 219765
33043 219765 131467 92260 13864 -97698 -73036 108036 200588 81503 -26157 60191 166746
33032 166746 102597 11735 65921 101901 -62248 -218885 -91969 164610 218475 105465
33022 105465 86485 143998 80904 -33572 12643 128646 66766 -84229 -18482 246617 403128
33011 403128 371861 351195 389162 330484 165807 47288 -6694 -69856 -57139 121336 273247
33000 273247 180174 10682 66356 254954 257261 84791 10677 70885 102976 150213 339536
32989 339536 489855 349393 92041 56669 140404 12493 -221441 -193448 8094 -36983
32979 -36983 -300009 -330410 -54698 123256 45146 -33629 -32178 -141647 -285268 -149332 168397
32968 168397 207799 -56231 -132495 143816 352346 236074 68779 85907 150010 169753
32958 169753 276722 414351 316498 47961 -928 211026 295936 149944 115830 287887
32948 287887 308594 53324 -116435 -417 140304 130067 133985 193624 118543 -482 180529
32937 180529 553209 569837 154349 -120171 7731 100258 -123060 -302358 -163569 7630
32927 7630 13320 152172 540867 708233 360699 -54786 -49839 193264 285093 280351 381485
32916 381485 459614 339049 162879 85957 -9285 -175999 -205011 -43244 41481 -37703 -12881
32905 -12881 180095 217647 13005 -55197 183918 377990 295921 192588 239798 209117 28620
32894 28620 25489 284901 397729 186951 53260 250130 451763 398148 331039 428362 448732
32883 448732 300955 315545 582680 677372 411556 194178 276757 324771 120443 4288
32873 4288 220224 480375 545292 581751 642390 499334 263934 394916 842044 1043834
32863 1043834 1011840 1412057 2249296 2578763 1993955 1301177 1161862 1157235 826679 548278
32853 548278 669715 776112 551329 405902 560705 498199 17189 -196211 227402 614751
32843 614751 470022 340527 680231 954514 721608 508420 732289 846796 459251 192392
32833 192392 514024 824959 636425 501321 831618 997887 593892 349442 753223 1054915
32823 1054915 709154 469433 915310 1284517 966358 723460 1178362 1571839 1324648
32814 1324648 1269506 1982248 2578485 2599900 3208509 4844026 5701975 4513726 2874466
32805 2874466 2641744 2989475 2423663 1731423 2236581 2981406 2529658 1861182 2504552
32796 2504552 3481471 3207619 2714554 3682782 5014953 4910663 4576349 6021191 7967660
32787 7967660 8207465 8240945 10843365 14725732 16890822 18669549 23386720 29468227 33024048
32778 33024048 36553437 46742937 63167680 79182947 97674926 135863129 205613617
32771 205613617 292569784 361139263 379426167 339086886 258355308 171330646 108279802
32764 108279802 77215560 63867520 51834071 39056048 31789304 29890992 26852382
32757 26852382 20897139 16606527 15836565 14974474 12073058 9817802 9788614 9612381 7761105
32748 7761105 6217346 6352665 6443384 5252319 4286420 4598903 4761040 3823902 3169586
32739 3169586 3673331 3922785 2966976 2152698 2553898 3054886 2611981 2111176 2399972
32730 2399972 2627362 2071809 1612815 1925742 2116256 1542173 1147554 1613028 1968901
32721 1968901 1434090 922256 1302743 1767819 1372976 742061 808570 1167710 1058730 813359
32711 813359 1025971 1336696 1228953 1060045 1233717 1305710 889014 503681 627860 842065
32701 842065 728659 649462 869369 921759 582283 428318 716271 797064 365266 138991
32691 138991 533714 836216 522037 222439 499037 806047 604640 397329 677816 915877
32681 915877 592499 233188 391753 578287 240755 -112636 159673 638162 635894 396458
32671 396458 464729 617015 445115 290515 577780 889139 698807 384628 529858 842614
32661 842614 745967 450350 471164 634823 510030 300486 392698 532714 347390 167408
32651 167408 439669 827494 781987 509751 490552 540622 270989 -5277 227366 696760
32641 696760 779789 554314 517724 620216 484146 265063 395232 729603 791108 623913
32631 623913 608138 683361 542217 343912 453002 695508 631747 357771 310951 487843
32621 487843 551803 503490 569842 648086 512829 342111 411321 534206 428387 314013
32611 314013 488594 655270 399594 7694 37500 358605 413828 199248 177324 396964
32601 396964 494103 431354 473868 544768 347110 31740 25125 274374 352982 227937 236542
32590 236542 387771 375647 220217 221068 333379 252895 59611 108887 333959 332123 115207
32579 115207 97620 338168 460769 357116 318324 415660 381408 186346 140178 320343
32569 320343 448017 412487 396018 422502 313780 151235 238847 524094 582673 284345
32559 284345 -21378 -85437 -44192 -21353 79122 250328 288243 158514 73551 98472 52701
32548 52701 -108371 -185020 -95956 -377 20039 70456 177084 235073 260252 370011 491145
32537 491145 422437 215103 154228 322234 496451 513176 434489 336275 222486 156346 198956
32526 198956 234837 129056 1796 53440 194542 180224 41472 26902 165351 248145
32516 248145 214075 192841 186405 64177 -126048 -178979 -68359 40036 91125 160632 216323
32505 216323 162601 73316 81919 112285 26060 -59435 60737 290937 375551 335891 386609
32494 386609 496181 430753 186845 -7486 -81487 -139128 -148948 -5819 156138 113987 -33877
32483 -33877 -15498 116850 73686 -132104 -198570 -80011 -45347 -160446 -180871 -32610 47693
32472 47693 -42418 -93975 27958 182759 242469 254222 240424 151918 64855 107072 174058
32461 174058 56964 -151448 -155182 39054 121671 10719 -43918 58339 120161 72736 122230
32450 122230 337172 486262 436809 352041 349461 314650 198838 158028 239993 251581 90005
32439 90005 -88374 -159907 -200912 -248318 -197846 -61877 -26220 -126142 -163092 -61043 1316
32428 1316 -63615 -93750 -8454 21257 -90074 -134077 55847 312583 386748 284737 171406
32417 171406 116341 104079 142149 213095 239593 192481 121835 45817 -49604 -98490 -23078
32406 -23078 88732 73662 -47617 -111513 -82658 -46257 25429 211990 378297 292877 24920
32395 24920 -100465 25577 188225 243046 273612 301195 197155 -13169 -97005 10249
32385 10249 82864 -17425 -134980 -118484 -43611 -3328 62855 194440 295930 312730 312190
32374 312190 313968 257607 186403 222065 317514 291422 139595 42404 46749 35699 17288 103760
32362 103760 189487 34951 -275897 -369404 -165598 -12406 -105997 -199501 -77866 75289
32352 75289 21538 -160593 -281404 -317221 -270138 -48123 297563 492703 409144 257337
32342 257337 230039 232123 153130 117033 237890 384737 407531 364673 335892 250105 83602
32331 83602 -15341 20021 42423 -21651 -17819 127165 222039 134038 22561 43375 87453
32320 87453 31217 -13888 70499 174102 172307 147843 195778 240656 235890 289449 399597 347272
32308 347272 70134 -143575 -79869 63455 30194 -77632 -35268 94386 103029 3042 -37674
32297 -37674 29397 160534 346081 497523 418093 106969 -128149 -82099 64242 89261
32287 89261 72842 128872 100157 -144062 -369645 -301362 -68619 29061 -453 39710 130224
32276 130224 126200 93242 179376 286354 226353 78426 43908 85248 60726 68069 267182
32265 267182 493182 461960 267698 251998 434713 500464 336356 170504 152090 177176
32255 177176 176392 217712 263132 156250 -72581 -185023 -88091 57870 130915 179040 215402
32244 215402 152718 6084 -80836 -67065 -48388 -30997 90529 293311 403213 359009 280300
32233 280300 240420 196636 172904 270275 447604 523707 453258 382538 384992 369437 305433
32222 305433 302141 379756 382678 220587 7623 -125895 -179300 -162967 -31954 156793 204796
32211 204796 25111 -199645 -237634 -85449 76595 119437 62573 -2163 -11097 18900 18930
32200 18930 -23585 -23009 73348 177500 190771 168297 207871 244857 147623 -25002 -77014 19749
32188 19749 92155 57345 27462 77243 126566 131893 186779 323287 394066 280348 76183
32177 76183 -52957 -73248 -40747 17393 68188 38000 -67850 -120020 -63249 -43259 -178197
32166 -178197 -308470 -192390 84629 145198 -163677 -502280 -450232 -55861 239050 183252
32156 183252 -9894 -31943 101437 166988 108113 55557 47663 -10797 -108068 -99823 16022
32145 16022 42351 -94199 -192168 -92639 61154 62771 -41510 -84240 -68963 -97044 -122646
32134 -122646 -33336 97621 86801 -66094 -183772 -187288 -154877 -122193 -39087 67151 87611
32123 87611 17897 -22873 22525 100321 177814 255513 257188 101676 -104733 -150705 -31059
32112 -31059 23278 -116141 -299294 -340849 -260929 -179967 -128526 -82604 -65604 -89127 -80059
32101 -80059 17445 129471 141897 57047 -24137 -43057 -33305 -48404 -95559 -133363 -102980 25265
32089 25265 210499 354735 377420 284571 168936 134802 201804 288385 315773 299123 275562
32078 275562 189045 -22015 -233463 -213544 49384 277566 262560 116698 35991 4679
32068 4679 -66080 -76755 114807 384303 461500 326741 218641 242687 237255 84252 -85198
32057 -85198 -97214 28391 150708 191631 166835 128404 130798 182600 220572 203332 195768 256073
32045 256073 298275 216934 91648 78329 137123 91347 -53027 -94136 28325 134943 117654
32034 117654 102509 191518 271351 223653 126804 88351 53924 -41705 -91047 20230 184908
32023 184908 218299 147722 153793 271670 350317 299984 200053 136697 83495 -7986 -107718
32012 -107718 -150273 -111238 -8824 118155 216279 248874 233801 212644 185034 118942 22956
32001 22956 -46109 -58133 -42836 -28807 5357 84496 172656 202596 162789 110545 90623 86724
31989 86724 77603 90359 145707 191820 169063 115816 115991 149769 109794 -16672 -105044 -76260
31977 -76260 3547 70145 171805 331861 428996 352893 182671 66354 7180 -77363 -164873
31966 -164873 -173152 -134988 -138565 -138530 -33706 91965 41516 -159089 -235320 -49004 207420
31955 207420 308401 288331 293493 313531 250798 148235 144276 238928 282499 203534 103245
31944 103245 89795 132442 134482 70721 -12769 -85932 -149513 -183779 -162483 -132788 -199056 -367740
31932 -367740 -476634 -381107 -173529 -83285 -157421 -199175 -75575 80485 85917 -17936 -57042
31921 -57042 16865 128354 256228 418719 524370 435203 184491 -32914 -100966 -69594
31911 -69594 -2290 102579 215118 252599 201343 140459 115586 102903 107333 163070 225182
31900 225182 209672 162240 222063 376760 431275 296323 135968 119157 177856 151348 49428
31889 49428 10950 74585 149405 181985 210898 251197 239685 129757 -26270 -123480 -105272
31878 -105272 -5369 94513 141020 142150 127528 107595 100669 157736 290535 397166 351647
31867 351647 179123 54525 91675 203401 216257 74525 -113755 -201090 -134613 13411
31857 13411 120628 124221 65323 30922 70812 171565 270455 281385 165209 6776 -42444
31846 -42444 53070 152790 120625 -3171 -80000 -52164 37148 132932 185581 146919 48722
31835 48722 20304 125456 251622 270624 228680 244628 297477 272653 165486 81009 69753
31824 69753 106278 181377 270898 276882 161760 73108 155894 311307 340653 254066 206083
31813 206083 193257 86951 -70095 -93678 16723 79667 75373 170623 350448 360397 121883
31802 121883 -113365 -158338 -132384 -152943 -103990 78268 187117 72989 -65136 -752
31792 -752 128527 64419 -114514 -122994 52071 146338 49831 -73808 -107477 -133235 -211832
31781 -211832 -251728 -187712 -112927 -136729 -224788 -256908 -179058 -56171 -3790 -62107 -125017
31770 -125017 -57288 92441 111365 -76152 -266608 -256680 -127413 -85316 -141233 -154860 -115467
31759 -115467 -142269 -233130 -245677 -149138 -86226 -133276 -178820 -110891 23232 119275 156221
31748 156221 162383 143341 111756 104618 113972 79994 4212 -15325 72102 164639 128742 -19165
31736 -19165 -132618 -117955 -25409 44239 58773 48625 25129 -34771 -117681 -143381 -49401
31725 -49401 117715 241134 253305 178869 77201 -8806 -63668 -110783 -187794 -254314 -178622
31714 -178622 81481 334975 345062 145446 -1199 28052 86737 50669 19309 102282 202751
31703 202751 192124 148059 213084 324901 306112 156600 37677 -3463 -73985 -194022 -229376
31692 -229376 -120609 2254 18997 -8734 38624 149333 216137 190215 108680 17835 -48380
31681 -48380 -48013 27542 101073 71311 -61062 -185379 -218451 -195634 -185952 -170848 -87469 31063
31669 31063 67012 -7900 -81153 -79401 -83961 -167400 -226197 -127002 57462 136515 83719 42829
31657 42829 68474 62400 -14555 -65592 -35645 14576 49998 92821 88101 -43793 -185025 -112917
31645 -112917 110138 132955 -166391 -463939 -481670 -385579 -426994 -479088 -285975 45333
31635 45333 199684 157956 143831 163297 25752 -201608 -197792 92288 337209 325642 233814
31624 233814 247421 256889 123825 -35175 -53688 17110 56605 99537 206332 276764 202993
31613 202993 69649 316 -65935 -233752 -399897 -374487 -186579 -42023 -7213 47355
31603 47355 182375 274614 222240 105996 63987 107197 135031 76968 -36724 -118642 -110857
31592 -110857 -37814 30068 69143 120777 198772 241572 204913 139772 113722 117436 127434 189794
31580 189794 326861 416950 316744 89475 -46032 -16429 14980 -78420 -174691 -86217 149966
31569 149966 314585 296286 199192 162860 200844 250867 280778 278920 203656 23157 -204048
31558 -204048 -343531 -304351 -137829 -1758 -3832 -79494 -67925 69000 170084 85731 -96011
31547 -96011 -154123 -42004 55913 -2773 -140788 -220240 -232253 -226320 -184840 -104542 -89452
31536 -89452 -197174 -279775 -166896 50383 128006 37965 962 124408 239779 186573 50040
31525 50040 -17503 -42287 -125826 -212235 -149617 57682 223841 217500 101452 8869 -26092
31514 -26092 -57438 -94864 -60300 92170 257584 265852 101225 -59502 -83284 -48964 -81074
31503 -81074 -129498 -72356 52128 117001 149909 273182 426707 410644 224030 90691 90067
31492 90067 40919 -148534 -297467 -266964 -192604 -221473 -263550 -212381 -178441 -262237 -309429
31481 -309429 -163257 23309 16838 -114587 -153301 -125157 -206370 -340454 -303832 -103317 40731
31470 40731 86657 194529 349409 331855 132798 37225 163924 249293 70886 -192710
31460 -192710 -243928 -92418 33047 47469 55226 116962 169945 154158 81173 -8564 -73176
31449 -73176 -82904 -65033 -95326 -200287 -309692 -331807 -232198 -43503 134620 166347 10921
31438 10921 -188849 -255422 -191068 -122301 -77745 -1198 42336 -88540 -321274 -368700 -125454
31427 -125454 145504 162595 -12985 -121190 -64088 46666 100374 79777 3496 -88648 -130675
31416 -130675 -102358 -58855 -32157 10781 53882 -2227 -170178 -295582 -260653 -153906 -115688
31405 -115688 -134908 -142799 -183369 -301931 -364220 -216778 19092 61489 -107754 -178944 35380
31394 35380 300895 278440 3438 -163623 -38102 142767 61537 -227927 -359148 -145602
31384 -145602 163650 214672 1572 -182846 -185056 -157032 -252179 -376348 -366453 -248491 -147296
31373 -147296 -53975 122427 330265 399983 288941 129394 16196 -86849 -187005 -178510
31363 -178510 -16200 155400 175777 94863 92455 208281 293123 246278 175109 241219 418882
31352 418882 505932 369614 108177 -55327 3875 218539 420453 488154 420996 303869
31342 303869 211715 151415 101005 77245 113094 175629 180279 107269 25692 -32991 -127300 -261729
31330 -261729 -299932 -151838 31217 20977 -154226 -227903 -76209 101496 67244 -138132
31320 -138132 -281116 -238486 -87825 44061 100841 87562 41161 10898 8198 -10982 -68445
31309 -68445 -105977 -68807 -8771 -18625 -81955 -86976 -2654 57053 -2652 -103943 -93029 39013
31297 39013 128243 51220 -115871 -209495 -188711 -141711 -114723 -59373 26326 35885 -82125
31286 -82125 -199204 -166619 -39503 -6489 -121346 -245365 -264328 -220883 -185989 -132868 -32788
31275 -32788 18510 -100250 -332572 -454792 -328447 -76925 50939 -27110 -143539 -115842
31265 -115842 12435 57781 -20423 -73269 -26397 -22872 -188051 -381517 -353540 -89320 168410
31254 168410 220318 86903 -104828 -258748 -315097 -255886 -148236 -87186 -72941 -29815 53795
31243 53795 103501 76040 -24 -90728 -163670 -159377 -77232 -45259 -147543 -229523 -82714
31232 -82714 197005 286844 104863 -68145 -20494 110600 136802 130247 217844 282000 142631
31221 142631 -97559 -168866 -25101 135894 199275 229451 247865 168478 8337 -55438 63582
31210 63582 213614 213613 93042 16069 45757 93840 78531 43788 97598 260773 409666 399313
31198 399313 243706 120353 159551 279930 294050 141826 -53027 -144002 -110070 -38338
31188 -38338 -9641 -19641 -826 76867 143951 116436 34077 28986 134415 224744 198410 117137
31176 117137 81014 65177 -3014 -81981 -69789 23147 91618 101964 105177 92429 -17635
31165 -17635 -217126 -356823 -310284 -111823 102637 221965 209752 112286 45871 98608 214608
31154 214608 250260 169962 94697 114504 154646 106575 5343 -34701 -9804 -24086 -103819
31143 -103819 -142260 -70996 18848 2288 -104207 -185524 -201503 -207895 -216063 -158969 -35340
31132 -35340 33410 -22952 -86181 -5101 171261 255976 195981 127852 142031 147423 44872
31121 44872 -92489 -124911 -52986 892 -17731 -35258 17680 99071 111267 23183 -92797
31110 -92797 -145510 -137676 -163800 -266395 -338702 -253903 -69047 21747 -43833 -111746 -54972
31099 -54972 43461 59499 44945 111540 195390 143865 1369 -14855 143045 245020 109788
31088 109788 -131268 -228140 -140973 -19921 55346 137586 241076 279731 204517 75338 -38714
31077 -38714 -120291 -134588 -26563 149835 222362 116174 -23288 -33567 37504 49360 24509
31066 24509 94368 230893 254104 131660 54898 139677 246198 211494 94167 47284 85262
31055 85262 132285 191961 303038 403177 394127 290873 178135 82558 9003 17427 119785
31044 119785 184830 104143 -25010 -45226 21597 64568 116272 265714 412527 371140 189248
31033 189248 92187 111123 45754 -168482 -336516 -321671 -227488 -164180 -77364 68464 153249
31022 153249 85300 -52855 -154453 -218020 -240442 -166894 -37828 8105 -33393 -6835 108033
31011 108033 124990 -14 -21349 207023 447441 418180 204060 72941 64597 37943 -13961
31000 -13961 16605 104107 121268 62823 20365 -212 -32942 -5847 144214 287228 250633
30989 250633 88916 -9860 -15256 -31790 -62673 -41829 -39069 -165370 -305778 -222661 72686
30978 72686 316018 371633 348551 305477 137479 -145057 -304248 -206115 -47339 -64515 -184789
30967 -184789 -174688 -28408 17910 -159171 -391606 -446221 -303955 -130763 -39715 10606
30957 10606 85785 160220 198426 252684 352317 365863 160471 -119863 -165073 61397 234628
30946 234628 130584 -67433 -99668 -34980 -96075 -258792 -318807 -248719 -193397 -170125 -62001
30935 -62001 110562 184163 125924 66186 46383 -22302 -124570 -112508 32157 131746 81199
30924 81199 -14165 -40086 -27176 -28895 -19057 7543 -15205 -97351 -148856 -122390 -68459 -3721
30912 -3721 126354 295119 355097 233117 49182 -30337 35262 173947 279864 251093 68027
30901 68027 -132120 -176353 -80881 -35274 -137869 -278566 -317077 -242171 -111774 29349 115094
30890 115094 65006 -103189 -254562 -277492 -174016 -5444 156267 224688 161722 54827
30880 54827 26562 70584 85841 50284 27876 25718 -6443 -51372 -54364 -55102 -119195 -168298
30868 -168298 -80131 62829 59537 -68341 -80967 86047 201664 111193 -27303 -22153 57355
30857 57355 41172 -57384 -102373 -66996 -42531 -83395 -156372 -192088 -131709 2793 68840
30846 68840 -46574 -228594 -247981 -94299 -2732 -101806 -246426 -280447 -248799 -238520 -216510
30835 -216510 -158112 -145862 -198354 -181194 -35077 83859 45072 -50640 -71473 -83343 -187399
30824 -187399 -292537 -267761 -191544 -225023 -334896 -360087 -277874 -195254 -137747 -51511 30624
30813 30624 28063 -6125 62930 212998 251714 80236 -158230 -243178 -120621 46665 50703
30802 50703 -129415 -281251 -216402 -45646 -43260 -231120 -322493 -166251 1988 -69249 -248393
30791 -248393 -245320 -71431 18985 -43976 -82964 -19114 8734 -79542 -148566 -56882 146121
30780 146121 315551 379108 347765 260833 173186 126279 109243 103371 140235 232841 288698
30769 288698 208608 50844 -27969 12743 70602 89245 133151 237680 313544 273617 169934
30758 169934 125710 172599 220607 184089 98981 90682 217613 372269 388540 242991 76619
30747 76619 1125 -24241 -75715 -119499 -67230 84040 249718 356740 383184 341311 274218
30736 274218 226702 184661 105166 30029 66959 207453 284126 196014 59404 17747 9075
30725 9075 -120018 -332756 -409158 -237832 35091 183580 141564 28920 -11015 39725 86694
30714 86694 65168 15411 -23027 -112474 -293965 -419887 -293255 20389 216927 142960 -23944
30703 -23944 -54992 61483 228008 416483 596959 654708 537376 360347 237105 136697
30693 136697 22592 -32069 -4792 -24146 -147238 -209164 -79571 93915 100994 -22211 -107140
30682 -107140 -129938 -155669 -145671 -51675 25092 -5177 -38194 15770 6801 -196682 -394796
30671 -394796 -330223 -130930 -107746 -222385 -175000 34704 86782 -94361 -203266 -81172
30661 -81172 38872 -23225 -80395 74826 314497 401987 342361 287789 278012 269884 274352 300926
30649 300926 300353 287928 372465 542919 591647 389907 94001 -63582 -64022 -55234 -126215 -243767
30637 -243767 -323511 -283425 -121041 19434 -17037 -165863 -211446 -111902 -44169 -72603 -27265
30626 -27265 170799 318520 242968 84547 59349 124715 111814 39307 44106 102773 73761
30615 73761 -33542 -58759 55753 198592 270890 276168 237625 170513 133097 174360 228818
30604 228818 175827 8147 -148119 -175933 -56915 152336 349455 418203 319993 147178
30594 147178 25387 -17100 -35503 -65876 -94326 -92127 -33305 79951 173282 149012 26925
30583 26925 -43351 23276 119815 97589 -23163 -87929 -9192 152838 280966 302187 223460
30572 223460 122083 79131 91703 86705 34603 -14579 -26316 -31009 -49322 -54634 -45628 -69091
30560 -69091 -133601 -184918 -190884 -158507 -67427 82712 165233 53532 -122963 -83848 167448
30549 167448 281060 81953 -119832 17461 334500 409288 177464 -37917 -50170 -4668
30539 -4668 -34272 -56083 -8859 -13540 -150611 -282613 -252890 -117418 -41002 -69986 -128626
30528 -128626 -156857 -141737 -72396 40313 133948 150742 98902 25928 -27592 -28202 34975 107130
30516 107130 104423 27492 -25687 -609 23630 -58669 -227324 -351085 -334156 -199189 -33266
30505 -33266 103499 199718 248547 223738 126966 33504 27447 81403 74580 -27996 -89596 27364
30493 27364 256495 388815 319350 145433 23838 11237 59308 103032 124079 147177 177935
30482 177935 155012 21568 -144312 -172346 -36131 64217 -32893 -205274 -224604 -100261
30472 -100261 -41967 -109580 -131122 -5363 138822 176884 183249 258389 325853 267365 143092
30461 143092 102099 148184 163014 113824 76058 77789 78687 88671 146867 182059 69378 -137311
30449 -137311 -207283 -49918 129902 117953 1785 29964 238613 407574 379500 246323
30439 246323 172712 178652 179399 137213 74729 2960 -64491 -62556 60835 236428 313025 223094
30427 223094 56118 -44399 -13510 108766 233064 286690 262509 219266 211028 219874 191938
30416 191938 127294 76282 45689 -17173 -116594 -156263 -58590 104280 170550 72503 -94650
30405 -94650 -188915 -158881 -56258 41153 86481 67911 -1865 -89023 -152364 -176425 -191085
30394 -191085 -238921 -311608 -334356 -237296 -42609 138969 208617 170213 115568 120906 163067
30383 163067 148120 26530 -142069 -263365 -322520 -370344 -408251 -373731 -269074 -211710 -283065
30372 -283065 -398636 -424985 -373088 -355776 -380170 -326870 -160039 -21112 -40190 -153191 -199555
30361 -199555 -141258 -88136 -127353 -209981 -218582 -105495 46129 89320 -40855 -239238 -325172
30350 -325172 -245049 -132219 -126876 -190327 -171145 -25840 123211 167898 164539 239816 393096
30339 393096 476198 376034 151511 -43553 -126279 -126261 -96932 -56719 -19168 -15007 -57676 -130433
30327 -130433 -226192 -349698 -454229 -437478 -258535 -24054 104773 81978 7832 -4553
30317 -4553 46446 67190 -11838 -144389 -205471 -129121 14254 110007 137452 158140 198405
30306 198405 232072 260310 297409 282078 133956 -89787 -240774 -303273 -394867 -500334 -427033
30295 -427033 -137916 94937 48431 -130053 -171221 -87642 -81012 -173605 -202346 -102980 53095
30284 53095 237882 431065 476046 248518 -77216 -208771 -139834 -83103 -56333 105771
30274 105771 333277 318928 16461 -241755 -254583 -214116 -294547 -344975 -220624 -92311
30264 -92311 -148630 -255710 -197354 -30057 78061 153449 275891 324881 178760 12836
30254 12836 77764 289211 345487 172476 -41010 -181168 -286692 -333640 -237999 -71320
30244 -71320 -15316 -90591 -150385 -132251 -96055 -35156 111194 264562 268163 149820 88416
30233 88416 104890 35134 -151392 -259828 -174281 -24712 47869 83859 146863 163368 66770
30222 66770 -42027 -31714 54186 66645 -26860 -101991 -42211 125339 256733 233414 89725
30211 89725 -15261 16444 103142 105536 13524 -73399 -99201 -78585 -17827 70966 115362 71011
30199 71011 26853 80592 148306 68958 -118324 -193710 -77349 55936 42989 -49736 -59914
30188 -59914 44235 161200 196339 136851 44883 8823 47571 66070 -22763 -158225 -213604
30177 -213604 -184066 -163956 -166472 -126509 -74943 -128216 -277114 -363046 -311623 -219306 -153369
30166 -153369 -49747 103595 164781 51939 -86103 -64269 77750 159973 132252 102438
30156 102438 125914 117993 7284 -122565 -112218 69256 250377 234470 45628 -85347
30146 -85347 -24554 84054 49315 -69425 -84384 -23054 -88151 -265386 -263011 38428 329928
30135 329928 266914 -57388 -259620 -183145 -31075 -14181 -90761 -110673 -55835 -30362 -77840
30124 -77840 -108522 -24658 131960 217667 179313 131646 177589 227287 124602 -82610 -162174
30113 -162174 -6167 235590 374060 379629 300325 145336 -41868 -132192 -66233 36633
30103 36633 45552 2335 15509 64646 57069 5774 -12057 -28360 -143090 -315866 -364373 -208159
30091 -208159 16056 135348 137817 131260 176618 222765 175020 1104 -204715 -268548 -105347
30080 -105347 156319 290258 230878 130893 122925 132606 35496 -86233 -27238 197793 298884
30069 298884 104120 -165751 -203678 -76938 -120155 -396492 -567533 -394598 -94935 -7502
30059 -7502 -113582 -139690 -6555 99128 55010 -48020 -99968 -106618 -95186 -52661 6044
30048 6044 43070 85105 179608 268528 239533 94763 -59422 -160653 -193465 -109793 73359
30037 73359 167465 31979 -153249 -101126 129706 203742 36365 -94351 -29450 43954 -13726
30026 -13726 -33411 116042 236618 121617 -86755 -134750 -40604 28216 66071 138149 154124
30015 154124 26280 -91700 -15214 152550 202383 185377 278439 402081 332608 129607
30005 129607 79700 227134 322127 259361 210995 262019 262070 145774 75852 128462 133113 -11852
29993 -11852 -139122 -111652 -64942 -135072 -178862 -24601 185074 195917 68030 88837 301122
29982 301122 419760 264875 23030 -36120 77079 136655 26937 -141668 -216308 -182482
29972 -182482 -130729 -115271 -109723 -85344 -62986 -57083 -25616 56806 108847 20337 -170301 -272075
29960 -272075 -165354 38353 126233 31504 -118835 -183545 -159589 -137333 -157995 -166633 -104769
29949 -104769 -9237 17443 -67572 -187040 -226732 -155113 -38538 42111 62779 56015 62490
29938 62490 80060 60830 -19579 -98046 -82046 17340 79163 36542 -23811 9078 99908 114535
29926 114535 10673 -107286 -123919 -33722 81009 138973 116498 54057 13776 13875 22438 30369
29914 30369 82027 188355 256982 183033 -3752 -144659 -109439 81119 274411 304853 130025
29903 130025 -116202 -240528 -187437 -71367 6481 78843 187619 246050 151963 -23289
29893 -23289 -104485 -55666 -17943 -90408 -199009 -232473 -210585 -235970 -317867 -324066 -139921
29882 -139921 148988 296417 166316 -85312 -198627 -148497 -137950 -239918 -259013 -62327
29872 -62327 157229 148629 -13360 -55966 64863 126846 7272 -165404 -249099 -250186 -203718
29861 -203718 -102597 -4880 -9787 -57699 39136 273442 364558 146688 -152586 -208946 -38982
29850 -38982 64901 -44625 -220644 -271414 -181059 -60572 -9947 -64508 -190056 -297842
29840 -297842 -313069 -238637 -124203 -103 115332 183147 181311 144214 100490 5922 -178060
29829 -178060 -358533 -368002 -175505 39242 75915 -69228 -232392 -296591 -297862 -306866 -295022
29818 -295022 -201529 -86708 -89579 -209591 -265350 -160961 -79999 -260387 -625823 -813061
29808 -813061 -583608 -72698 394761 600911 515443 241365 -21357 -77718 72767 211724
29798 211724 160480 -3784 -84243 -39135 11141 4626 10038 70954 122269 114988 109067 159408
29786 159408 190864 91383 -106852 -244089 -229145 -121859 -981 139777 295495 353340
29776 353340 226440 37539 8138 152589 245228 149648 15938 34333 136751 117886
29766 117886 -36337 -142762 -115338 -66915 -90937 -115368 -39183 116750 266121 364537 398889
29755 398889 357264 270937 217220 229776 260608 255598 201503 87771 -84601 -232206 -234441
29744 -234441 -98938 14298 -8029 -97484 -130550 -104263 -105314 -165585 -227254 -218627 -117165
29733 -117165 25487 97001 24702 -110585 -137165 -4913 146196 169762 72698 -58868
29723 -58868 -185849 -285294 -289367 -166188 -3780 85945 101908 106115 95238 24751 -71363
29712 -71363 -93973 -13551 86933 110489 36694 -78360 -151701 -141951 -101395 -124933 -215549
29701 -215549 -259084 -184448 -80818 -74674 -146775 -173999 -120340 -72166 -82978 -92143 -35181 44118
29689 44118 46697 -55033 -189033 -268044 -268516 -223686 -166742 -110654 -78512 -101134 -149092 -117877
29677 -117877 45136 226038 250343 104730 -41575 -54633 20777 69635 65058 60958 93449
29666 93449 143781 158707 87602 -50766 -144784 -111481 -25154 -14687 -53141 -6947 104867
29655 104867 103540 -47197 -151048 -89449 549 -1777 18839 162635 261622 141952 -34272
29644 -34272 -984 156496 121597 -129916 -281218 -166937 25879 119652 185505 297634
29634 297634 344629 261637 206525 302762 400997 309689 112458 36110 105570 142700 53616
29623 53616 -66675 -91847 13809 202963 360573 356417 194988 62389 111385 259232
29613 259232 322008 282505 270596 324076 344947 286820 216155 166538 92400 10705 34798
29602 34798 189073 313586 250819 44439 -136802 -207513 -209207 -193728 -158460 -90416 -8752
29591 -8752 47525 52059 22535 24367 101537 193327 187218 86790 40574 130220 212921 99776
29579 99776 -150082 -265635 -113657 126347 197122 59351 -129863 -236143 -235126 -149819
29569 -149819 -31159 26807 -23493 -83873 -19106 130665 176173 47906 -97369 -105451 -31127
29558 -31127 -11408 -40549 -14510 64077 84908 21382 -26065 -1779 22026 -12723 -35443 42985
29546 42985 174592 217839 113873 -44442 -117617 -60365 39804 52362 -57617 -185382
29536 -185382 -206375 -121310 -25347 51280 172250 336800 405817 277978 65465 -24603 45857
29525 45857 120646 88556 22620 34577 99658 117262 81921 84217 154171 206115 171554 111331
29513 111331 133417 235077 299120 254616 180418 202432 312924 355945 217504 -13209 -126967
29502 -126967 -31543 150057 236061 187259 107804 85644 105320 116977 117212 124898 125010 89537
29490 89537 41314 53830 173627 352806 467843 420271 233449 34856 -81218 -148637
29480 -148637 -241921 -323816 -269029 -49029 201049 338113 350213 297351 210095 118168 87554
29469 87554 131375 155342 90513 8095 -4504 3149 -47581 -89929 -26506 46839 -43149 -227930
29457 -227930 -245737 -47281 102841 24545 -121611 -123068 -41112 -51952 -134091 -140511 -67857
29446 -67857 -27008 -19193 38553 109853 78925 -18983 -17403 110132 190709 113590 -15157 -51162
29434 -51162 -11006 -7503 -77473 -154262 -162092 -87955 9848 49924 15566 -21342 -9337 -9808
29422 -9808 -101267 -228417 -253898 -148323 -20641 41775 55327 50153 6597 -81038 -160348
29411 -160348 -183452 -165136 -157598 -197738 -267970 -280704 -151136 64616 177462 89407 -75523
29400 -75523 -162574 -195287 -245481 -221961 -18999 208397 200528 4886 -67302 72686 165690
29389 165690 58910 -38708 69197 227136 203501 73261 47784 95517 31354 -125585
29379 -125585 -185378 -128981 -131476 -244481 -315066 -261313 -203277 -248715 -327963 -322599 -226694 -117278
29367 -117278 -68463 -126585 -261488 -325043 -185926 65509 182205 78357 -50878 -1270
29357 -1270 167899 236467 117621 -66590 -173757 -200558 -231561 -291137 -304332 -213117 -83224
29346 -83224 -29012 -43284 -3471 118260 172821 53585 -115289 -150081 -78880 -64938 -114804
29335 -114804 -73687 88136 198282 143498 18758 -59523 -113685 -180841 -192649 -108184 -35976
29324 -35976 -81162 -168019 -152982 -37248 68039 125832 187227 264474 315994 329378 309154
29313 309154 215001 26119 -159272 -206092 -114674 -10093 24830 4043 -52178 -140810 -208764
29302 -208764 -179712 -65841 45323 119645 182382 194709 67810 -156204 -278854 -186485
29292 -186485 -6743 74583 57303 61059 80843 -28175 -298839 -515700 -426111 -55678 269650
29281 269650 254816 -42738 -286356 -263268 -123459 -138518 -305510 -352360 -132662 167024
29271 167024 287502 207642 73785 -51168 -195378 -305969 -266337 -96611 22034 -25627
29261 -25627 -146389 -173461 -61819 98060 200410 217404 210267 264198 381986 458624 410959
29250 410959 297416 228698 198388 120261 12345 -8227 67487 100056 28481 -16265 82015
29239 82015 238649 304273 274880 237492 198857 108708 -10500 -88439 -111211 -90888 -3917
29228 -3917 116716 120517 -62023 -237757 -168999 78541 232943 233284 280013 437430 482651
29217 482651 276488 20743 -45596 6369 -17808 -70714 39191 277731 402765 337049
29207 337049 252261 239966 156877 -90399 -320707 -310894 -119151 8567 -13929 -43044 25712
29196 25712 92852 22908 -143189 -244330 -209606 -112852 -38249 7870 37414 31441 3578
29185 3578 32844 154047 271961 275537 193311 130607 92277 5549 -95588 -77303 68405
29174 68405 173609 142231 84284 97914 80879 -84657 -292902 -350698 -262010 -177386 -128015
29163 -128015 -32233 64519 -257 -223452 -381649 -327615 -158331 -16851 90693 185725
29153 185725 199760 98184 -10058 -17675 31194 54012 85185 185937 289011 275001 144553
29142 144553 -5366 -116857 -172254 -134438 -13355 74864 49127 183 45590 117002 61226
29131 61226 -99948 -204124 -214921 -242032 -286606 -194541 67122 289688 288387 132945 2788
29120 2788 -51734 -86693 -122058 -146181 -168818 -157558 -18030 240139 411474 314433 37886
29109 37886 -175459 -235234 -238084 -241279 -189945 -84644 -44152 -130604 -239130 -245774 -177007 -145389
29097 -145389 -172756 -167135 -65949 63341 93070 -10233 -133972 -153180 -99069 -121146 -259793
29086 -259793 -354303 -256784 -52812 55385 32774 25936 105873 164859 115279 42281 69542
29075 69542 178306 258654 271116 263574 271260 282123 276871 241248 161237 58215 5758 59579
29063 59579 180263 262650 238861 137376 51031 47805 96344 98387 27722 -6635 88460 217662
29051 217662 198298 25521 -109791 -96198 -38826 -56539 -98601 -71081 -11358 -3397 -24851
29040 -24851 -15768 -7430 -41841 -52325 21029 81962 19382 -77564 -48371 50852 24514 -110001
29028 -110001 -105077 128265 354534 342019 156659 3094 -52718 -55938 -8086 86441 121785
29017 121785 16465 -116845 -85760 122232 325924 381209 311420 218146 171996 199499 286593
29006 286593 371948 390686 329747 208038 38362 -132831 -194855 -79596 111991 186591
28996 186591 79467 -76237 -123609 -58205 4549 -15345 -89207 -138344 -121485 -62298 -19414
28985 -19414 -44480 -152425 -300764 -393746 -347531 -182505 -19957 49933 56889 55430 2363
28974 2363 -161579 -342006 -353406 -174527 4126 41053 7303 8012 -8796 -130352 -285762
28963 -285762 -342459 -320321 -334728 -372648 -311980 -154042 -44478 -26266 46046 258855 451649
28952 451649 401949 119193 -161648 -244943 -143448 -2367 64024 50790 33194 85363 206524
28941 206524 306860 270881 60997 -214757 -352130 -225880 58832 241371 174223 -27142
28931 -27142 -147796 -129572 -90154 -133203 -236707 -312125 -281469 -106208 160485 346859 295743
28920 295743 58518 -130664 -114600 25014 102359 50507 -45016 -81651 -44645 6840 17768
28909 17768 -2484 3345 57892 109934 105667 59886 7224 -68551 -181334 -269671 -280582 -281165
28897 -281165 -352625 -406109 -278094 -15855 128114 44786 -79625 -59090 25902 -2847 -140522
28886 -140522 -254332 -296553 -287191 -192549 -14513 92977 13779 -101598 -46893 56753 -98590
28875 -98590 -464555 -589560 -262514 118138 77656 -270785 -425919 -227675 -12113 -42186
28865 -42186 -150076 -78547 108478 173211 84743 16118 44495 73820 37476 -12566 -39563
28854 -39563 -82921 -141661 -138319 -61292 -17751 -65090 -102829 -33802 65175 63062 -3462 19474
28842 19474 149528 215522 90441 -136752 -274475 -241068 -121553 -61164 -125889 -230849
28832 -230849 -211153 -13389 207140 255233 132041 -1038 -63022 -105526 -125733 -26657 161066
28821 161066 212882 12396 -228515 -232302 -37550 76831 -10478 -145869 -170705 -113156 -73044
28810 -73044 -73786 -87740 -93751 -63972 9783 52943 -21470 -159389 -205847 -131885 -87206 -168415
28798 -168415 -269032 -250449 -147382 -88562 -93171 -67294 35673 150741 185712 114630 9088
28787 9088 -2581 132600 285032 270856 124374 97016 291929 458725 322152 -5567
28777 -5567 -162294 -27423 163204 195199 126365 91623 75004 7009 -65088 -53550 15887
28766 15887 54652 50422 46649 40939 8620 -19146 -2329 18623 -22008 -95788 -110704 -50543
28754 -50543 1754 -17697 -81963 -129709 -144897 -168733 -246618 -347348 -343092 -142421 138729
28743 138729 246717 92999 -127792 -217485 -238908 -343355 -458475 -389786 -181420 -95928
28733 -95928 -199310 -242102 -65470 125055 74727 -124980 -184211 -39069 108136 119871
28723 119871 71438 64792 83851 78324 53131 24146 -20569 -79814 -123560 -125841 -66543 61714
28711 61714 183447 150469 -65306 -261959 -241020 -88858 -40875 -118856 -144919 -105661 -202933
28700 -202933 -456079 -555894 -304956 41102 121844 -16034 -38658 150746 309694 255707
28690 255707 90312 -15964 -34148 -7319 43721 76662 43730 4329 71020 203181 229361
28679 229361 129829 92738 188037 203742 -16292 -259200 -216427 39353 129941 -95646 -373027
28668 -373027 -422745 -299435 -217274 -215040 -178198 -93452 -83636 -197414 -321597 -344310 -293247
28657 -293247 -247852 -195587 -69099 103254 182618 83436 -110369 -236344 -220138 -104613
28647 -104613 46209 193375 283875 260854 151141 71944 95916 159466 160412 99381 53947
28636 53947 46948 26196 -31367 -76375 -62375 -19 81093 163222 208229 156217 3921 -153604
28624 -153604 -211210 -169233 -121302 -135006 -184980 -211423 -207549 -217911 -266336 -330248 -396526 -490454
28612 -490454 -603413 -637225 -506260 -282424 -135643 -113153 -91687 8413 95073 78990
28602 78990 39738 73244 89999 -37342 -199874 -162276 68456 230494 198729 140272 194280
28591 194280 242357 142302 -23753 -115530 -167747 -255015 -281607 -136373 64919 134070 109360
28580 109360 147087 202878 116802 -29274 27239 281557 405538 238765 29209 27806 115623
28569 115623 45486 -159685 -291108 -290631 -265814 -259861 -224539 -173352 -175437 -221762 -241972 -223250
28557 -223250 -195928 -158508 -132378 -205636 -378991 -458695 -283862 5513 125013 28804 -71168
28546 -71168 -50767 -13671 -56440 -108305 -82535 -15701 33300 86546 165361 220797 224008 228895
28534 228895 279387 342539 383619 415258 429741 383220 290378 230022 215019 170458 82117
28523 82117 31705 25374 -59310 -254892 -375989 -250608 20276 177697 112263 -68815 -218208
28512 -218208 -261979 -185502 -37087 76464 100486 106682 163041 185254 46897 -193481 -319175
28501 -319175 -222592 -30673 63055 1602 -125833 -198441 -150474 5399 197458 336782
28491 336782 347235 191695 -64262 -231171 -157652 56554 147354 46463 -13118 134555
28481 134555 303319 238195 27111 -39988 67806 104463 -33637 -179645 -222308 -256277
28471 -256277 -320972 -281971 -108885 -2931 -72582 -124029 19540 210213 229301 160225 227021
28460 227021 397537 447148 335606 223330 158007 44400 -84787 -76622 27374 -9494
28450 -9494 -218282 -318175 -152322 42927 5879 -139885 -95144 149804 334996 338217 290852
28439 290852 291566 252746 99491 -67639 -114413 -61388 -31350 -75990 -137351 -146709 -98753 -37672
28427 -37672 -5460 -4180 -1334 21966 37768 5631 -69082 -133947 -140237 -81948 -2733 24525
28415 24525 -39934 -139518 -164225 -85986 5320 42923 83899 188920 274927 213126 37662
28404 37662 -84768 -91509 -84620 -128228 -138037 -47262 49316 29264 -68671 -109092 -59834 -15716
28392 -15716 -51874 -149291 -245309 -274934 -190079 -29353 56025 -48100 -248055 -326051 -203190
28381 -203190 -15942 85264 99192 95706 91473 80140 95211 151164 187582 160225 124992
28370 124992 131508 96775 -78042 -295908 -332855 -146130 39569 27585 -96200 -111739 25628
28359 25628 156461 152603 49708 -50214 -93958 -72626 9735 127892 245662 342871 390694
28348 390694 332311 170616 40279 63990 144268 60620 -189999 -334589 -204762 2499
28338 2499 7964 -150903 -218954 -128003 -51169 -77004 -89774 -23827 735 -96525 -189134 -139701
28326 -139701 -17924 19319 -46137 -123388 -169585 -179157 -105731 50306 144225 46318 -134391
28315 -134391 -155369 26754 183136 107141 -143368 -346830 -364416 -233092 -84601 -28324
28305 -28324 -81140 -178038 -254697 -303570 -332656 -321361 -273067 -260946 -339761 -445819 -469304
28294 -469304 -396813 -295708 -193065 -74278 28158 64191 68476 110012 151720 96469 -29320
28283 -29320 -90123 -54044 -25819 -32135 39792 208384 287417 144603 -77509 -158749 -104318
28272 -104318 -76675 -115088 -123441 -91968 -114593 -169447 -89340 168114 386167 348824 128267
28261 128267 -25490 -22598 -10112 -112843 -248061 -270931 -197923 -164768 -205597 -208946 -109874
28250 -109874 -2535 -590 -79778 -135608 -121487 -50278 62846 164873 155454 31563 -41656
28239 -41656 46534 141115 29018 -200214 -250136 -73895 40152 -86135 -255648 -218536
28229 -218536 -32797 82454 77911 57036 57022 44062 38992 77986 124276 155820 235541 352164
28217 352164 327238 66857 -221752 -284468 -183565 -164639 -250587 -247414 -112746 -24824 -65353
28206 -65353 -102548 -43972 29240 45099 50434 77567 87929 87653 109441 66245 -144959 -371372
28194 -371372 -315920 7669 223676 115099 -100154 -170767 -178199 -268617 -311921 -148702 43116
28183 43116 -4516 -175182 -125200 145503 268515 78977 -151208 -158312 -51571 -60074 -151193
28172 -151193 -116571 91908 306349 370187 282100 133507 -1898 -112331 -219012 -300379
28162 -300379 -268998 -89214 104468 121766 -31913 -142799 -79931 25381 -15384 -167440
28152 -167440 -232431 -139459 -32837 -58559 -179929 -252119 -196731 -39476 163184 344482
28142 344482 399548 250218 -22026 -197274 -148794 5084 67428 20460 -11734 -14419 -105337
28131 -105337 -277673 -329152 -161841 24904 6636 -140472 -183872 -95342 -31015 -15619 78955
28120 78955 229959 217709 -25402 -256157 -245735 -73436 53132 98481 135982 123378 -33512
28109 -33512 -257206 -353287 -278651 -174119 -122896 -52402 82161 176866 127692 -5901 -76644
28098 -76644 -30867 51410 58051 -55035 -223227 -302605 -192577 35936 190252 174917 99731
28087 99731 110879 178761 153055 559 -132021 -121123 -30529 -4021 -61882 -96858 -44496
28076 -44496 44181 112839 186367 294915 384967 386465 328432 301089 320477 321932 287418 274337
28064 274337 285290 216485 12099 -211570 -297952 -256589 -226441 -259914 -272469 -219941 -189832
28053 -189832 -246897 -295566 -206367 -21060 91038 69409 33779 85104 141119 57005 -143460
28042 -143460 -262961 -166070 62608 238776 299772 334097 408261 452494 363629 169421 17906
28031 17906 7735 91093 161159 176882 159834 116935 39609 -33771 -35845 25081 46574 -31619
28019 -31619 -123281 -99240 28731 112622 69083 -5733 28175 160792 247471 200677 93637
28008 93637 55354 115356 189540 194164 133010 70145 43568 23753 -44139 -166233 -276203
27997 -276203 -290627 -190530 -48987 24564 -22930 -141408 -226463 -220048 -150299 -61287 62260
27986 62260 246663 419752 437143 262365 54420 2172 105740 196865 154827 20601
27976 20601 -95839 -130471 -71978 54661 166449 154437 -6310 -220024 -376600 -442131
27966 -442131 -414024 -267213 -18459 213690 304434 257766 179642 143290 147952 176946 208130
27955 208130 179016 29128 -213125 -445502 -586678 -602675 -479716 -265406 -105750 -114259
27945 -114259 -202838 -174484 -3752 117961 63239 -54036 -64566 28873 116990 153913 130660
27934 130660 -10956 -271950 -474132 -421743 -158650 90929 213042 270843 298840 229705
27924 229705 68596 -43750 -28977 12187 -24547 -82506 -65263 -13207 -25537 -76155 -45244
27913 -45244 91822 223100 244891 161045 40230 -50292 -67600 -20346 14285 -43207 -170835
27902 -170835 -244205 -161786 42748 224408 260490 158065 25547 -52354 -74110 -51048 40606
27891 40606 170474 202377 65364 -75966 -499 229078 317799 175530 62848 177345
27881 177345 332037 258109 38425 -36800 71618 142426 92175 65884 112073 82332 -55786
27870 -55786 -95995 66376 216741 133642 -78709 -180487 -157778 -159656 -194084 -147200 -45503
27859 -45503 -32405 -84070 -6695 223543 350935 187326 -110938 -256496 -190445 -74539
27849 -74539 -18319 12830 53223 65628 34520 8612 16366 31539 51999 121132 226751 262755
27837 262755 155655 -29508 -170434 -224671 -227317 -205322 -166903 -135538 -120598 -90305 -43359
27826 -43359 -52418 -142388 -188559 -72732 103626 134400 23981 -14834 90385 151334 47222
27815 47222 -45823 73368 297182 356936 198577 3776 -96625 -130747 -145530 -142012 -134338
27804 -134338 -123890 -47550 109893 217109 170330 79875 84616 80265 -101533 -318298 -257089
27793 -257089 51891 226313 112600 9694 161204 375262 380840 256911 214169 189600
27783 189600 -9822 -316906 -484804 -463291 -397458 -323213 -160129 31741 83392 12173
27773 12173 17567 150207 231644 157177 51148 41999 78108 60539 3045 -28068 -12271 47217
27761 47217 130393 152516 42432 -97982 -64568 164275 363853 354370 206992 69979 -59221
27750 -59221 -251510 -447448 -508006 -426198 -348045 -375403 -446839 -441978 -343070 -250524 -247421 -279492
27738 -279492 -210223 -10890 158415 121736 -90244 -272670 -289861 -196030 -105786 -41957 40464
27727 40464 143087 199029 150986 30958 -52641 -34970 5478 -59547 -195555 -202329 -672
27716 -672 202645 175579 -13428 -109069 -39746 34922 20201 4208 55333 112772 134483 166031
27704 166031 201357 160445 73584 92137 223874 259450 92295 -78285 -30869 153065 242385
27693 242385 208346 205459 273237 277326 140722 -43524 -151146 -150132 -71301 39901 127977
27682 127977 159438 150577 112342 5794 -177563 -335964 -348071 -223082 -89986 -58175 -136144
27671 -136144 -242184 -247848 -81333 148427 212784 30996 -205564 -267815 -155473 -22697
27661 -22697 52626 73607 -3152 -199202 -365234 -310466 -82082 75645 59553 16995 79892
27650 79892 183278 228889 253140 310139 320915 184954 -31463 -151225 -104740 2211 29619
27639 29619 -50882 -148838 -163203 -103601 -92466 -201307 -309629 -228498 24182 199898 137399
27628 137399 -10547 21177 258598 471078 473927 315569 149499 39664 -44062 -110532
27618 -110532 -115681 -42567 43278 51364 -25665 -85197 -21155 141029 247413 180251 2073
27607 2073 -102078 -26323 148401 259900 238687 142498 47890 -28323 -91643 -118795 -89200
27596 -89200 -31084 11420 31456 35634 5213 -49838 -31521 147693 402207 515137 381129
27585 381129 124007 -65481 -125179 -112219 -90634 -94119 -126833 -140025 -78948 1052 -31925
27574 -31925 -172910 -230531 -98113 59919 45678 -72848 -102565 -66040 -142211 -302401 -296014
27563 -296014 -51024 182180 200491 124030 145081 208326 153451 31418 32702 158844 197261
27552 197261 37562 -170779 -228918 -126828 -8515 15160 -42964 -99285 -96702 -55111 -32391
27541 -32391 -39914 -31338 11329 37484 14034 -7323 28754 83468 84222 46077 48594 109505 159283
27528 159283 135005 37731 -89531 -184674 -194671 -143158 -129519 -182309 -167593 37536 317465
27517 317465 421236 302088 187274 252398 385840 382620 239102 106743 39118 -40056
27507 -40056 -137837 -131947 39073 241351 282873 137319 -30561 -49746 82292 211681 201277
27496 201277 74611 -34366 -59527 -64268 -104823 -123701 -58971 17807 1442 -48560 30838
27485 30838 235012 353734 275808 170320 232275 373678 353625 156216 28635 119016
27475 119016 266453 244716 75752 -35306 -4159 42173 -23502 -152420 -209111 -161677 -102757
27464 -102757 -98647 -96461 -18719 97927 132445 50995 -27862 9713 103952 91361 -71282
27453 -71282 -241014 -269585 -174455 -77381 -26846 36583 141530 193146 78264 -160170 -328036
27442 -328036 -296017 -158614 -104806 -158166 -157388 -17152 122472 97563 -34797 -93061 -52256
27431 -52256 -62765 -192626 -312188 -279298 -110390 89668 257406 363803 371938 279982 148625
27420 148625 35509 -42101 -59767 5829 87237 58599 -77900 -146983 -27376 171590 256884
27409 256884 192906 95422 56488 77608 115948 101897 -26388 -214041 -290171 -181663 -46128
27398 -46128 -68461 -201135 -249735 -152681 -17078 76521 135398 149517 100357 64979 134490
27387 134490 224186 149925 -77965 -225025 -154574 -588 62872 52457 58119 45452 -63580
27376 -63580 -199922 -200931 -31689 169129 264107 248880 202096 173992 153080 114584 73149
27365 73149 69774 103365 111350 53700 -17121 -20496 50536 147932 243797 312155 291291 169549
27353 169549 59070 56903 80020 -4220 -123386 -78373 123849 244405 170235 64156 58186
27342 58186 28952 -158922 -380938 -429224 -321306 -221239 -156443 -34082 125097 195536
27332 195536 174179 193130 285305 317681 206642 54481 6960 77214 167290 190809 132458
27321 132458 41264 -7868 14511 54935 47033 618 -26327 -16608 2525 12828 -911 -70211
27309 -70211 -178057 -214950 -98193 85728 156869 53018 -122119 -246994 -280486 -222787
27299 -222787 -94125 26773 46016 -25828 -77053 -48916 -8024 -26712 -66521 -39339 62553
27288 62553 156922 175724 136887 107089 109723 90859 334 -107442 -118573 -26438 28262 -53702
27276 -53702 -176409 -176669 -47463 78292 124305 118943 65905 -80681 -282967 -397028 -344554
27265 -344554 -207819 -100417 -37299 11848 39092 45442 86831 181381 238152 181264 95315
27254 95315 127216 260191 313235 193101 30487 -6403 52915 41716 -86675 -193592 -173368
27243 -173368 -114352 -154098 -258501 -273018 -161173 -52048 -37071 -56897 -41556 -34243 -86459
27232 -86459 -134594 -96920 -24408 -32030 -115321 -148741 -56852 100894 208684 191083 53142
27221 53142 -114374 -200876 -199877 -213295 -279658 -294430 -193845 -99573 -124687 -139147 53449
27210 53449 354177 433522 183146 -128961 -225047 -131044 -24937 35234 89428 124857 103359
27199 103359 56245 29783 346 -67911 -154837 -244102 -354398 -438558 -375753 -168062 -16916
27188 -16916 -64714 -171927 -116005 78032 194730 158972 103021 109300 88534 -33141 -163283
27177 -163283 -159685 -3166 200299 318541 270947 91094 -63765 -48575 98276 194199
27167 194199 134081 -16741 -161028 -282457 -374208 -372903 -251750 -100905 -24756 -12152 11418
27156 11418 51697 53396 7335 -39581 -69876 -111861 -169800 -203917 -184965 -115389 -2741 125093
27144 125093 185107 104587 -56427 -129804 -34451 116421 159941 82286 3818 5664 55126
27133 55126 91842 105983 115954 127517 132047 106411 21736 -94221 -122395 30492 273417
27122 273417 392179 304832 156614 108646 142340 161820 183765 284079 412863 419319 260549
27111 260549 57135 -74513 -132439 -150161 -119232 -39535 34182 45598 -13423 -123415 -245469
27100 -245469 -302057 -235383 -111909 -84974 -209434 -359071 -368278 -201534 41383 223164
27090 223164 250398 137147 22403 47184 175879 219691 81756 -106648 -153974 -33483
27080 -33483 127624 212484 191014 92200 -15956 -54699 -10537 43660 43679 2160 -52353 -127398
$$ [...]
##END NTUPLES=NMR SPECTRUM
##END=
