##TITLE=31Pdec_LY-4Dix.60.4
 CD3CN, 24 sc
 12.03.2021
##JCAMPDX= 6.0         $$ Bruker NMR JCAMP-DX V2.0
##DATA TYPE= NMR SPECTRUM
##DATA CLASS= NTUPLES
##ORIGIN= UXNMR, Bruker Analytische Messtechnik GmbH
##OWNER= root
$$ XWIN-NMR		Version 3.5
$$ Fri Mar 12 12:58:11 2021 Russian Standard Time (UT+4h)  she@DPX200
##.OBSERVE FREQUENCY= 81.013821
##.OBSERVE NUCLEUS= ^31P
##.ACQUISITION MODE= SIMULTANEOUS
##.ACQUISITION SCHEME= undefined
##.AVERAGES= 24
##.DIGITISER RES= 16
##SPECTROMETER/DATA SYSTEM= spect
##.PULSE SEQUENCE= zgpg30
##.SOLVENT NAME= CD3CN
##.SHIFT REFERENCE= (INTERNAL, CD3CN, 0, 248.564)
##AUDIT TRAIL= $$ (NUMBER, WHEN, WHO, WHERE, WHAT)
$$ ##TITLE= Audit trail, XWIN-NMR		Version 3.5
$$ ##JCAMPDX= 5.01
$$ ##ORIGIN= Bruker BioSpin GmbH
$$ ##OWNER= she
$$ F:/spectra/data/she/nmr/P31/1/pdata/1/auditp.txt
$$ ##AUDIT TRAIL=  $$ (NUMBER, WHEN, WHO, WHERE, WHAT)
(   1,<2021-03-12 12:57:07.81 +0400>,<she>,<DPX200>,
      <created by zg, POWCHK disabled, PULCHK disabled
       configuration hash MD5:
       00 E9 B6 7A A2 85 ED C7 34 08 36 98 17 FE 4E 26
       data hash MD5: 32K
       A2 F8 45 A9 8D 00 FE 85 14 2E 07 46 B3 CE C8 56>)
(   2,<2021-03-12 12:57:11.00 +0400>,<she>,<DPX200>,
      <Start of raw data processing
       efp BC_mod = 2 LB = 1 FT_mod = 6 PKNL = 1 PHC0 = -4284.5 PHC1 = 612.2012 SI = 64K 
       data hash MD5: 64K
       8E 0C 10 96 BD 0C 62 41 90 9A 16 C8 6C 5F 03 5F>)
(   3,<2021-03-12 12:57:37.04 +0400>,<she>,<DPX200>,
      <pk PHC0 = -124.2136 PHC1 = 133 
       data hash MD5: 64K
       9E 66 44 05 EE A6 B9 50 89 C3 45 18 6B AA 0E 0A>)
$$ ##END=
$$ 
$$ hash MD5
$$ D8 1D A3 4B F1 DB 67 2D 28 96 18 3D B6 37 13 69
##$RELAX= 
##$RELAX= 
##$RELAX= 
##$RELAX= 
##$RELAX= 
##$RELAX= 
##$RELAX= 
##$RELAX= 
$$ Bruker specific parameters
$$ --------------------------
##$DU= <F:/spectra>
##$EXPNO= 1
##$NAME= <P31>
##$PROCNO= 1
##$TYPE= <nmr>
##$USER= <she>
##$AMP= (0..31)
100 100 100 100 100 100 100 100 100 100 100 100 100 100 100 100 100 100 
100 100 100 100 100 100 100 100 100 100 100 100 100 100 
##$AQSEQ= 0
##$AQ_mod= 1
##$AUNM= <au_zg>
##$AUTOPOS= <>
##$BF1= 81.014009
##$BF2= 200.13
##$BF3= 200.13
##$BF4= 200.13
##$BF5= 200.13
##$BF6= 200.13
##$BF7= 200.13
##$BF8= 200.13
##$BYTORDA= 1
##$CFDGTYP= 0
##$CFRGTYP= 5
##$CHEMSTR= <none>
##$CNST= (0..31)
1 1 145 1 1 1 1 1 1 1 1 1 1 1 1 1 1 1 1 1 1 1 1 1 1 1 1 1 1 1 1 1 
##$CPDPRG= <waltz16>
##$CPDPRG1= <>
##$CPDPRG2= <waltz16>
##$CPDPRG3= <>
##$CPDPRG4= <mlev>
##$CPDPRG5= <mlev>
##$CPDPRG6= <mlev>
##$CPDPRG7= <mlev>
##$CPDPRG8= <mlev>
##$CPDPRGB= <>
##$CPDPRGT= <>
##$D= (0..31)
0 1 0 0 0 0 0 0 0 0 0 0.03 2e-05 3e-06 0 0 0 0 0 0 0 0 0 0 0 0 0 0 0 0 
0 0 
##$DATE= 1615539427
##$DBL= (0..7)
120 120 120 11 120 120 24 19 
##$DBP= (0..7)
150 150 150 150 150 150 150 150 
##$DBP07= 0
##$DBPNAM0= <>
##$DBPNAM1= <>
##$DBPNAM2= <>
##$DBPNAM3= <>
##$DBPNAM4= <>
##$DBPNAM5= <>
##$DBPNAM6= <>
##$DBPNAM7= <>
##$DBPOAL= (0..7)
0.5 0.5 0.5 0.5 0.5 0.5 0.5 0.5 
##$DBPOFFS= (0..7)
$$ [...]
##$SUBNAM2= <"">
##$SUBNAM3= <"">
##$SUBNAM4= <"">
##$SUBNAM5= <"">
##$SUBNAM6= <"">
##$SUBNAM7= <"">
##$SUBNAM8= <"">
##$SUBNAM9= <"">
##$SW= 501.771253377433
##$SWIBOX= (0..15)
0 1 3 0 0 0 0 0 0 0 0 0 0 0 0 0 
##$SW_h= 40650.406504065
##$TD= 32768
##$TD0= 1
##$TE= 0
##$TE2= 300
##$TE3= 300
##$TEG= 300
##$TL= (0..7)
0 120 53 12 22 120 120 120 
##$TP= (0..7)
150 150 150 150 150 150 150 150 
##$TP07= 0
##$TPNAME0= <>
##$TPNAME1= <>
##$TPNAME2= <>
##$TPNAME3= <>
##$TPNAME4= <>
##$TPNAME5= <>
##$TPNAME6= <>
##$TPNAME7= <>
##$TPOAL= (0..7)
0.5 0.5 0.5 0.5 0.5 0.5 0.5 0.5 
##$TPOFFS= (0..7)
0 0 0 0 0 0 0 0 
##$TUNHIN= 0
##$TUNHOUT= 0
##$TUNXOUT= 0
##$USERA1= <user>
##$USERA2= <user>
##$USERA3= <user>
##$USERA4= <user>
##$USERA5= <user>
##$V9= 5
##$VALIST= <valist>
##$VCLIST= <CCCCCCCCCCCCCCC>
##$VD= 0
##$VDLIST= <DDDDDDDDDDDDDDD>
##$VPLIST= <PPPPPPPPPPPPPPP>
##$VTLIST= <TTTTTTTTTTTTTTT>
##$WBST= 1024
##$WBSW= 4
##$XGAIN= (0..3)
0 0 0 0 
##$XL= 0
##$YL= 0
##$YMAX_a= 4991
##$YMIN_a= -26343
##$ZGOPTNS= <>
##$ZL1= 120
##$ZL2= 120
##$ZL3= 120
##$ZL4= 120
##$ABSF1= 0
##$ABSF2= 0
##$ABSG= 0
##$ABSL= 0
##$ALPHA= 0
##$AQORDER= 0
##$ASSFAC= 0
##$ASSFACI= 0
##$ASSFACX= 0
##$ASSWID= 0
##$AUNMP= <proc_1d>
##$AZFE= 0.1
##$AZFW= 0.5
##$BCFW= 0
##$BC_mod= 2
##$BYTORDP= 0
##$COROFFS= 0
##$CY= -3
##$DATMOD= 1
##$DC= 0
##$DFILT= <>
##$DTYPP= 0
##$F1P= 0
##$F2P= 0
##$FCOR= 1
##$FTSIZE= 65536
##$FT_mod= 6
##$GAMMA= 0
##$GB= 0
##$INTBC= 1
##$INTSCL= 5.30512e-09
##$ISEN= 30
##$LB= 1
##$LEV0= 0
##$LPBIN= 0
##$MAXI= 10000
##$MC2= 0
##$MEAN= 0
##$ME_mod= 0
##$MI= 50
##$NCOEF= 0
##$NC_proc= -2
##$NLEV= 6
##$NOISF1= 182.463
##$NOISF2= 159.3651
##$NSP= 0
##$NTH_PI= 0
##$NZP= 0
##$OFFSET= 248.5645
##$PC= 4
##$PHC0= -4408.713
##$PHC1= 745.2012
##$PH_mod= 1
##$PKNL= yes
##$PPARMOD= 0
##$PSCAL= 0
##$PSIGN= 0
##$REVERSE= no
##$SF= 81.014009
##$SI= 65536
##$SIGF1= 159.3651
##$SIGF2= -187.1042
##$SINO= 113.3802
##$SIOLD= 16384
##$SREGLST= <1H.CDCl3>
##$SSB= 0
##$STSI= 65536
##$STSR= 0
##$SW_p= 40650.406504065
##$SYMM= 0
##$S_DEV= 0
##$TDeff= 32768
##$TDoff= 0
##$TI= <>
##$TILT= no
##$TM1= 0
##$TM2= 0
##$TOPLEV= 0
##$USERP1= <user>
##$USERP2= <user>
##$USERP3= <user>
##$USERP4= <user>
##$USERP5= <user>
##$WDW= 1
##$XDIM= 65536
##$YMAX_p= 350266014
##$YMIN_p= -1623969
$$ End of Bruker specific parameters
$$ ---------------------------------
##NTUPLES= NMR SPECTRUM
##VAR_NAME=  FREQUENCY,     SPECTRUM/REAL,   SPECTRUM/IMAG
##SYMBOL=    X,             R,               I
##VAR_TYPE=  INDEPENDENT,   DEPENDENT,       DEPENDENT
##VAR_FORM=  AFFN,          ASDF,            ASDF
##VAR_DIM=   65536,         65536,           65536
##UNITS=     HZ,            ARBITRARY UNITS, ARBITRARY UNITS
##FACTOR=    0.620285442955139, 1,           1
##FIRST=     20137.2065510759, 0,            0
##LAST=      -20513.1999529892, 0,           0
##MIN=       -20513.1999529892, -1623969,    0
##MAX=       20137.2065510759, 350266014,    0
$$ Real data points
##PAGE= N=1
##DATA TABLE= (X++(R..R)), XYDATA
$$ [...]
##PAGE= N=2
##DATA TABLE= (X++(I..I)), XYDATA
$$ plain form
35752 398132 528391 541347 551437 602563 623808 606453 639790 727792 728971 555670 311784
35741 311784 153286 117440 167213 291978 458379 554255 505796 394328 349132 376903 405248
35730 405248 443346 570088 778648 949387 987368 905766 774531 659386 604822 605833 596141
35719 596141 517706 393519 295070 270992 342615 502986 657291 644380 420506 164751
35709 164751 91298 202307 337626 414258 472458 517412 485204 384463 320816 335438 343527
35698 343527 284595 224672 247600 331353 395380 409690 405266 416206 440325 430198 334427 194140
35686 194140 160630 328167 574525 676975 578508 426504 356099 367386 419408 489375 504237
35675 504237 373413 154807 42841 116291 239582 293148 338756 441466 498833 420976
$$ packed form
35752C98132J30259J2956J0090N1126K1245j7355L3337Q8002J179j73301k43886
35741C11784j58498l5846M9773J24765J66401R5876m8459j11468m5196K7771K8345
35730D05248L8098J26742K08560J70739L7981q1602j31235j15145n4564J011r692
35719E96141p8435j24187r8449k4078P1623J60371J54305j2911k23874k55755
35709A64751p3453J11009J35319P6632N8200M4954l2208j00741o3647J4622Q089
35698C43527n8932n9923K2928Q3753O4027J4310m424J0940K4119j0127r5771j40287
35686A94140l3510J67537K46358J02450r8467j52004p0405J1287N2022O9967J4862
35675E04237j30824k18606j11966P3450J23291N3566M5608J02710N7367p7857
$$ plain form
35665 420976 340642 427919 587561 579303 397217 277233 316004 343645 257829 236476 450292
35654 450292 746301 835842 700087 583922 617465 667838 605964 513252 510126 537621 477265
35643 477265 397007 477640 704103 831151 729111 595471 681345 916119 989284 777542
35633 777542 500979 404904 447797 418954 261312 125583 130240 211587 251211 247471 283220
35622 283220 379564 473543 532954 604289 708849 759937 661413 465117 343498 388931 514593
35611 514593 590093 603105 622753 661033 663410 617434 580398 591119 626605 657913 679695 666769
35599 666769 574646 421364 308643 310816 382618 427358 427694 453114 545019 644877 655611 552965
35587 552965 415748 344868 363605 410583 426836 422915 446842 513692 595296 661595 701281
$$ packed form
35665D20976q0334Q7277J59642q258j82086j19984L8771K7641q5816k1353K13816
35654D50292K96009Q9541j35755j16165L3543N0373o1874r2712l126K7495o0356
35643D77265q0258Q0633K26463J27048j02040j33640Q5874K34774P3165k11742
35633G77542k76563r6075M2893k8843j57642j35729M657Q1347L9624l740L5749
35622B83220R6344R3979N9411P1335J04560N1088r8524j96296j21619M5433J25662
35611E14593P5500J3012J9648L8280K377m5976l7036J0721L5486L1308K1782j2926
35599F66769r2123j53282j12721K173P1802M4740L36K5420R1905R9858J0734j02646
35587E52965j37217p0880J8737M6978J6253l921K3927O6850Q1604O6299L9686
$$ plain form
35576 701281 711421 691477 640956 556072 454893 405941 468910 580691 582462 425179 271771
35565 271771 302035 480274 628877 675389 686687 696817 669705 631984 666528 739979 709213
35554 709213 560092 472074 558541 701486 752668 745673 770200 776308 678585 551962 534031
35543 534031 596835 600553 528716 480967 459031 364015 217185 178721 292016 393092 360025
35532 360025 293464 338318 455673 506328 476459 481375 579066 693883 722434 639519 500041
35521 500041 386805 350536 369959 389043 408480 489106 630780 714441 637987 472024 399467
35510 399467 506465 693566 792321 722158 538221 373202 333535 413755 510160 541842 539651
35499 539651 581616 668751 722356 691982 604689 510525 444534 446970 543204 673372 714479
$$ packed form
35576G01281J0140j9944n0521q4884j01179m8952O2969J11781J771j57283j53408
35565B71771L0264J78239J48603M6512J1298J0130k7112l7721L4544P3451l0766
35554G09213j49121q8018Q6467J42945N1182o995K4527O108r7723j26623j7931
35543E34031O2804L718p1837m7749k1936r5016j46830l8464J13295J01076l3067
35532C60025o6561M4854J17355N0655k9869M916R7691J14817K8551q2915j39478
35521E00041j13236l6269J9423J9084J9437Q0626J41674Q3661p6454j65963p2557
35510C99467J06998J87101R8755p0163j83937j65019l9667Q0220R6405L1682k191
35499E39651M1965Q7135N3605l0374q7293r4164o5991K436R6234J30168M1107
$$ plain form
35488 714479 624871 509775 479324 489951 415125 254263 169391 287005 541641 760633
35478 760633 843369 803953 694685 571762 511864 565239 669616 682188 536810 325663
35468 325663 194925 202674 309614 454722 582056 630115 568558 443662 337137 283496
35458 283496 268849 291635 361883 445928 482369 467498 464996 513634 583102 639152 687873 726200
35446 726200 714307 641615 566092 542080 557040 579785 613533 654007 661592 637543 658907 760268
35434 760268 852379 854910 834318 880054 912051 786542 563781 467120 551565 618857 533781
35423 533781 426366 460365 577449 632379 640370 698287 758156 690935 537145 497211 664035
35412 664035 916283 1085899 1106663 1006355 878569 847078 933010 990967 915053 843817 964851
$$ packed form
35488G14479q9608j15096l0451J0627p4826j60862q4872J17614K54636K18992
35478G60633Q2736l9416j09268j22923n9898N3375J04377J2572j45378k11147
35468C25663j30738P749J06940J45108J27334M8059o1557j24896j06525n3641
35458B83496j4647K2786P0248Q4045L6441j4871k502M8638O9468N6050M8721L8327
35446G26200j1893p2692p5523k4012J4960K2745L3748M0474P585k4049K1364J01361
35434G60268R2111K531k0592M5736L1997j25509k22761r6661Q4445O7292q5076
35423E33781j07415L3999J17084N4930P991N7917N9869o7221j53790l9934J66824
35412F64035K52248J69616K0764j00308j27786l1491Q5932N7957p5914p1236J21034
$$ plain form
35401 964851 1174419 1194446 1009426 857486 726743 249326 -687711 -1565402 -1802258 -1481254
35391 -1481254 -1151734 -1062758 -995713 -790918 -599172 -534821 -462849 -292814 -178438 -224948
35381 -224948 -244903 -37540 268288 389155 281596 131015 34894 -64107 -166760 -173100
35371 -173100 -70638 25472 59957 98460 156257 135995 16436 -53327 30854 142405 104939
35360 104939 -24138 -28614 135169 269150 232777 137772 144516 201405 141038 -35358 -142120
35349 -142120 -74644 62159 126709 109969 72456 32013 3648 56030 217375 383880 427549
35338 427549 355138 265772 196911 122394 66218 87206 155384 168739 107995 61520 76948
35327 76948 103135 111293 156289 262864 355115 367940 342779 341166 337810 276398 174647 103219
$$ packed form
35401I64851K09568K0027j85020j51940j30743m77417r37037q77691k36856L21004
35391a481254L29520Q8976O7045K04795J91746O4351P1972J70035J14376m6510
35381b24948j9955K07363L05828J20867j07559j50581r6121r9001j02653o340
35371a73100J02462R6110L4485L8503N7797k0262j19559o9763Q4181J11551l7466
35360A04939j29077m476J63783J33981l6373r5005O744N6889o0367j76396j06762
35349a42120O7476J36803O4550j6740l7513m0443k8365N2382J61345J66505M3669
35338D27549p2411q9366o8861p4517n6176K0988O8178J3355o0744m6475J5428
35327G6948K6187Q158M4996J06575R2251J2825k5161j613l356o1412j01751p1428
$$ plain form
35315 103219 104898 187745 341503 502555 564012 492596 387369 355845 382192 388274 369222
35304 369222 377638 410962 412044 370947 347718 397768 528642 704758 836543 809209 608538
35293 608538 385853 302073 331742 328455 263832 262489 379360 487898 463120 361491 316505
35282 316505 331401 292935 162359 43876 47895 157791 260077 268461 198112 138017 160289
35271 160289 246206 304260 272200 190318 155065 209526 305918 379001 430431 513753 631613
35260 631613 677970 536860 260792 90977 216930 529198 711204 606028 392246 332053
35250 332053 446099 554392 564955 555050 578697 576110 527694 530271 614340 624692 431338
35239 431338 164183 69028 182927 325472 385074 421874 469796 438084 292263 169721
$$ packed form
35315A03219J679Q2847J53758J61052O1457p1416j05227l1524K6347O082j9052
35304C69222Q416L3324J082m1097k3229N0050J30874J76116J31785k7334k00671
35293F08538k22685q3780K9669l287o4623j343J16871J08538k4778j01629m4986
35282C16505J4896l8466j30576j18483M019J09896J02286Q384p0349o0095K2272
35271A60289Q5917N8054l2060q1882l5253N4461R6392P3083N1430Q3322J17860
35260F31613M6357j41110k76068j69815J25953L12268J82006j05176k13782o0193
35250C32053J14046J08293J0563r905K3647k587m8416K577Q4069J0352j93354
35239D31338k67155r5155J13899J42545N9602L6800M7922l1712j45821j22542
$$ plain form
35229 169721 200850 332434 440001 515496 623377 745734 791174 714340 541508 333878
35219 333878 195553 227790 379904 442842 308991 139821 135255 240079 259338 177370 142666
35208 142666 187761 208550 213359 335170 553400 652662 546918 423617 454383 561392 596963
35197 596963 571965 562873 552822 514007 505464 544968 526728 414771 364149 474668 577252
35186 577252 478341 285660 246651 361183 422211 382636 397502 510001 580509 571336 633481
35175 633481 819929 948949 875923 707593 613833 591086 552225 510241 519907 539557 495291
35164 495291 409878 348336 307696 272344 298565 415111 506611 440358 272898 190910 259647
35153 259647 360542 384943 367975 396508 476595 537690 519106 432637 372353 445024 638708
$$ packed form
35229A69721L1129J31584J07567P5495J07881J22357M5440p6834j72832k07630
35219C33878j38325L2237J52114O2938j33851j69170m566J04824J9259q1968l4704
35208A42666M5095K0789M809J21811K18230R9262j05744j23301L0766J07009L5571
35197E96963k4998r092j0051l8815q543L9504j8240j11957n0622J10519J02584
35186E77252r8911j92681l9009J14532O1028l9575J4866J12499P0508r173O2145
35175F33481J86448J29020p3026j68330r3760k2747l8861m1984R666J9650m4266
35164D95291q5413o1542m0640l5352K6221J16546R1500o6253j67460q1988O8737
35153B59647J00895K4401j6968K8533Q0087O1095j8584q6469o0284P2671J93684
$$ plain form
35142 638708 792302 772890 649623 586347 591903 530881 395164 373631 552716 718126 631162
35131 631162 397972 348181 571305 791707 753890 541732 408371 435205 506959 539310
35121 539310 568101 625375 658445 605376 479301 351995 289129 302032 339288 345859 344412
35110 344412 402277 492921 487490 356101 268912 370213 543123 568866 458850 422867 525163
35099 525163 601941 558685 515726 561621 578239 461528 338428 376266 501964 513500 398350
35088 398350 342745 446200 600148 666852 648151 642664 713766 820586 847951 730248 563868
35077 563868 517283 590309 582248 381406 150356 92599 167341 214659 249680 400713 616516
35066 616516 692074 590072 493784 495691 466736 325206 222262 312799 490026 512798 323735
$$ packed form
35142F38708J53594j9412j23267o3276N556o1022j35717k1533J79085J65410q6964
35131F31162k33190m9791K23124K20402l7817k12158j33361K6834P1754L2351
35121E39310K8791N7274L3070n3069j26075j27306o2866J2903L7256O571j447
35110C44412N7865R0644n431j31389q7189J01301J72910K5743j10016l5983J02296
35099E25163P6778m3256m2959M5895J6618j16711j23100L7838J25698J1536j15150
35088C98350n5605J03455J53948O6704j8701n487P1102J06820K7365j17703j66380
35077E63868m6585P3026q061k00842k31050n7757P4742M7318L5021J51033K15803
35066F16516P5558j02002r6288J907k8955j41530j02944R0537J77227K2772j89063
$$ plain form
35055 323735 106450 56206 186048 351369 417608 404702 456843 635444 790107 736325
35045 736325 530833 422557 514904 637234 611419 492928 445829 502411 573475 612541 638569
35034 638569 645273 612315 584871 628323 701980 683616 555667 481431 614799 861589 929978
35023 929978 669188 286706 122064 233415 359867 322264 271086 411233 651389 737322
35013 737322 632959 531614 533989 560002 574975 647986 742645 699627 515970 415880 526782
35002 526782 685697 701966 632210 641882 744542 836780 873144 862313 791718 679074 597011
34991 597011 546845 435190 273036 232708 375752 503380 450187 353349 419174 578524
34981 578524 620548 542614 496889 484358 396088 304499 399634 627370 693478 493958 279767
$$ packed form
35055C23735k17285n0244J29842J65321O6239j2906N2141J78601J54663n3782
35045G36325k05492j08276R2347J22330k5815j18491m7099N6582P1064L9066K6028
35034F38569O704l2958k7444M3452P3657j8364j27949p4236J33368K46790O8389
35023I29978k60790l82482j64642J11351J26452l7603n1178J40147K40156Q5933
35013G37322j04363j01345K375K6013J4973P3011R4659m3018j83657j00090J10902
35002E26782J58915J6269o9756R672J02660R2238L6364j0831p0595j12644q2063
34991E97011n0166j11655j62154m0328J43044J27628n3193r6838O5825J59350
34981E78524M2024p7934m5725j2531q8270r1589R5135K27736O6108j99520k14191
$$ plain form
34970 279767 298129 489103 642214 666757 597175 484544 389288 368111 397058 407572 420263
34959 420263 506956 612136 594337 477048 451826 567859 637932 553909 469884 521042 571598
34948 571598 445973 245286 200192 314830 388478 332679 253948 249289 309600 413797 547190
34937 547190 630640 588544 485717 453276 493884 515351 533509 644829 785308 739783 472685
34926 472685 251328 310983 552056 717753 744696 758203 801989 778072 650763 530033
34916 530033 500989 501555 439920 341188 299235 340968 413140 470659 509732 529819 526791 523776
34904 523776 550173 577036 531936 414210 345040 435425 621860 712770 618238 459325 398799
34893 398799 429479 420438 338089 300166 386405 507482 531708 461993 398664 382661 378801 382528
$$ packed form
34970B79767J8362J90974J53111K4543o9582j12631r5256k1177K8947J0514J2691
34959D20263Q6693J05180j7799j17289k5222J16033P0073q4023q4025N1158N0556
34948E71598j25625k00687m5094J14638P3648n5799p8731m659O0311J04197J33393
34937E47190Q3450m2096j02827l2441M0608K1467J8158J11320J40479m5525k67098
34926D72685k21357N9655K41073J65697K6943J3507M3786k3917j27309j20730
34916E30033k9044N66o1635r8732m1953M1733P2172N7519L9073K0087l028l015
34904E23776K6397K6863m5100j17726o9170R0385J86435R0910r4532j58913o0526
34893C98799L0680r041q2349l7923Q6239J21077K4226o9715o3329j6003l860L727
$$ plain form
34881 382528 425221 471088 428182 301585 234075 331588 525506 675427 738995 759703 747994
34870 747994 681045 593257 557020 567720 544374 469355 440541 535545 688123 766022 743587
34859 743587 731383 823340 956817 965961 781659 545600 480605 649254 892807 1021506
34849 1021506 998571 902415 794031 707435 702878 802121 891885 824497 633473 528568 630453
34838 630453 812229 868318 760989 626778 595886 680691 810477 905806 920350 852841 735706
34827 735706 619263 570801 645800 805786 901266 824234 661518 593457 643321 651109 518284
34816 518284 343106 257701 258861 277133 296030 313094 293985 264435 335330 520794 647851
34805 647851 594192 507697 602389 812996 871731 701692 503417 426392 389003 314848 333102
$$ packed form
34881C82528M2693M5867m2906j26597o7510R7513J93918J49921O3568K0708j1709
34870G47994o6949q7788l6237J0700k3346p5019k8814R5004J52578P7899k2435
34859G43587j2204R1957J33477R144j84302k36059o4995J68649K43553J28699
34849A021506k2935r6156j08384q6596m557R9243Q9764o7388j91024j04905J01885
34838F30453J81776N6089j07329j34211l0892Q4805J29786R5329J4544o7509j17135
34827G35706j16443m8462P4999J59986R5480p7032j62716o8061M9864P788j32825
34816E18284j75178q5405J160J8272J8897J7064j9109k9550P0895J85464J27057
34805F47851n3659q6495R4692K10607N8735j70039j98275p7025l7389p4155J8254
$$ plain form
34794 333102 572248 884681 975082 772432 516045 451969 562533 651435 617250 549208
34784 549208 557935 603079 561417 427425 336799 367709 433678 450099 497291 678346 884320
34773 884320 890641 695633 573676 712629 954695 1026682 918013 860943 973270 1100806
34763 1100806 1066648 938874 929473 1082133 1200472 1117839 923048 820549 832139 778293
34753 778293 559950 314458 224926 292171 396016 487505 586353 645285 571242 380605 206803
34742 206803 137412 145615 188649 260490 326307 322131 266913 275360 399467 535392 549618 439295
34730 439295 313691 265472 310076 414113 534508 639046 705716 704616 618203 511743 515606
34719 515606 650899 738908 620388 418062 397331 573175 678365 578321 476875 571117
$$ packed form
34794C33102K39146L12433R0401k02650k56387o4076J10564Q8902l4185o8042
34784E49208Q727M5144m1662j33992r0626L0910O5969J6421M7192J81055K05974
34773H84320O321j95008j21957J38953K42066P1987j08669n7070J12327J27536
34763A100806l4158j27774r401J52660J18339q2633j94791j02499J1590n3846
34753G78293k18343k45492q9532O7245J03845R1489R8848N8932p4043j90637j73802
34742B06803o9391Q203M3034P1841O5817m176n5218Q447J24107J35925J4226j10323
34730D39295j25604m8219M4604J04037J20395J04538O6670j100q6413j06460L863
34719E15606J35293Q8009j18520k02326k0731J75844J05190j00044j01446R4242
$$ plain form
34709 571117 720201 675364 488913 435613 592828 749298 728232 580042 424029 299217
34699 299217 234037 289207 439864 544374 519215 447775 448562 531960 645667 752243 792479
34688 792479 693542 512902 459090 636532 858297 864782 667785 509900 513003 553839 510183
34677 510183 448030 482346 587639 650204 620621 524769 397865 294089 294129 411432 544576
34666 544576 606402 640048 715651 784565 760516 685369 660356 649252 531372 350803 309735
34655 309735 455576 569619 475745 291008 226201 281185 316808 321134 391653 501850 504343
34644 504343 380143 292410 339175 412399 379676 279346 243251 312602 417310 482852 491040
34633 491040 476528 508155 627798 770881 800397 660182 446546 294528 247943 276186
$$ packed form
34709E71117J49084m4837j86451n3300J57215J56470k1066j48190j56013j24812
34699B99217o5180N5170J50657J04510k5159p1440P87Q3398J13707J06576M0236
34688G92479r8937j80640n3812J77442K21765O485j96997j57885L103M0836m3656
34677E10183o2153L4316J05293O2565k9583r5852j26904j03776M0J17303J33144
34666E44576O1826L3646P5603O8914k4049p5147k5013j1104j17880j80569m1068
34655C09735J45841J14043r3874j84737o4807N4984L5623M326P0519J10197K493
34644E04343j24200q7733M6765P3224l2723j00330l6095O9351J04708O5542Q188
34633D91040j4512L1627J19643J43083K9516j40215k13636j52018m6585K8243
$$ plain form
34623 276186 351434 450182 529932 570965 611837 690425 776989 813918 796432 768797 764177 789387
34611 789387 842895 903216 920768 864475 761683 661161 582371 532285 532058 577281 608331
34600 608331 582823 549034 574705 623348 589423 456048 320899 242218 164769 61991 53145
34589 53145 260915 596268 816696 808155 694811 637055 638252 623832 604082 634857 678212
34578 678212 644696 556943 528496 567989 553276 447909 391116 475185 566627 494425 328743
34567 328743 300952 476098 670839 713047 637829 578094 579898 599055 600714 586102 562438
34556 562438 543426 557648 623716 732973 861396 966684 982612 876763 720424 634130
34546 634130 646884 681041 700340 780268 966109 1141013 1142022 975953 809135 736026 669066
$$ packed form
34623B76186P5248R8748P9750M1033M0872P8588Q6564L6929j7486k7635m620K5210
34611G89387N3508O0321J7552n6293j02792j00522p8790n0086k27M5223L1050
34600F08331k5508l3789K5671M8643l3925j33375j35149p8681p7449j02778q846
34589E3145K07770L35353K20428q541j13344n7756J197j4420j9750L0775M3355
34578F78212l3516q7753k8447L9493j4713j05367n6793Q4069R1442p2202j65682
34567C28743k7791J75146J94741M2208p5218n9735J804J9157J659j4612k3664
34556E62438j9012J4222O6068J09257J28423J05288J5928j05849j56339q6294
34546F34130J2754L4157J9299P9928J85841J74904J009j66069j66818p3109o6960
$$ plain form
34535 669066 512188 348466 342193 486400 580430 497900 363529 373440 522162 637626 647288
34524 647288 653828 730617 796158 759827 670227 632614 675111 780212 952908 1159374 1283977
34513 1283977 1255548 1147057 1053232 953602 807821 690990 687482 724419 669292 536574 439807
34502 439807 398404 367768 402478 577268 773252 774641 593340 471365 520587 587994 551803
34491 551803 526080 647702 842029 941422 903363 788804 643065 514632 486087 570072
34481 570072 651888 624039 508353 392136 337828 398016 594754 823182 904038 802334
34471 802334 672601 630976 625819 595510 584381 610771 592760 521253 542271 734029 953017
34460 953017 1037003 1012604 963554 852568 637733 421384 313828 281964 289459 425201 704418
$$ packed form
34535F69066j56878j63722o273J44207R4030q2530j34371R911J48722J15464R662
34524F47288O540P6789O5541l6331q9600l7613M2497J05101J72696K06466J24603
34513A283977k8429j08491r3825r9630j45781j16831l508L6937n5127j32718r6767
34502D39807m1403l0636L4710J74790J95984J389j81301j21975M9222O7407l6191
34491E51803k5723J21622J94327R9393l8059j14559j45739j28433k8545Q3985
34481E70072Q1816k7849j15686j16217n4308O0188J96738K28428Q0856j01704
34471H02334j29733m1625n157l0309j1129K6390j8011p1507K1018J91758K18988
34460I53017Q3986k4399m9050j10986k14835k16349j07556l1864P495J35742K79217
$$ plain form
34449 704418 908737 853293 673681 608993 634903 580047 489031 561829 789172 943063 910789
34438 910789 780650 627044 469415 406900 515783 639674 570242 412608 453713 674913
34428 674913 753906 593539 468379 539832 606880 514671 452074 595004 753675 667821 433250
34417 433250 343470 467153 649969 799649 907230 897142 720834 529484 515184 633059
34407 633059 694550 676113 712852 832636 928461 978330 1069858 1199339 1253074 1208737 1161373
34396 1161373 1124125 1000982 803370 693605 729051 743524 600795 420022 408211 569813
34386 569813 729627 785067 791695 815963 837064 825575 821830 875997 958889 991234 944940 864663
34374 864663 790051 714096 646357 659256 800041 982816 1057775 994355 905146 865753 819230
$$ packed form
34449G04418K04319n5444j79612o4688K5910n4856r1016P2798K27343J53891l2274
34438I10789j30139j53606j57629o2515J08883J23891o9432j57634M1105K21200
34428F74913P8993j60367j25160P1453O7048r2209o2597J42930J58671q5854k34571
34417D33250q9780J23683J82816J49680J07581j0088j76308j91350j4300J17875
34407F33059O1491j8437L6739J19784R5825M9869R1528J29481N3735m4337m7364
34396A161373l7248j23143j97612j09765L5446J4473j42729j80773j1811J61602
34386E69813J59814N5440O628K4268K1101j1489l745N4167Q2892L2345m6294q0277
34374H64663p4612p5955o7739J2899J40785J82775P4959o3420q9209l9393m6523
$$ plain form
34363 819230 719470 656220 721722 833082 838224 763399 781429 909239 915621 636549 255581
34352 255581 114555 296375 555176 663828 663926 693828 718313 602474 398894 354461 575050
34341 575050 848679 916562 799020 704480 703209 682722 600064 569439 652729 746024 763696
34330 763696 780786 874323 953045 895876 772684 761167 881142 966955 901091 735394 560469
34319 560469 389223 231871 182735 327388 588940 754382 690906 503941 424858 528344
34309 528344 628768 528146 309274 244891 420821 624707 672038 658211 750797 895168
34299 895168 928065 869204 860122 877925 781168 636403 705130 1023490 1266518 1184412 953276
34288 953276 900335 1056179 1202236 1233603 1221433 1175836 1006735 742403 572790 607581
$$ packed form
34363H19230r9760o3250O5502J11360N142p4825J8030J27810O382k79072l80968
34352B55581j41026J81820K58801J08652R8K9902K4485j15839k03580m4433K20589
34341E75050K73629O7883j17542r4540j271k0487q2658l0625Q3290R3295J7672
34330G63696J7090R3537P8722n7169j23192j1517J19975Q5813o5864j65697j74925
34319E60469j71246j57352m9136J44653K61552J65442o3476j86965p9083J03486
34309E28344J00424j00622k18872o4383J75930K03886M7331j3827R2586J44371
34299H95168L2897n8861r082J7803r6757j44765O8727L18360K43028q2106k31136
34288I53276n2941J55844J46057L1367j2170m5597j69101k64332j69613L4791
$$ plain form
34278 607581 739886 809253 778851 703580 640177 645314 760528 939206 1068945 1106864 1108155
34267 1108155 1093964 1006132 845455 732298 743258 792155 774487 736265 778591 870525 897753
34256 897753 853310 835077 868343 872199 814993 772260 793153 821823 804075 778272 795595 821495
34244 821495 787524 696441 612473 575560 581981 634984 756983 931512 1059887 1017264 783679
34233 783679 508030 386572 458652 582591 642039 682006 764033 797617 674966 511722
34223 511722 547216 793045 986147 955950 841387 831440 875966 826211 718611 699061 741380
34212 741380 678162 508777 450145 612015 805865 799460 642847 594309 765617 978431
34202 978431 1000193 828283 667136 658779 731602 754102 755225 877650 1125890 1297162 1225544
$$ packed form
34278F07581J32305O9367l0402p5271o3403N137J15214J78678J29739L7919J291
34267A108155j4191q7832j60677j13157J0960M8897j7668l8222M2326R1934K7228
34256H97753m4443j8233L3266L856n7206m2733K0893K8670j7748k5803J7323K5900
34244H21495l3971r1083q3968l6913O421N3003J21999J74529J28375m2623k33585
34233G83679k75649j21458P2080J23939N9448L9967Q2027L3584j22651j63244
34223E11722L5494K45829J93102l0197j14563r947M4526m9755j07600j9550M2319
34212G41380o3218j69385n8632J61870J93850o405j56613m8538J71308K12814
34202I78431K1762j71910j61147q357P2823K2500J123J22425K48240J71272p1618
$$ plain form
34191 1225544 993366 807055 734911 681373 586850 534099 638119 900451 1188126 1323706
34181 1323706 1220457 977833 813159 841517 954786 975435 879976 786750 769974 800021
34171 800021 850203 940038 1053397 1115791 1089614 1020820 964925 926501 888798 848959 813807
34160 813807 804568 852267 935034 953541 850498 723804 717574 821579 898165 895303 887470 893192
34148 893192 822732 672991 614610 770091 1020618 1158142 1142460 1079769 1020587 932857 844229
34137 844229 849229 946064 993798 894610 737093 688521 788529 914881 941036 874699 827005
34126 827005 873580 970506 1006228 924711 793956 753621 882372 1100293 1217421 1118790 902064
34115 902064 780525 835107 928731 906229 803008 770781 848577 922887 910417 870251 899548
$$ packed form
34191A225544k32178j86311p2144n3538r4523n2751J04020K62332K87675J35580
34181A323706j03249k42624j64674K8358J13269K0649r5459r3226j6776L0047
34171H00021N0182Q9835J13359O2394k6177o8794n5895l8424l7703l9839l5152
34160H13807r239M7699Q2767J8507j03043j26694o230J04005P6586k862p833N722
34148H93192p0460j49741n8381J55481K50527J37524j5682o2691n9182q7730q8628
34137H44229N000R6835M7734r9188j57517m8572J00008J26352K6155o6337m7694
34126H27005M6575R6926L5722q1517j30755m0335J28751K17921J17128r8631k16726
34115I02064j21539N4582R3624k2502j03221l2227P7796P4310j2470m0166K9297
$$ plain form
34104 899548 994639 1061125 1022117 892152 770898 762998 870239 978313 992349 952414 951272
34093 951272 983706 981583 966793 1027306 1130776 1116389 932382 745138 720188 806365 847456
34082 847456 816089 803296 834905 847638 836146 881419 999136 1074363 1012234 878977 819297
34071 819297 875461 961098 993627 972751 919916 826571 716332 690290 815995 997424 1061468
34060 1061468 980818 903501 934493 1009429 1043134 1069225 1123867 1115788 974230 838177 897241
34049 897241 1077431 1101556 889199 689062 729993 915727 993484 901941 803423 830348 936340
34038 936340 998223 975015 934761 950411 992610 956846 817139 696053 709126 790532 787242
34027 787242 696390 665973 760016 882604 966101 1064891 1192954 1236718 1143112 1050992 1089985
$$ packed form
34104H99548R5091O6486l9008j29965j21254p900J07241J08074J4036l9935j142
34093I51272L2434k123j4790O0513J03470j4387j84007j87244k4950Q6177M1091
34082H47456l1367j2793L1609J2733j1492M5273J17717P5227o2129j33257n9680
34071H19297N6164Q5637L2529k0876n2835r3345j10239k6042J25705J81429O4044
34060A061468q0650p7317L0992P4936L3705K6091N4642q079j41558j36053N9064
34049H97241J80190K4125k12357k00137M0931J85734P7757r1543r8518K6925J05992
34038I36340O1883k3208m0254J5650M2199l5764j39707j21086J3073Q1406l290
34027G87242r0852l0417R4043J22588Q3497R8790J28063M3764r3606r2120L8993
$$ plain form
34016 1089985 1154705 1042688 758189 521335 493786 629064 796182 930482 1027955 1076423
34006 1076423 1052124 965791 880367 860531 888560 861879 732022 619024 686456 900037 1036389
33995 1036389 973958 845415 822814 876901 872928 813969 835407 987025 1156409 1221675 1183860
33984 1183860 1123070 1088869 1067298 1031592 1001561 1031315 1116636 1150057 1042104 874122 829090
33973 829090 954332 1101391 1137478 1102665 1099255 1137243 1170681 1192969 1209446 1195154 1158362
33962 1158362 1163836 1215461 1207009 1079121 933263 885798 894789 849307 758318 722763 767390
33951 767390 820182 832121 822940 833461 897043 1007518 1063668 939174 685838 554907 702850
33940 702850 979796 1137202 1136405 1099047 1063415 987629 917258 933418 974119 919491 830710
$$ packed form
34016A089985O4720j12017k84499k36854k7549J35278J67118J34300R7473M8468
34006A076423k4299q6333q5424j9836K8029k6681j29857j12998O7432K13581J36352
33995A036389o2431j28543k2601N4087l973n8959K1438J51618J69384O5266l7815
33984A183860o0790l4201k1571l5706l0031K9754Q5321L3421j07953j67982m5032
33973H29090J25242J47059L6087l4813l410L7988L3438K2288J6477j4292l6792
33962A158362N474N1625q452j27888j45858m7465Q991m5482r0989l5555M4627
33951G67390N2792J1939r181J0521O3582J10475N6150j24494k53336j30931J47943
33940G02850K76946J57406p97l7358l5632p5786p0371J6160M0701n4628q8781
$$ plain form
33929 830710 882728 1059689 1148101 1066900 975196 983285 979787 860300 735207 760229 899758
33918 899758 1007737 1040037 1046086 1032274 974361 914040 918856 978266 1038852 1103636 1195374 1257996
33906 1257996 1208175 1071946 963170 926588 909236 901688 987823 1192369 1375116 1376506 1221829
33895 1221829 1080028 1038750 1029333 989350 982349 1085989 1244474 1326922 1287959 1184819 1077327
33884 1077327 1008754 1047609 1221491 1413386 1450299 1313867 1149364 1053799 991006 945638
33874 945638 997730 1159458 1279909 1232092 1096096 1041474 1105493 1194485 1235397 1222181 1170982
33863 1170982 1122866 1133639 1180316 1150086 1008747 897273 955046 1119267 1213780 1181971 1126580
33852 1126580 1164672 1326416 1536661 1625392 1450314 1100572 872795 934065 1118461 1178747
$$ packed form
33929H30710N2018J76961Q8412q1201r1704Q089l498j19487j25093K5022J39529
33918H99758J07979L2300O049j3812n7913o0321M816N9410O0586O4784R1738O2622
33906A257996m9821j36229j08776l6582j7352p548Q6135K04546J82747J390j54677
33895A221829j41801m1278r417l9983p001J03640J58485Q2448l8963j03140j07492
33884A077327o8573L8855J73882J91895L6913j36432j64503r5565o2793m5368
33874I45638N2092J61728J20451m7817j35996n4622O4019Q8992M0912j3216n1199
33863A170982m8116J0773M6677l0230j41339j11474N7773J64221R4513l1809n5391
33852A126580L8092J61744K10245Q8731j75078l49742k27777O1270J84396O0286
$$ plain form
33842 1178747 1107675 1048325 1018338 938179 844926 848889 924409 956676 957112 1019140 1098322 1071499
33830 1071499 1000151 1085183 1334269 1513433 1481491 1348267 1234249 1099304 916570 816233
33820 816233 911277 1111647 1232624 1192232 1025932 821104 713951 828850 1120992 1369808
33810 1369808 1415868 1330774 1286382 1336043 1397263 1387314 1307667 1226092 1205969 1229597 1208601
33799 1208601 1115593 1050430 1086889 1125047 1040754 926219 990701 1234151 1425113 1430253 1364004
33788 1364004 1356833 1374438 1353989 1338939 1366305 1367617 1296217 1231607 1251146 1301149 1288483 1209043
33776 1209043 1112004 1029384 999359 1056929 1148858 1167119 1111975 1101032 1176628 1244036 1246496
33765 1246496 1246685 1278952 1286298 1266128 1296015 1342075 1252638 1049784 1000569 1240332 1538578
$$ packed form
33842A178747p1072n9350k9987q0159r3253L963P5520L2267M36O2028P9182k6823
33830A071499p1348Q5032K49086J79164l1942j33224j14018j34945j82734j00337
33820H16233R5044K00370J20977m0392j66300k04828j07153J14899K92142K48816
33810A369808M6060q5094m4392M9661O1220r949p9647q1575k0123K3628k0996
33799A208601r3008o5163L6459L8158q4293j14535O4482K43450J90962N140o6249
33788A364004p171J7605k0449j5050K7366J312p1400o4610J9539N0003j2666p9440
33776A209043r7039q2620l0025N7570R1929J8261n5144j0943P5596O7408K460
33765A246496J89L2267P346k0170K9887M6060q9437k02854m9215K39763K98246
$$ plain form
33754 1538578 1632550 1592200 1620151 1671717 1564123 1343409 1229911 1247819 1208871 1066711
33744 1066711 1004830 1119918 1266636 1306486 1304827 1369609 1457395 1465959 1411490 1396922 1462676
33733 1462676 1551457 1587849 1548718 1483470 1473852 1530863 1544895 1409254 1182775 1039900 1055726
33722 1055726 1136816 1180482 1198339 1242322 1304148 1349853 1382967 1410352 1400972 1341421 1288348
33711 1288348 1301037 1350974 1359102 1304355 1238587 1205987 1205736 1232156 1290212 1356118 1380062 1359878
33699 1359878 1364671 1443686 1552045 1616849 1637138 1650722 1638249 1557050 1457200 1446593 1519044
33688 1519044 1536776 1433482 1318416 1306055 1355271 1373876 1377247 1423535 1482283 1501391 1524804
33677 1524804 1598263 1635950 1552814 1466797 1567117 1805898 1929703 1826711 1639806 1507725
$$ packed form
33754A538578R3972m0350K7951N1566j07594k20714j13498J7908l8948j42160
33744A066711o1881J15088J46718L9850j659O4782Q7786Q564n4469j4568O5754
33733A462676Q8781L6392l9131o5248r618N7011J4032j35641k26479j42875J5826
33722A055726Q1090M3666J7857M3983O1826M5705L3114K7385r380n9551n3073
33711A288348J2689M9937Q128n4747o5768l2600k51K6420N8056O5906K3944k0184
33699A359878M793P9015J08359O4804K0289J3584j2473q1199r9850j0607P2451
33688A519044J7732j03294j15066j2361M9216J8605L371M6288N8748J9108K3413
33677A524804P3459L7687q3136q6017J00320K38781J23805j02992j86905j32081
$$ plain form
33667 1507725 1406684 1316148 1336785 1523092 1745463 1840727 1802056 1730797 1689787 1676426 1658175
33656 1658175 1582260 1431964 1298155 1291986 1374984 1406902 1372356 1394091 1493146 1531551 1458950
33645 1458950 1411937 1465895 1490254 1391105 1310040 1402120 1566856 1599126 1500914 1447816 1519486
33634 1519486 1645380 1765139 1870141 1915263 1844532 1699293 1586201 1550583 1566493 1610211
33624 1610211 1654977 1646662 1580546 1547385 1606776 1674552 1639797 1535767 1483360 1513099 1554935
33613 1554935 1567847 1574077 1590767 1616959 1663655 1727237 1771286 1793425 1850384 1951478 1998866
33602 1998866 1911509 1742051 1599538 1531288 1545829 1649710 1774138 1777849 1639346 1546000
33592 1546000 1662206 1895480 2025414 1984804 1877329 1794596 1761712 1798320 1886807 1934073
$$ packed form
33667A507725j01041r0536K0637J86307K22371R5264l8671p1259m1010j3361j8251
33656A658175p5915j50296j33809o169Q2998L1918l4546K1735R9055L8405p2601
33645A458950m7013N3958K4359r9149q1065R2080J64736L2270r8212n3098P1670
33634A519486J25894J19759J05002M5122p0731j45239j13092l5618J5910M3718
33624A610211M4766q315o6116l3161N9391O7776l4755j04030n2407K9739M1836
33613A554935J2912O230J6690K6192M6696O3582M4049K2139N6959J01094M7388
33602A998866q7357j69458j42513o8250J4541J03881J24428L711j38503r3346
33592A546000J16206K33274J29934m0610j07475q2733l2884L6608Q8487M7266
$$ plain form
33582 1934073 1896896 1876551 1953300 2019481 1950987 1858969 1956372 2221156 2419354 2451124 2443257
33571 2443257 2476141 2452855 2311423 2160900 2103524 2092393 2077856 2139149 2328794 2506844
33561 2506844 2497266 2349506 2287462 2410384 2578453 2619978 2547076 2509204 2593634 2740437 2842475
33550 2842475 2873847 2894830 2952417 3013273 3014711 2971188 2993871 3170951 3443120 3659495 3776002
33539 3776002 3914050 4153938 4370440 4422314 4428514 4628628 4992052 5255613 5367258 5466729
33529 5466729 5240863 3827682 906433 -2411667 -4447841 -4677378 -4022600 -3462853 -3056033
33520 -3056033 -2510531 -1975643 -1754884 -1709383 -1497174 -1135977 -866106 -679355 -430958 -236566
33510 -236566 -305915 -502184 -498554 -296836 -181934 -211396 -157529 46523 191883 170350 127252
$$ packed form
33582A934073l7177k0345P6749O6181o8494r2018R7403K64784J98198L1770p867
33571B443257L2884k3286j41432j50523n7376j1131j4537O1293J89645J78050
33561B506844r578j47760o2044J22922J68069M1525p2902l7872Q4430J46803J02038
33550B842475L1372K0983N7587O0856J438m3523K2683J77080K72169K16375J16507
33539C776002J38048K39888K16502N1874O200K00114L63424K63561J11645R9471
33529E466729k25866j413181k921249l318100k036174k29537O54778N59747M06820
33520c056033N45502N34888K20759M5501K12209L61197K69871J86751K48397J94392
33510b36566o9349j96269L630K01718J14902k9462N3867K04052J45360k1533m3098
$$ plain form
33499 127252 177565 266421 367511 536284 700772 671320 448163 285296 355374 548466
33489 548466 681130 721007 724854 715792 707490 737437 819750 936935 1074012 1189287 1209154
33478 1209154 1146168 1129577 1200925 1208013 1059246 928601 992605 1114719 1056359 870864 785773
33467 785773 801345 743046 641240 699245 911511 1070256 1146993 1306695 1529034 1592887
33457 1592887 1486967 1455297 1550140 1519550 1262897 1030724 1013454 1078940 1101454 1212788
33447 1212788 1497674 1738231 1719799 1553113 1450383 1398832 1299617 1230025 1304904 1429538
33437 1429538 1438788 1363492 1333664 1322655 1208811 1017749 903647 934524 1053658 1206816
33427 1206816 1368736 1482328 1488635 1398478 1276069 1194374 1220911 1353155 1459967 1420345
$$ packed form
33499A27252N0313Q8856J01090J68773J64488k9452k23157j62867P0078J93092
33489E48466J32664L9877L847r062q302K9947Q2313J17185J37077J15275J9867
33478A209154o2986j6591P1348P088j48767j30645O4004J22114n8360j85495q5091
33467G85773J5572n8299j01806N8005K12266J58745P6737J59702K22339O3853
33457A592887j05920l1670R4843l0590k56653k32173j7270O5486K2514J11334
33447A212788K84886K40557j8432j66686j02730n1551r9215o9592P4879J24634
33437A429538R250p5296k9828j1009j13844j91062j14102L0877J19134J53158
33427A206816J61920J13592O307r0157j22409q1695K6537J32244J06812l9622
$$ plain form
33417 1420345 1328480 1387560 1581100 1670250 1575702 1510524 1613698 1702510 1577425 1368456
33407 1368456 1349675 1539945 1704562 1680565 1527863 1406522 1429535 1589515 1750168 1773322
33397 1773322 1690812 1645148 1652967 1605153 1526358 1591180 1795647 1878030 1719537 1570280 1671057
33386 1671057 1875057 1892355 1733609 1647994 1743926 1916905 2060784 2132728 2095693 1993141
33376 1993141 1983970 2116839 2189855 2034685 1800483 1718271 1723414 1601778 1404343 1381405 1540957
33365 1540957 1611651 1477726 1338650 1353093 1400808 1327667 1208867 1215735 1365158 1532273
33355 1532273 1616577 1604248 1545030 1529193 1613607 1733053 1760872 1673566 1564026 1484578 1391009
33344 1391009 1264377 1170315 1159959 1218520 1342049 1544393 1747133 1803696 1716631 1700214
$$ packed form
33417A420345r1865N9080J93540Q9150r4548o5178J03174Q8812j25085k08969
33407A368456j8781J90270J64617k3997j52702j21341K3013J59980J60653K3154
33397A773322q2510m5664P819m7814p8795O4822K04467Q2383j58493j49257J00777
33386A671057K04000J7298j58746q5615R5932J72979J43879P1944l7035j02552
33376A993141r171J32869P3016j55170k34202q2212N143j21636j97435k2938J59552
33365A540957P0694j33925j39076J4443M7715p3141j18800O868J49423J67115
33355A532273Q4304j2329n9218j5837Q4414J19446K7819q7306j09540p9448r3569
33344A391009j26632r4062j0356N8561J23529K02344K02740N6563q7065j6417
$$ plain form
33334 1700214 1900163 2148644 2160032 1925364 1729904 1754322 1838796 1751849 1555653 1517303
33324 1517303 1701065 1862574 1808058 1671156 1694510 1872025 1995794 1982980 1942640 1932326
33314 1932326 1869827 1735923 1661685 1715709 1773747 1726085 1675922 1781418 2000055 2151444
33304 2151444 2177759 2185724 2248569 2307389 2285771 2193200 2080790 1970576 1867253 1791180 1758425
33293 1758425 1744460 1699482 1612920 1552279 1604834 1761891 1896526 1897408 1794952 1703773 1671976
33282 1671976 1654632 1611001 1550833 1500580 1498241 1598956 1801163 1990381 2050446 2010165 1981354
33271 1981354 1980779 1936833 1857432 1849158 1947847 2049558 2041578 1914971 1741513 1623101 1646288
33260 1646288 1791667 1917532 1929613 1907979 1951115 1994120 1956968 1966108 2177968 2447015 2465703
$$ packed form
33334A700214J99949K48481J1388k34668j95460K4418Q4474q6947j96196l8350
33324A517303J83762J61509n4516j36902K3354J77515J23769j2814m0340j0314
33314A932326o2499j33904p4238N4024N8038m7662n0163J05496K18637J51389
33304B151444K6315P965O2845N8820k1618r2571j12410j10214j03323p6073l2755
33293A758425j3965m4978q6562o0641N2555J57057J34635Q82j02456r1179l1797
33282A671976j7344m3631o0168n0253k339J00715K02207J89218O0065m0281k8811
33271A981354n75m3946p9401q274R8689J01711p980j26607j73458j18412K3187
33260A646288J45379J25865J2081k1634M3136M3005l7152R140K11860K69047J8688
$$ plain form
33249 2465703 2229004 2053829 2101245 2195928 2198531 2227269 2361131 2425967 2282630 2089474
33239 2089474 2065243 2184160 2304104 2414483 2550409 2623126 2552000 2439148 2413046 2410124
33229 2410124 2304156 2154249 2130169 2255137 2388339 2414839 2324895 2164793 2022152 1995751
33219 1995751 2083306 2168937 2194468 2244982 2387851 2538731 2576744 2494970 2367240 2268850 2275674
33208 2275674 2412857 2565226 2585186 2510964 2495848 2515837 2402385 2207251 2222712 2518489
33198 2518489 2769975 2726598 2562004 2545990 2643407 2688559 2707274 2782288 2806447 2662361 2482735
33187 2482735 2459804 2546965 2601933 2659766 2797975 2897298 2823251 2698289 2707228 2775363 2731033
33176 2731033 2638165 2648759 2664329 2496386 2260007 2240893 2433481 2571481 2577809 2618573 2716901
$$ packed form
33249B465703k36699j75175M7416R4683K603K8738J33862O4836j43337j93156
33239B089474k4231J18917J19944J10379J35926P2717p1126j12852k6102k922
33229B410124j05968j49907k4080J24968J33202K6500q9944j60102j42641k6401
33219A995751Q7555Q5631K5531N0514J42869J50880L8013q1774j27730r8390O824
33208B275674J37183J52369J9960p4222j5116J9989j13452j95134J5461K95777
33198B518489K51486m3377j64594j6014R7417M5152J8715P5014K4159j44086j79626
33187B482735k2931Q7161N4968N7833J38209R9323p4047j24962Q939O8135m4330
33176B731033r2868J0594J5570j67943k36379j9114J92588J38000O328M0764R8328
$$ plain form
33165 2716901 2682758 2476179 2311682 2329296 2442121 2562845 2704308 2804925 2740289 2580015
33155 2580015 2554933 2682008 2699998 2496753 2331754 2463026 2769571 2941654 2896390 2810902
33145 2810902 2829908 2910954 2934151 2851184 2721553 2650920 2691592 2798646 2899558 2973811 3019858
33134 3019858 2998548 2893164 2784906 2774342 2853008 2933216 2968477 2964419 2921342 2860480 2859882
33123 2859882 2966125 3111688 3207367 3263399 3329008 3375464 3342754 3247786 3148086 3055007 2977703
33112 2977703 2986333 3122036 3294908 3375516 3354478 3333127 3387791 3491598 3531325 3396272 3127535
33101 3127535 2953931 3042395 3240872 3268403 3148895 3189711 3487455 3759998 3779197 3664996
33091 3664996 3594201 3521531 3389525 3322706 3377741 3374246 3227746 3180904 3419532 3716035 3768454
$$ packed form
33165B716901l4143k06579j64497J7614J12825J20724J41463J00617o4636j60274
33155B580015k5082J27075J7990k03245j64999J31272L06545J72083m5264q5488
33145B810902J9006Q1046K3197q2967j29631p0633M0672J07054J00912P4253M6047
33134C019858k1310j05384j08258j0564P8666Q0208L5261m058m3077o0862n98
33123B859882J06243J45563R5679N6032O5609M6456l2710r4968r9700r3079p7304
33112B977703Q630J35703J72872Q0608k1038k1351N4664J03807L9727j35053k68737
33101C127535j73604Q8464J98477K7531j19508M0816K97744K72543J9199j14201
33091C664996p0795p2670j32006o6819N5035l495j46500m6842K38628K96503N2419
$$ plain form
33080 3768454 3659141 3644925 3709935 3679045 3579400 3525609 3428161 3197181 3066190 3297730
33070 3297730 3694774 3833413 3698137 3658047 3853282 4028271 3987795 3833042 3697416 3583085
33060 3583085 3516247 3576914 3721911 3812491 3832613 3872474 3927978 3929055 3908041 3925817 3918053
33049 3918053 3833892 3803170 3922250 4025940 3952116 3863423 3978177 4147567 4076910 3831182
33039 3831182 3719106 3780460 3801124 3754773 3805418 3925080 3932110 3878771 3986718 4217597 4317641
33028 4317641 4274945 4319363 4471793 4512082 4410499 4377754 4455114 4457356 4361782 4359693 4476075
33017 4476075 4521790 4468294 4491351 4599214 4596455 4466819 4421029 4513699 4571017 4535656 4525634
33006 4525634 4530650 4422594 4282850 4333187 4528941 4619242 4611286 4736587 4941688 4896707 4585373
$$ packed form
33080C768454j09313j4216O5010l0890r9645n3791r7448k30980j30991K31540
33070C297730L97044J38639j35276m0090J95235J74989m0476j54753j35626j14331
33060C583085o6838O0667J44997R0580K0122L9861N5504J077k1014J7776p764
33049C918053q4161l0722J19080J03690p3824q8693J14754J69390p0657k45728
33039C831182j12076O1354K0664m6351N0645J19662P030n3339J07947K30879J00044
33028D317641m2696M4418J52430M0289j01583l2745P7360K242r5574k089J16382
33017D476075M5715n3496K3057J07863k759j29636m5790R2670N7318l5361j0022
33006D525634N016j08056j39744N0337J95754R0301p956J25301K05101m4981l11334
$$ plain form
32995 4585373 4406159 4560141 4782927 4828668 4802132 4851552 4913567 4921244 4930425 4923848 4813886
32984 4813886 4707168 4815135 5054207 5116333 4980268 4944369 5103134 5222974 5198668 5187538
32974 5187538 5222996 5158892 5072083 5226993 5540073 5592283 5307212 5097523 5177688 5265440
32964 5265440 5170045 5136257 5328864 5474021 5338043 5141863 5178485 5377274 5535040 5649838
32954 5649838 5767629 5807265 5765757 5806894 5964468 6051573 6000939 5977648 6051114 6104925 6147097
32943 6147097 6312606 6493547 6415837 6153999 6075834 6202314 6184584 6019001 6133388 6559436
32933 6559436 6710138 6320954 5968795 6213504 6775491 7053924 6999165 6962809 7048054 7109365
32923 7109365 7141395 7239631 7357063 7413600 7463470 7533053 7518557 7415697 7388239 7477723 7543563
$$ packed form
32995D585373j79214J53982K22786M5741k6536M9420O2015P677R181o577j09962
32984D813886j06718J07967K39072O2126j36065l5899J58765J19840k4306j1130
32974E187538L5458o4104q6809J54910L13080N2210k85071k09689Q0165Q7752
32964E265440r5395l3788J92607J45157j35978j96180L6622J98789J57766J14798
32954E649838J17791L9636m1508M1137J57574Q7105n0634k3291P3466N3811M2172
32943F147097J65509J80941p7710k61838p8165J26480j7730j65583J14387M26048
32933F559436J50702l89184l52159K44709N61987K78433n4759l6356Q5245O1311
32923G109365L2030R8236J17432N6537M9870O9583j4496j02860k7458Q9484O5840
$$ plain form
32912 7543563 7575255 7703238 7840599 7748906 7525163 7528414 7746683 7796400 7652426 7747223
32902 7747223 8175915 8468271 8389913 8302883 8443504 8516611 8350903 8294409 8563176 8824257
32892 8824257 8837706 8899986 9218208 9448296 9320028 9151026 9268032 9461395 9477983 9514307
32882 9514307 9746246 9898610 9766158 9659091 9859063 10122004 10172916 10202336 10430963 10672140
32872 10672140 10746090 10831633 11023594 11078131 10963723 11073445 11514511 11823921 11774919 11765693
32862 11765693 11982813 11945800 11404300 10925776 10999516 11282294 11346808 11453257 11916184 12401108
32852 12401108 12543198 12623086 12961925 13279417 13294903 13314644 13593320 13794785 13712684 13797179
32842 13797179 14315598 14752659 14723213 14690531 15073500 15465763 15485635 15549924 16017740 16434437
$$ packed form
32912G543563L1692J27983J37361r1693k23743L251K18269M9717j43974R4797
32902G747223M28692K92356p8358q7030J40621P3107j65708n6494K68767K61081
32892H824257J3449O2280L18222K30088j28268j69002J17006J93363J6588L6324
32882I514307K31939J52364j32452j07067J99972K62941N0912K9420K28627K41177
32872A0672140P3950Q5543J91961N4537j14408J09722M41066L09410m9002r226
32862A1765693K17120l7013n41500m78524P3740K82778O4514J06449M62927M84924
32852A2401108J42090P9888L38839L17492J5486J9741K78676K01465q2101Q4495
32842A3797179N18419M37061k9446l2682L82969L92263J9872O4289M67816M16697
$$ plain form
32832 16434437 16443182 16554563 17165106 17741458 17858895 18065218 18775339 19350251 19305479 19366403
32822 19366403 20195064 21132097 21400431 21491092 22097182 22764541 22938036 23237959 24276909
32813 24276909 25327163 25639464 25897337 26766324 27271018 26449476 25417259 25781971 27093665
32804 27093665 27939636 28500601 29807295 31455056 32392649 33110339 34703704 36628839 37766708
32795 37766708 38784975 40933548 43488275 45090635 46584339 49571022 53209690 55708704
32787 55708704 57959797 62075048 67277539 71258122 74749859 80257288 86990641 92295600
32779 92295600 97736816 107595852 120879166 132006841 141416743 157112652 179599844
32772 179599844 190675323 165054687 93514064 -7337247 -105167816 -170061186 -189673930
$$ packed form
32832A6434437Q745J11381O10543N76352J17437K06323P10121N74912m4772O0924
32822A9366403Q28661R37033K68334R0661O06090O67359J73495K99923J038950
32813B4276909J050254L12301K57873Q68987N04694q21542j032217L64712J311694
32804B7093665Q45971N60965J306694J647761R37593P17690J593365J925135J137869
32795C7766708J018267K148573K554727J602360J493704K986683L638668K499014
32787E5708704K251093M115251N202491L980583L491737N507429O733353N304959
32779I2295600N441216R859036J3283314J1127675R409902J5695909K2487192
32772A79599844J1075479k5620636p1540623j00851311r7830569o4893370j9612744
$$ plain form
32765 -189673930 -174856001 -149957427 -132711434 -123193163 -113211149 -101190805 -92285130
32758 -92285130 -87945399 -83766006 -77416504 -71660571 -68365673 -65374481 -61073900 -57184638
32750 -57184638 -55006779 -52967753 -49889100 -47172429 -45830416 -44476066 -42098317 -39997056
32742 -39997056 -39182461 -38455336 -36796340 -35237491 -34656035 -33977507 -32287334 -30640517 -30068320
32733 -30068320 -29706112 -28574891 -27428980 -27155357 -26984411 -25970324 -24773560 -24342956 -24169570
32724 -24169570 -23426395 -22602320 -22452474 -22444028 -21757132 -20840196 -20532768 -20535810 -20113483 -19492767
32714 -19492767 -19269705 -19179207 -18686883 -18113445 -18011574 -18063360 -17676334 -17069136 -16767716 -16628141
32704 -16628141 -16297518 -16025284 -16103031 -16112964 -15623194 -15031212 -14866335 -14861765 -14549933 -14157595
$$ packed form
32765a89673930J4817929K4898574J7245993R518271R982014J2020344Q905675
32758i2285130M339731M179393O349502N755933L294898K991192M300581L889262
32750e7184638K177859K039026L078653K716671J342013J354350K377749K101261
32742c9997056Q14595P27125J658996J558849N81456O78528J690173J646817N72197
32733c0068320L62208J131221J145911K73623J70946J014087J196764M30604J73386
32724b4169570P43175Q24075J49846Q446O86896R16936L07428l042M22327O20716
32714a9492767K23062R0498M92324N73438J01871n1786L87026O07198L01420J39575
32704a6628141L30623K72234p7747r933M89770N91982J64877M570L11832L92338
$$ plain form
32694 -14157595 -14070737 -14019557 -13634346 -13222555 -13167659 -13140269 -12734806 -12313564 -12369376 -12588805
32684 -12588805 -12401899 -11972648 -11811106 -11856256 -11747409 -11573969 -11579610 -11540729 -11191762 -10858631
32674 -10858631 -10936600 -11140675 -10988117 -10623270 -10460046 -10409929 -10172052 -9897918 -9862747 -9851826
32664 -9851826 -9568304 -9282074 -9376505 -9601113 -9473125 -9105189 -8957440 -9059557 -9121440 -9126444
32654 -9126444 -9195038 -9148876 -8811467 -8458924 -8409414 -8471486 -8335655 -8154453 -8178676 -8213448
32644 -8213448 -8035614 -7947194 -8260682 -8614669 -8495394 -8103542 -7993227 -8143647 -8109330 -7847806
32634 -7847806 -7681314 -7625600 -7443967 -7219863 -7232803 -7392663 -7388834 -7263645 -7274598 -7341805
32624 -7341805 -7194001 -6920627 -6838458 -6943380 -6993440 -6979029 -7033353 -7061991 -6929227 -6798992
$$ packed form
32694a4157595Q6858N1180L85211M11791N4896K7390M05463M21242n5812k19429
32684a2588805J86906M29251J61542m5150J08847J73440n641L8881L48967L33131
32674a0858631p7969k04075J52558L64847J63224N0117K37877K74134L5171J0921
32664i851826K83522K86230r4431k24608J27988L67936J47749j02117o1883n004
32654i126444o8594M6162L37409L52543M9510o2072J35831J81202k4223l4772
32644h213448J77834Q8420l13488l53987J19275L91852J10315j50420L4317K61524
32634g847806J66492N5714J81633K24104j2940j59860L829J25189j0953o7207
32624g341805J47804K73374Q2169j04922n0060J4411n4324k8638J32764J30235
$$ plain form
32614 -6798992 -6834907 -6827328 -6594366 -6433053 -6631689 -6871818 -6731184 -6461652 -6578802 -6944707
32604 -6944707 -6997809 -6705338 -6534538 -6594266 -6551841 -6355160 -6317105 -6467304 -6485294 -6320042
32594 -6320042 -6261348 -6351949 -6318448 -6140209 -6118189 -6304411 -6393957 -6262446 -6117963 -6055752
32584 -6055752 -5940514 -5788961 -5798883 -5931308 -5911170 -5708970 -5597066 -5671501 -5731048 -5683552
32574 -5683552 -5671314 -5739284 -5756621 -5708988 -5709812 -5705429 -5531649 -5269691 -5182394 -5292939 -5377972
32563 -5377972 -5358468 -5334464 -5268901 -5033376 -4753259 -4706230 -4869615 -4950752 -4869612 -4827016 -4888464
32552 -4888464 -4893626 -4808176 -4788873 -4859932 -4877254 -4842654 -4907094 -5039593 -5041810 -4919610 -4894590
32541 -4894590 -5007295 -5041490 -4893045 -4710648 -4627326 -4628084 -4699410 -4837891 -4911669 -4784948 -4571268
$$ packed form
32614f798992l5915P579K32962J61313j98636k40129J40634K69532j17150l65905
32604f944707n3102K92471J70800n9728M2425J96681L8055j50199j7990J65252
32594f320042N8694r0601L3501J78239K2020j86222q9546J31511J44483O2211
32584f055752J15238J51553r922j32425K0138K02200J11904p4435n9547M7496
32574e683552J2238o7970j7337M7633q24M383J73780K61958Q7297j10545q5033
32563e377972J9504K4004O5563K35525K80117M7029j63385q1137Q1140M2596o1448
32552d888464n162Q5450J9303p1059j7322L4600o4440j32499k217J22200K5020
32541d894590j12705l4195J48445J82397Q3322p58p1326j38481p3778J26721K13680
$$ plain form
32530 -4571268 -4505582 -4596988 -4658740 -4615724 -4519420 -4356621 -4135925 -4050516 -4230593 -4448795
32520 -4448795 -4418493 -4262126 -4299337 -4487935 -4509214 -4332959 -4241563 -4316178 -4345289 -4257115 -4217606
32509 -4217606 -4262123 -4228593 -4104807 -4072989 -4164617 -4213862 -4179746 -4182930 -4218995 -4168680 -4077931
32498 -4077931 -4086304 -4112028 -3971939 -3770263 -3775030 -3945783 -4000705 -3924091 -3961377 -4114719 -4113404
32487 -4113404 -3923352 -3819608 -3884833 -3893411 -3782034 -3779450 -3948581 -4038087 -3932989 -3839895 -3869989
32476 -3869989 -3834517 -3628350 -3451685 -3467412 -3558116 -3583675 -3583178 -3590166 -3543396 -3493903 -3600271
32465 -3600271 -3814177 -3871763 -3692471 -3487003 -3393307 -3322139 -3236489 -3249655 -3357977 -3400357
32455 -3400357 -3361142 -3391333 -3477933 -3443214 -3315782 -3314594 -3411839 -3338636 -3107206 -3069620 -3324681
$$ packed form
32530d571268O5686r1406o1752M3016R6304J62799K20696Q5409j80077k18202
32520d448795L0302J56367l7211j88598k1279J76255R1396p4615k9111Q8174L9509
32509d217606m4517L3530J23786L1818r1628m9245L4116l184l6065N0315R0749
32498d077931q373k5724J40089K01676m767j70753n4922P6614l7286j53342J315
32487d113404J90052J03744o5225q578J11377K584j69131q9506J05098R3094l0094
32476c869989L5472K06167J76665j5727r0704k5559M97o988M6770M9493j06368
32465c600271k13906n7586J79292K05468R3696P1168Q5650j3166j08322m2380
32455c400357L9215l0191q6600L4719J27432J188r7245P3203K31430L7586k55061
$$ plain form
32444 -3324681 -3525266 -3450135 -3319707 -3338454 -3363347 -3269701 -3228330 -3343105 -3393367 -3225707
32434 -3225707 -3057756 -3106114 -3230758 -3226206 -3159021 -3144262 -3092749 -2962641 -2965090 -3220453 -3479077
32423 -3479077 -3481083 -3345172 -3310902 -3337332 -3257939 -3119981 -3074308 -3106259 -3132163 -3181293 -3251990
32412 -3251990 -3193069 -2964115 -2801608 -2885328 -3053721 -3092075 -3072162 -3136087 -3171922 -3015653
32402 -3015653 -2792217 -2741192 -2842848 -2904229 -2887935 -2882186 -2866149 -2774767 -2695784 -2751231 -2868586
32391 -2868586 -2888374 -2807796 -2725888 -2662371 -2617257 -2670894 -2824232 -2884854 -2725462 -2516024 -2484118
32380 -2484118 -2587572 -2647094 -2654109 -2700128 -2735411 -2663825 -2574913 -2619308 -2729343 -2710633 -2552039
32369 -2552039 -2416380 -2376160 -2373277 -2393972 -2478662 -2587606 -2629509 -2595320 -2538208 -2490637 -2510781
$$ packed form
32444c324681k00585P5131J30428j8747k4893R3646M1371j14775n0262J67660
32434c225707J67951m8358j24644M552O7185J4759N1513J30108k449k55363k58624
32423c479077k006J35911L4270k6430P9393J37958M5673l1951k5904m9130p0697
32412c251990N8921K28954J62507q3720j68393l8354J9913o3925l5835J56269
32402c015653K23436N1025j01656o1381J6294N749J6037R1382P8983n5447j17355
32391b868586j9788Q0578Q1908O3517M5114n3637j53338o0622J59392K09438L1906
32380b484118j03454n9522p015m6019l5283P1586Q8912m4395j10035J8710J58594
32369b552039J35659M0220K883k0695q4690j08944m1903L4189N7112M7571k0144
$$ plain form
32358 -2510781 -2684800 -2942733 -3023952 -2806407 -2522537 -2445005 -2507232 -2471432 -2333948 -2286935
32348 -2286935 -2372767 -2461486 -2514690 -2594358 -2642917 -2531372 -2325008 -2239957 -2315999 -2379317 -2360205
32337 -2360205 -2392385 -2525397 -2585085 -2453558 -2296462 -2342214 -2551519 -2678020 -2610292 -2496194
32327 -2496194 -2505396 -2591475 -2581596 -2450056 -2371266 -2463802 -2608153 -2629770 -2564457 -2575085 -2663000
32316 -2663000 -2665986 -2530956 -2373293 -2251521 -2120328 -2050072 -2219672 -2579548 -2786943 -2647900
32306 -2647900 -2397125 -2345430 -2455156 -2486594 -2387990 -2292915 -2261070 -2265818 -2341294 -2506448 -2613323
32295 -2613323 -2492061 -2204041 -1968536 -1891368 -1929085 -2037448 -2166204 -2186267 -2033316 -1871553
32285 -1871553 -1909354 -2094447 -2198140 -2164255 -2145385 -2194835 -2164304 -1976252 -1802315 -1856097
$$ packed form
32358b510781j74019k57933q1219K17545K83870P7532o2227L5800J37484M7013
32348b286935q5832q8719n3204p9668m8559J11545K06364Q5051p6042o3318J9112
32337b360205l2180j33012n9688J31527J57096m5752k09305j26501O7728J14098
32327b496194r202q6079R879J31540P8790r2536j44351k1617O5313j0628q7915
32316b663000k986J35030J57663J21772J31193P0256j69600l59876k07395J39043
32306b647900K50775N1695j09726l1438R8604R5075L1845m748p5476j65154j06875
32295b613323J21262K88020K35505P7168l7717j08363j28756k0063J52951J61763
32285a871553l7801j85093j03693L3885J8870m9450L0531J88052J73937n3782
$$ plain form
32275 -1856097 -2120272 -2377621 -2456878 -2382471 -2303511 -2310904 -2340483 -2277495 -2129706 -2010118 -1948997
32264 -1948997 -1858690 -1732926 -1721996 -1898849 -2091066 -2097813 -1968587 -1899704 -1935620 -1959844 -1939586
32253 -1939586 -1981453 -2124996 -2247519 -2237144 -2147717 -2104062 -2116407 -2074786 -1926263 -1783876
32243 -1783876 -1791602 -1907952 -1941853 -1840762 -1793450 -1931331 -2084327 -2033446 -1875071 -1863812
32233 -1863812 -1980907 -1983898 -1848703 -1792903 -1838668 -1760962 -1563733 -1573882 -1877739 -2087569
32223 -2087569 -1931775 -1684650 -1688749 -1821639 -1828372 -1848498 -2135262 -2495764 -2529747 -2285250
32213 -2285250 -2169219 -2277943 -2314516 -2163675 -2061084 -2123691 -2158476 -2064997 -2039107 -2209731
32203 -2209731 -2390735 -2369065 -2191495 -2019424 -1914631 -1887644 -1954039 -2037107 -2004195 -1881442
$$ packed form
32275a856097k64175k57349p9257P4407P8960p393k9579O2988J47789J19588O1121
32264a948997R0307J25764J0930j76853j92217o747J29226O8883l5916k4224K0258
32253a939586m1867j43543j22523J0375Q9427M3655j2345M1621J48523J42387
32243a783876p726j16350l3901J01091M7312j37881j52996N0881J58375J1259
32233a863812j17095k991J35195N5800m5765P7706J97229j0149l03857k09830
32223b087569J55794K47125m099j32890o733k0126k86764l60502l3983K44497
32213b285250J16031j08724l6573J50841J02591o2607l4785R3479K5890j70624
32203b209731j81004K1670J77570J72071J04793K6987o6395q3068L2912J22753
$$ plain form
32193 -1881442 -1839797 -1908061 -1922130 -1828559 -1789306 -1879472 -1936056 -1857680 -1814367 -1961769 -2148794
32182 -2148794 -2143160 -2002025 -1966624 -2068416 -2091351 -1921888 -1719947 -1681345 -1781338 -1844330 -1785653
32171 -1785653 -1692468 -1689252 -1797345 -1942490 -2045286 -2060167 -1968723 -1815737 -1735179 -1829758 -2001870
32160 -2001870 -2023215 -1825760 -1602915 -1549294 -1633672 -1731875 -1835020 -1967188 -2026919 -1918056
32150 -1918056 -1759616 -1753011 -1885204 -1967406 -1930680 -1865346 -1789632 -1625418 -1429479 -1399669 -1566961
32139 -1566961 -1695063 -1601064 -1401992 -1318659 -1382263 -1473240 -1533029 -1584511 -1616569 -1601069 -1597090
32128 -1597090 -1701189 -1878884 -1958110 -1849746 -1705309 -1756079 -1992716 -2114536 -1889702 -1498130
32118 -1498130 -1358630 -1606746 -1920329 -1943855 -1719420 -1551417 -1574239 -1654379 -1666646 -1663826
$$ packed form
32193a881442M1645o8264j4069R3571L9253r0166n6584P8376M3313j47402j87025
32182b148794N634J41135L5401j01792k2935J69463K01941L8602r9993o2992N8677
32171a785653R3185L216j08093j45145j02796j4881R1444J52986Q0558r4579j72112
32160b001870k1345J97455K22845N3621q4378r8203j03145j32168n9731J08863
32150a918056J58440O605j32193q2202L6726O5334P5714J64214J95939K9810j67292
32139a566961j28102R3999J99072Q3333o3604r0977n9789n1482l2058J5500L979
32128a597090j04099j77695p9226J08364J44437n0770k36637j21820K24834L91572
32118a498130J39500k48116l13583k3526K24435J68003k2822q0140j2267K820
$$ plain form
32108 -1663826 -1746817 -1908178 -2049645 -2077223 -1965299 -1783067 -1647397 -1607725 -1615315 -1636839
32098 -1636839 -1711874 -1838185 -1907413 -1849554 -1741891 -1672705 -1606975 -1506307 -1459283 -1537539 -1630824
32087 -1630824 -1602134 -1520483 -1556435 -1713291 -1838139 -1841433 -1746229 -1596063 -1475589 -1519419 -1709596
32076 -1709596 -1777646 -1536653 -1204571 -1133354 -1306706 -1408053 -1327966 -1266648 -1333417 -1386374
32066 -1386374 -1329932 -1263819 -1253934 -1235404 -1227238 -1364871 -1618277 -1747781 -1657503 -1535901 -1523964
32055 -1523964 -1508844 -1396602 -1328905 -1436475 -1598254 -1649225 -1641043 -1696346 -1771402 -1765418 -1721244
32044 -1721244 -1721064 -1710761 -1617738 -1525772 -1546533 -1624504 -1649831 -1658999 -1737385 -1820926 -1790032 -1680594
32032 -1680594 -1610020 -1567338 -1474539 -1389954 -1433300 -1545990 -1551384 -1452871 -1450559 -1619511 -1769362
$$ packed form
32108a663826q2991j61361j41467k7578J11924J82232J35670L9672p590k1524
32098a636839p5035j26311o9228N7859J07663O9186O5730J00668M7024p8256r3285
32087a630824K8690Q1651l5952j56856j24848l294R5204J50166J20474m3830j90177
32076a709596o8050K40993L32082P1217j73352j01347Q0087O1318o6769n2957
32066a386374N6442O6113R885J8530Q166j37633k53406j29504R0278J21602J1937
32055a523964J5120J12242O7697j07570j61779n0971Q182n5303p5056N984M4174
32044a721244J80J0303R3023R1966k0761p7971k5327r168p8386q3541L0894J09438
32032a680594P0574M2682R2799Q4585m3346j12690n394R8513K312j68952j49851
$$ plain form
32021 -1769362 -1701594 -1455092 -1220617 -1139505 -1252664 -1509951 -1732498 -1692004 -1368572 -1054564
32011 -1054564 -1050230 -1287514 -1414402 -1266170 -1083175 -1168880 -1466818 -1638082 -1503183 -1232165
32001 -1232165 -1085731 -1132681 -1283064 -1450875 -1574025 -1578406 -1448985 -1282585 -1178689 -1138096
31991 -1138096 -1142112 -1229727 -1385985 -1463833 -1371337 -1248269 -1279473 -1404790 -1417912 -1306908 -1266048
31980 -1266048 -1368800 -1460752 -1423010 -1331805 -1286104 -1265191 -1242835 -1274615 -1375963 -1456333 -1462731
31969 -1462731 -1455798 -1466735 -1426027 -1327577 -1310787 -1448762 -1578850 -1497716 -1250477 -1081104 -1129472
31958 -1129472 -1296833 -1403914 -1390838 -1342380 -1361121 -1443147 -1493061 -1459805 -1400514 -1370726 -1333612
31947 -1333612 -1264410 -1252381 -1360627 -1467238 -1428380 -1336280 -1392647 -1559103 -1591019 -1429379
$$ packed form
32021a769362O7768K46502K34475Q1112j13159k57287k22547M0494L23432L14008
32011a054564M334k37284j26888J48232J82995q5705k97938j71264J34899K71018
32001a232165J46434m6950j50383j67811j23150m381J29421J66400J03896M0593
31991a138096m016q7615j56258p7848R2496J23068l1204j25317j3122J11004M0860
31980a266048j02752r1952L7742R1205M5701K0913K2356l1780j01348q0370o398
31969a462731O933j0937M0708R8450J6790j37975j30088Q1134K47239J69373m8368
31958a129472j67361j07081J3076M8458j8741q2026m9914L3256N9291K9788L7114
31947a333612O9202J2029j08246j06611L8858R2100n6367j66456l1916J61640
$$ plain form
31937 -1429379 -1282973 -1266631 -1246314 -1149283 -1138031 -1306297 -1457523 -1393604 -1215021 -1124427
31927 -1124427 -1127620 -1152384 -1268253 -1517780 -1690352 -1573355 -1328293 -1300000 -1499135 -1591976
31917 -1591976 -1413385 -1184413 -1151754 -1279229 -1406664 -1488926 -1535934 -1489958 -1321249 -1133969
31907 -1133969 -1039659 -1008152 -964114 -953167 -1073048 -1281708 -1418003 -1418707 -1389509 -1422779 -1455275
31896 -1455275 -1382860 -1235613 -1131813 -1098355 -1058736 -994564 -985090 -1052348 -1103854 -1096140 -1112569
31885 -1112569 -1175339 -1135864 -919765 -742349 -847241 -1119811 -1235106 -1156040 -1175861 -1422830
31875 -1422830 -1636712 -1568682 -1337754 -1212677 -1249855 -1336926 -1422436 -1503648 -1519692 -1445406 -1383749
31864 -1383749 -1399084 -1372962 -1197286 -997286 -972748 -1108082 -1226695 -1251628 -1223797 -1140194
$$ packed form
31937a429379J46406J6342K0317R7031J1252j68266j51226O3919J78583R0594
31927a124427l193k4764j15869k49527j72572J16997K45062K8293j99135r2841
31917a591976J78591K28972L2659j27475j27435q2262m7008M5976J68709J87280
31907a133969R4310L1507M4038J0947j19881k08660j36295p04K9198l3270l2496
31896a455275P2415J47247J03800L3458L9619O4172R474o7258n1506P714j6429
31885a112569o2770L9475K16099J77416j04892k72570j15295P9066j9821k46969
31875a422830k13882O8030K30928J25077l7178q7071q5510q1212j6044P4286O1657
31864a383749j5335K6122J75676K00000K4538j35334j18613k4933K7831Q3603
$$ plain form
31854 -1140194 -982327 -856031 -896498 -1055490 -1165073 -1186896 -1217823 -1280048 -1306831 -1323150
31844 -1323150 -1424690 -1558574 -1543141 -1363459 -1241149 -1309905 -1395209 -1256028 -934351 -718651
31834 -718651 -799973 -1072126 -1273833 -1268486 -1159778 -1133252 -1207925 -1215936 -1060574 -891334 -911903
31823 -911903 -1088249 -1200969 -1155513 -1069712 -1046841 -1041798 -1006715 -1000495 -1053170 -1056847 -924392
31812 -924392 -770399 -791788 -1001695 -1208009 -1259221 -1207440 -1196483 -1268258 -1341503 -1348757 -1326332
31801 -1326332 -1350811 -1427870 -1487076 -1476856 -1419667 -1366526 -1344016 -1365332 -1438550 -1517212 -1485788
31790 -1485788 -1266370 -939936 -710046 -724959 -944414 -1176826 -1245330 -1142546 -1032263 -1071149
31780 -1071149 -1228628 -1330898 -1282021 -1158929 -1062482 -982392 -887634 -853865 -972770 -1179470
$$ packed form
31854a140194J57867J26296m0467j58992j09583k1823l0927o2225k6783j6319
31844a323150j01540j33884J5433J79682J22310o8756q5304J39181L21677K15700
31834g18651q1322k72153k01707N347J08708K6526p4673q011J55362J69240k0569
31823i11903j76346j12720M5456Q5801K2871N043L5083O220n2675l677J32455
31812i24392J53993k1389k09907k06314n1212N1781J0957p1775p3245p254K2425
31801a326332k4479p7059n9206J0220N7189N3141K2510k1316p3218p8662L1424
31790a485788K19418L26434K29890j4913k19455k32412o8504J02784J10283l8886
31780a071149j57479j02270M8877J23092R6447Q0090R4758L3769j18905k06700
$$ plain form
31770 -1179470 -1300969 -1269802 -1178282 -1121520 -1102570 -1108699 -1157248 -1214744 -1181414 -1036001 -909202
31759 -909202 -915301 -976061 -930886 -785977 -711455 -778066 -848537 -807064 -762528 -881653 -1101890
31748 -1101890 -1193106 -1093071 -992266 -1035548 -1117780 -1078432 -946008 -846120 -787857 -713899 -677058
31737 -677058 -771665 -928387 -972022 -882335 -817790 -862067 -918594 -894185 -828123 -785694 -763168
31726 -763168 -753963 -785716 -843181 -867843 -865755 -896513 -939088 -910092 -831427 -816842 -870075 -883124
31714 -883124 -867626 -966319 -1165063 -1235446 -1084935 -929358 -956668 -1043152 -1003366 -913288 -937072
31703 -937072 -1001533 -928252 -780688 -783835 -944317 -1031999 -947256 -856183 -910478 -1035574 -1071088
31692 -1071088 -979952 -852278 -789017 -811554 -834007 -752596 -614649 -610722 -804488 -988852 -962089
$$ packed form
31770a179470j21499L1167R1520N6762J8950o129m8549n7496L3330J45413J26799
31759i09202o099o0760M5175J44909P4522o6611p0471M1473M4536j19125k20237
31748a101890r1216J00035J00805m3282q2232L9348J32424R9888N8263P3958L6841
31737f77058r4607j56722m3635Q9687O4545m4277n6527K4409O6062M2429K2526
31726g63168R205l1753n7465k4662K088l0758m2575K8996P8665J4585n3233j3049
31714h83124J5498r8693j98744p0383J50511J55577k7310q6484L9786R0078k3784
31703i37072o4461P3281J47564l147j60482q7682Q4743R1073n4295j25096l5514
31692a071088R1136J27674O3261k2537k2453Q1411J37947L927j93766j84364K6763
$$ plain form
31681 -962089 -830079 -827657 -932768 -918542 -754853 -672794 -786616 -918329 -904054 -849945 -930307
31670 -930307 -1091281 -1127787 -975001 -781369 -720844 -823712 -979813 -1058197 -1031491 -987859
31660 -987859 -995649 -992881 -891246 -760737 -782043 -989873 -1184124 -1160252 -944399 -734233 -669653
31649 -669653 -730998 -824046 -891587 -934443 -962536 -959239 -910812 -853728 -843096 -866602 -855371 -807592
31637 -807592 -818611 -929510 -1031480 -1013113 -930878 -916233 -965666 -964137 -902228 -919314 -1088925
31626 -1088925 -1277432 -1292196 -1112216 -903667 -824673 -865875 -898828 -852069 -787232 -785028 -825000
31615 -825000 -849506 -886468 -990898 -1101225 -1102610 -1021285 -985646 -990639 -905690 -751360 -730203
31604 -730203 -896462 -1039400 -1019868 -971421 -1006635 -995562 -859838 -814351 -1015021 -1204400
$$ packed form
31681i62089J32010K422j05111J4226J63689Q2059j13822j31713J4275N4109q0362
31670i30307j60974l6506J52786J93632O0525j02868j56101p8384K6706M3632
31660i87859p790K768J01635J30509k1306k07830j94251K3872K15853K10166O4580
31649f69653o1345r3048o7541m2856k8093L297M8427N7084J0632k3506J1231M7779
31637h07592j1019j10899j01970J8367Q2235J4645m9433J529O1909j7086j69611
31626a088925j88507j4764J79980K08549P8994m1202l2953M6759O4837K204l9972
31615h25000k4506l6962j04430j10327j385Q1325L5639m993Q4949J54330K1157
31604g30203j66259j42938J9532M8447l5214J1073J35724M5487k00670j89379
$$ plain form
31594 -1204400 -1072979 -788146 -751449 -953397 -1019550 -850541 -746863 -855637 -950328 -886065
31584 -886065 -855964 -999118 -1109318 -974865 -730683 -626706 -664726 -701598 -732671 -834088
31574 -834088 -950973 -962777 -881905 -815374 -792223 -764526 -720273 -688033 -684067 -720022 -786303
31563 -786303 -792628 -648090 -443943 -402150 -571816 -739172 -730442 -638081 -629742 -691144 -703340
31552 -703340 -650583 -609099 -626216 -722790 -905754 -1073727 -1045296 -812232 -631266 -708076 -907325
31541 -907325 -950630 -807111 -696772 -762845 -926514 -1047184 -1065475 -985045 -844760 -724245
31531 -724245 -687161 -720003 -784974 -884173 -993912 -1009237 -875404 -722430 -727493 -864270 -930959
31520 -930959 -832022 -690720 -644381 -659575 -631184 -568803 -569001 -636625 -654884 -567897 -501681 -615196
$$ packed form
31594a204400J31421K84833L6697k01948o6153J69009J03678j08774r4691O4263
31584h86065L0101j43154j10200J34453K44182J03977l8020l6872l1073j01417
31574h34088j16885j1804Q0872O6531K3151K7697M4253L2240L966l5955o6281
31563g86303o325J44538K04147M1793j69666j67356Q730R2361Q339o1402j2196
31552g03340N2757M1484j7117r6574j82964j67973K8431K33064J80966p6810j99249
31541i07325m3305J43519J10339o6073j63669j20670j8291Q0430J40285J20515
31531g24245L7084l2842o4971r9199j09739j5325J33833J52974n063j36777o6689
31520i30959R8937J41302M6339j5194K8391O2381j98o7624j8259Q6987O6216j13515
$$ plain form
31508 -615196 -866125 -1032966 -991236 -867280 -855993 -967207 -1041881 -967374 -784412 -614394
31498 -614394 -563716 -665860 -835537 -913071 -830453 -692961 -632625 -657697 -729474 -874708 -1083043
31487 -1083043 -1197689 -1088707 -863294 -723343 -686957 -644449 -602009 -629438 -639438 -502217
31477 -502217 -341299 -407132 -658803 -794768 -727213 -682387 -764322 -786658 -666358 -619891 -773957
31466 -773957 -911297 -839391 -722486 -787496 -950874 -1009251 -983114 -995301 -999150 -905508 -813811
31455 -813811 -843823 -888559 -803472 -694915 -740994 -858219 -837185 -700118 -631488 -645751 -619834
31444 -619834 -580768 -656153 -782130 -761543 -604155 -531412 -631158 -757055 -788522 -764023 -739212
31433 -739212 -717728 -730806 -799159 -831440 -746207 -652121 -697263 -792226 -729883 -547266 -496420
$$ packed form
31508f15196k50929j66841M1730J23956J1287j11214p4674P4507J82962J70018
31498f14394N0678j02144j69677p7534Q2618J37492O0336k5072p1777j45234k08335
31487a083043j14646J08982K25413J39951L6386M2508M2440k7429j0000J37221
31477e02217J60918o5833k51671j35965O7555M4826q1935k2336J20300M6467j54066
31466g73957j37340P1906J16905o5010j63378n8377K6137j2187l849R3642R1697
31455h13811l0012m4736Q5087J08557m6079j17225K1034J37067O8630j4263K5917
31444f19834L9066p5385j25977K0587J57388P2743r9746j25897l1467K4499K4811
31433g39212K1484j3078o8353l2281Q5233R4086m5142r4963O2343J82617N0846
$$ plain form
31422 -496420 -651431 -816000 -855688 -858493 -902502 -908805 -816383 -704246 -658065 -677366 -753360
31411 -753360 -867552 -904031 -769489 -610111 -668682 -896303 -976721 -807926 -675020 -814597
31401 -814597 -1072914 -1176501 -1116718 -1051581 -999494 -866698 -679649 -575510 -600472 -675548
31391 -675548 -735384 -777876 -796829 -762380 -663760 -526935 -414380 -412771 -548507 -704089 -714143
31380 -714143 -568899 -424506 -392864 -435374 -486839 -550358 -624394 -664958 -675575 -718300 -788902
31369 -788902 -800541 -733451 -677277 -689476 -742037 -826730 -949590 -1000182 -833889 -542203 -416515
31358 -416515 -548874 -700150 -688032 -652347 -751444 -849900 -774215 -671666 -783570 -989069
31348 -989069 -939778 -619496 -413731 -558124 -827970 -908247 -820539 -792915 -873996 -898110 -776032
$$ packed form
31422d96420j55011j64569l9688k805m4009o303R2422J12137M6181j9301p5994
31411g53360j14192l6479J34542J59378n8571k27621q0418J68795J32906j39577
31401h14597k58317j03587N9783O5137N2087J32796J87049J04139k4962p5076
31391f75548n9836m2492j8953L4449R8620J36825J12555J609j35736j55582j0054
31380g14143J45244J44393L1642m2510n1465o3519p4036m0564j0617m2725p0602
31369g88902j1639O7090N6174j2199n2561q4693j22860n0592J66293K91686J25688
31358d16515j32359j51276J2118L5685r9097r8456P5685J02549j11904k05499
31348i89069M9291L20282K05765j44393k69846q0277Q7708K7624q1081k4114J22078
$$ plain form
31337 -776032 -626441 -588451 -632276 -631417 -559075 -512633 -540965 -558609 -509903 -523040 -742103
31326 -742103 -1040880 -1110630 -878796 -631062 -609071 -691582 -647547 -520291 -513949 -620788 -647063
31315 -647063 -561192 -526818 -580316 -564924 -455459 -468165 -703759 -915456 -832379 -554623 -413186
31304 -413186 -530308 -719796 -775280 -672322 -498578 -350972 -318326 -425011 -561982 -593336
31294 -593336 -559637 -649634 -919797 -1170826 -1196560 -1052205 -947578 -941086 -898836 -749095 -609126
31283 -609126 -595855 -646819 -639362 -594283 -623517 -724463 -778385 -749729 -734354 -773298 -767037 -652785
31271 -652785 -534722 -524238 -559988 -531272 -495718 -590404 -760737 -785661 -610187 -460099 -530150
31260 -530150 -716472 -795034 -746334 -730013 -799832 -834302 -756782 -649431 -584574 -483334 -251386
$$ packed form
31337g76032J49591L7990m3825Q59P2342M6442k8332j7644M8706j3137k19063
31326g42103k98777o9750K31834K47734K1991q2511M4035J27256O342j06839k6275
31315f47063Q5871L4374n3498J5392J09465j2706k35594k11697Q3077K77756J41437
31304d13186j17122j89488n5484J02958J73744J47606L2646j06685j36971l1354
31294e93336L3699q9997k70163k51029k5734J44355J04627O492M2250J49741J39969
31283f09126J3271n0964P457M5079k9234j00946n3922K8656J5375l8944O261J14252
31271f52785J18063J0484l5750K8716L5554r4686j70333k4924J75474J50088p0051
31260e30150j86322p8562M8700J6321o9819l4470P7520J07351O4857J01240K31948
$$ plain form
31249 -251386 27546 155553 52375 -173570 -378495 -517544 -615122 -690789 -759095 -839533
31239 -839533 -913881 -923961 -870118 -858154 -955793 -1035161 -890252 -539271 -277021 -338235 -611892
31228 -611892 -812579 -850842 -856059 -867344 -738383 -432130 -201933 -300702 -626392 -846584
31218 -846584 -811630 -654620 -522142 -427904 -391452 -488594 -669441 -725173 -574171 -419389
31208 -419389 -457689 -573508 -527326 -348997 -295604 -442675 -570326 -509548 -381695 -385745 -520248
31197 -520248 -654695 -747592 -829197 -843813 -692079 -433600 -293422 -399327 -602146 -644781
31187 -644781 -477006 -311658 -347017 -516873 -601956 -547214 -529183 -670759 -834611 -820567
31177 -820567 -666822 -587220 -651331 -706832 -631678 -496232 -424863 -436092 -484258 -541969 -574583
$$ packed form
31249b51386K78932J28007j03178k25945k04925j39049r7578p5667o8306q0438
31239h39533p4348j0080N3843J1964r7639p9368J44909L50981K62250o1214k73657
31228f11892k00687l8263n217j1285J28961L06253K30197r8769l25690k20192
31218h46584L4954J57010J32478R4238L6452r7142j80847n5732J51002J54782
31208d19389l8300j15819M6182J78329N3393j47071j27651O0778J27853m050j34503
31197e20248j34447r2897q1605j4616J51734K58479J40178j05905k02819m2635
31187f44781J67775J65348l5359j69856q5083N4742J8031j41576j63852J4044
31177h20567J53745P9602o4111n5501P5154J35446P1369j1229m8166n7711l2614
$$ plain form
31166 -574583 -537582 -465353 -466804 -570455 -665632 -652589 -555485 -441642 -348492 -345082 -516792
31155 -516792 -792586 -934669 -833506 -685311 -720852 -872641 -900934 -768721 -672723 -721944
31145 -721944 -795987 -758912 -643561 -561283 -553975 -596110 -646477 -646563 -552742 -421502 -389513 -511850
31133 -511850 -672065 -708725 -601218 -482409 -480748 -593288 -723325 -804326 -838355 -820074 -706033
31122 -706033 -514895 -383218 -416448 -529137 -556947 -493869 -468155 -507153 -519356 -518868 -638075
31111 -638075 -854082 -942104 -813139 -661859 -631378 -578717 -381372 -238748 -385458 -681574
31101 -681574 -799151 -695480 -589768 -564266 -519616 -473509 -560335 -730547 -772219 -665590
31091 -665590 -617671 -700415 -748757 -678991 -616630 -625361 -593453 -490756 -460818 -539320 -557258
$$ packed form
31166e74583L7001P2229j451j03651r5177J3043R7104J13843R3150L410j71710
31155e16792k75794j42083J01163J48195l5541j51789k8293J32213R5998m9221
31145g21944p4043L7075J15351Q2278P308m2135n0367q6R3821J31240L1989j22337
31133e11850j60215l6660J07507J18809J661j12540j30037q1001l4029J8281J14041
31122g06033J91138J31677l3230j12689k7810O3078K5714l8998j2203M88j19207
31111f38075k16007q8022J28965J51280L0481N2661J97345J42624j46710k96116
31101f81574j17577J03671J05712K5502M4650M6107q6826j70212m1672J06629
31091f65590M7919q2744m8342O9766O2361q731L1908J02697K9938p8502j7938
$$ plain form
31080 -557258 -465488 -477641 -706819 -919388 -879004 -722486 -739166 -931055 -1047409 -960102
31070 -960102 -776196 -634198 -579304 -605507 -671086 -699265 -664407 -628091 -624219 -607025 -584191
31059 -584191 -664612 -869431 -1035606 -1031784 -934862 -862772 -780786 -631535 -512075 -529636 -591843
31048 -591843 -533660 -368849 -241686 -215595 -273699 -422017 -610146 -665894 -519697 -382985
31038 -382985 -467497 -636495 -613747 -447646 -429229 -581263 -610855 -432036 -351467 -567408
31028 -567408 -818927 -782131 -561273 -493464 -634062 -745248 -708200 -638491 -600967 -501390 -333361
31017 -333361 -287365 -476922 -728951 -807846 -735959 -722579 -841662 -961716 -981375 -949994 -911232
31006 -911232 -799617 -595943 -451962 -516656 -715134 -843310 -833988 -784401 -750810 -676483 -533081
$$ packed form
31080e57258R1770j2153k29178k12569M0384J56518j6680j91889j16354Q7307
31070i60102J83906J41998N4894k6203o5579k8179L4858L6316L872J7194K2834
31059e84191q0421k04819j66175L822R6922P2090Q1986J49251J19460j7561o2207
31048e91843N8183J64811J27163K6091n8104j48318j88129n5748J46197J36712
31038c82985q4512j68998K2748J66101J8417j52034k9592J78819Q0569k15941
31028e67408k51519L6796K20858O7809j40598j11186L7048O9709L7524R9577J68029
31017c33361M5996j89557k52029p8895P1887J3380j19083j20054j9659L1381L8762
31006i11232J11615K03674J43981o4694j98478j28176R322M9587L3591P4327J43402
$$ plain form
30995 -533081 -388899 -308469 -304350 -396814 -580566 -719886 -649350 -428395 -319553 -433160
30985 -433160 -568859 -523540 -388144 -381838 -525610 -662104 -710781 -721690 -725697 -698011 -650103
30974 -650103 -620490 -586613 -497497 -375822 -293340 -275989 -317211 -430382 -589889 -682117 -629389
30963 -629389 -509118 -437533 -399098 -319347 -238288 -252259 -328505 -348401 -313930 -336466 -418671
30952 -418671 -426397 -314478 -217692 -249551 -340010 -353972 -279051 -216943 -243031 -333394 -402966
30941 -402966 -388794 -314469 -269380 -304495 -380626 -449051 -520433 -594945 -600353 -495605 -372967
30930 -372967 -344594 -378981 -370492 -322344 -322241 -371370 -388574 -370544 -396751 -472181 -509378 -478734
30918 -478734 -440348 -415897 -369906 -335044 -406808 -575538 -701025 -700976 -642408 -605400 -581792 -557625
$$ packed form
30995e33081J44182Q0430M119r2464j83752j39320P0536K20955J08842j13607
30985d33160j35699M5319J35396O306j43772j36494m8677j0909m007K7686M7908
30974f50103K9613L3877Q9116J21675Q2482J7351m1222j13171j59507r2228N2728
30963f29389J20271P1585L8435P9751Q1059j3971p6246j9896L4471k2536q2205
30952d18671p726J11919R6786l1859r0459j3962P4921O2108k6088r0363o9572
30941d02966J4172P4325M5089l5115p6131o8425p1382p4512n408J04748J22638
30930c72967K8373l4387Q489M8148J03m9129j7204J8030k6207p5430l7197L0644
30918d78734L8386K4451M5991L4862p1764j68730j25487M9N8568L7008K3608K4167
$$ plain form
30906 -557625 -573873 -643687 -707693 -718485 -680043 -584558 -426252 -298330 -335564 -515523 -654295
30895 -654295 -651940 -602598 -606897 -634425 -650177 -706647 -795610 -773403 -586269 -426397 -479281
30884 -479281 -628717 -625216 -476104 -430722 -583247 -725523 -667130 -514278 -505168 -679678 -845853
30873 -845853 -833269 -675298 -541948 -559904 -708133 -844643 -821032 -606934 -331839 -188574
30863 -188574 -260203 -438028 -538397 -503417 -444148 -470942 -545438 -557885 -499534 -466952 -508896
30852 -508896 -561990 -555343 -504265 -472832 -497872 -567766 -626985 -596722 -453260 -295234 -265395
30841 -265395 -387763 -543916 -619803 -601932 -518811 -388125 -267857 -265798 -417972 -610326
30831 -610326 -692802 -639788 -544482 -488751 -475345 -466890 -437120 -384614 -329918 -306408 -344971 -460365
$$ packed form
30906e57625j6248o9814o4006j0792L8442R5485J58306J27922l7234j79959j38772
30895f54295K355M9342m299k7528j5752n6470q8963K2207J87134J59872n2884
30884d79281j49436L501J49112M5382j52525j42276N8393J52852R110j74510j66175
30873h45853J2584J57971J33350j7956j48229j36510K3611K14098K75095J43265
30863a88574p1629j77825j00369L4980N9269k6794p4496j2447N8351L2582m1944
30852e08896n3094O647N1078L1433k5040o9894n9219L0263J43462J58026K9839
30841b65395j22368j56153p5887J7871Q3121J30686J20268K059j52174j92354
30831f10326q2476N3014R5306N5731J3406Q455K9770N2506N4696K3510l8563j15394
$$ plain form
30819 -460365 -628510 -761857 -753861 -604354 -463189 -468240 -565164 -588505 -509876 -478239 -586252
30808 -586252 -724604 -737122 -622601 -502634 -461758 -497303 -569779 -627012 -621261 -569514 -560694
30797 -560694 -643039 -737383 -720816 -573717 -394289 -283333 -253571 -243485 -196632 -129372 -114683
30786 -114683 -184970 -283381 -352576 -423284 -538132 -638186 -638255 -573170 -524008 -434731 -202464
30775 -202464 44064 5488 -355821 -679925 -662441 -441183 -335976 -385307 -395607 -326393
30765 -326393 -332967 -461445 -571467 -581013 -558819 -543203 -486929 -428814 -504106 -706378 -839305
30754 -839305 -805936 -757667 -827143 -890293 -770740 -548760 -457176 -534434 -590339 -514096 -425753
30743 -425753 -464382 -572074 -589391 -489060 -411278 -480775 -663442 -824854 -887672 -889582 -894841
$$ packed form
30819d60365j68145j33347P996J49507J41165n051r6924k3341P8629L1637j08013
30808e86252j38352j2518J14521J19967M0876l5545p2476n7233N751N1747Q820
30797e60694q2345r4344J6567J47099J79428J10956K9762J0086M6853O7260J4689
30786a14683p0287r8411o9195p0708j14848j00054o9O5085M9162Q9277K32267
30775b02464K46528l8576l61309l24104J7484K21258J05207m9331j0300O9214
30765c26393o574j28478j10022r546K2194J5616N6274N8115p5292k02272j32927
30754h39305L3369M8269o9476o3150J19553K21980R1584p7258n5905P6243Q8343
30743d25753l8629j07692j7317J00331P7782o9497j82667j61412o2818j910n259
$$ plain form
30732 -894841 -902178 -876130 -832027 -822416 -844388 -834654 -775374 -729884 -734541 -730358 -665060 -595364
30720 -595364 -600676 -647700 -648956 -621748 -655336 -720991 -670667 -480711 -347934 -430482 -608821
30709 -608821 -657172 -579284 -588302 -763543 -918570 -869872 -682270 -552539 -562512 -651499 -745668
30698 -745668 -801496 -778269 -673031 -547196 -443173 -334689 -239639 -287229 -537388 -809985
30688 -809985 -868009 -732272 -629724 -650604 -672408 -640660 -676540 -813372 -863342 -707180 -522635
30677 -522635 -524158 -625811 -592255 -419684 -315727 -354358 -409664 -428187 -505619 -642474 -673101
30666 -673101 -541706 -429626 -469066 -525900 -443399 -329945 -375247 -501432 -471717 -303977
30656 -303977 -282499 -506098 -698725 -609643 -381403 -314954 -417850 -434399 -266238 -105800
$$ packed form
30732h94841p337K6048M4103R611k1972R734N9280M5490m657M183O5298O9696
30720e95364n312m7024j256K7208l3588o5655N0324J89956J32777q2548j78339
30709f08821m8351P7888r018j75241j55027M8698J87602J29731r973q8987r4169
30698g45668n5828K3227J05238J25835J04023J08484R5050m7590k50159k72597
30688h09985n8024J35737J02548k0880k1804L1748l5880j36832m9970J56162J84545
30677e22635j523j01653L3556J72571J03957l8631n5306j8523p7432j36855l0627
30666f73101J31395J12080l9440n6834Q2501J13454m5302j26185K9715J67740
30656c03977K1478k23599j92627Q9082K28240O6449j02896j6549J68161J60438
$$ plain form
30646 -105800 -116057 -201457 -205631 -171131 -248645 -438606 -583770 -596248 -556919 -570134 -623372
30635 -623372 -638342 -596008 -550574 -540505 -536893 -496506 -440041 -435045 -487419 -498659 -388486 -231343
30623 -231343 -186903 -296460 -442339 -524908 -568997 -610935 -601967 -508619 -402447 -345563 -286485
30612 -286485 -194265 -194751 -403521 -692249 -817871 -755945 -700760 -732064 -705675 -533831 -359366
30601 -359366 -335308 -402711 -426131 -413222 -444564 -487481 -450361 -370624 -389001 -545301 -725477
30590 -725477 -815747 -805394 -728983 -607635 -482318 -430189 -492159 -610000 -672886 -625699 -515671
30579 -515671 -426455 -378083 -320081 -230114 -173080 -221250 -352804 -482703 -558176 -563326 -481715
30568 -481715 -348613 -292704 -399464 -560875 -604936 -556672 -592970 -725998 -744225 -547417
$$ packed form
30646a05800j0257q5400m174L4500p7514j89961j45164j2478L9329j3215n3238
30635f23372j4970M2334M5434J0069L612M0387N6465M996n2374j1240J10173J57143
30623b31343M4440j09557j45879q2569m4089m1938Q968R3348J06172N6884N9078
30612b86485R2220m86k08770k88728j25622O1926N5185l1304K6389J71844J74465
30601c59366K4058o7403k3420J2909l1342m2917L7120P9737j8377j56300j80176
30590g25477r0270J0353P6411J21348J25317N2129o1970j17841o2886M7187J10028
30579e15671Q9216M8372N8002Q9967N7034m8170j31554j29899p5473n150Q1611
30568d81715J33102N5909j06760j61411m4061M8264l6298j33028j8227J96808
$$ plain form
30558 -547417 -336926 -333712 -466865 -507036 -391438 -244891 -164013 -155265 -232309 -399121 -549971
30547 -549971 -540675 -379414 -237498 -251603 -392804 -535534 -588907 -555196 -503567 -487980 -487883
30536 -487883 -467430 -471353 -558781 -648544 -593615 -447842 -450051 -633523 -679782 -364071 51300
30525 51300 148564 -56038 -185807 -107918 -94897 -328364 -593482 -633300 -535094 -539626 -646321
30514 -646321 -651941 -494757 -337062 -317909 -395483 -456985 -457079 -407367 -322147 -231013 -191538 -230366
30502 -230366 -291089 -293693 -249592 -263602 -388637 -529200 -557090 -487135 -438678 -437539 -390609
30491 -390609 -282731 -243045 -335157 -429472 -407399 -362217 -439420 -583735 -630872 -577397 -557212
30480 -557212 -590286 -568163 -487741 -485425 -593735 -652922 -542641 -356979 -271454 -347855 -528201
$$ packed form
30558e47417K10491L214j33153m0171J15598J46547Q0878Q748p7044j66812j50850
30547e49971R296J61261J41916j4105j41201j42730n3373L3711N1629J5587R7
30536d87883K0453l923q7428q9763N4929J45773k209j83472m6259L15711M15371
30525E1300R7264k04602j29769P7889J3021k33467k65118l9818R8206m532j06695
30514f46321n620J57184J57695J9153p7574o1502r4M9712Q5220R1134L9475l8828
30502b30366o0723k604M4101j4010j25035j40563k7890O9955M8457J139M6930
30491c90609J07878L9686r2112r4315K2073M5182p7203j44315m7137N3475K0185
30480e57212l3074K2123Q0422K316j08310n9187J10281J85662Q5525p6401j80346
$$ plain form
30469 -528201 -712123 -785455 -681945 -485002 -382375 -458368 -597610 -638024 -556577 -469920
30459 -469920 -503762 -677185 -868810 -907534 -751930 -549264 -453356 -444448 -421012 -387101 -409536
30448 -409536 -464189 -495207 -560239 -716872 -825481 -709230 -478779 -420374 -555699 -618722
30438 -618722 -518762 -488523 -648556 -764345 -645289 -487063 -545212 -703738 -677423 -479856
30428 -479856 -370270 -425373 -467722 -393495 -310285 -332296 -435215 -531904 -551474 -460733 -326270
30417 -326270 -297714 -406772 -476939 -379306 -253973 -281961 -367591 -305923 -164117 -182150 -336039
30406 -336039 -344379 -143771 -16336 -139017 -320022 -343463 -296674 -346162 -422897 -382809 -308729
30395 -308729 -376155 -518260 -500846 -301516 -163273 -245785 -434570 -551349 -572428 -555513
$$ packed form
30469e28201j83922p3332J03510J96943J02627p5993j39242m0414Q1447Q6657
30459d69920l3842j73423j91625l8724J55604K02666R5908Q908K3436L3911k2435
30448d09536n4653l1018o5032j56633j08609J16251K30451N8405j35325o3023
30438f18722R9960L0239j60033j15789J19056J58226n8149j58526K6315J97567
30428d79856J09586n5103m2349P4227Q3210k2011j02919r6689j9570R0741J34463
30417c26270K8556j09058p0167R7633J25333k7988q5630O1668J41806j8033j53889
30406c36039q340K00608J27435j22681j81005k3441M6789m9488p6735M0088P4080
30395c08729o7426j42105J7414J99330J38243q2512j88785j16779k1079J6915
$$ plain form
30385 -555513 -501024 -401168 -326760 -343262 -393523 -374274 -304723 -315265 -462758 -646257 -735171
30374 -735171 -708446 -621894 -502650 -354838 -239730 -250537 -379146 -482926 -445773 -333876
30364 -333876 -317989 -442488 -544409 -444200 -175343 39066 34940 -130686 -288620 -359024
30354 -359024 -375926 -363984 -310308 -262935 -325110 -488841 -585349 -497870 -338322 -299759 -401500
30343 -401500 -506279 -533089 -508451 -447204 -346737 -285086 -350248 -459107 -423200 -232364 -100102
30332 -100102 -168701 -336004 -447612 -494562 -525992 -525701 -494506 -519081 -634483 -733464 -724297
30321 -724297 -661690 -615830 -548150 -442141 -413686 -535190 -675646 -681492 -601081 -558123 -521403
30310 -521403 -398956 -258761 -237116 -301172 -319308 -302009 -344100 -382820 -270622 -75297 -45018
$$ packed form
30385e55513N4489R9856P4408j6502n0261J9249O9551j0542j47493j83499q8914
30374g35171K6725Q6552J19244J47812J15108j0807j28609j03780L7153J11897
30364c33876J5887j24499j01921J00209K68857K14409m126j65626j57934p0404
30354c59024j6902J1942N3676M7373o2175j63731r6508Q7479J59548L8563j01741
30343d01500j04779k6810K4638O1247J00467O1651o5162j08859L5907J90836J32262
30332a00102o8599j67303j11608m6950l1430K91L1195k4575j15402r8981R167
30321g24297O2607M5860O7680J06009K8455j21504j40456n846Q0411M2958L6720
30310e21403J22447J40195K1645o4056j8136J7299m2091l8720J12198J95325L0279
$$ plain form
30299 -45018 -237065 -416467 -390471 -243887 -165395 -207235 -293555 -335961 -288009 -194860 -199907
30288 -199907 -380238 -594841 -648191 -570466 -543319 -581071 -531226 -395369 -369148 -500720 -588848
30277 -588848 -527609 -479941 -560481 -611466 -498501 -397254 -528875 -774028 -821496 -605351
30267 -605351 -344385 -206615 -172565 -203897 -312266 -433621 -434370 -309874 -232130 -325930 -501522
30256 -501522 -583580 -531921 -452997 -430477 -434539 -416421 -414254 -484444 -561911 -511914 -344916 -235782
30244 -235782 -250794 -217949 -16590 165934 93308 -131933 -224014 -170350 -196256 -313526 -298285
30233 -298285 -160216 -209398 -518135 -729540 -616848 -445785 -505565 -643407 -602834 -494057
30223 -494057 -527588 -559615 -354746 -86657 -93423 -286663 -310102 -189040 -279833 -586123 -686919
$$ packed form
30299d5018j92047j79402K5996J46584P8492m1840q6320m2406M7952R3149n047
30288a99907j80331k14603n3350P7725K7147l7752M9845J35857K6221j31572q8128
30277e88848O1239M7668q0540n0985J12965J01247j31621k45153m7468K16145
30267f05351K60966J37770L4050l1332j08369j21355p49J24496P7744r3800j75592
30256e01522q2058N1659P8924K2520m062J8118K167p0190p7467M9997J66998J09134
30244b35782j5012L2845K01359J82524p2626k25241r2081N3664k5906j17270J5241
30233b98285J38069m9182l08737k11405J12692J71063n9780j37842M0573J08777
30223d94057l3531l2027K04869K68089o766j93240k3439J21062r0793l06290j00796
$$ plain form
30212 -686919 -444339 -254698 -403711 -638537 -635854 -495939 -468984 -513005 -455778 -363284 -420219
30201 -420219 -591664 -683936 -638565 -536431 -408073 -251396 -154226 -202156 -322519 -379649
30191 -379649 -366252 -368053 -411753 -471663 -547281 -618920 -614838 -530424 -475443 -493037 -458374 -290076
30179 -290076 -128447 -138593 -256130 -314681 -322805 -404263 -534678 -563550 -476323 -424486 -479911
30168 -479911 -538455 -500366 -398875 -314214 -283064 -323505 -440255 -574894 -641843 -634326 -615598
30157 -615598 -602873 -551076 -459801 -401524 -417607 -463082 -481753 -472400 -455096 -429843 -404909 -427698
30145 -427698 -539254 -691830 -742463 -579781 -279371 -72856 -93389 -205819 -196807 -82116
30135 -82116 -60332 -178865 -260102 -206186 -149339 -192861 -226976 -163275 -141466 -284217 -421337
$$ packed form
30212f86919K42580J89641j49013k34826K683J39915K6955m4021N7227R2494n6935
30201d20219j71445r2272M5371J02134J28358J56677R7170m7930j20363n7130
30191c79649J3397j801m3700n9910p5618p1639M082Q4414N4981j7594L4663J68298
30179b90076J61629j0146j17537n8551q124q1458j30415k8872Q7227N1837n5425
30168d79911n8544L8089J01491Q4661L1150m0441j16750j34639o6949P517J8728
30157f15598J2725N1797R1275N8277j6083m5475j8671R353J7304K5253K4934k2789
30145d27698j11556j52576n0633J62682L00410K06515k0533j12430R012J14691
30135h2116K1784j18533q1237N3916N6847m3522l4115O3701K1809j42751j37120
$$ plain form
30124 -421337 -323852 -94253 -37516 -205899 -359354 -362732 -335102 -365249 -349817 -216405 -94765
30113 -94765 -134256 -288209 -389920 -352878 -225038 -119759 -133344 -261293 -382588 -395049
30103 -395049 -344924 -335295 -354595 -322756 -262388 -269447 -343121 -406709 -467530 -575002 -646382 -545772
30091 -545772 -336405 -230399 -263183 -249137 -109666 -7536 -71418 -210091 -302998 -365862
30081 -365862 -414190 -367645 -223882 -140522 -201995 -273198 -222490 -124801 -104150 -141644 -188023
30070 -188023 -297966 -485880 -605917 -553779 -446202 -424516 -425241 -336107 -237474 -272556 -392830
30059 -392830 -450653 -446734 -468376 -473288 -364847 -214455 -180507 -252238 -287091 -258663 -258014 -292007
30047 -292007 -295598 -309520 -425806 -577604 -599856 -488904 -395198 -373255 -351866 -336476 -408073
$$ packed form
30124d21337R7485K29599N6737j68383j53455l378K7630l0147J5432J33412J21640
30113i4765l9491j53953j01711L7042J27840J05279j3585j27949j21295j2461
30103c95049N0125R629j9300L1839O0368p059p3674o3588o0821j07472p1380J00610
30091e45772K09367J06006l2784J4046J39471J02130o3882j38673r2907o2864
30081c65862m8328M6545J43763Q3360o1473p1203N0708R7689K0651l7494m6379
30070a88023j09943j87914j20037N2138J07577K1686p25Q9134R8633l5082j20274
30059c92830n7823L919k1642m912J08441J50392L3948p1731l4853K8428O49l3993
30047b92007l591j3922j16286j51798k2252J10952R3706K1943K1389J5390p1597
$$ plain form
30036 -408073 -514731 -500624 -371910 -309921 -385124 -479603 -530917 -616836 -734184 -729304 -549371
30025 -549371 -363968 -334662 -432623 -560022 -672841 -710894 -598075 -400181 -302539 -352128
30015 -352128 -406255 -399312 -435713 -531164 -514391 -324294 -165466 -202811 -325234 -386426 -446722
30004 -446722 -572821 -638593 -575729 -590447 -827402 -1028585 -896566 -640701 -726849 -1136143
29994 -1136143 -1324419 -985456 -448938 -171464 -175550 -202563 -154939 -134275 -198770 -311086
29984 -311086 -447316 -590938 -677305 -667929 -622250 -600759 -568071 -480120 -384524 -336409 -295438
29973 -295438 -215059 -159292 -204116 -274128 -214855 -15822 156884 159160 6332 -194188 -355152
29962 -355152 -434993 -437898 -427964 -479534 -574629 -606039 -523554 -417104 -392331 -416975 -383965 -298395
$$ packed form
30036d08073j06658J4107J28714O1989p5203r4479n1314q5919j17348M880J79933
30025e49371J85403K9306r7961j27399j12819l8053J12819J97894R7642m9589
30015c52128n4127O943l6401r5451J6773J90097J58828l7345j22423o1192o0296
30004d46722j26099o5772O2864j4718k36955k01183J32019K55865q6148m09294
29994a136143j88276L38963N36518K77474m086k7013M7624K0664o4495j12316
29984c11086j36230j43622q6367R376M5679K1491L2688Q7951R5596M8115M0971
29973b95438Q0379N5767m4824p0012N9273J99033J72706K276j52828k00520j60964
29962c55152p9841k905R934n1570r5095l1410Q2485J06450K4773k4644L3010Q5570
$$ plain form
29950 -298395 -277339 -343115 -353030 -217576 -69004 -75348 -172634 -167132 -67636 -90851 -297073
29939 -297073 -454631 -388300 -255595 -289200 -426248 -432782 -298428 -239211 -333259 -420316 -401606
29928 -401606 -391861 -482039 -565420 -528708 -443523 -421806 -417928 -328514 -182343 -77591 -17611
29917 -17611 36954 31400 -97030 -253985 -294793 -267337 -348784 -533116 -596587 -440985 -266838
29906 -266838 -274054 -354526 -266652 -18986 127293 20664 -204273 -347813 -380912 -383102 -376397
29895 -376397 -339268 -308008 -333998 -368087 -306777 -157127 -50472 -69312 -156623 -233682 -307347
29884 -307347 -389195 -397631 -257298 -57774 11760 -102148 -250497 -283688 -228674 -205303 -237923
29873 -237923 -238413 -151686 -36715 7690 -54563 -181925 -302903 -362685 -352491 -309332 -268199
$$ packed form
29950b98395K1056o5776r915J35454J48572o344r7286N502R9496k3215k06222
29939b97073j57558O6331J32705l3605j37048o534J34354N9217r4048q7057J8710
29928d01606R745r0178q3381L6712Q5185K1717L878Q9414J46171J04752N9980
29917a7611N4565n554j28430j56955m0808K7456q1447j84332o3471J55602J74147
29906b66838p216q0472Q7874K47666J46279j06629k24937j43540l3099k190O705
29895c76397L7129L1260k5990l4089O1310J49650J06655j8840q7311p7059p3665
29884c07347q1848q436J40333J99524O9534j13908j48349l3191N5014K3371l2620
29873b37923m90Q6727J14971M4405o2253j27362j20978n9782J0194M3159M1133
$$ plain form
29862 -268199 -213880 -116035 -18098 -31615 -195633 -386762 -442657 -357241 -269037 -252906 -228368
29851 -228368 -123311 -25059 -62064 -193388 -246397 -159840 -68560 -113263 -264181 -387867 -418572
29840 -418572 -403841 -422995 -506733 -610190 -645349 -575696 -478491 -451055 -460285 -385211 -226370
29829 -226370 -143271 -220382 -325509 -306216 -216932 -219040 -342555 -493005 -621976 -725681 -730428
29818 -730428 -569823 -350896 -239149 -175772 60032 448648 630506 353661 -161380 -485271
29808 -485271 -482914 -361761 -304767 -277811 -202922 -129025 -156597 -300585 -493376 -660080 -745163
29797 -745163 -712322 -565339 -360633 -184276 -109567 -147924 -224092 -238649 -186807 -170746 -250550
29786 -250550 -338103 -313276 -205717 -166597 -267988 -418457 -487610 -437579 -314561 -184582
$$ packed form
29862b68199N4319R7845R7937j3517j64018j91129n5895Q5416Q8204J6131K4538
29851b28368J05057R8252l7005j31324n3009Q6557R1280m4703j50918j23686l0705
29840d18572J4731j9154q3738j03457l5159O9653R7205K7436r230P5074J58841
29829b26370Q3099p7111j05127J9293Q9284k108j23515j50450j28971j03705m747
29818g30428J60605K18927J11747O3377K35804L88616J81858k76845n15041l23891
29808d85271K357J21153N6994K6956P4889P3897k7572j43988j92791j66704q5083
29797g45163L2841J46983K04706J76357P4709l8357p6168j4557N1842J6061p9804
29786b50550q7553K4827J07559L9120j01391j50469o9153N0031J23018J29979
$$ plain form
29776 -184582 -110748 -133964 -229772 -313959 -323668 -277895 -245426 -272047 -344795 -408957 -422306 -408745
29764 -408745 -437688 -520781 -563257 -474977 -302540 -173781 -126286 -88476 -36377 -48107 -147314
$$ packed form
29776a84582P3834k3216r5808q4187r709M5773L2469k6621p2748o4162j3349J3561
29764d08745k8943q3093m2476Q8280J72437J28759M7495L7810N2099j1730r9207
$$ [...]
##END NTUPLES=NMR SPECTRUM
##END=
