##TITLE=31Pdec_LY-4Dix
 CD3CN, 24 sc
 11.03.2021
##JCAMPDX= 6.0         $$ Bruker NMR JCAMP-DX V2.0
##DATA TYPE= NMR SPECTRUM
##DATA CLASS= NTUPLES
##ORIGIN= UXNMR, Bruker Analytische Messtechnik GmbH
##OWNER= root
$$ XWIN-NMR		Version 3.5
$$ Thu Mar 11 10:53:07 2021 Russian Standard Time (UT+4h)  she@DPX200
##.OBSERVE FREQUENCY= 81.013821
##.OBSERVE NUCLEUS= ^31P
##.ACQUISITION MODE= SIMULTANEOUS
##.ACQUISITION SCHEME= undefined
##.AVERAGES= 24
##.DIGITISER RES= 16
##SPECTROMETER/DATA SYSTEM= spect
##.PULSE SEQUENCE= zgpg30
##.SOLVENT NAME= CD3CN
##.SHIFT REFERENCE= (INTERNAL, CD3CN, 0, 248.564)
##AUDIT TRAIL= $$ (NUMBER, WHEN, WHO, WHERE, WHAT)
$$ ##TITLE= Audit trail, XWIN-NMR		Version 3.5
$$ ##JCAMPDX= 5.01
$$ ##ORIGIN= Bruker BioSpin GmbH
$$ ##OWNER= she
$$ F:/spectra/data/she/nmr/P31/1/pdata/1/auditp.txt
$$ ##AUDIT TRAIL=  $$ (NUMBER, WHEN, WHO, WHERE, WHAT)
(   1,<2021-03-11 10:51:55.85 +0400>,<she>,<DPX200>,
      <created by zg, POWCHK disabled, PULCHK disabled
       configuration hash MD5:
       00 E9 B6 7A A2 85 ED C7 34 08 36 98 17 FE 4E 26
       data hash MD5: 32K
       32 82 2D 76 17 57 89 59 EB BF A7 B2 1E 7C 32 42>)
(   2,<2021-03-11 10:52:01.00 +0400>,<she>,<DPX200>,
      <Start of raw data processing
       efp BC_mod = 2 LB = 1 FT_mod = 6 PKNL = 1 PHC0 = -4020.404 PHC1 = 16.40097 SI = 64K 
       data hash MD5: 64K
       13 BA 82 94 92 E1 D2 F7 1A 11 4D DB 10 A7 F3 B9>)
(   3,<2021-03-11 10:52:24.23 +0400>,<she>,<DPX200>,
      <pk PHC0 = -34.2917 PHC1 = 21.20002 
       data hash MD5: 64K
       D2 7A F4 9F 26 D6 4B DC C7 D6 B4 37 BC 60 31 51>)
$$ ##END=
$$ 
$$ hash MD5
$$ 23 61 3B F4 2F 77 18 FB 91 28 6F 74 86 44 1E A2
##$RELAX= 
##$RELAX= 
##$RELAX= 
##$RELAX= 
##$RELAX= 
##$RELAX= 
##$RELAX= 
##$RELAX= 
$$ Bruker specific parameters
$$ --------------------------
##$DU= <F:/spectra>
##$EXPNO= 1
##$NAME= <P31>
##$PROCNO= 1
##$TYPE= <nmr>
##$USER= <she>
##$AMP= (0..31)
100 100 100 100 100 100 100 100 100 100 100 100 100 100 100 100 100 100 
100 100 100 100 100 100 100 100 100 100 100 100 100 100 
##$AQSEQ= 0
##$AQ_mod= 1
##$AUNM= <au_zg>
##$AUTOPOS= <>
##$BF1= 81.014009
##$BF2= 200.13
##$BF3= 200.13
##$BF4= 200.13
##$BF5= 200.13
##$BF6= 200.13
##$BF7= 200.13
##$BF8= 200.13
##$BYTORDA= 1
##$CFDGTYP= 0
##$CFRGTYP= 5
##$CHEMSTR= <none>
##$CNST= (0..31)
1 1 145 1 1 1 1 1 1 1 1 1 1 1 1 1 1 1 1 1 1 1 1 1 1 1 1 1 1 1 1 1 
##$CPDPRG= <waltz16>
##$CPDPRG1= <>
##$CPDPRG2= <waltz16>
##$CPDPRG3= <>
##$CPDPRG4= <mlev>
##$CPDPRG5= <mlev>
##$CPDPRG6= <mlev>
##$CPDPRG7= <mlev>
##$CPDPRG8= <mlev>
##$CPDPRGB= <>
##$CPDPRGT= <>
##$D= (0..31)
0 1 0 0 0 0 0 0 0 0 0 0.03 2e-05 3e-06 0 0 0 0 0 0 0 0 0 0 0 0 0 0 0 0 
0 0 
##$DATE= 1615445515
##$DBL= (0..7)
120 120 120 11 120 120 24 19 
##$DBP= (0..7)
150 150 150 150 150 150 150 150 
##$DBP07= 0
##$DBPNAM0= <>
##$DBPNAM1= <>
##$DBPNAM2= <>
##$DBPNAM3= <>
##$DBPNAM4= <>
##$DBPNAM5= <>
##$DBPNAM6= <>
##$DBPNAM7= <>
##$DBPOAL= (0..7)
0.5 0.5 0.5 0.5 0.5 0.5 0.5 0.5 
##$DBPOFFS= (0..7)
$$ [...]
##$SUBNAM2= <"">
##$SUBNAM3= <"">
##$SUBNAM4= <"">
##$SUBNAM5= <"">
##$SUBNAM6= <"">
##$SUBNAM7= <"">
##$SUBNAM8= <"">
##$SUBNAM9= <"">
##$SW= 501.771253377433
##$SWIBOX= (0..15)
0 1 3 0 0 0 0 0 0 0 0 0 0 0 0 0 
##$SW_h= 40650.406504065
##$TD= 32768
##$TD0= 1
##$TE= 0
##$TE2= 300
##$TE3= 300
##$TEG= 300
##$TL= (0..7)
0 120 53 12 22 120 120 120 
##$TP= (0..7)
150 150 150 150 150 150 150 150 
##$TP07= 0
##$TPNAME0= <>
##$TPNAME1= <>
##$TPNAME2= <>
##$TPNAME3= <>
##$TPNAME4= <>
##$TPNAME5= <>
##$TPNAME6= <>
##$TPNAME7= <>
##$TPOAL= (0..7)
0.5 0.5 0.5 0.5 0.5 0.5 0.5 0.5 
##$TPOFFS= (0..7)
0 0 0 0 0 0 0 0 
##$TUNHIN= 0
##$TUNHOUT= 0
##$TUNXOUT= 0
##$USERA1= <user>
##$USERA2= <user>
##$USERA3= <user>
##$USERA4= <user>
##$USERA5= <user>
##$V9= 5
##$VALIST= <valist>
##$VCLIST= <CCCCCCCCCCCCCCC>
##$VD= 0
##$VDLIST= <DDDDDDDDDDDDDDD>
##$VPLIST= <PPPPPPPPPPPPPPP>
##$VTLIST= <TTTTTTTTTTTTTTT>
##$WBST= 1024
##$WBSW= 4
##$XGAIN= (0..3)
0 0 0 0 
##$XL= 0
##$YL= 0
##$YMAX_a= 13779
##$YMIN_a= -25678
##$ZGOPTNS= <>
##$ZL1= 120
##$ZL2= 120
##$ZL3= 120
##$ZL4= 120
##$ABSF1= 0
##$ABSF2= 0
##$ABSG= 0
##$ABSL= 0
##$ALPHA= 0
##$AQORDER= 0
##$ASSFAC= 0
##$ASSFACI= 0
##$ASSFACX= 0
##$ASSWID= 0
##$AUNMP= <proc_1d>
##$AZFE= 0.1
##$AZFW= 0.5
##$BCFW= 0
##$BC_mod= 2
##$BYTORDP= 0
##$COROFFS= 0
##$CY= -3
##$DATMOD= 1
##$DC= 0
##$DFILT= <>
##$DTYPP= 0
##$F1P= 0
##$F2P= 0
##$FCOR= 1
##$FTSIZE= 65536
##$FT_mod= 6
##$GAMMA= 0
##$GB= 0
##$INTBC= 1
##$INTSCL= 5.30512e-09
##$ISEN= 30
##$LB= 1
##$LEV0= 0
##$LPBIN= 0
##$MAXI= 10000
##$MC2= 0
##$MEAN= 0
##$ME_mod= 0
##$MI= 50
##$NCOEF= 0
##$NC_proc= -2
##$NLEV= 6
##$NOISF1= 182.463
##$NOISF2= 159.3651
##$NSP= 0
##$NTH_PI= 0
##$NZP= 0
##$OFFSET= 248.5645
##$PC= 4
##$PHC0= -4054.696
##$PHC1= 37.60099
##$PH_mod= 1
##$PKNL= yes
##$PPARMOD= 0
##$PSCAL= 0
##$PSIGN= 0
##$REVERSE= no
##$SF= 81.014009
##$SI= 65536
##$SIGF1= 159.3651
##$SIGF2= -187.1042
##$SINO= 113.3802
##$SIOLD= 16384
##$SREGLST= <1H.CDCl3>
##$SSB= 0
##$STSI= 65536
##$STSR= 0
##$SW_p= 40650.406504065
##$SYMM= 0
##$S_DEV= 0
##$TDeff= 32768
##$TDoff= 0
##$TI= <>
##$TILT= no
##$TM1= 0
##$TM2= 0
##$TOPLEV= 0
##$USERP1= <user>
##$USERP2= <user>
##$USERP3= <user>
##$USERP4= <user>
##$USERP5= <user>
##$WDW= 1
##$XDIM= 65536
##$YMAX_p= 382429791
##$YMIN_p= -804637
$$ End of Bruker specific parameters
$$ ---------------------------------
##NTUPLES= NMR SPECTRUM
##VAR_NAME=  FREQUENCY,     SPECTRUM/REAL,   SPECTRUM/IMAG
##SYMBOL=    X,             R,               I
##VAR_TYPE=  INDEPENDENT,   DEPENDENT,       DEPENDENT
##VAR_FORM=  AFFN,          ASDF,            ASDF
##VAR_DIM=   65536,         65536,           65536
##UNITS=     HZ,            ARBITRARY UNITS, ARBITRARY UNITS
##FACTOR=    0.620285442955139, 1,           1
##FIRST=     20137.2065510759, 0,            0
##LAST=      -20513.1999529892, 0,           0
##MIN=       -20513.1999529892, -804637,     0
##MAX=       20137.2065510759, 382429791,    0
$$ Real data points
##PAGE= N=1
##DATA TABLE= (X++(R..R)), XYDATA
$$ [...]
35904c75766M0724J15065R8267R0973Q7165j0153j25396p2651R4076J14881m2066
$$ -375766 -335042 -219977 -121710 -30737 56428 46275 -79121 -151772 -57696 57185 15119
35893A5119j17633j5458L6493q3663j52447M093J92110J73812M0885l002N54q5258
$$ 15119 -102514 -117972 -81479 -165142 -317589 -313496 -121386 52426 93311 90309 90863 5605
35881E605j76034j06059N0982R5775L7652L3521P1592Q52j62572k29663j38888
$$ 5605 -170429 -276488 -225506 -129731 -92079 -58558 13034 13886 -148686 -378349 -517237
35870e17237k5899J9182M9789R6049R7695M3431J0737K7773L6703J9342K3180
$$ -517237 -543136 -523954 -474165 -378116 -280421 -236990 -226253 -198480 -161777 -142435 -119255
35859a19255M2829J3226n1940m7888N4979J46173J21613Q783q4116p4616L9261
$$ -119255 -76426 -63200 -115140 -163028 -108049 38124 159737 168520 84404 9788 49049
35848D9049J54788J18313r3658k74043k02189M7153J74556O0753q2026m3273Q3190
$$ 49049 203837 322150 228492 -45551 -247740 -200587 -26031 34722 -47304 -90577 -7387
35837g387Q3034k8388n2688M6062P3445p4221k24550j84729l1502K5057k4478
$$ -7387 75647 47259 -5429 40633 114078 39857 -184693 -369422 -400924 -375867 -400345
35826d00345p57J37923K08271J03952k6169l0322l23p9447j72316r2697Q4883
$$ -400345 -401102 -263179 -54908 49044 22875 -7447 -7770 -87217 -259533 -352230 -267347
35815b67347J06201l9277p5020J08945K47426J07078j36549j60907K2061J12302
$$ -267347 -161146 -200423 -275443 -166498 80928 188006 51457 -109450 -87389 24913
35805B4913j5432j57672j17522K5642P6629P284m6764k822P3563Q4012K3839l4590
$$ 24913 9481 -148191 -265713 -240071 -163442 -156158 -202922 -205744 -132181 -48169 -24330 -58920
35793e8920l8594j93L2760J8795m5564j02291o5987O4014J53624Q2765p0365j12223
$$ -58920 -97514 -97707 -64947 -46152 -91716 -194007 -259994 -195980 -42356 40409 -29956 -142179
35781a42179j0447O1889O968m5642K5945J16677P2756m6022p4521j3435J1353
$$ -142179 -152626 -90737 -83769 -129411 -103466 13211 85967 39945 -34576 -48011 -36658
35770c6658j1363J3791Q7530J19706R6340O0605j6116j48048j93784l7193J52168
$$ -36658 -48021 -34230 53300 173006 269346 329951 313835 165787 -27997 -65190 86978
35759H6978J09916j05092j75701r550J47539J20061J9723k4530o3109j36720j43560
$$ 86978 196894 91802 -83899 -93449 54090 174151 193874 169344 106235 -30485 -174045
35748a74045k7071J02925J38107Q7972j7391j44947j68377L1J84911J37143n4699
$$ -174045 -201116 -98191 39916 127888 110497 -34450 -202827 -202796 -17885 119258 64559
35737F4559q0535N4454K5310k08853k67783J0565K62018J83708q409k3235J5826
$$ 64559 -15976 38478 63788 -145065 -412848 -402283 -140265 43443 35034 11799 27625
35726B7625r9163k03983o1572J69388J92062O1628J2058K0292m6055p0878Q1766
$$ 27625 -71538 -275521 -337093 -167705 24357 85985 98043 118335 72280 1402 83168
35715H3168J89638n638k78757k28217L9792P9397j30045j68957P0474K04989L8520
$$ 83168 272806 267168 -11589 -239806 -200014 -120617 -250662 -419619 -349145 -144156 -105636
35704a05636j26204m1272R9462O4024l2242p227N6387K5778j1821M7511Q1308
$$ -105636 -231840 -273112 -173650 -109626 -141868 -149095 -92708 -66930 -78751 -31240 50068
35693E0068m4939k02726j80318l429J31597J38857Q0602J4991l9956o0701n2963
$$ 50068 5129 -197597 -377915 -381344 -249747 -110890 -30288 -15297 -55253 -115954 -168917
35682a68917o2892p5754n005J39056J94286O7521j02425j27562k6107M0222J9719
$$ -168917 -231809 -307563 -312568 -173512 20774 88295 -14130 -141692 -167799 -127577 -107858
35671a07858R840N4797N2533p2412j99375j37290Q6215K00879N0247j49206r2405
$$ -107858 -98018 -43221 9312 -63100 -262475 -399765 -313550 -112671 -62424 -211630 -304035
35660c04035J40555J70831r1630k73884j04402J68380J84312K3264j658J03378
$$ -304035 -163480 7351 -84279 -358163 -462565 -294185 -109873 -86609 -88267 15111
35650A5111Q0952p3433j11861n015J8003p5482n4338J12273J49630k5881j18629
$$ 15111 96063 22630 -89231 -94246 -76243 -151725 -206063 -93790 55840 29959 -88670
35639h8670L7058J68783L1591j66793j28790L5640M1549o4812l2898J04499Q8488
$$ -88670 -51612 117171 148762 -18031 -146821 -111181 -69632 -134444 -167342 -62843 25645
35628B5645p7367j04657Q2759K02741P1080j15208j09952K1485O6868M648l3197
$$ 25645 -51722 -156379 -73620 129121 200201 84993 -24959 -3474 63394 68042 34845
35617C4845j5801k3723o2940n3806O106K0832m7164j16756j08161l3890M6144
$$ 34845 19044 -4679 -67619 -121425 -115319 -94487 -141651 -258407 -366568 -400458 -354314
35606c54314Q5269O4409K1613M9269J62935K03502K1517k46486k87294n0176J48082
$$ -354314 -269045 -204636 -183023 -133754 29181 232683 254200 7714 -279580 -329756 -181674
35595a81674P9155o8157k0037J33761J19783l5245o1196O4475O8715j21414k08673
$$ -181674 -102519 -170676 -190713 -56952 62831 27586 -33610 30865 99580 -21834 -230507
35584b30507k897K48025K21566k1477j79385j42005m4525L262K0191L4317L5224
$$ -230507 -233404 14621 236187 214710 35325 -106680 -151205 -147943 -127752 -93435 -58211
35573e8211L0659L7073L4824L301m1241q6596j36140j50316p0249O9651J55695
$$ -58211 -27552 9521 44345 47646 6405 -80191 -216331 -366647 -436896 -367245 -211550
35562b11550J44779R1119K3968o2443j07825m7774L2130K196o8056j0804J12953
$$ -211550 -66771 24348 48316 -14127 -121952 -169726 -137596 -135400 -203456 -214260 -101307
35551a01307Q4266o3661n5172J41458K14954K7228j51158j03057P024j1648m9008
$$ -101307 -17041 -80702 -135874 5584 220538 247766 96608 -6449 575 -11073 -60081
35540f0081J9079N1719o5518j57473p4536K7200N451J7101J77191K57909P3431
$$ -60081 -41002 10717 -54801 -212274 -286810 -259610 -254159 -237058 -59867 198042 271473
35529B71473j47625j39414l8504o5203r1260M9083J43566k2829j86363k7149K10004
$$ 271473 123848 -15566 -54070 -119273 -210533 -161450 -17884 -40713 -227076 -254225 -44221
35518d4221R7960k10533k29221L4440J49676L8865J9046J27297P2149j35302j48455
$$ -44221 53739 -156794 -386015 -351575 -201899 -163034 -143988 -16691 55458 -79844 -228299
35507b28299O1337J32082k7099r3597M7413J15836m583p5833j0111k3117j40818
$$ -228299 -166962 -34880 -61979 -155576 -108163 7673 3090 -72743 -82854 -105971 -246789
35496b46789r4832J29982J83415l4666j79194p3103J9837n1992m8473J35903K06148
$$ -246789 -341621 -211639 -28224 -62890 -242084 -315187 -295350 -347342 -395815 -259912 -53764
35485e3764K1544j03831K1863J01563p7381k03205M87K31216J09961j52992j16284
$$ -53764 -32220 -136051 -114188 -12625 -90006 -293211 -292724 -61508 48453 -104539 -220823
35474b20823J53201K24651P994j70951j13169L8528R4146K6132q7538j29325k2367
$$ -220823 -67622 157029 165023 -5928 -119097 -80569 13577 39709 -47829 -177154 -199521
35463a99521J24494R7802q6133j50190J0315J39007M1099j00106o0008N4577L8647
$$ -199521 -75027 22775 -63358 -213548 -203233 -64226 -23127 -123233 -183241 -128664 -90017
35452i0017m9022l8631L7716N0254J5277O552n213l3834M569Q6898L5726j49451
$$ -90017 -139039 -177670 -139954 -89700 -74423 -67871 -73084 -106918 -102349 -15451 20275 -129176
35440a29176j95132N982J63053M5195j38113j10011J7758L072p5851l933J44047
$$ -129176 -324308 -318326 -155273 -110078 -248191 -358202 -340444 -337372 -413223 -417156 -273109
35429b73109J39099O240n5075l0630m5766p7102j6287Q4085J06490R5236J27678
$$ -273109 -134010 -127770 -182845 -213475 -259241 -336343 -352630 -268545 -162055 -66819 60859
35418F0859J01353p3285k14073j04923J26462J73990N087j44354j52905j11440
$$ 60859 162212 88927 -125146 -230069 -103607 70383 75470 -68884 -221789 -333229
35408c33229q6871m1237L5130J02355J47607J49906O0476o6776p4239M5893Q9290
$$ -333229 -420100 -461337 -426207 -323852 -176245 -26339 34137 -32639 -106878 -60985 28305
35397B8305k7224j01832P553J30922R2119K231L077p935j18055j46318K7702J58022
$$ 28305 1081 -100751 -93198 37724 129843 132074 135151 127216 9161 -137157 -109455 48567
35385D8567J9297j61826p0497J38609J04644j05367j18831R6930K00092M8464
$$ 48567 67864 -93962 -164459 -25850 78794 -26573 -145404 -48474 151618 200082
35375B00082j34248j67538j05262j6057Q8721J26521M7208n11R4742J35834o5729
$$ 200082 65834 -101704 -206966 -223023 -134302 -7781 39427 38916 133658 269492 203763
35364B03763k67130j27577J79844K02828l5974r1425J15901J79272m2252j70192
$$ 203763 -63367 -190944 -11100 191728 155754 64329 180230 359502 317250 147058
35354A47058N484J68836Q0904L5J53180K84641J70808J54477O05938J124360R07211
$$ 147058 152542 321378 402282 402317 555497 840138 1010946 1165423 1771361 2895721 3802932
35343C802932j18051j076617j187738o21907j22709p2660k19992k01636k2965
$$ 3802932 3684881 2608264 1420526 798619 675910 603250 383258 181622 158657
35334A58657O6096k1730j20495r0617k778J8660j1917j3849P944J0230J8028M9788
$$ 158657 224753 203023 82528 -8089 -10867 7793 -4124 -17973 -10029 201 18229 68017
35322F8017K6415r3120j72287p3482R2866R8026n7683j33272P365K18803K76873
$$ 68017 94432 1312 -170975 -244457 -151591 -53565 -111248 -244520 -237155 -18352 258521
35311B58521J21338j26388k79003k18118j0413J34013J02679J3914J1906L9881
$$ 258521 379859 253471 -25532 -243650 -254063 -120050 -17371 -3457 8449 48330
35301D8330k7506j32361j16219J2717R9465Q4721L4923k2053r3807j05574L115
$$ 48330 20824 -111537 -227756 -215039 -115574 -30853 4070 -17983 -111790 -217364 -214249
35290b14249J05454L3073j35525j61893l943J50619J94709J91505J47102k5494
$$ -214249 -108795 -75722 -211247 -373140 -377083 -226464 -31755 159750 306852 281358
35280B81358k52651k80621k9398K47932K87173J21197m8213j22175j20745o7677
$$ 281358 28707 -251914 -281312 -33380 253793 374990 326777 204602 83857 16180
35270A6180j590o637j01055j57118m7046J63954K65729J43534q9433k17033j53694
$$ 16180 14590 7953 -93102 -250220 -297266 -133312 132417 275951 186518 -30515 -184209
35259a84209k2788J5327k6044j945J19578J81618O4810j25465j92404q7172P1996
$$ -184209 -206997 -191670 -217714 -219659 -100081 81537 146347 20882 -171522 -258694 -186698
35248a86698J48967Q7541n9962j44046n7397R0091P4796j03598j73738J2518K37986
$$ -186698 -37731 49810 -10152 -154198 -211595 -121504 -46708 -150306 -324044 -311526 -73540
35237g3540K34726N6560o1871o2690o0169r5685j14833j06236q0630j95J15540
$$ -73540 161186 217746 155875 93185 33016 -62669 -177502 -283738 -364368 -364563 -249023
35226b49023J35877K9395k8691N9578J10840l2476j87377j08475R1765J30452
$$ -249023 -113146 -83751 -112442 -52864 57976 25500 -161877 -270352 -178587 -48135
35216d8135K6904K7063J41919J39557k4965j33478q3194j6780k7816l0417J6584
$$ -48135 -21231 5832 147751 287308 262343 128865 45671 28891 1075 -29342 -12758
35205a2758J9212m8533p7721k1490L6789N2230P4212J09951R9697L6380l5317
$$ -12758 6454 -42079 -119800 -141290 -104501 -52271 21941 131892 231589 267969 232652
35194B32652j09840j71071j30636J9097J01286K902j05045l2404R3914M9734p5774
$$ 232652 122812 -48259 -178895 -159798 -58512 -55610 -160655 -193059 -99145 -49411 -125185
35183a25185m0269R4937O8103q4848o5550J47111K22540J9917j88172j53419K3725
$$ -125185 -165454 -70517 -2414 -87262 -152812 -5701 216839 236756 48584 -104835 -81110
35172h1110J33797J31259N4675o6110j35693o6623K9074k4067j35450o3814J36775
$$ -81110 52687 183946 238621 172511 36818 -29805 -731 -24798 -160248 -224062 -87287
35161h7287J56809l9538j32105O127R6661l9037j68626p9420M6655k1053j44843
$$ -87287 69522 29984 -102121 -95994 667 -38370 -206996 -286416 -239761 -260814 -405657
35150d05657p0192J31004J90926P0668l4865k1857L6519O7727O8721M0662l149
$$ -405657 -475849 -344845 -153919 -83251 -118116 -139973 -103454 -35727 32994 73656 70507
35139G0507j1657K1610J7276o8721j59202j56682n7121P0733J36943O4883j10159
$$ 70507 58850 80460 97736 29015 -130187 -286869 -343990 -273257 -136314 -71431 -181590
35128a81590j98877o5341J49700J92731N5896m2214j3565J1431l6384o0098j5674
$$ -181590 -380467 -445808 -296108 -103377 -47481 -89695 -103260 -91829 -128213 -188311 -203985
35117b03985J1477k883Q907J6917p0192j57291m5106J95665K52110M8121j33133
$$ -203985 -192508 -195391 -186484 -169567 -239759 -397050 -442156 -246491 5619 53740 -79393
35106g9393j10342m5709p9318o7112J07344K62542K02694L0523n0619l5990j4491
$$ -79393 -189735 -235444 -314762 -381874 -274530 -11988 190706 221229 170610 134620 120129
35095A20129K8757R8683P3488r1410k14191j33305N2959J57178J46314O6117q7201
$$ 120129 148886 247569 321057 229647 15456 -117849 -64890 92288 238602 304719 217518
35084B17518k55774k70773r0185Q4734Q7241J141m0648o1218q3580j121J96404
$$ 217518 -38256 -309029 -399214 -314480 -227239 -226098 -266746 -327964 -411544 -412665 -216261
35073b16261K84877J17462j15703j60672n2197K7035N6082J05600J25194N0954
$$ -216261 68616 186078 70375 -90297 -142494 -115459 -59377 46223 171417 222371
35063B22371j5094K8684P2281j9749j50187j55828r3069j04752j36356n8343M6996
$$ 222371 207277 235961 308242 288493 138306 -17522 -110591 -215343 -351699 -410042 -363046
35052c63046J6315o6681J4805K15232K57690O5339j23817j14675J7916J12444
$$ -363046 -346731 -413412 -398607 -183375 74315 139654 15837 -98838 -80922 31522
35042C1522J17051M6516o7875j29967m7848J01769J36993L5382l5632K17Q744
$$ 31522 148573 195089 127214 -2753 -50601 51168 188161 223543 187911 188128 196872
35031A96872r7655j69331m8728J39363J36095n8113j58109q196J76038J16110
$$ 196872 99217 -70114 -118842 20521 156616 98503 -59606 -67802 108236 224346
35021B24346j19333k18537q4725N1997J7558n7956m167R3775O5455l7815m4583
$$ 224346 105013 -113524 -198249 -146252 -128694 -186650 -190817 -97042 -31587 -69402 -113985
35010a13985L2860M4166j7851l3932j2273o5327j52541j13818L4574J05372O2385
$$ -113985 -81125 -36959 -54810 -88742 -101015 -166342 -318883 -432701 -398127 -292755 -230370
34999b30370O1421J31171J06620m2594j11911p396Q4283J5924q6672p8357m4633
$$ -230370 -168949 -37778 68842 26248 -85663 -93059 -8776 7148 -79524 -157881 -202514
34988b02514j04301j64870q6841O0477J08794M4633j7851k4256L147N0064R3160
$$ -202514 -306815 -471685 -558526 -498049 -389255 -344622 -362473 -386729 -383582 -333518 -240358
34977b40358Q0380J8002j3858L542n968n4468m1307O4333J41719J03296J8956
$$ -240358 -159978 -141976 -155834 -152292 -158260 -212728 -254035 -189702 -47983 55313 74269
34966G4269k3833l9455m8314j4980L8246J5175p1553o8742O3968J35621p666k29744
$$ 74269 50436 10981 -37333 -52313 -14067 1108 -70445 -139187 -75219 60402 52736 -177008
34954a77008k66536o1289J83779K52889J37056J6611L6379J09908L6879j57749
$$ -177008 -443544 -504833 -321054 -68165 68891 85502 121881 231789 268668 110919
34944A10919j90608M3955K34024R5058j61003j50239O2649J00139p4885j29431
$$ 110919 -79689 -35734 198290 293348 132345 -17894 44755 144894 70009 -59422
34934e9422L0967J24611K6277m6825Q259K987j22649j54112l7157j3215j42431
$$ -59422 -28455 96156 122433 75608 83867 86854 -35795 -189907 -227064 -240279 -382710
34923c82710j41912R4642K64821J73805L6998K4976k8575j87185j66410J28371
$$ -382710 -524622 -429980 -165159 8646 45644 70620 42045 -145140 -311550 -183179
34913a83179K91753M9924k36013j48124J08208R8413j11937j51080L814Q8890
$$ -183179 108574 158498 -77515 -225639 -117431 -19018 -130955 -282035 -278221 -189331
34903a89331O7164Q8381J04340j6209j40919p4290M7688j9045j68810j35042K0412
$$ -189331 -122167 -33786 70554 54345 -86574 -160864 -113176 -132221 -301031 -436073 -415661
34892d15661M1083m3519j1449J01050Q2916k1094M846J22138J15952Q709j7619
$$ -415661 -374578 -418097 -429546 -328496 -245580 -266674 -261828 -139690 -23738 -15029 -32648
34881c2648r650j22995k22129o6680J87245J69999o5139j11186Q6130J38695q6851
$$ -32648 -42298 -165293 -387422 -454102 -266857 -96858 -161997 -273183 -187053 -48358 -135209
34870a35209k25423m5604J61591Q3715j17380j10643Q7015J98026J13279k4894
$$ -135209 -360632 -406236 -244645 -160930 -278310 -388953 -301938 -103912 9367 -15527
34860a5527q1355p4501q1352j02302m6907J33159L04071K53558n384j87433j09671
$$ -15527 -96882 -171383 -252735 -355037 -401944 -268785 35286 288844 283460 96027 -13644
34849a3644N6503O8504l7458q5931o6928n5134K302J46280K16183Q3530q5858
$$ -13644 42859 111363 73905 -12026 -78954 -134088 -131786 14494 230677 314207 228349
34838B28349r4085m8793j12748j32046P7099K67845Q5081k78327k95912N8623
$$ 228349 134264 85471 -27277 -159323 -82224 185621 270702 -7625 -303537 -244914
34828b44914K59981P1426j28108k1858J58138Q9054j14645j51051j6663O8831
$$ -244914 15067 86493 -41615 -63473 94665 183719 69074 -81977 -98640 -29809
34818b9809L6406j047J6511L3886J142o4501j05181p1351R829L6225k7910p7528
$$ -29809 6597 5550 22061 55947 57089 -7412 -112593 -183944 -174115 -137890 -165800 -243328
34806b43328l1070L4794M1315N6373J19403R2501q8446k00991n8661J35957R7752
$$ -243328 -274398 -239604 -198289 -141916 -22513 69988 -18458 -219449 -278110 -142153 -44401
34795d4401n4677j7622J39093R5804j18762j56088L1868J09621m2102j38857k6547
$$ -44401 -99078 -116700 22393 118197 -565 -156653 -124785 -15164 -57266 -196123 -222670
34784b22670O8108m566m4471R2402J99488Q2944r8394j09211M694O6832O0325
$$ -222670 -154562 -159128 -203599 -111197 88291 171235 72841 -36370 -31676 35156 95481
34773I5481O0592N9516K7286n602m1724j25438j90485j05587O8372J05547l2293
$$ 95481 156073 215589 242875 237273 195549 70111 -120374 -225961 -157589 -52042 -84335
34762h4335j24155m5914O7772R8201R9490R1694o732j34798q8505J07676J50964
$$ -84335 -208490 -254404 -186632 -88431 11059 102753 96021 -38777 -127282 -19606 131358
34751A31358o1205k31582j36261K9730K1064n2986J3839J25496P4536o1688n3943
$$ 131358 70153 -161429 -297690 -267960 -246896 -299882 -286043 -160547 -86011 -147699 -201642
34740b01642P8165J19152L3492r332M6165O4629k4124j09560q4703P771N9274
$$ -201642 -123477 -4325 29167 19835 66000 130629 106505 -3055 -87758 -79987 -20713
34729b0713K8842l3302m1438M2162J46656J49653K4737j14486j43957n3920O7123
$$ -20713 8129 -25173 -66611 -24449 122207 271860 296597 182111 38154 -15766 51357
34718E1357J15850M4455q4849j31426l7747P6756P5842L073p800M2166M1467k8078
$$ 51357 167207 211662 126813 -4613 -42360 34396 110238 113311 105511 147677 189144 161066
34706A61066q4066j02991j11255o3542P2412J58962M6567j41646j32237R7649
$$ 161066 77000 -25991 -137246 -200788 -128376 30586 77153 -64493 -196730 -99081
34696i9081K92071K91081J74440K3004j78145l55044l47225j70050k3436J9385
$$ -99081 192990 484071 658511 681515 503370 148326 -198899 -368949 -392385 -373000
34686c73000P4087J53689J14680l0207o1821O7903J21924j2783j14626j2631J13936
$$ -373000 -298913 -145224 -30544 -60751 -122572 -54669 67255 54472 -60154 -72785 41151
34675D1151N0193r8367j17735l7418q570q918O1947J31005O4358o1129n2871Q0206
$$ 41151 91344 -7023 -124758 -162176 -170746 -179664 -117717 13288 77646 16517 -36354 43852
34663D3852J32821J3376j38692j57334l2460J25678K03009J52325K0408q2694
$$ 43852 176673 190049 51357 -105977 -138437 -12759 190250 342575 362983 280289
34653B80289p6578K2160J20313J18589m487j39209j34442l346N1651p9731k26153
$$ 280289 203711 225871 346184 464773 460286 321077 186635 183289 234940 155209 -70944
34642g0944j81698j9604N2612M0448R6905J87738J32749m4105j25619p1438n5989
$$ -70944 -252642 -272246 -219634 -179186 -82281 105457 238206 194101 68482 -2956 -58945
34631e8945j10264o7935P0354P6691r2121j73903l8712R3569N2748L054J04604
$$ -58945 -169209 -237144 -166790 -90099 -182220 -356123 -394835 -301266 -248518 -245464 -140860
34620a40860J97634R4896o5352m9223Q5091J12940J0298o6441n9268l8254l5776
$$ -140860 56774 151670 86318 37095 122186 235126 245424 178983 119715 81461 45685
34609D5685l5512m6765n2144J0438J00918O5592j05187j92734p2898P5307O2088
$$ 45685 10173 -36592 -88736 -78298 22620 88212 -16975 -209709 -282607 -207300 -145212
34598a45212j6496J2968R3953Q9654O0763J12857J21211p1753k92231k20105R6757
$$ -145212 -161708 -148740 -54787 34867 95630 208487 329698 257945 -34286 -254391 -157634
34587a57634K62608J02310j17145j26168j3181J4162k3370N089M2487o5263k39804
$$ -157634 104974 207284 90139 -36029 -49210 -35048 -58418 -53329 -10842 -76105 -315909
34576c15909k05380R2454L33840K33715o0164j81520o0075L7167l1388p6061N8065
$$ -315909 -521289 -428835 -94995 138720 78556 -102964 -163039 -125872 -157260 -233321 -175256
34565a75256J98993J35428k0913l6664L1798n1661k56798k89515n4083J94865
$$ -175256 23737 159165 138252 101588 133386 81725 -175073 -464588 -518671 -323806
34555c23806K30640J20086J9983n2424j21113j19734p398J09681J00828j5665
$$ -323806 -93166 26920 46903 -5521 -126634 -246368 -253766 -144085 -43257 -58922
34545e8922j04368p3796L2426Q1372M260q3000p182J75267J91688l4309k00047
$$ -58922 -163290 -237086 -204660 -123288 -119028 -202028 -209210 -33943 157745 123436 -76611
34534g6611n7998J83263J81430l914n9399L4182J7125j46165k09118j00026k9085
$$ -76611 -134609 48654 230084 226170 166771 200953 218078 71913 -137205 -237231 -266316
34523b66316q4008r9210m455N4365K7709N3559J49451J45508J2263o6119k0895
$$ -266316 -350324 -449534 -453989 -399624 -371915 -318356 -168905 -23397 -11134 -77253 -98148
34512i8148J9656K6397R6919J51143N08k25364j72704J21395J99502p6435k72659
$$ -98148 -78492 -52095 44824 195967 196475 -28889 -201593 -80198 119304 42869 -229790
34501b29790j00704J32188J02181J902R8237K02138N0775j42593l7871J97045
$$ -229790 -330494 -198306 -96125 -94223 4014 206152 256927 114334 76463 273508
34491B73508J34074j91221l21169q7996J76337J70332j4498j37943j31781p6131
$$ 273508 407582 216361 -104808 -192804 -16467 153865 139367 1424 -130357 -206488
34481b06488l8492k2429N148N8272Q3374K6863m2044m418R4491Q0397o1650j39156
$$ -206488 -244980 -267409 -262261 -203989 -120615 -93752 -135796 -140214 -45723 34674 -26976 -166132
34469a66132n4583O0601Q6429O2381K1740p6672j72082j19486L1926N7946o0183
$$ -166132 -220715 -160114 -73685 -11304 10436 -66236 -238318 -357804 -325878 -267932 -328115
34458c28115q8186L3385P0797n7597j01050O6429J89453P4620o6254O828J63046
$$ -328115 -416301 -382916 -312119 -369716 -470766 -404337 -214884 -140264 -206518 -199690 -36644
34447c6644J66875N5348k7211r6558j69255j17558N8771J06958p3869k08781r2356
$$ -36644 130231 185579 158368 61810 -107445 -225003 -166232 -59274 -133143 -341924 -434280
34436d34280P2679O8423L8157J38422J74705k8258k23692j29959P5285P6698m1884
$$ -434280 -361601 -293178 -255021 -116599 58106 29848 -193844 -323803 -248518 -171820 -213704
34425b13704k5722N0369k1670j22039k1102J45372J03110m3864j4965R7961l349
$$ -213704 -239426 -189057 -210727 -332766 -353868 -208496 -105386 -149250 -164215 -66254 -69603
34414f9603k40451k60964l7593J33800J63581K05959K31715O7558j67090j61748
$$ -69603 -310054 -571018 -608611 -474811 -311230 -105271 126444 194002 26912 -134836
34404a34836M5604J12234j5852m2698J06651J50237k2004j52019q2668k085o6879
$$ -134836 -89232 23002 7150 -35548 71103 221340 199336 47317 -35351 -37436 -104315
34393a04315j57605j59265j38109j01497P3113L21777L48948P7247j69200j25663
$$ -104315 -261920 -421185 -559294 -660791 -587678 -265901 83047 160294 -8906 -134569
34383a34569N1288Q9391P009k6666k4354j00232j85831r8748J35313K53387R6707
$$ -134569 -83281 6110 13119 -13547 -37901 -138133 -323964 -422712 -287399 -34012 62695
34372F2695j63995k37216p7413Q1303P5095L9537J48254K58683R8745k29674k98374
$$ 62695 -101300 -338516 -415929 -334626 -259531 -219994 -71740 186943 285688 56014 -242360
34361b42360N91K36836Q2923j86990j56106Q7327J62434L0398k9669N0191O9153
$$ -242360 -241769 -4933 77990 -109000 -265106 -177779 -15345 15053 -14616 35575 104728
34350A04728j8174l6347M4138M8931n5199r5301k1170J5071l0125k257J39419
$$ 104728 86554 50207 94345 143276 88077 -7224 -28394 -13323 -43448 -45705 93714
34339I3714J95035L6009j73553k07246p7114K3818j0107r0467p4725L8244R0973
$$ 93714 288749 324758 151205 -56041 -133155 -109337 -119444 -209911 -284636 -246392 -155419
34328a55419j5403j45082j02598N8371J15051N0770N8684J38758O2448j47950
$$ -155419 -170822 -315904 -418502 -360131 -245080 -194310 -135626 3132 65580 -82370
34318h2370j34680J81097L49024Q3053k31391j57093P2250q170k62930k04534
$$ -82370 -217050 -35953 313071 396124 164733 7640 79890 71720 -191210 -395744
34308c95744J32990K45238R727j64922o7989M2118p792l6292N5350P1667o4217
$$ -395744 -262754 -17516 -7789 -172711 -240700 -198582 -206374 -242666 -187316 -115649 -179866
34297a79866j18247L4555J74933J21195Q291p075p210p8613r9185K2533J28736
$$ -179866 -298113 -263558 -88625 32570 40861 33786 26576 -52037 -151222 -128689 47
34286D7N2764r8728j10363J6530Q4520j5657j74694k06314n7789J29396J79016
$$ 47 52811 -45917 -156280 -139750 -55230 -70887 -245581 -451895 -509684 -380288 -201272
34275b01272Q9077M128j5569m3818q2456k7123Q3367N1525j14008j27091R0708
$$ -201272 -112195 -108067 -123636 -167454 -249910 -277033 -193666 -142141 -256149 -383240 -292532
34264b92532K00376n452k07454p9956J46943J04652n2248M9246K81894K20655
$$ -292532 -92156 -97608 -305062 -385018 -238075 -133423 -185671 -136425 145469 366124
34254C66124q7985j99394m8545j0549j71060j78193P2398K10046L0768j67599
$$ 366124 278139 78745 30200 19651 -151409 -329602 -257204 -47158 -16390 -183989
34244a83989j15941K3817K5254l5624k1972m338n9418q3162K717R7188J09693
$$ -183989 -299930 -276113 -250859 -286483 -308455 -312793 -372211 -455373 -452656 -355468 -245775
34233b45775P6888J2542j08711j76380m3637J62120J51666n7980j38195K2017
$$ -245775 -168887 -156345 -265056 -441436 -485073 -322953 -171287 -229267 -367462 -345445
34223c45445J52874P7080k3085L2841J26692Q9504k3709p5905m7865K3526J06676
$$ -345445 -192571 -115491 -138576 -105735 20957 110461 86752 10847 -37018 -13492 93184
34212I3184J07442m5058k10033j71084K2316J10478K5073n4710n1872p6650j35178
$$ 93184 200626 155568 -54465 -225549 -203233 -92755 -67682 -122392 -174264 -250914 -386092
34201c86092q4471O6352J22717L2498m2283k1824O492J6003O6410J07720N0853
$$ -386092 -470563 -404211 -281494 -248996 -291279 -313103 -306611 -290608 -224198 -116478 -65625
34190f5625p564N6029R6502o6353k32448r2814J81228J49454j48464k39192j6213
$$ -65625 -73189 -17160 79342 12989 -219459 -312273 -131045 18409 -130055 -369247 -385460
34179c85460J27015L1738n619J15810Q8413j54832k22661L1436K07598P0435n1330
$$ -385460 -258445 -226707 -232326 -116516 -28103 -182935 -405596 -374160 -166562 -96127 -147457
34168a47457O9774J15155j24582k50203N7191L79082K00514k25912l06190n8687
$$ -147457 -77683 37472 -87110 -337313 -280122 98960 299474 73562 -232628 -291315
34158b91315L3270j05638j01481J30668K45296R2226n4170R890J21540P7358o8467
$$ -291315 -258045 -363683 -465164 -334496 -89200 3026 -51144 -41254 80286 157644 89177
34147H9177j56926j44830p8130m684L3037K4902J5514K6718J3650l1898l2585
$$ 89177 -67749 -212579 -290709 -295393 -262356 -237454 -221940 -195222 -181572 -213470 -246055
34136b46055L8042Q6399N2548P256J4503L4564L6132N1239N7092j7686j11357
$$ -246055 -208013 -121614 -69066 -61810 -47307 -12743 23389 74628 131720 114034 2677
34125B677o4231R5388J35265k0532j61380j30901m9063o2520j12309r4061l2371
$$ 2677 -61554 33834 169099 148567 -12813 -143714 -192777 -255297 -367606 -461667 -494038
34114d94038L3553J26954J93431J14317m9424q2153L2489P0091l2984o7004M2779
$$ -494038 -460485 -333531 -140100 -25783 -75207 -157360 -124871 -54780 -87764 -154768 -111989
34103a11989P7386n8163j28384N656J15808K3295o0113Q5897K71991K00833n6719
$$ -111989 -34603 -92766 -221150 -215494 -99686 -76391 -136504 -50607 221384 422217 365498
34092C65498k15971k06794j41688m0747J12946K00407J25527J2297J0410N2185
$$ 365498 149527 -57267 -198955 -239702 -126756 73651 199178 211475 221885 274070
34082B74070J4567m8414m7233m6833j00355q9443M3306J07801l7234j97780j27499
$$ 274070 288637 240223 192990 146157 45802 -43641 -335 107466 70232 -127548 -255047
34071b55047P3698J28330J3083n8275J1147J15489J49596R7681j7711j24548j25370
$$ -255047 -181349 -53019 -39936 -98211 -87064 28425 178021 275702 257991 133443 8073
34060H073m3842j9428o8040l7984R1621J11839o1039j87466o8511J29712J51314
$$ 8073 -35769 -55197 -123237 -161221 -69600 42239 -18800 -206266 -274777 -145065 6249
34049F249L6200k1810j0740k8343l6316M2090J04407R991j52953j77807m9689
$$ 6249 42449 20639 9899 -18444 -54760 -12670 91737 101728 -51225 -229032 -278721
34038b78721O0136N9046J9934L5688J06519J44775M7920j62404k84688j62684
$$ -278721 -218585 -159539 -139605 -103917 2602 147377 195297 32893 -251795 -414479
34028d14479O0848J21261L1478K8241J32857J14944o1873j44696m4026J5651n6899
$$ -414479 -353631 -232370 -200892 -172651 -39794 75150 13277 -131419 -175445 -159794 -216693
34017b16693l3375J75725K87617J23618o9413n7364n771j11836k05236p6278J06996
$$ -216693 -250068 -74343 213274 336892 267479 210115 204344 92508 -112728 -189006 -82010
34006h2010Q5105n2832p9185l5348p0801j03116J131J13438O1485l8423n753N5505
$$ -82010 3095 -49737 -128922 -164270 -235071 -338187 -337056 -223618 -162133 -200556 -206309 -150804
33994a50804j8379r1543K5590J67836O5724j50338j27402J24146K45298R5907
$$ -150804 -169183 -260726 -235136 -67300 -1576 -151914 -279316 -155170 90128 186035
33984A86035p8426o3736O2634J31456R0394j9609j15425j05721p537L6296k7872
$$ 186035 107609 43873 106507 237963 328357 308748 193323 87602 80065 116361 88489
33973H8489o1116K2585Q0205j7246j46484j39036n4122l0950l2418M2600J37824
$$ 88489 27373 49958 130163 112917 -33567 -172603 -226725 -257675 -290093 -247493 -109669
33962a09669J40122O9034p262r3458j58261r6714N3687Q7046l2004p1743N9181
$$ -109669 30453 99487 92225 -1233 -159494 -256208 -202521 -115475 -147479 -219222 -160041
33951a60041J22677k1275j40009m4802O4377j5575j01825J3953J39200K6907j39299
$$ -160041 -37364 -58639 -198648 -243450 -179073 -194648 -296473 -282520 -143320 -116413 -255712
33940b55712n5975J45395J26134o5298j03178M5270J20416N2640J5817N7926O3788
$$ -255712 -311687 -166292 -40158 -105456 -208634 -163364 -42948 9692 25509 83435 147223
33929A47223L2181M5080L5641q5621j77542p6161O7695J5335j23858o9979J27359
$$ 147223 179404 224484 260125 174504 -3038 -79199 -11504 3831 -120027 -190006 -62647
33918f2647J78325N8948L217L9258l1357j91526j75574N8762K08936Q4041j32341
$$ -62647 115678 174626 177843 217101 185744 -5782 -181356 -122594 86342 170383 38042
33907C8042j87406p2035P2828J56090J54081P8175j6068p6680j03851r2099j6270
$$ 38042 -149364 -221399 -148571 7519 161600 239775 223707 147027 43176 -48923 -65193
33896f5193N3750j4050j61035j33749J10562K46240N3573k04651j75989M1110
$$ -65193 -11443 -25493 -186528 -320277 -209715 36525 90098 -114553 -290542 -249432
33886b49432J01186j9895m8208R1762J79584Q3420o5313j02804j9818Q5526R7991
$$ -249432 -148246 -168141 -216349 -124587 54997 138417 73104 -29700 -49518 36008 133999
33875A33999k2263j43630q5116Q9040J09049o7030j47925P147J34524K2750j25025
$$ 133999 111736 -31894 -117010 -27970 81079 14049 -133876 -126729 7795 30545 -94480
33864i4480p7263J6159n5127j47621n3104Q4940M6436l8933M3054J51704N5591
$$ -94480 -171743 -155584 -210711 -358332 -411436 -326496 -280060 -318993 -275939 -124235 -68644
33853f8644r5686k3805J53686J20074q1991j48904l9426L8015L9412P1241Q3764
$$ -68644 -164330 -188135 -34449 85625 3634 -145270 -184696 -146681 -107269 -36028 47736
33842D7736k5724j29173n8731O7272O0315P654M5295L7075j21273j70924P3768
$$ 47736 22012 -107161 -165892 -98620 -38305 -30651 14644 51719 -69554 -240478 -166710
33831a66710K68180N6024k55593j57441J87304K15408q7354k37698j27822r5203
$$ -166710 101470 157494 -98099 -255540 -68236 147172 59818 -177880 -305702 -400905
33821d00905j77440o2594J96657J78635j05563j44222J82982L56636R2390j96231
$$ -400905 -578345 -640939 -444282 -265647 -371210 -515432 -332450 24186 116576 -79655
33811g9655j09462J38082J63347p610j29088j27627m2699J02823J88722O9836
$$ -79655 -189117 -51035 112312 104702 -24386 -152013 -194712 -91889 96833 166669
33801A66669j21084r0235J22761J70838o675p7814P8088J50799l4918k08775j43320
$$ 166669 45585 -44650 78111 248949 242274 164460 242548 393347 358429 149654 6334
33790F334j7832l5368p2201J4225Q1284j0262j09375n0656M8844K3493m9025k7745
$$ 6334 -11498 -46866 -119067 -104842 -23558 -33820 -143195 -193851 -145007 -121514 -170539 -198284
33778a98284L2084J8522k3922j1443J6532R068J3576M4833J6375q0131j02814
$$ -198284 -166200 -147678 -171600 -183043 -166511 -157443 -143867 -99034 -82659 -162790 -265604
33767b65604J8270J53200J72926J21299Q7253N0838l9885j45735j76005r5085
$$ -265604 -247334 -94134 78792 200091 287344 338182 298297 152562 -23443 -118528
33757a18528L7925J04614M3624m0347N021J17148P1036j28842j84737J2227J58345
$$ -118528 -80603 24011 67635 27288 32309 149457 220493 91651 -93086 -80859 77486
33746G7486L6198j06553n950J34665K8861j40527m8178J60716J29233n6582n2029
$$ 77486 113684 7131 1181 135846 164707 24180 -23998 136718 265951 209369 157340
33735A57340Q0383L373k18497k09981J5001Q2840m2246l6102J12314P4043j30178
$$ 157340 237723 241096 22599 -187382 -172381 -89541 -131787 -167889 -55575 18468 -111710
33724a11710r8805J89273K68361J100j76693l9738O4484q9226j93772l7315O6090
$$ -111710 -210515 -21242 247119 248219 71526 31788 96272 7046 -186726 -224041 -157951
33713a57951j16952k46151J0493L54448L15547j0351j67065l4101J23391J27928
$$ -157951 -274903 -521054 -510561 -156113 159434 149083 -17982 -52083 71308 199236
33703A99236L5229p2789j41248r3835M1741Q1782n7429j97974j56913l103R4571
$$ 199236 234465 161676 20428 -73407 -31666 50116 -7313 -205287 -362200 -365303 -270732
33692b70732J06746Q4825L1095k9032k308J11325J54427K4391j72927k66858k06196
$$ -270732 -163986 -79161 -48066 -77098 -79406 31919 186346 210737 37810 -229048 -435244
33681d35244n3325Q7249J16169L5599j3478P0176J88147J94695J09678K1523p9742
$$ -435244 -488569 -401320 -285151 -249552 -263030 -192854 -4707 189988 299666 321189 241447
33670B41447j78400j25140R8800K14767M4475j47161o3777J08230L5434j43823
$$ 241447 63047 -62093 36707 251474 295949 148788 85011 193241 228675 84852
33660H4852o7326J61154J28778j36359k00807P496J00357n3581j33875N14P9854
$$ 84852 17526 178680 307458 171099 -29708 -22212 78145 24564 -109311 -108797 -28943
33649b8943k1467n9653O3163Q8583p9158j39638P6207K85414K07710l6507j97519
$$ -28943 -50410 -110063 -46900 41683 -37475 -177113 -100906 184508 392218 355711 158192
33638A58192k24108j49773J4293J34627L6569j65919j62603O2763K05638J51366
$$ 158192 -65916 -215689 -201396 -66769 -30200 -196119 -358722 -295959 -90321 61045
33628F1045R8449J19106M7742j12676j35449j8381k2633j63915j48045P0373J65870
$$ 61045 159494 278600 326342 213666 78217 59836 37203 -126712 -274757 -204384 -38514
33617c8514K0673p9218R230N0430o8945j07680M3273J29500K0543m6968M7297
$$ -38514 -17841 -97059 -87829 -37399 -106344 -214024 -170751 -41251 -20708 -67676 -20379
33606b0379O0443j13231j73573M6903K26911Q3331j46933j13873R9337J93209
$$ -20379 40064 -73167 -246740 -199837 27074 110405 -36528 -150401 -51064 142145
33596A42145J26722M1740m1526j47680j70946m4914Q2901N8567n2592j02949o3031
$$ 142145 268867 310607 269081 121401 -49545 -94459 -11558 47009 -5583 -108532 -171563
33585a71563K3354J11230J15882q277j25702p0495P4010R4456K217k3720R912
$$ -171563 -148209 -36979 78903 70626 -55076 -125571 -51561 42895 45112 21392 31304
33574C1304m7041j46643j11812K515L938m0391P8097K51992J80945p8001j62285
$$ 31304 -15737 -162380 -274192 -271677 -267739 -308130 -230033 21959 202904 124903 -37382
33563c7382l670J00071K4318m0642m019K2451M0484J42878K00807K4162k14917
$$ -37382 -41052 59019 83337 42695 38676 61127 101611 244489 445296 469458 254541
33552B54541j83858N3618J55615P6658L1898K1933q2146j38571K9651J90828P0226
$$ 254541 70683 124301 279916 356574 388472 410405 328259 189688 219339 410167 480393
33541D80393q5626O9856L02059K22822M1888J30509K62434J45082J75448O56926
$$ 480393 394767 464623 766682 989504 1031392 1161901 1424335 1569417 1744865 2401791
33531B401791R34947O12492Q34798K517788L893752K255732j790844m389836l436545
$$ 2401791 3336738 3949230 4784028 7301816 11195568 13451300 11660456 7270620 3834075
33522C834075j105088k76930p68127p77602j35618M1261k99201k71717J24458
$$ 3834075 2728987 2452057 1683930 906328 770710 811971 512770 241053 365511
33513C65511J33812k06065k01702J09415Q8899k26039k23649R8072J77767m2908
$$ 365511 499323 293258 91556 200971 289870 63831 -159818 -61746 116021 73113
33503G3113j18434k513k2030j23061l550J92155J11518r6054o1154Q2855M19j31737
$$ 73113 -45321 -47834 -69864 -192925 -196475 -4320 107198 11144 -50010 32845 33264 -98473
33491i8473L2150K67288J51464j35306j52328k0588j22293k93171j23347K09520
$$ -98473 -66323 200965 352429 217123 64795 44207 -78086 -371257 -494604 -285084
33481b85084K11636n5990j43950k5973q314o1128L8409J32046m2905k47468j05691
$$ -285084 -73448 -129438 -273388 -299361 -307675 -368803 -330394 -198348 -241253 -488721 -594412
33470e94412J84767J94220K7093M4861J31366k3685k07288k7786K88483K35404
$$ -594412 -409645 -215425 -188332 -143471 -12105 -35790 -243078 -270864 17619 253023
33460B53023p0211j13885R3625J09266r2056j33106K4213P4585j0478k1498j7456
$$ 253023 182812 68927 162552 271818 179762 46656 70869 145454 134976 113478 96022
33449I6022j57996k34174j1760K04076K7154k59254j42581J98971K06916o2721
$$ 96022 -61974 -296148 -307908 -103832 -76678 -335932 -478513 -279542 -72626 -135347
33439a35347r0357J36940J59069n7487r0661J07127J41812n9210j47504k6049
$$ -135347 -225704 -88764 70305 12818 -77843 29284 171096 111886 -35618 -61667
33429f1667N1253M0009J26598K27919R2186j59784j99365r9396j64992k86954
$$ -61667 -10414 29595 156193 384112 476298 316514 117149 17753 -147239 -434193
33419d34193j22879J95125K20889k2894j05153L5558N2506j09791j42143J1874
$$ -434193 -557072 -361947 -141058 -163952 -269105 -233547 -181041 -290832 -432975 -421101
33409d21101Q3164J4002N47M0945j7115o4024R4646K71961J62762q2102j10958
$$ -421101 -337937 -323935 -323388 -282443 -299558 -363582 -268936 3025 165787 83685 -27273
33398b7273n911n8213j36613M7670K66058J00830k35205j89063J59108K26829
$$ -27273 -33184 -91397 -228010 -180340 85718 186548 -48657 -237720 -78612 148217
33388A48217m7002j45367O6577J55538l3675j36970n986M9775q1176r3334J11792
$$ 148217 101215 -44152 22425 177963 144288 7318 1332 51107 -30069 -123403 -11611
33377a1611K02094J7630j51921q7686M2429N8743L6652O1095Q0524Q9945J37123
$$ -11611 190483 208113 56192 -31494 10935 69678 106330 167425 247949 337894 475017
33366D75017J35289j7802j84767j67715m1811L677k275L4252O786j44582j87054
$$ 475017 610306 592504 407737 240022 198211 201888 199613 233865 240651 96069 -90985
33355i0985R802J41217l3766k10393n5115J67991O3638j63260q4876J63967J57369
$$ -90985 -81183 60034 26268 -184125 -239240 -71249 -7611 -170871 -255747 -91780 65589
33344F5589m3573p2970L0110j8869j18710J692J69348N8830j39269m2758J73816
$$ 65589 22016 -50954 -20844 -39713 -158423 -156731 12617 71447 -67822 -110580 63236
33333F3236Q4935j67791j23034J41859J71175k7056o5150N3396Q76j76056j53552
$$ 63236 148171 -19620 -142654 -795 170380 143324 78174 131570 132446 -43610 -197162
33322a97162J3121K4690m4933N1735J45719l4372k26700n8225J98232Q4015j57052
$$ -197162 -184041 -159351 -204284 -152549 -6830 -41202 -267902 -326127 -127895 -43880 -200932
33311b00932k2208K51277R8281k55933j44094K88033K82302j84733l69300o2643
$$ -200932 -223140 28137 126418 -129515 -273609 14424 296726 111993 -257307 -319950
33301c19950J56936L1804n0724N5198K4922j53842r4274J75092J93592m4814o5631
$$ -319950 -163014 -131210 -181934 -126736 -101814 -255656 -349930 -174838 18754 -26060 -91691
33290i1691J59213J54250j20459j83612K9257N8385j49494j28235J62657K05242
$$ -91691 67522 221772 101313 -82299 -53042 5343 -144151 -272386 -109729 95513
33280I5513j01553k37905j9328J22051P328j577K02596K27551l5121j72868k3273
$$ 95513 -6040 -243945 -263273 -141222 -133894 -135471 67125 294676 259555 86687 63414
33269F3414O8060m3046o4696Q0433Q5416j03874j70759n7595l3117q0996O4798
$$ 63414 131474 88428 23732 104165 189581 85707 -85052 -142647 -175764 -256760 -191962
33258a91962K62774J08444k56628k82343L3359J55141j5537m8021J12189N5426
$$ -191962 70812 179256 -77372 -359715 -326356 -171215 -186752 -234773 -122584 -67158
33248f7158k10770k10140P7774J52700m5845l7538K23137K18360j25539k45796
$$ -67158 -277928 -488068 -410294 -257594 -303439 -340977 -117840 100520 -25019 -270815
33238b70815L7275K21418O7903l6704R9337J39950m9302j38397j6875J7121q7536
$$ -270815 -233540 -12122 55781 19077 118414 258364 209062 70665 53790 70911 -16625
33227a6625m1928J17817M7562j64075q5860J95954J71002j23957j43604J29747
$$ -16625 -58553 59264 106826 -57249 -143109 52845 223847 99890 -43714 86033
33217H6033J50559j39809k18449p274J7588j73624r4433K23748J97536j72956
$$ 86033 236592 96783 -121666 -128940 -111352 -284976 -379409 -155661 41875 -131081
33207a31081k23455J50128K86446j7291j76706M6767J72331J3897p513J78056
$$ -131081 -354536 -204408 82038 64747 -111959 -65192 107139 121036 113523 291579
33197B91579R4033k63714k94220O9309J85002q9329j53263J17680J11077k59673
$$ 291579 385612 121898 -172322 -103013 81989 -7340 -160603 -42923 68154 -191519
33187a91519k74367K28896M54096O6280k21687R619J78822q6922k30905R0615
$$ -191519 -465886 -236990 217106 283386 61699 71318 250140 163218 -67687 22928
33177B2928K77965q3250m01408j28875K98885K96050O0133M059K4319o4248q0757
$$ 22928 300893 217643 -183765 -312640 -13755 282295 342428 346487 370806 306558 225801
33166B25801L2359k1422k42762k10336Q4812J19204j68382j92877J69294K87118
$$ 225801 258160 236738 -6024 -216360 -131548 -12344 -180726 -373603 -204309 82809
33156H2809o6494k88381o0671J35210K1075L895K38307K45071j02594k39810K4833
$$ 82809 16315 -272066 -332737 -197527 -176452 -172557 65750 310821 208227 -31583 -6750
33145f750J42736q1712j15145J86159K15394j85642l23308O8939L08902L4001
$$ -6750 135986 54274 -60871 125288 340682 155040 -168268 -99329 209573 243574
33135B43574j74323K7517J09907k08701l60731m7013J70845k0662j10622J39982
$$ 243574 69251 96768 206675 -2026 -362757 -409770 -238925 -259587 -370209 -230227
33125b30227J81420j74827k74445J21933L07520l5934k12695J34121L14175o4267
$$ -230227 -48807 -223634 -498079 -376146 -68626 -104560 -317255 -183134 131041 66774
33115F6774l12819J6164K82046K0744j84305Q2772K21095j56095l61392P9909
$$ 66774 -246045 -229881 52165 72909 -111396 -28624 192471 36376 -325016 -245107
33105b45107M58886J47009k87056j75262J05744K6247r6980Q6474J55450j79672
$$ -245107 213779 360788 73732 -101530 4214 30461 -66519 19955 175405 -4267
33095d267l54305J0295L24416J05623j60620k3895R8828j25396k18007J05779
$$ -4267 -358572 -348277 -23861 81762 -78858 -102753 -3925 -129321 -347328 -241549
33085b41549K71827m6670k47444L3646K10962n8370j66187K06362L84821J8679
$$ -241549 30278 -16392 -263836 -230190 -19228 -77598 -243785 -37423 347398 366077
33075C66077j88447J26873K17451k84114n11493L8336M67404Q2310l53630q4879
$$ 366077 177630 304503 521954 237840 -273653 -235317 232087 314397 -39233 -124112
33065a24112K80683M8953k39603L1189L24499P4827j72731Q8875K57739j53566
$$ -124112 156571 205524 -34079 -2890 321609 396436 223705 312580 570319 416753
33055D16753m61469j19018J88869r7920k83890J72098M79824N479m30905n9465
$$ 416753 -44716 -163734 25135 -72785 -356675 -184577 295247 300726 -130179 -189644
33045a89644L93255J17330k69387j7923K84826k2490k83811J36808M65874j6223
$$ -189644 203611 320941 51554 33631 318457 295967 12156 148964 614838 598615
33035E98615m67153j7855N19841J39039m68430k38130K83040P1825m03017j70060
$$ 598615 131462 113607 633448 772487 304057 65927 348967 420792 17775 -152285
33025a52285L39747J86744k49529r7186K80437R1788k64380n0231K69396l1242
$$ -152285 187462 374206 124677 27491 307928 399716 135336 85105 354501 323259
33015C23259m12454j06903L10397K5467l71908k4626M60046J44903m05921k01284
$$ 323259 -89195 -196098 114299 139766 -232142 -256768 203278 348181 -57740 -259024
33005b59024K81779P7394l77627j53927L16629J23526l03772p1643L90432K09409
$$ -259024 22755 100149 -277478 -431405 -114776 8750 -295022 -366665 23767 233176
32995B33176j88234N254K84211j35202n87276j39270N01067J98454m69057k74686
$$ 233176 44942 50196 334407 199205 -388071 -527341 -26274 172180 -296877 -571563
32985e71563L91736L57294j22301l9672L10674J9049m80098j89091M42102L03092
$$ -571563 -179827 177467 55166 15494 326168 345217 -134881 -323972 118130 421222
32975D21222k83264k32425K37512J62827k41090j24544K29809M6300k79807K2402
$$ 421222 137958 -94467 143045 305872 64782 -59762 170047 216347 -63460 -41058
32965d1058M47762J59107l05404p2834L01202m5655m74117p8261M15717J254n50013
$$ -41058 406704 565811 260407 187573 488775 443120 -30997 -109258 306459 307713 -242300
32954b42300j04049N77204K30996m64082j89844M52032J36439n58327k58658N19395
$$ -242300 -346349 230855 461851 -2231 -192075 259957 396396 -161931 -420589 98806
32944I8806L70349l00504j63339M04960J75397l92081q7320N14283J19407o27189
$$ 98806 469155 168651 5312 410272 585669 193588 106268 620551 739958 112769
32934A12769k79869N53066K93973n67018l94273M70087M22736l24571l07802K67197
$$ 112769 -167100 385966 679939 112921 -281352 188735 611471 286900 -20902 246295
32924B46295Q3104n05405j69107N99885L19884n37106l76281M46384L57186l46512
$$ 246295 329399 -176006 -345113 254772 574656 37550 -338731 107653 464839 118327
32914A18327j71839N23240K49935n49529l00161N41626L13920n58086l59994N08148
$$ 118327 -53512 469728 719663 170134 -130027 411599 725519 167433 -192561 315587
32904C15587K82357o56069m64005N44243M63726n05706m65806M86459N12376l55650
$$ 315587 597944 -58125 -522130 22113 485839 -19867 -485673 786 513162 157512
32894A57512l71139M41459M29377l36590k74815M52774K91985m77996k69262N33360
$$ 157512 -213627 227832 657209 320619 45804 498578 790563 312567 43305 576665
32884E76665K63989o08862k98931O91583M42408n74800l50237O79217M32599o83021
$$ 576665 840654 231792 -67139 624444 1066852 492052 141815 821032 1253631 570610
32874E70610m99560O59068N92130m73245l85438O75964O74171j56002N6854P58394
$$ 570610 71050 730118 1322248 849003 463565 1139529 1813700 1657698 1714552 2472946
32864B472946j7665j347301p71958Q36052O11026r03080p69759O84505N73272
$$ 2472946 2455281 1107980 336022 1172074 1783100 880020 110261 794766 1368038
32855A368038q37240o65286Q33344P29620p45472o25687Q45188O23107j025655
$$ 1368038 530798 -134488 698856 1428476 683004 57317 902505 1525612 499957
32846D99957r00111Q23294Q71212o64097n31994J094784Q48410j031155r33987
$$ 499957 -400154 423140 1294352 630255 98261 1193045 2041455 1010300 76313
32837G6313R90906R59593j015923j054999R51599J083188q39409q96012J037136
$$ 76313 1067219 2026812 1010889 -44110 907489 1990677 1151268 255256 1292392
32828A292392R49265j173338j064722J295880J356259j032919j123683J352288
$$ 1292392 2241657 1068319 3597 1299477 2655736 1622817 499134 1851422
32820A851422J490926j055026j215503J433897J727694o56818l56234K573116
$$ 1851422 3342348 2287322 1071819 2505716 4233410 3576592 3220358 5793474
32812E793474J912258k433022l211892O97405J943347j310436k039966J562171
$$ 5793474 7705732 5272710 2060818 2758223 4701570 3391134 1351168 2913339
32804B913339K296650j610770k449203J794582K914941j417109k488899K357778
$$ 2913339 5209989 3599219 1150016 2944598 5859539 4442430 1953531 4311309
32796D311309L791312j268404k769795K922044M988782p75948k495477M898636
$$ 4311309 8102621 6834217 4064422 6986466 11975248 11199300 8703823 13602459
32788A3602459Q270994J261483j785284O844126J1161222K044939j010625J5103788
$$ 13602459 21873453 23134936 21349652 28193778 39355000 41399939 40389314 55493102
32780E5493102K7276680J6473109J3087502N4365025J09283656J00272448O178269
$$ 55493102 82769782 99242891 112330393 166695418 275979074 376251522 382429791
32773C82429791j01518980j39121860r3061217j1836381M8441894N5605846J2785775
$$ 382429791 280910811 141788951 48727734 36891353 85333247 140939093 153724868
32766A53724868l9038148n2327537k4258048K391503p27109j3915702j0009191
$$ 153724868 114686720 62359183 38101135 40492638 39765529 25849827 15840636
32759A5840636K676261K402074o491281n742451K450992K521162m349281m394988
$$ 15840636 18516897 20918971 14427690 8685239 11136231 13657393 9308112 4913124
32751D913124J994449K564058k847000l322000J569510K029948k394714k686128
$$ 4913124 6907573 9471631 6624631 3302631 4872141 6902089 4507375 1821247
32743A821247J617053K049136j931126k322951J529589K039362j593500k195177
$$ 1821247 3438300 5487436 3556310 1233359 2762948 4802310 3208810 1013633
32735A013633J154057J685876j560754k100680J132471J911810j013806j777623
$$ 1013633 2167690 3853566 2292812 192132 1324603 3236413 2222607 444984
32727D44984R70793J705929r78253j855129N57653J386160q29260j514297P05015
$$ 444984 1415777 3121706 2143453 288324 845977 2232137 1402877 -111420 593595
32718E93595J438159o61033j370390O51649J347425o29283j380104M64915J199983
$$ 593595 2031754 1370721 331 651980 1999405 1370122 -9982 454933 1654916
32709A654916n30448j205255M73876J114412n36890j178266M41016J119669m14810
$$ 1654916 1124468 -80787 393089 1507501 970611 -207655 233361 1353030 938220
32700I38220j098363L42742R96641l79704j023612K44975Q05767l94711q00033
$$ 938220 -160143 182599 1179240 799536 -224076 20899 826666 431955 -368078
32691c68078N11764R53639l50930p94520M74870Q15072o21959j101402L55326
$$ -368078 143686 1097325 746395 -48125 426745 1241817 619858 -481544 -126218
32682a26218J011778k93763r70807K29377Q95323k11675q10728K95080Q98458
$$ -126218 885560 591797 -379010 -149633 745690 534015 -276713 18367 916825
32673I16825j87219q35308J34452P00673k60795p88554J95418P74814r5500n67136
$$ 916825 729606 -105702 28750 729423 468628 -319926 -124508 650306 554806 -12330
32663a2330L05927O51233m11920r01799J54093P74281j17956o44231K68263P84605
$$ -12330 293597 944830 532910 -368889 -214796 559485 441529 -202702 65561 850166
32653H50166j72432p79749J08694P53385l2300o38653P4921N76347k05468p43223
$$ 850166 677734 -102015 6679 760064 727764 89111 164032 740379 534911 -208312
32643b08312L3192O36250m816m81538K04117O45399j16220o40806O8815O08813
$$ -208312 -175120 461130 456314 -25224 178893 824292 708072 67266 136081 744894
32633G44894l5210n26545J09552N61623j01503n45191J76356P29354J20690l93309
$$ 744894 709684 183139 292691 854314 752811 207620 383976 1113330 1234020 840711
32623H40711J47521N24000j71593o92967j08000L77140j46791n05907J27359M94489
$$ 840711 988232 1512232 1340639 647672 539672 916812 770021 264114 391473 885962
32613H85962k51266p60696m3604O02286P8205m72947J381M24254j80519o82467
$$ 885962 634696 -126000 -169604 432682 510887 37940 39321 463575 283056 -399411
32603c99411m7496O09064J48571m66024j13943L91945O2071l31596O5743M24900
$$ -399411 -446907 162157 310728 -155296 -269239 122706 184777 -146819 -81076 343824
32593C43824n6280m86847n4745L47035o3906l65681J87570N75248j3036n03565
$$ 343824 287544 -199303 -254048 92987 29081 -336600 -149030 426218 413182 -90383
32583i0383K9679N43552K0736n63505j19382M86103J32273m44347j46080M18941
$$ -90383 -60704 482848 503584 -59921 -179303 306800 439073 -5274 -151354 267587
32573B67587K27926k27655p8859K14918l5265k81903N9305L01181j35984m43480
$$ 267587 495513 267858 188999 403917 368652 86749 146054 447235 311251 -132229
32563a32229L3799M38705K0622m01734m7740L07708q7754m37235K1890M68048
$$ -132229 -98430 340275 360897 -40837 -88577 219131 131377 -305858 -283968 184080
32553A84080R3586k97351J12567M96385k4722o23892k92114K99819J44519k61227
$$ 184080 277666 -19685 92882 589267 564545 -59347 -351461 -51642 92877 -168350
32543a68350p5916K19124n3965k87425J56699N12644K5543n06477j86551L05740
$$ -168350 -244266 -25142 -79107 -366532 -209833 302811 328354 -178123 -364674 -58934
32533e8934P9014k75015L0878L51594o4495m63298r633M95726Q0604n10170k04568
$$ -58934 20080 -254935 -224057 127537 63042 -400256 -409889 85837 166441 -343729 -548297
32522e48297L68640J21377l99720j01740N28704L49343l03047l17449J53492J91042
$$ -548297 -179657 -58280 -458000 -559740 -31036 318307 15260 -302189 -148697 42345
32512D2345r1577M277K21394p4071m53414j67128L49168K39033j99797j76313
$$ 42345 -49232 -44955 176439 102368 -351046 -518174 -169006 70027 -129770 -306083
32502c06083R2131j7908k01533P7052L50768K9382l25294k0062L68533O9617l43619
$$ -306083 -213952 -231860 -433393 -356341 -5573 23809 -301485 -321547 46986 116603 -227016
32491b27016k7177M55742J52842m56035l29805K35237K57024j09255o4081J98925
$$ -227016 -254193 201549 354391 -101644 -431449 -196212 60812 -48443 -112524 86401
32481H6401p674l64950j54272K56040J01167k45586m381M08572J35496m05521
$$ 86401 78727 -286223 -440495 -184455 -83288 -328874 -333255 75317 210813 -194708
32471a94708k32101L52726L20199j83306j96674K26167K30354j49991j53084J54178
$$ -194708 -426809 -74083 246116 62810 -133864 92303 322657 172666 19582 173760
32461A73760N8845l16087k29149K11000K43422j04526j57861P0810K5674j83798
$$ 173760 232605 -83482 -312631 -101631 141791 37265 -120596 -49786 -24112 -207910
32451b07910k9136K74863J38635j93156p1973K71300J51776k36504k03334J07166
$$ -207910 -237046 37817 176452 -16704 -88677 182623 334399 97895 -105439 1727
32441A727O6466j57646J3273L09314Q4873l44969k06596K70984K72626r2351q7778
$$ 1727 68193 -89453 -76180 233134 318007 -26962 -233558 37426 310052 217701 129923
32430A29923J93365Q5013k59624j54286K25757J47897k44845k11183J37003P7685
$$ 129923 323288 408301 148677 -5609 220148 368045 123200 -87983 49020 126705
32420A26705k70256j75469K36805J93505k14521j79144K82958L66649j4629j55021
$$ 126705 -143551 -319020 -82215 111290 -103231 -282375 583 367232 352603 197582
32410A97582N7914M6847k03416j36240J67551Q8828k62166j94188J97440J55693
$$ 197582 255496 302343 98927 -37313 130238 219066 -43100 -237288 -39848 115845
32400A15845k72657k72307K09117L47410l6713k00393J02517K31190p7299k72840
$$ 115845 -156812 -429119 -220002 127408 90695 -109698 -7181 224009 146710 -126130
32390a26130q4724O9353J096L1767J73474M5336k56730k07203J40470J96950o1012
$$ -126130 -210854 -141501 -140405 -108638 64836 110172 -146558 -353761 -213291 -16341 -77353
32379g7353p1054J91707J56677k00966k60054P9692K07471o2232k02257K570J39136
$$ -77353 -148407 43300 199977 -989 -261043 -181351 26120 -36112 -238369 -235799 -96663
32368i6663M6373N3870J87997P7719k11800j79999J53341K15114q7054k16798
$$ -96663 -50290 3580 191577 269296 57496 -122503 30838 245952 158898 -57900
32358e7900l885J25201K0437J4903J55724J05684j03729q3225J06701L2686k21002
$$ -57900 -61785 63416 83853 98756 254480 360164 256435 173210 279911 312597 91595
32347I1595j54717J55764J35326k03167k46315Q5152K02531m5467j43139O9222
$$ 91595 -63122 92642 227968 24801 -221514 -136362 66169 20702 -122437 -53215
32337e3215J32089r0806j59619N2206J26331n0064q3973J00048J07549r8045q9993
$$ -53215 78874 -11932 -171551 -119345 6986 -43078 -127051 -27003 80546 -17499 -107492
32326a07492J51905J52084j29534j75996J10711K16870j3039j18498N4659P7402
$$ -107492 44413 196497 66963 -109033 1678 218548 205509 87011 141670 219072
32316B19072j72315k30474N7582K11304o475j83137m2520J11097M0315l7204Q976
$$ 219072 46757 -183717 -126135 85169 78694 -104443 -146963 -35866 4449 -32755 -23779
32305b3779l8311k02423j54906J58277L36407J76714n6579j53731j86609j39473
$$ -23779 -62090 -264513 -419419 -261142 75265 251979 195400 41669 -144940 -284413
32295b84413R4545L03818J56074j78887k25620R148J01759o084l421R3784N870
$$ -284413 -189868 113950 270024 91137 -134483 -125335 -23576 -29660 -33081 60703 66573
32284F6573j34908K1338K61354Q5350l16887k94097J13734K38246p709l1293K57949
$$ 66573 -68335 -46997 214357 299707 -17180 -311277 -197543 40703 32994 1701 259650
32273B59650K52630j85645m25482j90879K1819n8027m5854K01840K26198j16473
$$ 259650 512280 326635 -98847 -289726 -267907 -325934 -371788 -169948 56250 -60223
32263f0223k85660j4361K16528P1890q5945M3554J67051M8221m0126P4633R5978
$$ -60223 -345883 -360244 -143716 -71826 -157771 -114217 52834 101055 60929 135562 231540
32252B31540j14397k08538j4873J23630J1109n3037Q9809J28996q2936k10327
$$ 231540 117143 -91395 -106268 17362 28471 -24566 65243 194239 111303 -99024
32242i9024o4172O8108Q453j8848O4725K3k06350j65308J49480K39842n1874k28683
$$ -99024 -163196 -95088 -86635 -105483 -40758 -40735 -247085 -412393 -262913 -23071 -74945 -303628
32230c03628o030K14202R1240j07440q0131J7823J9981Q6606K53531K24991o1183
$$ -303628 -309658 -95456 -4216 -111656 -191787 -173964 -153983 -67377 186154 411145 349962
32219C49962k28343j05957k651q2654q5541P7558R7799q5494q0742K08785L07737
$$ 349962 121619 15662 13011 -69643 -155184 -77626 20173 -65321 -146063 62722 370459
32208C70459j7120l19963k22610K3993R4407R8371J62266R2302j59583k51850
$$ 370459 353339 33376 -189234 -165241 -70834 27537 189803 282105 122522 -129328
32198a29328m5634R8811l5864j35127M1316K09170Q9420j12555j17720q693N1399
$$ -129328 -174962 -76151 -112015 -247142 -205826 3344 92764 -19791 -137511 -146204 -94805
32187i4805R3739R7299o6312k54627j36959J90316K51557k534r6441J01132J53469
$$ -94805 -1066 96233 29921 -224706 -361665 -171349 80208 77674 -18767 82365 235834
32176B35834p2090j13220J79777K66591j19747m24124k05471J15770L5856j76861
$$ 235834 163744 50524 230301 496892 377145 -46979 -252450 -136680 -100824 -277685
32166b77685n3867K20743K07426J229l0569O4459M747j49855j43414p011N5653
$$ -277685 -331552 -110809 96617 97846 67277 131736 136483 -13372 -156786 -163797 -108144
32155a08144M4683N8930N1861o765N944R2479M1453j71075k54372r4038L8458
$$ -108144 -63461 -4531 47330 40565 46509 138988 180441 9366 -245006 -339044 -300586
32144c00586j0057r511J63609K40467N5346j24141o7787M2958N361n9311l1068
$$ -300586 -310643 -320154 -156545 83922 139268 15127 -52660 -9702 -4341 -63652 -94720
32133i4720m1248j30069q3091J31863K05796K0819j13243q178Q7774j2970j06395
$$ -94720 -135968 -266037 -349128 -217265 -11469 9350 -103893 -112071 -24297 -37267 -143662
32122a43662l9916p432j18403j45938J4129J06207P648k8389J09746J42035n2296
$$ -143662 -183578 -191010 -309413 -455351 -441222 -335015 -327367 -355756 -246010 -103975 -156271
32111a56271j55313J1313J46116K7313r6478m044J08396O2176K7869J03226N9824
$$ -156271 -311584 -300271 -154155 -126842 -223320 -227364 -118968 -56792 -28923 74303 134127
32100A34127j70684k65211q1080N9428l0741o5990J18192K06399R043j43988j5765
$$ 134127 -36557 -301768 -382848 -323420 -354161 -420151 -301959 -95560 -86517 -230505 -246270
32089b46270R6925l9394j22846Q9479K58032M6313k54817k13583N2467J70773
$$ -246270 -149345 -188739 -311585 -222106 35926 82239 -172578 -386161 -333694 -162921
32079a62921J18609P6856L8251l0434N261J28328N9899k14059k79283O458J82142
$$ -162921 -44312 32544 70795 40361 45622 173950 233849 19790 -259493 -253035 -70893
32068g0893n2030k94617j35372J49914J29178m4882P996K03869K19617P5997p786
$$ -70893 -122923 -417540 -552912 -402998 -273820 -318702 -310706 -106837 112780 188777 180991
32057A80991l9002r4232n4629J09138J32647r5319k57357j26429N3780M5757J3456
$$ 180991 141989 47757 -6872 102266 234913 139594 -117763 -244192 -190412 -144655 -131199
32046a31199R1556O7650j26600j48962J16795K31786l6754k32648p844K23878
$$ -131199 -39643 28007 -98593 -247555 -130760 101026 64272 -168376 -176220 47658
32036D7658L5717k20237o4807K21356J27320j49122r7174J59058J23338j55596
$$ 47658 83375 -136862 -201669 19687 147007 -2115 -99289 59769 183107 27511
32026B7511k17385k1861Q4823N3370R8877J55678J2405j67869p7602J44617J40111
$$ 27511 -189874 -211735 -126912 -73542 25335 181013 193418 25549 -52053 92564 232675
32015B32675k6855l3222P4944R526j63590j39130M7114R9577k554n7522p0016
$$ 232675 205820 172598 247542 257068 93478 -45652 1462 101039 98485 40963 -29053
32004b9053j37730j07686J44644L14959R3892k31186j78025J33905K03256j0961
$$ -29053 -166783 -274469 -129825 185134 279026 47840 -130185 3720 206976 196015
31994A96015j09823O98L1246p7923p8982N4528P9393k9461n0569L0486J8734o2101
$$ 196015 86192 86890 118136 40213 -38769 15759 95152 65691 15122 45608 64342 2241
31982B241j0209J16443P2458r2698r3134O7817R3099p9225j83633r2492K8553
$$ 2241 -7968 108475 180933 88235 -4899 62918 156017 76792 -106841 -199333 -170780
31971a70780O2965P8268R4116M0896m0770m3125n592k9366n9261r367K1868n6108
$$ -170780 -107815 -29547 64569 105465 64695 21570 15978 -13388 -72649 -82016 -60148 -116256
31959a16256p8841J08343L03433K19895l9909j48195o0796K287k7661l3591m206
$$ -116256 -195097 -86754 216679 436574 396665 248470 187674 189961 162300 128709 124503
31948A24503k5908o3775l9721k2175p7424q5626L4139J11477J5444p1137K6643
$$ 124503 98595 34820 -4901 -27076 -104500 -190126 -155987 -44510 -29066 -100203 -73560
31937g3560J32205L7253r6642l5827Q4163K9103o9130L2831J91941J11531j09573
$$ -73560 58645 95898 -744 -36571 47592 76695 7565 40396 232337 343868 234295
31926B34295j42720J022M1551m8513n8474J5497r426j02029n9507R4396J37170
$$ 234295 91575 92597 134148 85635 27161 42658 33232 -68797 -128304 -33908 103262
31915A03262L1640n7919p2748p3512l7558O3122R6805l1556j59440j11465J2993
$$ 103262 134902 76983 4235 -69277 -106835 -43713 53092 21536 -137904 -249369 -236376
31904b36376O0078R8121J87812J51898r1594k56229j19934O5016j889j41999m8143
$$ -236376 -176298 -78177 109635 261533 169939 -86290 -206224 -141208 -143097 -285096 -333239
31893c33239J39186J08316m0478j6419R6148L5389r1662j5984J36170O3247j08848
$$ -333239 -194053 -85737 -126215 -142634 -46486 -11097 -102759 -118743 17427 80674 -28174
31882b8174l3401J89712J57125j23262k56368j41172n2291p4447j4548J29679
$$ -28174 -61575 128137 285262 162000 -94368 -235540 -287831 -362278 -376826 -247147
31872b47147J43987M2346L9191R3176k1379k08635j38765J47843K43147K9103
$$ -247147 -103160 -60814 -21623 71553 50174 -158461 -297226 -149383 93764 122867
31862A22867j56802r0973N0166O6392K026m7199o2048N132J63072K31604O3965
$$ 122867 -33935 -124908 -74742 -8350 -6324 -53523 -115571 -110439 52633 284237 348202
31851C48202j50538j32075M4300J02644L7515L5290N3640q2341k64694k30840
$$ 348202 197664 65589 109889 212533 250048 285338 338978 256637 -8057 -238897
31841b38897l0275O6864L8497N5846P2024o9353k20443j15663J17147J34900j5465
$$ -238897 -269172 -202308 -163811 -107965 -35941 -105294 -325737 -441400 -324253 -189353 -204818
31830b04818L154J82335J90881L479o1975N3234P0855n9120p2059O1536M7912
$$ -204818 -201664 -19329 171552 175031 113056 166290 237145 178025 105966 167502 215414
31819B15414j61915k43124p1574P1140K1561j0435J12018J91892Q6308k9745Q517
$$ 215414 53499 -189625 -261199 -190059 -168498 -178933 -66915 124977 211285 181540 190057
31808A90057R0004O9217q642o5868j20978j55958r3679K4027O0649J2579q625
$$ 190057 280061 349278 340636 274768 153790 -2168 -95847 -71820 -11171 1408 -7217
31797g217J739k5809m1729K3692O0858l4685j02936L0116J88072J06388q8263
$$ -7217 -5478 -31287 -73016 -49324 11534 -23151 -126087 -95971 92101 198489 110226
31786A10226q6838M8870J6238j50784j47532J9217M7654p6868n6272J35664J82350
$$ 110226 23388 72258 88496 -62288 -209820 -190603 -142949 -219817 -276089 -140425 41925
31775D1925J3354n9950Q1831J52949j4300j82730j37859j5911r684o8009o4561
$$ 41925 55279 -4671 77160 230109 215809 33079 -104780 -120691 -130375 -198384 -262945
31764b62945q240M4681P8339N9180j5776l2114O9805J23925n750j35060m1419
$$ -262945 -271185 -226504 -148165 -88985 -104761 -136875 -67070 56855 51105 -83955 -125374
31753a25374J20475O3605j18805j13733O4192J41652R5756J16681J55457J2647
$$ -125374 -4899 58706 -60099 -173832 -109640 32012 127768 244449 399906 412553
31743D12553j91497j54487M8573O7565r6515j09340O8383J24942j4598r2560m1557
$$ 412553 221056 66569 115142 182707 86192 -23148 45235 170177 155579 63019 21462
31732B1462o1061j35599k6201K06472K21698L519j00977o562J0184j01306p1690
$$ 21462 -39599 -175198 -201399 5073 226771 230290 129313 122751 132935 31629 -40061
31721d0061J01004Q1800j49477j90328O7689K21592O5497q0771K98N0132j12755
$$ -40061 60943 142743 -6734 -197062 -129373 92219 157716 76945 77243 127375 14620
31710A4620k09325j5694K07086J53088n0056j25604p2016k4433N104K4022k1764
$$ 14620 -194705 -210399 -3313 149775 99719 -25885 -97901 -122334 -117230 -93208 -114972
31699a14972p0358J7235J50588R0935j04199j28087L0782O2797p2989o2675J37685
$$ -114972 -185330 -168095 -17507 73428 -30771 -158858 -128076 -65279 -138268 -200943 -63258
31688f3258J54255j36246l42694k06854M950K1964j4196O6511J29183P1094N7303
$$ -63258 90997 -45249 -387943 -594797 -589847 -567883 -582079 -515568 -386385 -315291 -257988
31677b57988J52224J40485m2188j38002n2597l8071j60040j04157K05237L38555
$$ -257988 -105764 34721 -7467 -145469 -198066 -236137 -396177 -500334 -295097 43458
31667D3458O2056k20883j29829Q8589O0073p5954j5705J16702M3763j15151p1311
$$ 43458 105514 -115369 -245198 -156609 -96536 -172490 -188195 -71493 -27730 -142881 -214192
31656b14192J02570J30338J6664l8649k4419m8152o4307j085L0899m8804q3970
$$ -214192 -111622 18716 35380 -3269 -27688 -75840 -140147 -141232 -110333 -159137 -243107
31645b43107L3916J21034K6548o7339J9489J08255j4847j79819j14462P7405J04637
$$ -243107 -209191 -88157 -61609 -128948 -109459 -1204 -16051 -195870 -310332 -232927 -128290
31634a28290k3596p5543k1102j8284p7040o3778K5616P0453M3997J1841j0527
$$ -128290 -151886 -227429 -248531 -266815 -343855 -407633 -382017 -311564 -267567 -255726 -266253
31623b66253k3919K2568J15358J31089M2510l416N5508O9507m3948j26167n4596
$$ -266253 -290172 -267604 -152246 -21157 21353 17937 73445 142952 99004 -27163 -81759
31612h1759M1564K9592j434L6118K4438j10765j77255l068K36377K38492n707
$$ -81759 -40195 -10603 -12037 24081 48519 -62246 -239501 -242569 -6192 232300 226593
31601B26593k28380k24014j4197K21559K71063P2353j62294j66197J2523Q6866
$$ 226593 -1787 -225801 -239998 -18439 252624 324977 162683 -3514 9009 95875
31591I5875j0038m7353O5094J13059k3103j51497j16208l9464l9682j9771P5810
$$ 95875 85837 38484 103578 216637 193534 42037 -74171 -113635 -153317 -173088 -97278
31580i7278R5807k8086j10325k3151R0289Q7827M0915K0232m1338j22857o2582
$$ -97278 -1471 -29557 -139882 -163033 -72744 15083 55998 76230 34892 -87965 -150547
31569a50547J18503J66349J5994q6843l7730n4122k18900k65046n7899J21928
$$ -150547 -32044 134305 150299 63456 25726 -28396 -247296 -512342 -570241 -448313
31559d48313N9704k6994Q4945K10273J11447p3884j11909o7345p8548m3458J23258
$$ -448313 -388609 -415603 -330658 -120385 -8938 -82822 -194731 -262076 -340624 -384082 -260824
31548b60824K13451O0512j22652q7214M0700L8011n736P4037J39003O173j51170
$$ -260824 -47373 13139 -109513 -196727 -156027 -118016 -123752 -49715 89288 95461 -55709
31537e5709p2381J14292R3029j13085k06478r2261O1298J42869J63979R9617n1825
$$ -55709 -128090 -13798 79231 -33854 -240332 -332593 -271295 -128426 35553 135170 83345
31526H3345j42338n8484P1702O9570l2182j13078j71881k08150j09111J18298
$$ 83345 -58993 -117477 -45775 23795 -8387 -121465 -293346 -501496 -610607 -492309
31516d92309K28999J02861j0248J14133K77073J78342p7703j59724l5814M2092
$$ -492309 -263310 -160449 -170697 -56564 220509 398851 321148 161424 125610 167702
31506A67702j8794o6709j9100K7407q202r5024j66416j54132k1457J29897J16498
$$ 167702 148908 82199 63099 90506 82304 -12720 -179136 -333268 -354725 -224828 -108330
31495a08330n4893j42030j3710J53637J60742N7998j4284m4015n1850P574R8577
$$ -108330 -163223 -305253 -318963 -165326 -4584 53414 39130 -4885 -56735 -49161 49416
31484D9416P8091m6677p5761L6951P3100o0956j38516j362J53991J08062l2518
$$ 49416 127507 80830 5069 42020 115120 54164 -84352 -85714 68277 176339 143821
31473A43821n6922J4472M4483K2350l549m5409q0696l7142L1946n556q5820j8675
$$ 143821 86899 101371 145854 168204 164655 119246 38550 1408 33354 27798 -58022 -76697
31461g6697J35082J23597k2643j5147J37515J05555j31887j97943j4193K8598
$$ -76697 58385 181982 159339 144192 281707 387262 255375 57432 43239 71837
31451G1837j82055k18137R1934K74788L0964k07710l4750K25199J29402j17502
$$ 71837 -110218 -328355 -236421 38367 69331 -138379 -173129 52070 181472 63970
31441F3970j18646q193q2905j57800M8546K76956J48351j18913q2800J32216R0948
$$ 63970 -54676 -62869 -145774 -303574 -255028 21928 170279 51366 -31434 100782 191730
31430A91730j62641k35194r4945k1549l1888M6299J15261J85j00306O6836K59488
$$ 191730 29089 -206105 -301050 -322599 -354487 -308188 -192927 -192742 -293048 -226212 33276
31419C3276J09574j82633j63095P0366N7880j78667j84951J06290K80676J53678
$$ 33276 142850 -39783 -202878 -132512 -74632 -253299 -438250 -331960 -51284 102394
31409A02394l3346j20839j73075j41678O8762K45987J18124j14933n0630K06435
$$ 102394 69048 -51791 -224866 -366544 -297782 -51795 66329 -48604 -99234 107201
31399A07201K02472o8435j66919O827Q5211n9019j16161L3077Q7455j06870k72316
$$ 107201 309673 241238 74319 81146 166357 107338 -8823 24254 111709 4839 -267477
31388b67477j68907P4923K42193K69248J31215j47500l28373j75378J45266K45784
$$ -267477 -436384 -361461 -119268 149980 281195 133695 -194678 -370056 -224790 20994
31378B0994P6344p5440q8527q9657q5395L2961J50414N2396j38847j09773R7256
$$ 20994 97338 21898 -66629 -156286 -241681 -208720 -58306 -5910 -144757 -254530 -157274
31367a57274J55644L5044P737R6871M6656j40801j67837J0317J06162K5474k1282
$$ -157274 -1630 33414 41151 138022 184678 43877 -123960 -113643 -7481 17993 -3289
31356c289J5279n1345j89343j28675J16564K03364L8762q0795j3172L0700n0657
$$ -3289 11990 -39355 -228698 -357373 -240809 -37445 1317 -79478 -92650 -61950 -112607
31345a12607o9168L1162L5781j04496j38906K6331J53282J02472L5945N5375L7500
$$ -112607 -181775 -150613 -114832 -219328 -358234 -331903 -178621 -76149 -40204 15171 52671
31334E2671l9190n280J30525J24007n7854j33300O433J02465j5847j57464j29550
$$ 52671 13481 8201 138726 262733 204879 71579 78012 180477 164630 7166 -122384
31323a22384l0266q969l2670l6259l9139j8114P7455J49549P3361k1767P2151
$$ -122384 -152650 -161619 -194289 -230548 -269687 -287801 -210346 -60797 12564 -9203 62948
31312F2948K26615J35526j42763k52369j40701j00690j86906j21500J30150K29591
$$ 62948 289563 425089 282326 29957 -110744 -211434 -398340 -519840 -389690 -160099
31302a60099N9261o7032L1269J14892O724j03090n5758L053l3570k9274N1149
$$ -160099 -100838 -167870 -136601 -21709 -14985 -118075 -173833 -170780 -204350 -233624 -182475
31291a82475R158j66013j68875R5724K79093J44056n1567j8885R3473K2115j42103
$$ -182475 -173317 -339330 -508205 -412481 -133388 10668 -40899 -59784 33689 55804 -86299
31280h6299j50470j8933N7036L1267J881K2199Q8072J68693J56151k8930k34685
$$ -86299 -236769 -255702 -198666 -167399 -165518 -143319 -55247 113446 269597 240667 5982
31269E982k21006k9890P5960N1218Q7452J76350Q4767j54648j92785M6813J89409
$$ 5982 -215024 -244914 -168954 -117736 -30284 146066 230833 76185 -116600 -69787 119622
31258A19622K2703j58052p2989R1208N3613r8827j41039j01257j12288j20949
$$ 119622 142325 -15727 -88716 2492 56105 -42722 -183761 -285018 -397306 -518255
31248e18255l0883P4383R2463Q8256J18602Q3086n9556j39578l1147J31731J61346
$$ -518255 -549138 -474755 -382292 -294036 -175434 -92348 -151904 -291482 -322629 -190898 -29552
31237b9552O6319l2098o6213k2105N2541J7320j73903k86588r1456K11649K24507
$$ -29552 36767 4669 -61544 -83649 -31108 -13788 -187691 -474279 -565735 -354086 -129579
31226a29579k3004j18290M3985J17939n1288j62712k1533J24205N0382p6642n6561
$$ -129579 -152583 -270873 -226888 -108949 -160237 -322949 -344482 -220277 -169895 -246537 -303098
31215c03098J5443K2273N5333J40021J00882p6500j24576M6500J55906L9401p7149
$$ -303098 -287655 -265382 -210049 -70028 30854 -45646 -170222 -123722 32184 71585 -5564
31204e564k5200J3489p6286p6233J10962J82731l5612k08560l2490K30170J90707
$$ -5564 -30764 -17275 -93561 -169794 -58832 123899 88287 -120273 -152763 77407 268114
31193B68114l7080j02323j7103k4393j01401n5870N5623L6143n6425j6104J11268
$$ 268114 231034 128711 111608 87215 -14186 -70056 -14433 21710 -34715 -50819 60449
31182F0449R5037p9741j87970j02842P1792J60244N6969j89386l34994j58880
$$ 60449 155486 75745 -112225 -215067 -143275 16969 73938 -115448 -450442 -609322
31172f09322J90755L12242J10652o7187P299J15562L1264q9826m5011L2015m8965
$$ -609322 -418567 -106325 4327 -62860 -55561 60001 91265 1439 -43572 -11557 -60522
31161f0522j62395j09074J9902M1415J2008N7417R3503J0156q0993n4653n469
$$ -60522 -222917 -331991 -312089 -270674 -258666 -201249 -107746 -97590 -178583 -233236 -238705
31150b38705k4870q43J06742Q7506j31576k34078L560K75741J88150j21898k26321
$$ -238705 -263575 -264418 -157676 -70170 -201746 -435824 -432264 -156523 31627 -90271 -316592
31139c16592o1713Q4535R1298Q6861J07528N3392n9787j10105q4049m5337J7849
$$ -316592 -378305 -293770 -202472 -115611 -8083 45309 -14478 -124583 -208632 -253969 -236120
31128b36120J04181R7225l4223j01467J5991J36311O6792p1505o9090J9693K3120
$$ -236120 -131939 -34714 -68937 -170404 -154413 -18102 48690 -22815 -91905 -72212 -49092
31117d9092l1097j7750L2616L4177L3067O8540L8537p9938j01913M5268J23312
$$ -49092 -80189 -97939 -65323 -31146 1921 70461 108998 29060 -72853 -27585 95727
31106I5727m0852k36357j99652j2650J06941J52435J81706J01380r7011j64940
$$ 95727 54875 -181482 -381134 -393784 -286843 -134408 47298 148678 51667 -113273
31096a13273J9438J79272P6724q4224m6516L7418o0298j68731l9560J46696Q9423
$$ -113273 -93835 85437 162161 77937 31421 68839 8541 -160190 -199750 -53054 36369
31085C6369p2723k6013J21562M8367j59672j50976N9323J41452M1767j30M8989
$$ 36369 -36354 -62367 59195 107562 -52110 -203086 -143763 -2311 39456 39326 88315
31074H8315N763r8498o5420M5003J1354r2174k1117J28710N4273j63216j50908
$$ 88315 94078 -4420 -69840 -24837 -13483 -105657 -126774 1936 56209 -107007 -257915
31063b57915Q0496J25497j01858k14353l0746J37671O1609m1367N2255J91880
$$ -257915 -177419 -51922 -153780 -368133 -398879 -261208 -199599 -240966 -188711 3169
31053C169J67420N7155J9164J8250k6665o1938m3112m8753j10858j27870n4139
$$ 3169 170589 227744 246908 265158 238493 176555 133443 84690 -26168 -154038 -208177
31042b08177J4590K3702L4948O3524M1350j2616O858Q1900P3114l3627q9412k6012
$$ -208177 -193587 -169885 -134937 -71413 -30063 -42679 -35821 46079 119193 85566 -3846 -29858
31030b9858N7554P4404L2959n4653j58540j54113K8898K11945J52979r1812k21318
$$ -29858 27696 102100 135059 80406 -78134 -232247 -203349 8596 161575 69763 -151555
31019a51555r6408J20269K16951J29350p7484k34638j48225J47110L16771J33961
$$ -151555 -247963 -127694 89257 218607 141123 -93515 -241740 -94630 222141 356102
31009C56102j68933k19047l1322R2804N9706J7643M27p5891j25678M083J82960
$$ 356102 187169 -31878 -63200 29604 89310 106953 107380 31489 -94189 -90106 92854
30998I2854J38629p7148j57483n2626M21m8056j133J37504J14404r1100j77640
$$ 92854 231483 154335 -3148 -55774 -55353 -103409 -104542 32962 147366 56266 -121374
30987a21374l3933Q3974K8017p332R8841J45239o401j56110j12242J86J0244p297
$$ -121374 -155307 -71333 -43316 -50648 48193 193432 187031 30921 -81321 -81135 -70891 -78188
30975g8188N5284R7501J9885n7579j4103M5997L733m1421K6766R0654j3200j98066
$$ -78188 -22904 74597 94482 36903 22800 68797 72530 31109 57875 148529 135329 -62737
30963f2737k47748j33448j0655K7542K4663L8216P4254J11905J15443O5159R636
$$ -62737 -310485 -443933 -454588 -427046 -402383 -364167 -289913 -178008 -62565 2594 12230
30952A2230J4039M5054J1369p5542j07085n1670J1168L3139L1721p280r9714j49480
$$ 12230 26269 71323 82692 7150 -99935 -151605 -140437 -107298 -75577 -82857 -182571 -332051
30940c32051m7915J20328J64258P3777J4956M6667O8718N1922P0008Q4026l7348
$$ -332051 -379966 -259638 -95380 -21603 -6647 40020 108738 160660 230668 314694 277346
30929B77346k35339k69053q1316R8980J04649L1337J503j9045o0786n1903J345
$$ 277346 42007 -227046 -308362 -209382 -104733 -73396 -71893 -90938 -151724 -203627 -202282
30918b02282k8220j32456j13882P6323J97891Q7744p2887n7016N9177P3843M842
$$ -202282 -230502 -362958 -476840 -400517 -202626 -114882 -187769 -244785 -185608 -111765 -106923
30907a06923P020P1076N4838n2940j17326p3606J2507P4732R6118O0025k4013
$$ -106923 -99903 -28827 26011 -26929 -144255 -217861 -205354 -130622 -34504 25521 1508
30896A508p4680k9168N0088N6816k879l2631j144J9342k8922j03884j14261k3370
$$ 1508 -73172 -102340 -52252 4564 1685 -30946 -32090 -12748 -41670 -145554 -259815 -283185
30884b83185J06280J67067J13105P096n4705m3365K044L9937N1458L4042J0004
$$ -283185 -176905 -9838 103267 110363 55658 12293 14337 54274 105732 139774 149778
30873A49778J949k5990j25822k29071j73736M8807K07268J23404o8644j21065
$$ 149778 151727 125737 -85 -229156 -402892 -354085 -146817 -23413 -92057 -213122
30863b13122k4972L3456p921l4126J2751O2102P8290J01704J16024N6003l5876
$$ -213122 -238094 -204638 -212559 -246685 -233934 -171832 -93542 8162 124186 180189 144313
30852A44313l6675M5619N5438p1882k01027j81183k9920J10198J20961L030j13351
$$ 144313 107638 153257 208695 136813 -64214 -245397 -275317 -165119 -44158 -41128 -154479
30841a54479p5772J02782K17319J17975q9130j94628j55465p9910k4396L8201
$$ -154479 -230251 -127469 89850 207825 118695 -75933 -231398 -311308 -335704 -297503
30831b97503J00927J20873R8873N1182l4861j20720r7703L7478J16792M4275m1705
$$ -297503 -196576 -75703 23170 74352 39491 -81229 -178932 -141454 -24662 19613 -22092
30820b2092m176O1118J7958o0243n3308l5585j03996j32420J7960J93141J59635
$$ -22092 -26268 34850 52808 -7435 -60743 -96328 -200324 -332744 -314784 -121643 37992
30809C7992m960n4603R402M139n6035r300R5714O2746p1024q2201L0126M3376
$$ 37992 33032 -21571 -12169 -8030 -64065 -73365 22349 85095 14071 -68130 -38004 5372
30797E372q2140j47510p9748j6116p107M1105J14112R3876J7519K1229N0643m0509
$$ 5372 -76768 -224278 -304026 -320142 -327249 -286144 -172032 -78156 -60637 -39408 11235 -29274
30785b9274j46928m4800J64947J62659m8700j50858p3077o6455j58840n9249K50019
$$ -29274 -176202 -221002 -56055 106604 57904 -92954 -166031 -232486 -391326 -450575 -200556
30774b00556L48147M1717k69171j88543J01918J88972K9966j17510j27007o4035
$$ -200556 147591 189308 -79863 -268406 -166488 22484 52450 -65060 -192067 -256102
30764b56102J0245N5539J4835o9854n6435O5391J27745O3566R050L5907L3249
$$ -256102 -245857 -190318 -175483 -245337 -301772 -236381 -108636 -45070 -36020 -113 33136
30753C3136l8987m6950M4941O9058m1887j09581j1873J19004J35763P4221j911
$$ 33136 -5851 -52801 -7860 61198 19311 -90270 -102143 16861 152624 226845 224934
30742B24934j04284j69875q0233P5823N6343j22723j63110J5611J18171k4127
$$ 224934 120650 -49225 -129458 -53635 2708 -120015 -283125 -267514 -149343 -173470
30732a73470j67242q0960Q9070J24552P7827O2895M240j46930k17447q4136J03754
$$ -173470 -340712 -421672 -332602 -208050 -130223 -67328 -63088 -210018 -427465 -511601 -407847
30721d07847J86154K14477K23706R2500j53611k33284n5147O7304p2345k01030
$$ -407847 -221693 -7216 216490 308990 155379 -77905 -133052 -65748 -138093 -339123
30711c39123m2465J80713J27123p6718q1164Q1714J07280k1023m4214P8509J19261
$$ -339123 -381588 -200875 -73752 -150470 -231634 -149920 -42640 -63663 -107877 -29368 89893
30700H9893M640q6364o0201k6701n4373p1591l5533J1674N8290J20959J53764
$$ 89893 94533 8169 -52032 -78733 -133106 -204697 -240230 -228556 -170266 -49307 104457
30689A04457J09586L8563l889n3933j16964q4621P0376J65295N4565j34198j95965
$$ 104457 214043 252606 248717 194784 77820 -6801 63575 228870 283435 149237 -46728
30678d6728j36089o9542J5894J72784K94457K33616M1851j01540j29540j02819
$$ -46728 -182817 -252359 -236465 -63681 230776 464392 506243 404703 275163 172344
30668A72344p1826n6716p0792o4756L0292J38107R5805n7203q6989M6805R4452
$$ 172344 100518 43802 -26990 -91746 -61454 76653 172458 115255 28266 75071 169523
30657A69523n8280j77660p7714Q3458J19273J13279J58011J14290q8462k23260
$$ 169523 111243 -66417 -144131 -60673 58600 171879 329890 444180 355718 132458
30647A32458j39578n2464j34874j61713N4772K21059K6863k49105j44834J98781
$$ 132458 -7120 -59584 -194458 -356171 -301399 -80340 -53477 -302582 -447416 -248635
30637b48635K50078m4528k10359l9718J41231P5712o0621m0510P5424J30759J00138
$$ -248635 1443 -43085 -253444 -293162 -151931 -76219 -136840 -177350 -101926 28833 128971
30626A28971J7535p8868r2508J2967P1072n9389k03083j12132R1561R0044q1775
$$ 128971 146506 67638 -24870 -11903 59169 -220 -203303 -315435 -223874 -133830 -215605
30615b15605q6647J23699K17903N5471q4088J8577J89728J84336L2357j08552
$$ -215605 -302252 -178553 39350 94821 10733 29310 219038 403374 435731 327179
30605C27179j90159k11021j37437j5312K9893p226L57P5181R5065K7680k1050
$$ 327179 137020 -74001 -211438 -226750 -196857 -204083 -203726 -128545 -33480 -5800 -26850
30594b6850k6852p3291j26057m6818J19995J54564K4340m7362L6766R4801J5255
$$ -26850 -53702 -126993 -253050 -299868 -179873 -25309 -969 -48331 -11565 83236 98491
30583I8491m0310M5820J06756j3632j54645q1376J25392J79522R735j55484j09574
$$ 98491 58181 104001 210757 197125 42480 -38896 86496 266018 275753 120269 10695
30572A0695Q5503J94435P1304j81250l01276j51199J02842J79054L2622j04692
$$ 10695 96198 290633 361937 180687 -120589 -271788 -168946 10108 42730 -61962
30562f1962n2226R1123J04709p1319k78370l08010r9019J90235L15702K03440
$$ -61962 -114188 -23065 81644 10325 -268045 -576055 -675074 -484839 -169137 34303
30552C4303K8283k7178o136n2320j42284j23211K1836J35427J16286K6499m2250
$$ 34303 62586 35408 29272 -23048 -165332 -288543 -266707 -131280 -14994 11505 -30745
30541c0745o4298l3809L8834P6693J1437q8400q8707J3138Q6011N8294n464k5154
$$ -30745 -95043 -128852 -90018 -13325 -1888 -90288 -178995 -165857 -79846 -21552 -27016 -52170
30529e2170j244J3580k8004j15241j46573k9811J44300J66107J3772q6015j0824
$$ -52170 -53414 -39834 -67838 -183079 -329652 -359463 -215163 -49056 -35284 -121299 -132123
30518a32123O8148J2541k4156R2544J67574N772j78158q3792J22253N0967k19034
$$ -132123 -63975 -51434 -75590 16954 184528 190300 12142 -71650 50603 101570 -117464
30507a17464k23523J14977L32393J53112j19290j37116l302K4012l0409m383P2417
$$ -117464 -340987 -226010 106383 259495 140205 3089 -213 23799 -6610 -10993 61424
30496F1424O4011k9566j16799j52025r6045P6850K24905J24489j60872k59145
$$ 61424 125435 95869 -20930 -172955 -269000 -192150 32755 157244 -3628 -262773
30486b62773j3642K37718J42255j45893k17911j4696J47440Q3025m1252j6705
$$ -262773 -276415 -38697 103558 -42335 -260246 -274942 -127502 -44477 -85729 -102434
30476a02434J16496J75343Q9673m1666r8461p6957o3670r1262q6280l483P3230
$$ -102434 14062 189405 279078 237412 138951 61994 -1676 -92938 -179218 -182701 -109471
30465a09471O5254M6531J03482J32203r404j99002j63960R4312K64685J68603
$$ -109471 -44217 2314 105796 237999 228595 29593 -134367 -40055 224630 393233
30455C93233l1280j44903j97972k36232j62137M8436J95108J26956j1005n732
$$ 393233 361953 217050 19078 -217154 -379291 -330855 -135747 -8791 -19796 -25528
30445b5528J03204J28793L3192p1019j11266q0420K2664J25108P2318j46660k86970
$$ -25528 77676 206469 239661 168642 57376 -23044 -380 124728 197046 50386 -236584
30434b36584j47691J18345J94973L0476j27730q9816P3230J81653J49959K3280
$$ -236584 -384275 -265930 -70957 -40481 -168211 -258027 -184797 -3144 146815 170095
30424A70095q2207o9418L9733J17060Q8944K1266j0942m0468j06391j38346o3471
$$ 170095 87888 18470 58203 175263 264207 285473 274531 234063 127672 -10674 -74145
30413g4145M9422P8537K4428j7033m214L0096N2553L1838o2137j70503j49185
$$ -74145 -24723 53814 78242 61209 56995 87091 139644 171482 109345 -61158 -210343
30402b10343K7962J70438J13942l5638o7351J1927K1279p7619j30154n8517K9555
$$ -210343 -182381 -11943 101999 66361 -990 10937 32216 -45403 -175557 -234074 -204519
30391b04519M5066M1930O7613N7397k6906q8616l6018O9329J09405P6836M4084
$$ -204519 -159453 -117523 -49910 7487 -19419 -108035 -144053 -74724 34681 111517 155601
30380A55601K9556j010m2373n9539o4186q9366j06542o1047J7604L8424r745l7754
$$ 155601 185157 184147 141774 82235 18049 -71317 -177859 -238906 -221302 -182878 -192623 -230377
30368b30377j675L1412Q921j5732J0809L6130k73m2913j5665K4312k0692q5049
$$ -230377 -232052 -200640 -191719 -207451 -196642 -160512 -160785 -203698 -219363 -195051 -215743 -300792
30356c00792j4626J52049J84102L163j69539j26714L4995R1308J7417m3197l5992
$$ -300792 -315418 -163369 20733 23896 -145643 -272357 -237362 -146054 -128637 -171834 -207826
30345b07826k0909N93P7401J44918P2913r8505j59824l1016J06011O9660n9773
$$ -207826 -228735 -228142 -150741 -5823 67090 -31415 -191239 -222255 -116244 -46584 -106357
30334a06357o9724P2363J79921J11832m4698j05495l1161M6117K2530m4705m8318
$$ -106357 -176081 -103718 76203 188035 143337 37842 6681 52798 75328 30623 -17695
30323a7695O189L7448L2192L3770J9498o3726j44161p6481J11366J96281O4272
$$ -17695 -11506 25942 58134 91904 111402 47676 -96485 -172966 -61600 134681 198953
30312A98953j23201j66457q0223O443N4958Q1502M6835o0568j32457q1542J3703
$$ 198953 75752 -90705 -170928 -164485 -109527 -28025 18810 -41758 -174215 -255757 -242054
30301b42054L9166K2389M3510P2554M1998j5007m0164o0907q9892l8369J18155
$$ -242054 -202888 -180499 -136989 -64435 -22437 -37444 -77608 -138515 -228407 -266776 -148621
30290a48621K23325J58848L9055M567j9143j40514k42280j62230N366O5254N1255
$$ -148621 74704 233552 272607 277174 258031 117517 -124763 -286993 -281627 -216373 -165118
30279a65118J07671J64167N8937j08476j00097M5058P5728l0358n6351L7483O1213
$$ -165118 -57447 106720 165657 57181 -42916 2142 77870 47512 -8839 28644 89857
30268H9857k9456p5217n3803j02341j68655m2328K05642K35812n287j68468p4920
$$ 89857 60401 -14816 -68619 -170960 -339615 -381943 -176301 59511 54224 -114244 -189164
30257a89164K7672m0346q2853M4217J22528j1475j27034j6015J05374r097j58329
$$ -189164 -161492 -201838 -284691 -240474 -117946 -129421 -256455 -272470 -167096 -176193 -334522
30246c34522l7573J99557J82587n4582j55685l0420Q3744Q0750P8450Q1661k7615
$$ -334522 -372095 -172538 10049 -44533 -200218 -230638 -146894 -66144 12306 93967 66352
30235F6352j53921n6426J92594K24747m0175k20786o1157J70903J23789r8553
$$ 66352 -87569 -143995 48599 273346 233171 12385 -48772 122131 245920 147367
30225A47367j53702j5058L9961r1400k01812j27757L7533J48493J94227J85141
$$ 147367 -6335 -21393 18568 -72832 -274644 -402401 -364868 -216375 -22148 162993
30215A62993N8251j58564k51566q1376J63880J81438l2817j95758j43998k321
$$ 162993 221244 62680 -188886 -270262 -106382 75056 42239 -153519 -297517 -299838
30205b99838P8063J06927J05395J4568j17629r4618J08315K05528N553k51207
$$ -299838 -221775 -114848 -9453 5115 -112514 -207132 -98817 106711 112264 -138943
30195a38943k29667J962J27296R4975J11853J97894J40657r0723k48326j89948
$$ -138943 -368610 -366648 -239352 -144377 -32524 165370 306027 215304 -33022 -222970
30185b22970n0065M1043J10723J45366M2503j39913j75032j9879R7396N3374P928
$$ -222970 -273035 -231992 -121269 24097 66600 -73313 -248345 -268224 -170828 -117454 -109526
30174a09526P5982J11842m280j27348r3692J5195M7862K5340K6400J3302n3109
$$ -109526 -33544 78298 74018 -53330 -147022 -131827 -83965 -58625 -32225 -18923 -72032
30163g2032r0043l9486K1019L7686O8698J04991K4546j48679j86444j0720J47168
$$ -72032 -162075 -201561 -180542 -142856 -74158 30833 55379 -93300 -279744 -290464 -143296
30152a43296J14980L8652O9604P6208p4357k12198j45123j1055k4773q1318K9731
$$ -143296 -28316 10336 79940 156148 81791 -130407 -275530 -286585 -311358 -392676 -362945
30141c62945J89900J27823q5371j26054M4666J34346K2246p2620k145P5003K653
$$ -362945 -173045 -45222 -130593 -256647 -211981 -77635 -55389 -128009 -130154 -55151 -52498
30130e2498j07023q9493o402j8970j03555q0191J00232K44266J55837p5108j46022
$$ -52498 -159521 -249014 -255416 -274386 -377941 -458132 -357900 -113634 42203 -32905 -178927
30119a78927M8987K19894O0098k71358l21858N045K99293K39242J417j04755q4997
$$ -178927 -129940 89954 150052 -121306 -443164 -438119 -138826 100416 101833 -2922 -87919
30108h7919q0928l6688J19888J94446K184k35817j64832J36159K52508N5005j57866
$$ -87919 -168847 -205535 -85647 108799 110983 -124834 -289666 -153507 99001 154006 -3860
30097c860j47388j2666O8865P2420K9417m3290o4196L5706J35066N4825j29093
$$ -3860 -151248 -163914 -95049 -22629 6788 -36502 -100698 -64992 70074 124899 -4194
30086d194j65543k8607M8504k7592q4274k6350J0378l1569J8178K16135K99645
$$ -4194 -169737 -198344 -149840 -177432 -261706 -288056 -277678 -309247 -291069 -74934 224711
30075B24711P2662k22723k13571N6491J90639J0470k21990k08992j0359J03419
$$ 224711 297373 74650 -138921 -82430 108209 118679 -103311 -312303 -322662 -219243
30065b19243M5861j9377L1509J08412Q5461J2139J4270O8894N0473l0183l1034
$$ -219243 -173382 -192759 -161250 -52838 32623 44762 59032 127926 178399 148216 117182
30054A17182N9030P5556l8475j24121q9857p6754j77451k13457k4985J99081J62180
$$ 117182 176212 251768 213293 89172 -685 -77439 -254890 -468347 -493332 -294251 -132071
30043a32071q4140k13544r3454R2617J65424J36630P0994j0448o7638o5888o4975
$$ -132071 -216211 -429755 -523209 -430592 -265168 -128538 -57544 -67992 -135630 -201518 -266493
30032b66493j21626j40533p953J72274J87209K9913j03634j05253l4130N5290
$$ -266493 -388119 -528652 -536605 -364331 -177122 -147209 -250843 -356096 -390226 -334936
30022c34936J42126J41086J9553l8391J34213L32429J92980k30902m71120k93393
$$ -334936 -192810 -51724 -32171 -70562 63651 396080 589060 358158 -112962 -406355
30012d06355J2513J13249N5039K9644L8876K4559O7176J99182K32627L2413k07875
$$ -406355 -393842 -280593 -225554 -195910 -157034 -132475 -65299 133883 366510 398923 191048
30001A91048k17295l7708Q3513P3918N5809O9506L5740l6888m1803K1085K6860
$$ 191048 -26247 -63955 19558 93476 149285 218791 254531 217643 175840 196925 223785
29990B23785o6388j55242j62163j23815p6999Q619J29803J89058J09465m6247
$$ 223785 157397 2155 -160008 -283823 -360822 -352203 -222400 -33342 76123 29876
29980B9876j34770r2026N611M3230Q526j760O8268J26700M9700j18509j89470
$$ 29876 -104894 -196920 -191309 -148079 -139553 -141313 -73045 53655 103355 -15154 -204624
29969b04624p7733Q3310J30197P6700M3696N5624K6586o9369j28815n9286P6022
$$ -204624 -282357 -199047 -68850 7850 51546 107170 133756 64387 -64428 -123714 -47692
29958d7692J14689j0162j74057j88923j4927J92574K53529J39025l7721j51659
$$ -47692 66997 56835 -117222 -306145 -321072 -128498 125031 264056 226335 74676
29948G4676j52630p4341l147L588l597O3866J58357J12141r5609k28934r8866
$$ 74676 -77954 -152295 -155442 -151854 -155451 -91585 66772 178913 83304 -145630 -244496
29937b44496J39058J85860K0876j04273o3301J033l5332q3872l1576O7118J02671
$$ -244496 -105438 80422 101298 -2975 -66276 -65243 -100575 -184447 -216023 -148905 -46234
29926d6234P2447K5713k9388o8053k0103R6991J29801q201j77405j80124k3636
$$ -46234 26213 51926 22538 -45515 -65618 31373 161174 152973 -24432 -204556 -228192
29915b28192J04160Q4286j4484n5921J892P3773M8513p2281j52045q4704M7206
$$ -228192 -124032 -39746 -54230 -110151 -108259 -34486 14027 -58254 -210299 -295003 -247797
29904b47797P7790K153k7947L2635M2429o9404j47316m7889J15149J41524N1239
$$ -247797 -170007 -167854 -195801 -163166 -120737 -190141 -337457 -385346 -270197 -128673 -77434
29893g7434J7838O1104L4283q4481j16977K7611J79761J44882k2305j18094p7251
$$ -77434 -59596 1508 35791 -48690 -165667 -138056 41705 186587 164282 46188 -31063
29882c1063r958M747N167J9300p21o1216o8260K1645Q8350R147j28223j23922
$$ -31063 -41021 -36274 -31107 -11807 -12528 -73744 -142004 -120359 -32009 -22862 -151085 -275007
29870b75007L7718J53686J00382N048K8334J14644J00606j8824r9355q5020o9453
$$ -275007 -237289 -83603 16779 21827 50161 164805 265411 246587 147232 62212 -7241
29859g241j09749j33254q0840j5620j0044k0534K8258R6451P7219k5826p7879
$$ -7241 -116990 -250244 -331084 -346704 -356748 -377282 -349024 -252573 -175354 -201180 -279059
29848b79059J256J14023J08737k4217j55074j86253j29826j9521J32745K51182
$$ -279059 -277803 -163780 -55043 -79260 -234334 -420587 -550413 -569934 -437189 -186007
29838a86007K04825Q620j05920J8218J95828J34425j15924k11356l3537J30048
$$ -186007 18818 27438 -78482 -60264 135564 269989 154065 -57291 -90828 39220
29828C9220M1211j25504q2649J13390J71868K1165j18328q6875K4522O3040R297
$$ 39220 80431 -45073 -127722 -14332 157536 178701 60373 -26502 -1980 61060 70357
29817G0357o6327j09343r2407j4018P3574R6541M1609l2108o0093k1797N3454
$$ 70357 4030 -105313 -197720 -211738 -138164 -41623 -14 -32122 -92215 -114012 -60558
29806f0558J03397Q9216M8141L7629L1166l9761j40819j59165q9653m6187n4965
$$ -60558 42839 132055 180196 217825 248991 209230 68411 -90754 -180407 -226594 -281559
29795b81559j2002R9723J48966R0799M8287O0756p455j71397k07194k2127J28474
$$ -281559 -293561 -193838 -44872 45927 94214 154970 147515 -23882 -231076 -253203 -124729
29784a24729M3063p1820M2062K25695J63914o9569j38142M901J01265N3762K963
$$ -124729 -81666 -153486 -111424 114271 278185 208616 70474 75375 176640 230402 233365
29773B33365k0350j15121j96712p0710J62254J78759m3994j73246n8122P1552
$$ 233365 213015 97894 -98818 -169528 -7274 171485 127491 -45755 -103877 -32325
29763c2325L9102l4007l9917o6261j23086n0222J42696J95686K8709r7042k9703
$$ -32325 6777 -27230 -67147 -133408 -256494 -306716 -164020 31666 60375 -36667 -66370
29752f6370K4794p9919j37483J3107J45612K9724j45235q7155J08627J57651O9419
$$ -66370 -41576 -121495 -258978 -245871 -100259 -70535 -215770 -302925 -194298 -36647 32772
29741C2772M9028P6227k0782j69632j24445R5676J93244M1851j50050j72815o3992
$$ 32772 81800 158027 137245 -32387 -156832 -61156 132088 173939 23889 -148926 -212918
29730b12918L6487P6557P0399L4245j289o884L514P318J3862J5218k4958p2051
$$ -212918 -176431 -99874 -29475 4770 3481 -3403 111 7429 21291 36509 11551 -60500
29718f0500k7271Q7252J01485l4082j26854l9244P5162K8323q2856n4553O9221
$$ -60500 -87771 -519 100966 66884 -59970 -99214 -24052 4271 -78585 -133138 -63917
29707f3917Q8770n849n5762l0578l4459o1029q035Q7738Q4581q860n4671m1674
$$ -63917 24853 19004 -36758 -67336 -101795 -162824 -170859 -83121 1460 -7400 -62071 -103745
29695a03745o8689r4216J3389J70007J28787j04116k15698n7823J19325O7375
$$ -103745 -172434 -266650 -253261 -83254 45533 -58583 -274281 -332104 -212779 -145404
29685a45404q5483p4471Q1461J42190K1983j18662j19040P821J36279J56222N6499
$$ -145404 -230887 -305358 -223897 -81707 -59724 -178386 -297426 -289605 -153326 2896 59395
29674E9395n3407m4027O5659J09001r057j80507k45791j82992o9461M5294J29487
$$ 59395 5988 -38039 27620 136621 127564 -52943 -298734 -481726 -551187 -505893 -376406
29663c76406J25164L4161k5100L0108J04459O8616j8894L15J12262J38751K6594
$$ -376406 -251242 -217081 -242181 -212073 -107614 -38998 -57892 -57577 54685 193436 220030
29652B20030p0004n2057k5151q0401j07682Q747J48553J14036n5560j48951j16714
$$ 220030 150026 97969 72818 -7583 -115265 -106518 42035 156071 100511 -48440 -165154
29641a65154j00372j28767n2104J48145K46755J19162l2188L732R9860J9302j58990
$$ -165154 -265526 -394293 -446397 -298252 -51497 67665 35477 39209 139069 158371 -619
29630f19j55286L5941J18781k9023j66269q0291R3795J06270m8217j80555j83851
$$ -619 -155905 -119964 -1183 -30206 -196475 -276766 -182971 -76701 -124918 -305473 -489324
29619d89324r4711L0811J50002J96076J34949L4237q775J8288N1759L2225n6968
$$ -489324 -584035 -553224 -403222 -207146 -72197 -37960 -46735 -28447 23312 55537 -1431
$$ [...]
##END NTUPLES=NMR SPECTRUM
##END=
