##TITLE=31Pdec_LY-3DixiHYD
 CD3CN, 24 sc
 5.03.2021
##JCAMPDX= 6.0         $$ Bruker NMR JCAMP-DX V2.0
##DATA TYPE= NMR SPECTRUM
##DATA CLASS= NTUPLES
##ORIGIN= UXNMR, Bruker Analytische Messtechnik GmbH
##OWNER= root
$$ XWIN-NMR		Version 3.5
$$ Fri Mar  5 10:06:26 2021 Russian Standard Time (UT+4h)  she@DPX200
##.OBSERVE FREQUENCY= 81.013821
##.OBSERVE NUCLEUS= ^31P
##.ACQUISITION MODE= SIMULTANEOUS
##.ACQUISITION SCHEME= undefined
##.AVERAGES= 24
##.DIGITISER RES= 16
##SPECTROMETER/DATA SYSTEM= spect
##.PULSE SEQUENCE= zgpg30
##.SOLVENT NAME= CDCl3
##.SHIFT REFERENCE= (INTERNAL, CDCl3, 0, 248.564)
##AUDIT TRAIL= $$ (NUMBER, WHEN, WHO, WHERE, WHAT)
$$ ##TITLE= Audit trail, XWIN-NMR		Version 3.5
$$ ##JCAMPDX= 5.01
$$ ##ORIGIN= Bruker BioSpin GmbH
$$ ##OWNER= she
$$ F:/spectra/data/she/nmr/P31/1/pdata/1/auditp.txt
$$ ##AUDIT TRAIL=  $$ (NUMBER, WHEN, WHO, WHERE, WHAT)
(   1,<2021-03-05 10:05:36.06 +0400>,<she>,<DPX200>,
      <created by zg, POWCHK disabled, PULCHK disabled
       configuration hash MD5:
       00 E9 B6 7A A2 85 ED C7 34 08 36 98 17 FE 4E 26
       data hash MD5: 32K
       5F FD A2 C7 58 3A 21 CF 45 4D 86 29 2B DF 1A F0>)
(   2,<2021-03-05 10:05:38.21 +0400>,<she>,<DPX200>,
      <Start of raw data processing
       efp BC_mod = 2 LB = 1 FT_mod = 6 PKNL = 1 PHC0 = -3323.865 PHC1 = -4.199005 SI = 64K 
       data hash MD5: 64K
       49 62 39 98 01 02 35 1F FF D3 77 D6 A2 97 CC A5>)
(   3,<2021-03-05 10:05:57.53 +0400>,<she>,<DPX200>,
      <pk PHC0 = 2.764231 PHC1 = 15.8 
       data hash MD5: 64K
       E9 27 D6 35 AB BA 57 EC EC 98 07 57 CD 00 A2 9E>)
(   4,<2021-03-05 10:06:00.81 +0400>,<she>,<DPX200>,
      <abs ABSG = 5 
       data hash MD5: 64K
       92 76 59 93 80 18 C8 B2 D6 A4 A9 8F BB 99 36 19>)
$$ ##END=
$$ 
$$ hash MD5
$$ 19 9A 34 C8 79 E2 D9 D6 19 E7 EE 35 C5 1B C8 45
##$RELAX= 
##$RELAX= 
##$RELAX= 
##$RELAX= 
##$RELAX= 
##$RELAX= 
##$RELAX= 
##$RELAX= 
$$ Bruker specific parameters
$$ --------------------------
##$DU= <F:/spectra>
##$EXPNO= 1
##$NAME= <P31>
##$PROCNO= 1
##$TYPE= <nmr>
##$USER= <she>
##$AMP= (0..31)
100 100 100 100 100 100 100 100 100 100 100 100 100 100 100 100 100 100 
100 100 100 100 100 100 100 100 100 100 100 100 100 100 
##$AQSEQ= 0
##$AQ_mod= 1
##$AUNM= <au_zg>
##$AUTOPOS= <>
##$BF1= 81.014009
##$BF2= 200.13
##$BF3= 200.13
##$BF4= 200.13
##$BF5= 200.13
##$BF6= 200.13
##$BF7= 200.13
##$BF8= 200.13
##$BYTORDA= 1
##$CFDGTYP= 0
##$CFRGTYP= 5
##$CHEMSTR= <none>
##$CNST= (0..31)
1 1 145 1 1 1 1 1 1 1 1 1 1 1 1 1 1 1 1 1 1 1 1 1 1 1 1 1 1 1 1 1 
##$CPDPRG= <waltz16>
##$CPDPRG1= <>
##$CPDPRG2= <waltz16>
##$CPDPRG3= <>
##$CPDPRG4= <mlev>
##$CPDPRG5= <mlev>
##$CPDPRG6= <mlev>
##$CPDPRG7= <mlev>
##$CPDPRG8= <mlev>
##$CPDPRGB= <>
##$CPDPRGT= <>
##$D= (0..31)
0 1 0 0 0 0 0 0 0 0 0 0.03 2e-05 3e-06 0 0 0 0 0 0 0 0 0 0 0 0 0 0 0 0 
0 0 
##$DATE= 1614924335
##$DBL= (0..7)
120 120 120 11 120 120 24 19 
##$DBP= (0..7)
150 150 150 150 150 150 150 150 
##$DBP07= 0
##$DBPNAM0= <>
##$DBPNAM1= <>
##$DBPNAM2= <>
$$ [...]
##$SUBNAM3= <"">
##$SUBNAM4= <"">
##$SUBNAM5= <"">
##$SUBNAM6= <"">
##$SUBNAM7= <"">
##$SUBNAM8= <"">
##$SUBNAM9= <"">
##$SW= 501.771253377433
##$SWIBOX= (0..15)
0 1 3 0 0 0 0 0 0 0 0 0 0 0 0 0 
##$SW_h= 40650.406504065
##$TD= 32768
##$TD0= 1
##$TE= 0
##$TE2= 300
##$TE3= 300
##$TEG= 300
##$TL= (0..7)
0 120 53 12 22 120 120 120 
##$TP= (0..7)
150 150 150 150 150 150 150 150 
##$TP07= 0
##$TPNAME0= <>
##$TPNAME1= <>
##$TPNAME2= <>
##$TPNAME3= <>
##$TPNAME4= <>
##$TPNAME5= <>
##$TPNAME6= <>
##$TPNAME7= <>
##$TPOAL= (0..7)
0.5 0.5 0.5 0.5 0.5 0.5 0.5 0.5 
##$TPOFFS= (0..7)
0 0 0 0 0 0 0 0 
##$TUNHIN= 0
##$TUNHOUT= 0
##$TUNXOUT= 0
##$USERA1= <user>
##$USERA2= <user>
##$USERA3= <user>
##$USERA4= <user>
##$USERA5= <user>
##$V9= 5
##$VALIST= <valist>
##$VCLIST= <CCCCCCCCCCCCCCC>
##$VD= 0
##$VDLIST= <DDDDDDDDDDDDDDD>
##$VPLIST= <PPPPPPPPPPPPPPP>
##$VTLIST= <TTTTTTTTTTTTTTT>
##$WBST= 1024
##$WBSW= 4
##$XGAIN= (0..3)
0 0 0 0 
##$XL= 0
##$YL= 0
##$YMAX_a= 9409
##$YMIN_a= -5948
##$ZGOPTNS= <>
##$ZL1= 120
##$ZL2= 120
##$ZL3= 120
##$ZL4= 120
##$ABSF1= 248.5645
##$ABSF2= -253.2056
##$ABSG= 5
##$ABSL= 3
##$ALPHA= 0
##$AQORDER= 0
##$ASSFAC= 0
##$ASSFACI= 0
##$ASSFACX= 0
##$ASSWID= 0
##$AUNMP= <proc_1d>
##$AZFE= 0.1
##$AZFW= 0.5
##$BCFW= 0
##$BC_mod= 2
##$BYTORDP= 0
##$COROFFS= 0
##$CY= -3
##$DATMOD= 1
##$DC= 0
##$DFILT= <>
##$DTYPP= 0
##$F1P= 0
##$F2P= 0
##$FCOR= 1
##$FTSIZE= 65536
##$FT_mod= 6
##$GAMMA= 0
##$GB= 0
##$INTBC= 1
##$INTSCL= 5.30512e-09
##$ISEN= 30
##$LB= 1
##$LEV0= 0
##$LPBIN= 0
##$MAXI= 10000
##$MC2= 0
##$MEAN= 0
##$ME_mod= 0
##$MI= 50
##$NCOEF= 0
##$NC_proc= -7
##$NLEV= 6
##$NOISF1= 182.463
##$NOISF2= 159.3651
##$NSP= 0
##$NTH_PI= 0
##$NZP= 0
##$OFFSET= 248.5645
##$PC= 4
##$PHC0= -3321.101
##$PHC1= 11.601
##$PH_mod= 1
##$PKNL= yes
##$PPARMOD= 0
##$PSCAL= 0
##$PSIGN= 0
##$REVERSE= no
##$SF= 81.014009
##$SI= 65536
##$SIGF1= 159.3651
##$SIGF2= -187.1042
##$SINO= 113.3802
##$SIOLD= 16384
##$SREGLST= <1H.CDCl3>
##$SSB= 0
##$STSI= 65536
##$STSR= 0
##$SW_p= 40650.406504065
##$SYMM= 0
##$S_DEV= 0
##$TDeff= 32768
##$TDoff= 0
##$TI= <>
##$TILT= no
##$TM1= 0
##$TM2= 0
##$TOPLEV= 0
##$USERP1= <user>
##$USERP2= <user>
##$USERP3= <user>
##$USERP4= <user>
##$USERP5= <user>
##$WDW= 1
##$XDIM= 65536
##$YMAX_p= 405784940
##$YMIN_p= -55371937
$$ End of Bruker specific parameters
$$ ---------------------------------
##NTUPLES= NMR SPECTRUM
##VAR_NAME=  FREQUENCY,     SPECTRUM/REAL,   SPECTRUM/IMAG
##SYMBOL=    X,             R,               I
##VAR_TYPE=  INDEPENDENT,   DEPENDENT,       DEPENDENT
##VAR_FORM=  AFFN,          ASDF,            ASDF
##VAR_DIM=   65536,         65536,           65536
##UNITS=     HZ,            ARBITRARY UNITS, ARBITRARY UNITS
##FACTOR=    0.620285442955139, 1,           1
##FIRST=     20137.2065510759, 0,            0
##LAST=      -20513.1999529892, 0,           0
##MIN=       -20513.1999529892, -55371937,   0
##MAX=       20137.2065510759, 405784940,    0
$$ Real data points
##PAGE= N=1
##DATA TABLE= (X++(R..R)), XYDATA
$$ [...]
13010d620407n884171l81838N590628N712787N93974l754380l101329R79072L362525
13001a503139J265343k233854k024193J926132M649670L865086K671436K709671
12993A1326152O26530m761841p762375l989649J789286K667562J64963L35749
12985C96377K909320K709636m31918j958773j571159k999808n009806j905363
12977g861494N560746Q682433L253752m080623n694149k718305p45489j289809
12969d892938k146739k185221j439430O01000L168719L242113l73493m124381
12961h150370l786948J52624L555186L648825J026726k101729l794086l142597
12953a2592369m93887K926806N550889N779588L267164N03413O77064K535756
$$ y = [-4620407, -10504578, -10886416, -5295788, 416999, 1010973, -2743407, -5844736, -4865664, -1503139, -237796, -2471650, -4495843, -2569711, 2079959, 5945045, 8616481, 11326152, 11952682, 7190841, -571534, -4561183, -2771897, -104335, 60628, 396377, 3305697, 6015333, 5583415, 3624642, 2053483, -946325, -5956131, -7861494, -2300748, 6381685, 9635437, 5554814, -139335, -2857640, -3603129, -4892938, -7039677, -9224898, -10664328, -10063328, -6894609, -3652496, -4025989, -8150370, -11937318, -11784694, -8229508, -4580683, -3553957, -5655686, -9449772, -12592369, -13086256, -10159450, -4608561, 1171027, 4438191, 4941604, 5618668, 8154424]
12945H154424Q00950n534216r481143n444404J484595K399305j860374k311518
12937a1792381L636610Q171635N344058q10305l722798k972672j485207J64896
12929c466164K165380K633059N71239j713293k274146k143717j887558J35030
12921e980170L316549L431016o84519l723381j417552K809923L386105Q66023
12913B003994n86081o28791j723423k939695r89599L286987N015692K193284j860442
12904C771926l512099k779918j678858j335603j395763o84713J426309L360937
12896b827782K474732q06539k303010J88470L012400J794887j698623k034017
12888b199482J692348M555194K823872j511045m076414l138379l40082J563706
$$ y = [8154424, 8955374, 3421158, -6059985, -11504389, -10019794, -7620489, -9480863, -11792381, -8155771, 15864, 5359922, 4549617, 826819, -2145853, -3631060, -3466164, -1300784, 1332275, 1903514, 190221, -2083925, -4227642, -6115200, -5980170, -2663621, 767395, 82876, -3640505, -5058057, -2248134, 1137971, 2003994, 1417913, 789122, -934301, -3873996, -4863595, -1576608, 3439084, 5632368, 3771926, 259827, -2520091, -4198949, -5534552, -6930315, -7615028, -6188719, -2827782, -353050, -1159589, -3462599, -3274129, -261729, 1533158, -165465, -2199482, -507134, 4048060, 6871932, 5360887, 1284473, -1853906, -2193988, -630282]
12880f30282J007479j011822j793582k54349J343930N33532j518728j549872J014818
12871b858876L275611K900019Q16112n86763m06180K35307r4187j178766j151873
12862I50404P67983K161782L36789k727748k074647K277983L582794k039739q346669
12853e111068o650916J805314P434515N408656O36311j141677p65511j462396
12845A53228k610502j795948L77586J643872J974207K418408J929472p32229l184553
12836A73541j781781K431600M323468J959392p45453l71293Q16191r42733m457217
12827A405715n447908l255249j105720j06982K011931N227404N535196J574703
12819E839090j865465j005926M97855k230976o096421m295954J877601L951024
$$ y = [-630282, 377197, -634625, -2428207, -2682556, -1338626, -805094, -2323822, -3873694, -2858876, 416735, 3316754, 4132866, 3546103, 3139923, 3375230, 3281043, 2102277, 950404, 1718387, 3880169, 4216958, 1489210, -585437, 1692546, 5275340, 3235601, -5111068, -11761984, -9956670, -2522155, 2886501, 3522812, 2381135, 1615624, 153228, -2457274, -4253222, -3875636, -2231764, -257557, 2160851, 4090323, 3358094, 173541, -1608240, 823360, 5146828, 7106220, 6360767, 5989474, 6805665, 5862932, 1405715, -4042193, -7297442, -8403162, -8510144, -6498213, -1270809, 4264387, 5839090, 3973625, 2967699, 3465554, 1234578, -4861843, -9157797, -7280196, -3329172]
12811c329172k70187k928908R39350N065203K444314k789606k208971K686246
12803c91731K728522l698453p296334j686169P267115R910493M977805j240800
12795A0570448m027731l675134j976497o6482O17201r92099l348046l387788p00308
12786f986436J490835O36582j546298j522572R82365K646820J557440J60968J456631
12777a123665L891656L029374j795355n635470m117063R43267M186301L368636
12769B747681J014382K58422J398703K565303K039358l81032l245881m636012
12761A760924m144784l226419k946481k405581m95330J929579L233264L423302
12753b871526L530647L246069J306218j875490l875056k847012P04490M439572
$$ y = [-3329172, -3599359, -6528267, -5588917, -523714, 1920600, -869006, -3077977, -391731, 2336791, -1361662, -8657996, -10344165, -3077050, 6833443, 11811248, 10570448, 6542717, 2867583, 891086, 824604, 1441805, 449706, -2898340, -6286128, -6986436, -5495601, -4859019, -6405317, -7927889, -6945524, -4298704, -2741264, -2580296, -1123665, 2767991, 5797365, 4002010, -1633460, -5750523, -4807256, -620955, 2747681, 3762063, 4020485, 5419188, 7984491, 10023849, 9642817, 6396936, 1760924, -2383860, -5610279, -8556760, -10962341, -11457671, -9528092, -6294828, -2871526, 659121, 3905190, 5211408, 3335918, -539138, -3386150, -2681660, 1757912]
12745A757912N345364J502074n134990q584544m558533L516298P367231L684093
12737D894905k092147l470999j155079l95556k454317l346586r66480J257405
12729g728854l8467k439915j285034K901158M821402K272672o97270j70942J872548
12720d92702J254049j751197l505382l054767k429988j535269K009430P035582
12712b470244Q092637L033727l049566m696178l072690k264364k102572J44592
12704f384658L153976K600213j421224l540214q67993K919125L197967N46050
12696B03242j147930k65794J344117J467425j30967j953621k288064p63487J344538
12687b190541K712545L276381L073855J130994k401794m242178j423303L486426
$$ y = [1757912, 7103276, 8605350, 3470360, -5114184, -9672717, -6156419, 1210812, 4894905, 2802758, -668241, -1823320, -2218876, -4673193, -8019779, -8986259, -7728854, -7767321, -10207236, -11492270, -8591112, -3769710, -1497038, -2194308, -2365250, -492702, 761347, -989850, -4495232, -7549999, -9979987, -11515256, -9505826, -2470244, 5622393, 8656120, 5606554, 910376, -2162314, -4426678, -6529250, -6384658, -3230682, -630469, -2051693, -5591907, -6459900, -3540775, -342808, 203242, -944688, -1210482, 133635, 1601060, 1470093, -483528, -2771592, -3535079, -2190541, 522004, 3798385, 6872240, 8003234, 5601440, 1359262, -64041, 3422385]
12679C422385M367147l86786n338494n111216p37369L190257M592452M233535
12671H231911K529829l49760k598066k506164j415214j725330k472733m99397
12663h04924L686433N056734P84178n156731o650569k886241J592861L323367
12655a054892L364026L944454M435930K549581j673555n179858n367025k878157
12647a859496m09646L90628J51213M02174J681977K976349K797782R49654r33456
12638F147179j264724p88170j640872l748128m056112q58143K871211L057388
12630b80371M39833m01859K020380L794848J556645k629524m689992m041278k566075
12621f797393l68831L368422O395344M867373o58888m724013l839460n05963J268791
$$ y = [3422385, 7789532, 7402746, 2064252, -3046964, -3784333, -594076, 3998376, 8231911, 10761740, 10411980, 7813914, 5307750, 3892536, 2167206, -305527, -804924, 2881509, 7938243, 8722421, 3565690, -3084879, -5971120, -4378259, -1054892, 2309134, 6253588, 10689518, 13239099, 11565544, 6385686, 1018661, -1859496, -2269142, -1878514, -1727301, -1325127, 356850, 3333199, 6130981, 7080635, 6147179, 4882455, 4094285, 2453413, -1294715, -5350827, -6208970, -3337759, -280371, 159462, -242397, 1777983, 5572831, 7129476, 4499952, -190040, -4231318, -6797393, -7166224, -3797802, 2597542, 7464915, 6806027, 2082014, -1757446, -2263409, -994618]
12612i94618J162542R08723M77084q84546j829896n86063J739908K661870K086518
12603D741522J432335J50057k962332n611089l845339J368391M078160J496360
12595H48065k144049k345499q07662j471047l395035k356845J930855M892183
12587d849034L539767K48460q57378J075828L286036K869790j32065l030674m009069
12578a858339m467112n980609n962560o23311P213930R079089K718169k963572
12570b844315l07915N142063L136108m554359o259675J186757P119708L222250
12562E840622m659103o536225k448814O18433O13936J113392K832030K282242
12554c43487j250343l685575k279731P54770K225070K175083K394873K944821
$$ y = [-994618, 167924, 1076647, 1553731, 669185, -1160711, -1746774, -6866, 2655004, 4741522, 6173857, 6323914, 3361582, -2249507, -6094846, -4726455, -648295, 848065, -1295984, -3641483, -4449145, -5920192, -9315227, -11672072, -9741217, -4849034, -1309267, -1060807, -1918185, -842357, 2443679, 5313469, 5181404, 2150730, -1858339, -6325451, -12306060, -18268620, -18891931, -11678001, -2598912, 119257, -2844315, -3152230, 1989833, 5125941, 571582, -5688093, -4501336, 2618372, 5840622, 1181519, -5354706, -7803520, -7185087, -6571151, -5457759, -2625729, -343487, -1593830, -5279405, -7559136, -6804366, -4579296, -2404213, -9340, 2935481]
12546B935481K126713o73606l386370l169455j9620K527978J559430j296734k261352
12537a657535r23525k05960j024385r64942Q51852J725655K3634j862682j496909
12528e534797j4447O56754J106549K457918L822178L982336K971077M15522m179294
12519E683796p954958o182435K76287M086616J462892k196222j038705K320379
12511c542350K275895l68948j313223r72261k214791k995024O91068O376442P553768
12502E490576L461470r36725l540008n905135o556653k299894L675060M068079
12494b543230q45721k728153J409345M325405P36632m152415l524192P71481K783500
12485c767348J724694O11676q3174j585687k702937j692333N8165M22530M13749
$$ y = [2935481, 5062194, 4388588, 1002218, -2167237, -2186857, 341121, 1900551, 603817, -1657535, -2581060, -2787020, -3811405, -4776347, -3924495, -2198840, -2175206, -4037888, -5534797, -5549244, -4892490, -3785941, -1328023, 2494155, 6476491, 9447568, 9863090, 5683796, -2271162, -8453597, -8177310, -4090694, -2627802, -4824024, -5862729, -3542350, -1266455, -1635403, -2948626, -3920887, -6135678, -9130702, -8439634, -2063192, 5490576, 8952046, 8015321, 4475313, -1429822, -7986475, -10286369, -6611309, -2543230, -3388951, -6117104, -4707759, -382354, 354278, -3798137, -7322329, -6550848, -3767348, -2042654, -1430978, -1514152, -3099839, -5802776, -7495109, -7436944, -7014414, -6600665]
12476f600665J996613M106858M102022J436972k322178m981574l985288J264097
12468d983143O078967M360684k133992m313749J046855N240632L67462p930238
12460b266522q299251k20081O037138M355213p59433k880009j363889J218485
12452d178349L264905L520129Q69355l128467m902092l419501j049428O98286
12444h325162K705571M777839M652648K090756L53560J387585K509324N15534
12436A0667655l122932m158543j585694J059175M93423k364511m100085l103086
12428f214598p59493J141712K301319K641100J289780j240623j750017J557749
12420a033071M873657L024493k231519l450959J541110N664371K853579k996660
$$ y = [-6600665, -4604052, -497194, 3604828, 5041800, 2719622, -2261952, -6247240, -4983143, 1095824, 5456508, 3322516, -991233, 55622, 5296254, 5663716, -2266522, -10565773, -10785854, -4748716, -393503, -1152936, -4032945, -5396834, -4178349, -913444, 2606685, 3476040, 347573, -4554519, -7974020, -9023448, -8325162, -5619591, -841752, 3810896, 5901652, 6255212, 7642797, 10152121, 10667655, 7544723, 3386180, 1800486, 2859661, 3353084, 988573, -3111512, -6214598, -6974091, -5832379, -3531060, -889960, 399820, -840803, -2590820, -1033071, 3840586, 6865079, 4633560, 1182601, 2723711, 8388082, 11241661, 8245001]
12412H245001m415377j505150k84174k221232k408932J813460O404876O266792
12404A1895264J227850m905783q185482o636318j341775L801618N346612L431867
12396D633853M93327j629315j591073J579281N383761M062565l395343q905430
12388F31626n420832J557545J111814n971111p639170N62185Q128468N718038
12380a321437j408659l330544o27057l24161k385014p58870M500548O224591J597901
12371B167298l588140l768538k77068K593450K914250Q23081k514747m146313
12363e796727j659938K572089L620823J332992O01794K943197L423668r62451
12355F075447n105208k817029L445318N457299M77467n353944n153338P27867
$$ y = [8245001, 3829624, 2324474, 2040300, -180932, -2589864, -776404, 5628472, 11895264, 13123114, 8217331, 31849, -6604469, -7946244, -4144626, 1201986, 4633853, 5127180, 3497865, 1906792, 3486073, 8869834, 12932399, 9537056, 631626, -4789206, -3231661, -2119847, -8090958, -15730128, -15167943, -7039475, -1321437, -2730096, -6060640, -6687697, -7011858, -9396872, -10155742, -5655194, 569397, 2167298, -1420842, -5189380, -5466448, -2872998, 41252, 864333, -1650414, -5796727, -7456665, -4884576, -1263753, 69239, 671033, 3614230, 7037898, 6075447, 970239, -1846790, 1598528, 7055827, 7533294, 2179350, -2973988, -2246121]
12347b246121N803657M594063j862683o845294m875365J733714N194715K174684
12339C671370j761605m65458L346060K147853m428332q129147l749752L552529
12331e816482N752881K344315j020118j347200p75579j215025j359831L4455J518063
12322a884521J362912K47459l16575n23089j190873j318847P66662L949131M556315
12313E648574J124051l031438l821477j647545k38530q70633r22794J116046K538751
12304a04995N85270k815658l670318j770905l06220k80745O47469L197558M293625
12295b24919J797704j547595j519697J889940M562043L303953q76581m204459
12287C180389l887620p91526J370151K10140k288683k320216O44901L484828L809929
$$ y = [-2246121, 3557536, 8151599, 6288916, -556378, -5431743, -3698029, 1496686, 3671370, 1909765, 1444307, 4790367, 6938220, 2509888, -5619259, -9369011, -5816482, -63601, 2280714, 1260596, -86604, -862183, -2077208, -3437039, -3402584, -1884521, -521609, -274150, -590725, -1113814, -2304687, -3623534, -2856872, 1092259, 5648574, 6772625, 3741187, -80290, -1727835, -1966365, -2836998, -3759792, -2643746, -104995, 480275, -2335383, -6005701, -7776606, -8082826, -8363571, -7716102, -4518544, -224919, 1572785, 25190, -1494507, 395433, 4957476, 8261429, 7384848, 3180389, -707231, -1498757, -128606, 81534, -2207149, -4527365, -3882464, -397636, 3412293]
12278C412293J920987j423573n515546p508474m137347K690721O340830L971489
12270b48620N22038J177676L971410L824780L64761k775749l569213k127203J486813
12261B626693N356859M668497k041862q244358o936313n80900K733844R78472
12253a439068j061086j140777j581581k196433L73299N040833N964593J926380
12245E886160j368725o78713M84309l06848M6127K975068M063035Q21592k227097
12236I694908j593952j317931n096901q026012l873705L846130O166734J444045
12228A243316l489433l369180O54941M914138O331081L027733l004677n628693
12220F79226k051730J870590k94841m955834l510899L652367O926755J909810
$$ y = [3412293, 5333280, 3909707, -1605839, -9114313, -13251660, -10560939, -4220109, -248620, 273418, 1451094, 5422504, 9247284, 9612045, 6836296, 3267083, 1139880, 2626693, 7983552, 12652049, 10610187, 2365829, -4570484, -5151384, -2417540, -1439068, -2500154, -3640931, -5222512, -7418945, -7045646, -2004813, 3959780, 5886160, 4517435, 3838722, 4323031, 4016183, 4062310, 7037378, 11100413, 11922005, 9694908, 8100956, 6783025, 1686124, -6339888, -10213593, -6367463, -200729, 1243316, -2246117, -5615297, -4960356, -46218, 6284863, 9312596, 6307919, 679226, -1372504, 498086, 203245, -4752589, -8263488, -4611121, 2315634, 4225444]
12212D225444m434060m774550j316331m01265k497038k627102J825633P733245
12204b266024R712207N115564l264727q661630o421573N98104M820360K778539
12196B410820j313392j786820J364833L569927K164802o34753j233723M83587
12188E025281J101695j419836m434119m124572j187200M25012K04303J768635
12180b640801N530149O282624J550928k946009j372026L031794L170059p61101
12172A1845617k578741o59531M84910j124580k040905k13069J664425J276772
12164H654898j45396j322194k840564m228296l520404r37945R85352J537436K012509
12155A95396J825067o66462l351201j895053L148270O146801M326534P23180j590126
$$ y = [4225444, -208616, -4983166, -6299497, -6700762, -9197800, -11824902, -9999269, -2266024, 7446183, 12561747, 9297020, 635390, -5786183, -5188079, -367719, 2410820, 1097428, -689392, 675441, 4245368, 6410170, 5775417, 4541694, 5025281, 6126976, 4707140, 273021, -3851551, -5038751, -4613739, -4409436, -2640801, 2889348, 9171972, 10722900, 7776891, 6404865, 9436659, 12606718, 11845617, 9266876, 8607345, 9092255, 7967675, 5926770, 5713701, 7378126, 8654898, 8509502, 7187308, 4346744, 118448, -3401956, -4339901, -3354549, -1817113, 195396, 2020463, 1354001, -1997200, -3892253, -743983, 5402818, 9729352, 10452532, 8862406]
12146H862406k772989k919173j242754N31939j66842j206527J411027M802016
12138G299103J701727o688169r816116l283878M125395L939237m61307k029152
12130e213160j232060j490369j087052J893499L211148m1822j858007K988476
12122b829347P517409K299618p669634q773503K37927O251608J910433m616067
12114e671556l665579K501337N695345L530134m32919l020808l221926j263218
12106e549190Q07998O10050p52372J82395L240324M040591P94753k710686k693246
12097b029383m9807K087615J935636p25936m246513m711030j83184M666712L522041
12088B66151j793577l050951J668603M562286N60694m342593k652741K780659
$$ y = [8862406, 6089417, 3170244, 1927490, 2459429, 2292587, 1086060, 2497087, 7299103, 9000830, 2312661, -7503455, -10787333, -6661938, -2722701, -3184008, -5213160, -6445220, -7935589, -9022641, -7129142, -3917994, -3959816, -5817823, -2829347, 4688062, 6987680, -681954, -9455457, -9217530, -2965922, -1055489, -5671556, -9337135, -6835798, -1140453, 2389681, 1956762, -1064046, -4285972, -5549190, -4741192, -4131142, -4883514, -4701119, -1460795, 2579796, 3374549, 663863, -2029383, -2079190, 8425, 1944061, 1218125, -3028388, -7739418, -7922602, -3255890, 266151, -1527426, -4578377, -2909774, 1652512, 2213206, -2129387, -4782128, -2001469]
12080b001469L482621j623569n085383j954810L809650M967949k16675o058129
12072d679815n581842J435285P401605N720617p98379m153900k394048o45897
12064c696374j130112J4246L843210M866172N35498l234023j764724M12245j695413
12055a849275l705159M21489O499277O174884Q87719j133374P22956k44388m161363
12046C612766l465857K588685M517605j984179q024249n054590K508964N297413
12038c442K440035m84810j313394j500375o14445K090429L589648J138822k109366
12029C233102j592585J094118J297275m14234K07721K876551L092327J55394j788500
12020H161169r29814J14718q5011L2855M09675j216881m037201l990052n03874
$$ y = [-2001469, 1481152, -142417, -5227800, -7182610, -3372960, 1594989, 1378314, -4679815, -10261657, -8826372, -1424767, 4295850, 3497471, -656429, -3050477, -3696374, -4826486, -4812240, -969030, 3897142, 4432640, 1198617, -566107, -153862, -1849275, -5554434, -5132945, 1366332, 7541216, 8428935, 7295561, 8018517, 7774129, 3612766, 146909, 2735594, 7253199, 5269020, -2755229, -7809819, -5300855, -3442, 2436593, 1951783, 638389, -861986, -1476431, 613998, 4203646, 5342468, 3233102, 1640517, 2734635, 4031910, 3617676, 3825397, 6701948, 9794275, 9949669, 8161169, 7231355, 7346073, 7261062, 7293917, 7703592, 6486711, 2449510, -1540542, -2044416]
12011b044416K074158J648719J316487K754865K589719j143460m440957l626873
12003h71758j350566j375702j849562M60610L023747J409070k213589j719299
11995d487049K822618M910299J944590j078098P3551K915087L355244J717680
11987A2173922M68605j19633q48150j232508j035728j403673k195838j259166
11979D547831J352673K025457o70039k696435p59642J938002R14787j907107j525307
11970C220220J493870K142935n28889k723473l165646m007323m283182l12799
11962h164287N757854O057909r92008o651670m545865K70477J032419M62546L840905
11953b931720P271343L514128m323005o354566j588223J453753j93982j25817
$$ y = [-2044416, 29742, 1678461, 2994948, 5749813, 8339532, 7196072, 2755115, -871758, -2222324, -3598026, -5447588, -4986978, -1963231, -554161, -2767750, -4487049, -1664431, 3245868, 5190458, 4112360, 4185911, 7100998, 10456242, 12173922, 12642527, 12522894, 11674744, 10442236, 9406508, 8002835, 5806997, 4547831, 5900504, 7925961, 7255922, 4559487, 3799845, 5737847, 6652634, 4745527, 3220220, 4714090, 6857025, 6328136, 3604663, 439017, -3568306, -7851488, -8164287, -2406433, 3651476, 2659468, -3992202, -8538067, -8267590, -7235171, -6772625, -2931720, 4339623, 7853751, 3530746, -2823820, -4412043, -2958290, -3152272, -3278089]
11945c278089M100211N691546J129715k938174j390762O29324k030256m588736
11937b675221j414045K809194J079238l025967j402583M189661N122510L48756
11929E031543l313023l410906l221809k223363K950411Q204839N148425l939275
11921E226842o957283q15155L499049m20462l800874J483160Q469185O932515
11913A3616977J68871j825255R83897J073518k233118l053987j106219j737901
11905E886783m523213l013132L120697N830139J037196n294596o519327l594473
11897g069926p17288J159786K719082K959149J226011n94957p16699k289k05074
11888a242205j681854l615288m512415k641938J642156M813905M283384K261664
$$ y = [-3278089, 822122, 6513668, 7643383, 4705209, 3314447, 3943771, 1913515, -2675221, -4089266, -1280072, -200834, -3226801, -4629384, -439723, 4682787, 5031543, 1718520, -1692386, -4914195, -7137558, -4187147, 4017692, 9166117, 5226842, -1730441, -2545596, 953453, 532991, -3267883, -1784723, 6684462, 13616977, 13785848, 11960593, 12944490, 14018008, 11784890, 8730903, 7624684, 5886783, 1363570, -1649562, 1471135, 7301274, 8338470, 3043874, -3475453, -7069926, -7787214, -6627428, -3908346, -949197, 276814, -318143, -1034842, -1037131, -1242205, -2924059, -6539347, -11051762, -13693700, -12051544, -7237639, -2954255, -692591]
11880f92591K011447K143988n09990m004274l398281P53545K625775L93083j332055
11871b009353K12738J734564M47245j141717l32129Q73545l80179k926973l843247
11862g365506k497146J67659L392303N680767N195113K600261L91394j248584
11854F316261l820838n500831k510297L267128M698906Q4985l357255n71044L492064
11845B099079K419879j359041j583688J157052J294308j849849l336607q32523
11837a991390K452677K994631P45719k022306k574772L31725L865303L132421
11829F934008j462237k953642J918445N982729J574359o811753q124997j072856
11821d015944M177635J035544n255361o760123l071590J255579L929937N202017
$$ y = [-692591, 1318856, 3462844, 2952854, -1051420, -4449701, -3696156, -1070381, -677298, -2009353, -1796615, -62051, 385194, -756523, -1088652, -215107, -595286, -3522259, -7365506, -9862652, -9694993, -6302690, -621923, 4573190, 7173451, 7564845, 6316261, 2495423, -3005408, -5515705, -2248577, 2450329, 2535314, -821941, -1392985, 2099079, 4518958, 3159917, 1576229, 2733281, 4027589, 2177740, -1158867, -1991390, 461287, 3455918, 4201637, 2179331, -395441, -63716, 3801587, 6934008, 5471771, 2518129, 4436574, 10419303, 11993662, 5181909, -2943088, -4015944, 161691, 1197235, -4058126, -10818249, -13889839, -12634260, -8704323, -3502306]
11813c502306M524221J304192k470865l510657r87380K320241K722551m38858
11805c8861l453288k277470J565439K134469j968294l970109J358344Q231531
11797A581761O940393j565582o318899k037100L945418L238343k255961n201839
11789a673466l710605j693455j374264j033444N68463J831898J018812j023174
11781g089235j629937P28163M184377M594680K59648m880345m981124O44960O547379
11772a621434P565743L865113p88246l102245j960066J237558K961434O95679
11764H853536l502539m999864k705674l43904q39197k634079k943703j576973
11756a0692397K65408K232201L904728M037629K578864J277590P39230o57523
$$ y = [-3502306, 1021915, 2326107, -144758, -3655415, -4642795, -2322554, 399997, -38861, -3492149, -5769619, -4204180, -2069711, -4038005, -8008114, -6649770, 1581761, 8522154, 6956572, 637673, -1399427, 2545991, 5784334, 3528373, -1673466, -5384071, -7077526, -8451790, -9485234, -8916771, -7084873, -6066061, -7089235, -8719172, -7991009, -3806632, 788048, 1047696, -3832649, -8813773, -8168813, -1621434, 5944309, 9809422, 9021176, 5918931, 3958865, 5196423, 8157857, 8853536, 5350997, 351133, -2354541, -2698445, -3537642, -6171721, -9115424, -10692397, -10426989, -8194788, -4290060, -252431, 2326433, 3604023, 4343253, 3685730]
11748C685730l282194m515835k684201n5935O99934O41541K119139M183574L863959
11739D655712R93592j419497j321136L39937J403693L80034k855842o239642o111792
11730a0174941j025982N262866O965177K722912k988615n296033l866512j570355
11722i971483k4620J525878L336880L543613Q90678k174206j667530K369229N062451
11713B890890K931242j385587k959200j160550P50249J256159J885596L133405
11705G342204L027361O02074k294368l573997k863751o48928J927616K611646
11697F129857M77381j642008q74061L84758k051602n882689m257659L001677P676496
11688B962150N390345J696334J463813L99046n647852j0118251m476409O724706
$$ y = [3685730, 403536, -4112299, -6796500, -6852435, -6152501, -5510960, -3391821, 791753, 4655712, 5649304, 4229807, 2908671, 3248608, 4652301, 5032335, 2176493, -4063149, -10174941, -11200923, -5938057, 1027120, 3750032, 761417, -4534616, -8401128, -9971483, -9996103, -8470225, -5133345, -1589732, -699054, -2873260, -4540790, -2171561, 2890890, 5822132, 4436545, 1477345, 316795, 1067044, 2323203, 4208799, 7342204, 10369565, 10971639, 8677271, 5103274, 2239523, 1590595, 3518211, 6129857, 6607238, 4965230, 4091169, 4475927, 2424325, -3458364, -7716023, -4714346, 2962150, 8352495, 10048829, 11512642, 11911688, 6263836, -3854415, -8330824, -1606118]
11680a606118J0344221K985433n281297o056805k005670R67673K220308L253487
11672D821232L045325R39931q40327j230818k327070m286222l311382J508952
11664a680379M452680J236095l364409j848265M759167Q122381M044559k812660
11656A2909169n892567l959281l88885J478020R32342m77917j157183j522439
11648A921259k759573l361622j07208N669947O868853j25744q241188p568053
11640g703329J317630Q274310P347943K723239j2793j337360l493416m987791
11632B128433l829275j713331p10112K53406J647834O22822l127479l629137K701738
11623e655101Q873926O046677k413278n219317m69068K139181k111419n532333
$$ y = [-1606118, 8738103, 11723536, 6442239, 385434, -1620236, -652563, 1567745, 4821232, 7866557, 8806488, 7966161, 6735343, 4408273, 122051, -3189331, -1680379, 2772301, 4008396, 643987, -1204278, 3554889, 11677270, 15721829, 12909169, 7016602, 3057321, 2668436, 4146456, 5078798, 4600881, 3443698, 1921259, -838314, -4199936, -4307144, 1362803, 8231656, 8105912, -135276, -7703329, -6385699, 1888611, 9236554, 11959793, 11947000, 10609640, 7116224, 2128433, -1700842, -3414173, -4124285, -3870879, -2223045, -1600223, -4727702, -8356839, -5655101, 3218825, 9265502, 6852224, 1632907, 1163839, 3303020, 1191601, -4340732]
11615d340732j990252K226118n26144n564617l479279L732541N341766r67307
11607e567906n413061j148140N952868O356901l34134o067790m621472K256290
11599h586444P718414P068580K396957m01892M60381N10605l209610o302541l625807
11590c971357J796660L005423j21542j918786j362000k641795n206067l054145
11582a3473609L644814O092260O34420m132066n64417N661221M670575k188738
11574C44460n456761k370719J028179J117588R19957K497068K973672M16311k136390
11565f66635j307905J745951L442871K407346M51862J77771K002264L058671L54118
11556A1666314m147237m433407J325730O700512M874063k030999o012924l849500
$$ y = [-4340732, -6330984, -4104866, -4631010, -10195627, -13674906, -9942365, -4600599, -5567906, -10980967, -12129107, -6176239, 180662, -153472, -6221262, -10842734, -8586444, -868030, 6200550, 8597507, 8195615, 8655996, 9166601, 5956991, -345550, -3971357, -2174697, 830726, 709184, -1209602, -2571602, -5213397, -10419464, -13473609, -9828795, -3736535, -3102115, -7234181, -7798598, -2137377, 2533198, 344460, -5112301, -7483020, -6454841, -5337253, -4417296, -1920228, 1053444, 1469755, -666635, -1974540, -228589, 3214282, 5621628, 6073490, 6251261, 8253525, 11312196, 11666314, 7519077, 3085670, 4411400, 11111912, 15985975, 13954976, 7942052, 4092552]
11548D092552N9519P81313j571260l468365k100363J973839M513910J574738m503250
11539A352633o381297j684141K748491P81157l817131m181133j519630j301175
11531a4002226k041142K045610Q772346R107137J378320n670842o043069l232463
11523i686329j135617K066108O638258P102171J369683l471460j176124L954578
11515E661268M143641j94921k856047k035382j161559j929026k628317k122038
11507c122381q28257R75131K383157J436008j474623k436465O28960M361861M715962
11498F639353K043254j382165m842779o981360m883623O13383L557284J304779
11490c931874r62713P47137J883087j994844n312060o48824P569150Q377050J185615
$$ y = [4092552, 4152071, 4933384, 3362124, -106241, -2206604, -232765, 4281145, 5855883, 1352633, -5028664, -6712805, -3964314, -3183157, -7000288, -11181421, -12701051, -14002226, -16043368, -13997758, -5225412, 3881725, 5260045, -410797, -6453866, -9686329, -10821946, -8755838, -2117580, 4984591, 6354274, 2882814, 1706690, 5661268, 9804909, 9609988, 6753941, 4718559, 3557000, 1627974, -1000343, -3122381, -3950638, -2975507, -592350, 843658, -630965, -3067430, -2438470, 1923391, 6639353, 8682607, 7300442, 2457663, -4523697, -9407320, -8793937, -5236653, -3931874, -4894587, -4147450, -2264363, -4259207, -9571267, -10220091, -2650941, 5726109, 6911724]
11481F911724l706748j449249J444602n30580l730120l415957j434276j008247
11473f918851o25772J746511L581842J970220r39628j164949J197777K941359
11465A788509K445889M98417j743361l336861l575948k816788j953845q87415
11457i581403N35560P32599j361975l046569r72358K953419L657924R07693l17140
11448f492250J784058L075824R88934j116318J3273K310241K533592J156008j42262
11439D111100j654464l079267j943224J852498L774501P63022l706161m338070
11431d220065q93429K922002M497299L148561j003866n774089p342577m781586
11423a3447750j304996J025756L762100O879343O409277J112295l619834l325073
$$ y = [6911724, 3204976, 1755727, 3200329, 2669749, -1060371, -4476328, -5910604, -6918851, -7544623, -5798112, -2216270, -246050, -1185678, -2350627, -1152850, 1788509, 4234398, 4732815, 2989454, -347407, -3923355, -6740143, -8693988, -9581403, -9045843, -8313244, -9675219, -12721788, -13694146, -10740727, -7082803, -6175110, -6492250, -4708192, -1632368, -643434, -1759752, -1746479, 563762, 3097354, 4253362, 4111100, 2456636, -622631, -2565855, -713357, 3061144, 3824166, 118005, -4220065, -5113494, -2191492, 2305807, 5454368, 4450502, -1323587, -8666164, -13447750, -14752746, -13726990, -9964890, -3085547, 3323730, 4436025, 816191, -2508882]
11415b508882j165416j716848k808899l7090M493085N114420J662241j250683
11407A781928j927758k059067j549973N77795K025153M38271j318580K28289J998929
11398A94987m55368l511526p31613M496768K810906m859817p212917r44558L476818
11389f736320o33814m914643j05822Q557001R880748L463098k214116l440824
11381C855308l074727k009331J328522M417492K596457k503625m308300j477641
11373a175845N30166r86007j953960P15815L563033K216140j802111l563246j389733
11364c845748J961264L240038J733591p50837j776035p54647L68091k09919j573772
11355a607974j886318j651403k478490l341998j575215K290975M407813L262472
$$ y = [-2508882, -3674298, -5391146, -8200045, -8237135, -3744050, 1370370, 3032611, 1781928, -145830, -2204897, -3754870, -3177075, -1151922, -713651, -2032231, -1803942, 194987, -260381, -3771907, -4503520, -6752, 2804154, -2055663, -9268580, -10213138, -6736320, -7370134, -12284777, -12390599, -3833598, 6047150, 9510248, 7296132, 3855308, 780581, -1228750, 99772, 4517264, 7113721, 4610096, 301796, -1175845, -645679, -1631686, -3585646, -2869831, 693202, 2909342, 1107231, -2456015, -3845748, -1884484, 1355554, 3089145, 2338308, 562273, -192374, 175717, -34202, -1607974, -3494292, -5145695, -7624185, -10966183, -12541398, -10250423, -5842610, -2580138]
11347b580138J766309K002448J597402j686125m738806k771613L024461N964990
11339B578928K593341k829637m224165j133913K218004L203521K828377K339844
11331G574300J364338n1594o68765n37179j458193l383400l263658J32022L055953
11322B763824J718571j973372l528827k644038k074449j397903J992954O005298
11314H62058M933017r68580l871380L12880N208300L357152k795246n235025k126610
11305c23434J219598J275863q640j54298L90208L76530k94858j167477j310864
11296B628M74976L173949L085296r88040m343465k429434J830261K118197j373771
11287A550597k529843M50600K433254M72915j303617P55321L225672J230343l462270
$$ y = [-2580138, -813829, 1188619, 2786021, 1099896, -3638910, -6410523, -3386062, 2578928, 5172269, 2342632, -1881533, -3015446, -797442, 2406079, 5234456, 7574300, 8938638, 8887044, 8218279, 7681100, 6222907, 2839507, -424151, -292129, 2763824, 4482395, 2509023, -1019804, -3663842, -5738291, -7136194, -5143240, 862058, 5795075, 4826495, 955115, 1267995, 6476295, 9833447, 7038201, 1803176, -323434, 896164, 2172027, 2163387, 2009089, 2399297, 2775827, 2480969, 1313492, 2628, 477604, 3651553, 6736849, 5748809, 1405344, -1024090, 806171, 2924368, 1550597, -979246, -528646, 1904608, 2377523, 1073906, 1829227, 5054899, 6285242, 2822972]
11278B822972n084519k171455J552815L191321L143607K150169J49884j428255
11270D326539n9856L615205M948275J203061l675003l588523J021890L128208
11262A0919796q77926n415878l797110J325370J815391l058085n493861k140719
11254f723022N16149k005251l544929K032108Q682789O852239m39380k014909
11246C355794K960954L746798l519589q881598m583883L064759M536204R08221
11238A587660q47658M32886J130298O52978P23512M61730j350836k434827j134086
11229g78343n06524k590650l175801J049455M934042K501141k186698j279854
11221b033232L075566K165117l620340m608942J535028N123455L33129n191030
$$ y = [2822972, -2261547, -4433002, -2880187, 311134, 3454741, 5604910, 5754794, 4326539, 4266683, 7881888, 12830163, 14033224, 10358221, 6769698, 7791588, 10919796, 10041870, 4625992, 828882, 2154252, 3969643, 911558, -4582303, -6723022, -6206873, -8212124, -11757053, -9724945, -1042156, 5810083, 5370703, 3355794, 6316748, 10063546, 6543957, -2337641, -6921524, -3856765, 679439, 1587660, 740002, 1172888, 2303186, 2956164, 3679676, 4141406, 2790570, 355743, -778343, -1284867, -3875517, -7051318, -6001863, -1067821, 1433320, -753378, -2033232, 1042334, 3207451, -412889, -5021831, -3486803, 1636652, 1969781, -3221249]
11213c221249k976316L014118L748694o88548k912970m00331K443849K731010
11205A738257K334322K690627K201837j66277k809323l994635l536520j566745
11197c108457J626754M097227L238101o51142l696633k695826R40922K756860
11189B507806N45065l078132m021551j707269R09828J901838K240700K482638
11181A780923J163186j345627j289883K418100M505730J043591k914651q07145
11173D554224L362167L87689p635260q217095J597758Q776989L924702m357295
11165B393879m020864J618453J753231k745541k301409L169037L930761k075283
11157A722264n518581j761647K130609O77742j144896J828857N519975M354299
$$ y = [-3221249, -6197565, -3183447, 565247, -123301, -3036271, -3436602, -992753, 1738257, 4072579, 6763206, 8965043, 8798766, 5989443, 1994808, -1541712, -3108457, -1481703, 2615524, 5853625, 5202483, 1505850, -1189976, -249054, 2507806, 3052871, -25261, -4046812, -5754081, -4844253, -2942415, -701715, 1780923, 2944109, 1598482, 308599, 2726699, 7232429, 8276020, 5361369, 4554224, 7916391, 8304080, 668820, -7548275, -5950517, 2826472, 6751174, 2393879, -1626985, -8532, 1744699, -1000842, -3302251, -133214, 3797547, 1722264, -3796317, -5557964, -3427355, -2749613, -3894509, -2065652, 3454323, 7808622]
11149G808622O83164o67773q92012l062480m797069k450257J337895J452687j165435
11140a752658j471180J211756K862516J716380M7436m96681q49890j937728l264384
11131c934433l687989j941016J883280M364297J806039l365502m243645L25881
11123h793088L421223J346643k78863K866316N293220J720936k267625J03632
11115C412394L490436n83873p056514m620888L731504M436378k883579l875644
11107c949786N045232Q681182j630562j2304173q814393K155448N921989K844067
11099b050996K202623K747997k746627r562808o265538M469348Q169497K023009
11091a013495j367769L545974O222547l57133o777578l422564L263634K464237
$$ y = [7808622, 8491786, 7824013, 6932001, 3869521, -927548, -3377805, -2039910, -587223, -1752658, -3223838, -2012082, 850434, 2566814, 2614250, 2117569, 1267679, -670049, -3934433, -7622422, -9563438, -7680158, -3315861, -1509822, -4875324, -9118969, -8793088, -5371865, -4025222, -4304085, -1437769, 3855451, 5576387, 3308762, 3412394, 6902830, 6318957, -737557, -5358445, -1626941, 2809437, -74142, -3949786, 1095446, 9776628, 8146066, -4158107, -12972500, -10817052, -4895063, -2050996, 151627, 2899624, 152997, -9409811, -15675349, -11206001, -3036504, -1013495, -2381264, 1164710, 7387257, 7030124, 252546, -3170018, 93616, 2557853]
11083B557853k715980j696929M945839O713656O34355m940534m464061k286771
11075a252572l044425m105119j994427O76980K14267j032167J512563O401275
11067b623625P670086L833792o8124k70894O32958j276836m884778o212347m582609
11058g782377k509822n93994K850166O785809O890281K066247k478927j864521
11050C362862J648158K189815j308462m312571l483333l55340J929703K162609
11042A833441O29932j942249l804612k829081P11806L457275K586714n70633j943599
11033a871006K26330K892026J804419k743066n658653l568165N17781J585940
11025f814394r4220j06672K401673L256819M13745k577335k378785l98833J079240
$$ y = [2557853, -158127, -1855056, 3090783, 9804439, 10438794, 5498260, 1034199, -1252572, -4296997, -8402116, -10396543, -9719563, -9505296, -10537463, -9024900, -2623625, 5046461, 8880253, 8812129, 8541235, 9174193, 7897357, 3012579, -3199768, -7782377, -10292199, -10886193, -8036027, -1250218, 5640063, 7706310, 5227383, 3362862, 5011020, 7200835, 5892373, 1579802, -1903531, -2258871, -329168, 1833441, 2463373, 521124, -3283488, -6112569, -5400763, -1943488, 643226, 72593, -1871006, -1644676, 1247350, 3051769, 308703, -5349950, -8918115, -8400334, -6814394, -6908614, -7015286, -4613613, -1356794, -943049, -3520384, -5899169, -6298002, -5218762]
11016e218762K533817L836201K273215j976190l385260P56970M403897J213182
11008D437070n006591n522465L50759N033544M050957N03897j290265l47492K323057
10999D532471M097440J090381o183743r789159l945866M856601N865214K22414
10991G45753j255119L905872N957529k88003o556607m677608Q38778J317734k429585
10982b441256l248203L72889L332153K506032l1888j345825q25399K83576N1639
10973a346282k267707m494882l809741j018609O35173O01668O75958K54931k272024
10964a3041515l936988k83161N696155O064998O09878k218268P29660K545248
10956c833993p16556k941686K97086L174405K68614l512340k015113J660070K530097
$$ y = [-5218762, -2684945, 1151256, 3424471, 1448281, -1936979, -1180009, 3223888, 4437070, -569521, -6091986, -5741227, -707683, 3343274, 3847171, 2556906, 2209414, 4532471, 8629911, 9720292, 3536549, -6252610, -10198476, -5341875, 523339, 745753, -509366, 3396506, 9354035, 9066032, 2509425, -2168183, -1329405, -11671, -2441256, -5689459, -5316570, -1984417, 521615, 489727, -856098, -1681497, -1397921, -1346282, -3613989, -8108871, -11918612, -12937221, -12302048, -11700380, -11024422, -10769491, -13041515, -16978503, -17261664, -11565509, -5500511, -4890633, -7108901, -6379241, -3833993, -4550549, -7492235, -7195149, -4020744, -3752130, -7264470, -9279583, -7619513, -5089416]
10947e089416L204815O350505O154497j356493p292467k332378O231172M520279
10939A0390514n385828q804748k268213K571081k31796k480645J598725N037120
10931D26210J211743m553696m448175k90683J625223R41408J134529K130706J592328
10922b30407n5612j055892j652785k080876o46703K648355M129612J617838j739148
10913I34382k151393n48252K7160n61191n15634K35955M85681J62830r8115l13992
10903b342569m48731j04634k9901j603652l664947k676447K156839O488040N793040
10894C567038R86644k929387k619692P80827L716331L746626J388191r10625j538075
10885F187878j025848m82886r3029M6266p19762k150293k705329j806163n49118
$$ y = [-5089416, -1884601, 4465904, 10620401, 9263908, 1971441, -360937, 5870235, 10390514, 5004686, -3800062, -6068275, -3497194, -3728990, -6209635, -4610910, 426210, 1637953, -2915743, -7363918, -7654601, -6029378, -5087970, -3953441, -1822735, -230407, -286019, -1341911, -2994696, -5075572, -5722275, -3073920, 1055692, 2673530, 934382, -1217011, -1765263, -1738103, -2299294, -2814928, -2578973, -2093292, -1930462, -2028577, -2342569, -2791300, -2895934, -2925835, -4529487, -8194434, -10870881, -8714042, -2226002, 3567038, 4553682, 1624295, -995397, -214570, 3501761, 7248387, 8636578, 7725953, 6187878, 5162030, 4679144, 4586115, 4632381, 3912619, 1762326, -943003, -2749166, -3298284]
10876c298284O83796K424944L130610L63452l485138k447999L067506M517608
10868D956495j554755o124528j302540N819449L671875m824309o790062k49277
10860f397652L652702l37867m416340k618663L45076K87119J438530O278373Q212437
10851F443715K658223l616986l126045K05496r26596l940687k008728K179336
10843b132272M14399n593652n160934M031431J0817915O664575k109201m156921
10835B775340J019285M119198J53525n493886n658914p18418L458007L792484
10827C446621K378044J470010K95192j883823l121917j944895n45255j407767
10819a313790k650494p88545K929344L502054l29506l859431k941590O53342K177523
$$ y = [-3298284, -2614488, -189544, 2941066, 3304518, -180620, -2628619, 438887, 4956495, 3401740, -2722788, -4025328, 1794121, 5465996, 641687, -6148375, -6397652, -2744950, -3082817, -7499157, -10117820, -9772744, -9485625, -8047095, -1768722, 6443715, 9101938, 5484952, 2358907, 2564403, 1637807, -2302880, -4311608, -2132272, -1717873, -7311525, -12472459, -8441028, 2376887, 9041462, 6932261, 2775340, 3794625, 7913823, 8067348, 2573462, -3085452, -3803870, -345863, 3446621, 5824665, 7294675, 7589867, 5706044, 2584127, 639232, 93977, -1313790, -3964284, -4752829, -1823485, 1678569, 1349063, -2510368, -5451958, -4798616, -2621093]
10810b621093k0677l086300l390341o95389J610773R45031n85825P51926L795022
10801c296873L600092j2813j140197K212091L817070k63631m255839k720062n25460
10792b585622l368362n404641J283545J0207248Q297491k275933o185242O75212
10784F43696N408797K52799n689512l539245J156521M32460k136119O8424L924040
10775E21861K963801q42020j631562P9720O64107J269270L821462M508288k8888
10766A1326039m671574k634962L509418N714937K088818k722874n501401n792280
10758A316121k596429L286794O536960L436017k061194m030807k797229j848303
10750A241930r45859J243609K003916q88655l414642j267724K244709J636412
$$ y = [-2621093, -2641770, -5728070, -9118411, -9813800, -8203027, -7257996, -7843821, -7091895, -3296873, 303219, 290406, -849791, 1362300, 5179370, 4915739, 659900, -2060162, -2585622, -5953984, -11358625, -10075080, 132168, 8429659, 6153726, -31516, 643696, 6052493, 6305292, 615780, -2923465, -1766944, -1334484, -3470603, -3402179, 521861, 3485662, 2643642, 1012080, 1091800, 1755907, 3025177, 6846639, 11354927, 11326039, 6654465, 4019503, 7528921, 13243858, 15332676, 12609802, 7108401, 1316121, -1280308, 2006486, 8543446, 11979463, 9918269, 5887462, 3090233, 1241930, 296071, 1539680, 3543596, 2654941, -759701, -2027425, 217284, 1853696]
10742A853696j187712p41031J932558J355278k446411m237489k335069K30454
10734e575726J855003K931944K108056j374840l592771q24661L614000L968738
10726C109743R23576r31930j501252l352196m284840l04926N731747O919119K659925
10717H968966j597770l518852m712324m068271P90654O199383N614314N5711l116364
10708D615447j760679o77745j840704k012043o93828j242209k867280p23862M302247
10699b900656N181237N82292k019716J535042N497787L934138o77611l139343
10691G993170l100292k456883j121732N30044M23665o38534J163880N250716N515991
10682A3560025Q8654m632757l972425k016435l370958m776120j757611K207176
$$ y = [1853696, 665984, -75047, 1857511, 3212789, 766378, -3471111, -5806180, -5575726, -3720723, -788779, 1319277, -55563, -3648334, -4472995, -858995, 3109743, 4033319, 3101389, 1600137, -1752059, -6036899, -6341825, -610078, 6309041, 8968966, 7371196, 3852344, -859980, -4928251, -4137597, 2061786, 7676100, 7731811, 4615447, 2854768, 2177023, 336319, -1675724, -2369552, -3611761, -6479041, -7202903, -2900656, 2280581, 2862873, 843157, 2378199, 7875986, 11810124, 11132513, 7993170, 4892878, 2435995, 1314263, 1844307, 2267972, 1629438, 2793318, 8044034, 13560025, 13648679, 9015922, 5043497, 3027062, -343896, -5120016, -6877627, -4670451]
10674d670451J172222k766378k802153J193351K892703L13726j411642J073340
10666e005282M331286L985675N22622k937047m673294m111230j041914K594959
10658f334225L136203K2883k225683J90600M538467N100138J350759j714825j512281
10649B552036j265003l543451n134547k380354J879999K127248r71807j565470
10641h301349J861794M205270K134110j108904j615668l06524N14895J526502
10633a089874L641308M493764J564892l427459o264932m773593j23252M280868
10625a698278M649889O38089k675535p57405L033239K015498k406946k258296
10617E40255L028525M307430j836468n939649o43761O723634N399761k575672
$$ y = [-4670451, -3498229, -6264607, -9066760, -7873409, -4980706, -4666980, -6078622, -5005282, -673996, 3311679, 3834301, 897254, -3776040, -7887270, -8929184, -6334225, -3198022, -3175139, -5400822, -5210222, -671755, 4428383, 5779142, 4064317, 2552036, 1287033, -2256418, -7390965, -9771319, -7891320, -5764072, -6735879, -8301349, -6439555, -2234285, -100175, -1209079, -2824747, -3131271, -2616376, -1089874, 2551434, 7045198, 8610090, 5182631, -1082301, -5855894, -5979146, -1698278, 2951611, 3589700, 914165, 156760, 3189999, 5205497, 2798551, 540255, 3568780, 7876210, 6039742, 100093, -543668, 6179966, 11579727, 9004055]
10609I004055p108246n308566k224389n48900J038941K218854J889401J963796
10601I24946L419249K345922l154823o871464l094793L466852M799226J793908
10593C629023L12011l6799k949354n482036k194485L610257L839337j113417l623483
10584d008946j749700m28792j016372n2685K179668J799928l86656n4849J961611
10575a756793J371281l33589J957169O348706N397101j746784p743712p783324
10567d289945l843265J029630M793876M244454j147405n081049k017181L812699
10559b498186M997147K463055J307213J05565m681531q283544l903998M134627
10551f359652N958153J716439o93577J5155p44574j961869K59418K071013k118267
$$ y = [9004055, 1895809, -3412757, -5637146, -6186046, -5147105, -2928251, -1038850, 924946, 4344195, 6690117, 3535294, -3336170, -6430963, -2964111, 1835115, 3629023, 3941034, 3904235, 954881, -4527155, -6721640, -3111383, 727954, -385463, -4008946, -5758646, -6187438, -7203810, -7256495, -5076827, -3276899, -3663555, -3718404, -1756793, -385512, -719101, 1238068, 7586774, 12983875, 11237091, 3493379, -4289945, -8133210, -7103580, -2309704, 1934750, 787345, -4293704, -6310885, -2498186, 2498961, 4962016, 6269229, 6374794, 1693263, -6590281, -10494279, -6359652, -401499, 1314940, 621363, 636518, -108056, -2069925, -1810507, 260506, -1857761]
10542a857761o698474k542089O018025P216404J354738j594042l39960j599546
10534d2705m390414k210408K082792P33344l103549j368956J958250j443796n699258
10525a3484700o32960O561682K816802m632900K33207J0999274Q361040m165433
10517F056012n831928L441761M510727l555482l150661N276305L854022n041741
10509E559015j645715R555587M434285j2149265j0118683Q717610R970215q884493
10501E438556j1260262Q678473J2272137q915860j3504076Q987136J3065335j2681431
10493B080008j3968674K3245536K8997660j8136073j5468832R8952137J94164718
10486B99866480J05918460j01833561j99476336j07355363J5423779K4665819
$$ y = [-1857761, -8556235, -11098324, -5080299, 2136105, 3490843, 1896801, 1556841, -42705, -4433119, -6643527, -4560735, -3827391, -6930940, -8299896, -6341646, -7785442, -13484700, -14117660, -7555978, -4739176, -9372076, -9138869, 1860405, 10221445, 6056012, 224084, 3665845, 8176572, 4621090, 1470429, 6746734, 10600756, 5559015, 3913300, 13468887, 17903172, 5753907, -4364776, 4352834, 14323049, 5438556, -5821706, 2856767, 15128904, 6213044, -7291032, 1696104, 14761439, 2080008, -11888666, 11356870, 40354530, 22218457, 6749625, 105701762, 299866480, 405784940, 303951379, 104475043, -2880320, 12543459, 37209278]
10480C7209278k6521035k6351415J3492388J7104546j1188160j3544803Q169095
10473a630106P507938j2964043j1758615R568365J2166010n834270r468984O433599
10465e980106J2026372K04880n024026K904471M954628k460466k330553N643926
10457I939126L197199q907693r396489M165040J0031616P51500o035182r62337
10449B782780L330457j179998m753982r68395K568426J283437Q08323K269917
10441F140965l87563n295667l657064K381078J873750l958741k887371N057783
10433g32830O434741j113980m489940P75373L142387k468738n181315J119751
10425b514551O326571K666029j954422N51372M094216O22566n142603m346328
$$ y = [37209278, 10688243, -15663172, -2170784, 14933762, 3745602, -9799201, -1630106, 5877832, -7086211, -18844826, -9276461, 2889549, -2944721, -12413705, -5980106, 6046266, 6251146, 1227120, 4131591, 9086219, 6625753, 4295200, 9939126, 13136325, 4228632, -5167857, -1002817, 9028799, 9780299, 3745117, 2782780, 6113237, 4933239, 179257, -789138, 1779288, 3062725, 3871048, 6140965, 5753402, 457735, -3199329, -818251, 1055499, -2903242, -5790613, -732830, 5701911, 4587931, 97991, 873364, 4015751, 1547013, -3634302, -2514551, 3812020, 6478049, 4523627, 5074999, 9169215, 9791781, 4649178, 302850]
10417C02850J482530M555375K833361l65964l301708n364133m201487P60964N185414
10408A887202M593577q2159m154182m101969q196M348640M161188q59679n023031
10399G61391l748158M93249K772139K431780J007264j757725m583866k920370
10391e544296L135850N351604o60893o628766l849928K650829L183083P2068K010379
10382b80070O681594M107495m745984p888273j397401N181730M465229M4298k689721
10373C478897l526839k798535L12544K760081J65442m339631l159672K988740
10365d118973N333683J343441j642937P07999L420409K072869k79491n5574O67181
10356G448607j120511m305566o063034m758543O3414N852999O729681R82897l833356
$$ y = [302850, 1785380, 6340755, 9174116, 8808152, 5506444, 142311, -4059176, -3298212, 1887202, 6480779, 6398620, 2244438, -1857531, -1865727, 2482913, 6644101, 5784422, 761391, -2986767, -2493518, 278621, 2710401, 3717665, 1959940, -2623926, -5544296, -2408446, 2943158, 2282265, -4346501, -8196429, -5545600, -2362517, -2290449, -280070, 6401524, 10509019, 5763035, -2125238, -3522639, 1659091, 6124320, 6168618, 3478897, -47942, -2846477, -2533933, 226148, 391590, -3948041, -7107713, -4118973, 1214710, 2558151, 915214, 1623213, 5043622, 7116491, 6837000, 6781426, 7448607, 6328096, 2022530, -4040504, -8799047, -8735633, -2882634, 3847047, 4829944, 996588]
10347I96588r25340M060681J182059p023893q807121j849261M176512L985988
10339d203787K644322L433622K590361p15693j158910K127569K785747j080364
10331F422867l189646q62566L16475k259987l244730k84557Q87677k385626l988142
10322h588235l49945K679072N52987k056280n78385J531864P76373K99257J839989
10313c893303M61642n228411p121033m79771O197192L855343k559109k679668
10305a1447118K871939N609989L479910J110452l30245k925468m385977p78405
10297f794923M717568N084006N77650j966118l46901P97681p33858j167172J755658
10288A923591M175514J812811l716559o767220m136044J411579L870397J016233
$$ y = [996588, 71248, 4131929, 5313988, -1709905, -10517026, -12366287, -8189775, -4203787, -1559465, 1874157, 4464518, 3748825, 2589915, 4717484, 7503231, 6422867, 3233221, 2370655, 2687130, 427143, -2817587, -3102144, -2214467, -4600093, -8588235, -8938180, -6259108, -5706121, -7762401, -8340786, -6808922, -6032549, -5733292, -3893303, -3431661, -8660072, -15781105, -16260876, -10063684, -6208341, -8767450, -11447118, -8575179, -2965190, 514720, 1625172, 1294927, -1630541, -6016518, -6794923, -2077355, 3006651, 3584301, 1618183, 1271282, 2068963, 1335105, 167933, 1923591, 6099105, 7911916, 4195357, -2571863, -6707907, -5296328, -1425931, -409698]
10280d09698j988301Q46810O776382P087929M28032m150393r09857L747831K039959
10271A3468694l016149m077704j900437j838123k696323J42025L351337p06130
10263B727190r222844r856126P96203J0456689Q124881j143812n296691k245487
10255e659997N91917m48072j641957p25480q37973l385206l747991J525991P749096
10246f579672P681954J713153l133600l365799k116379j627470N48492N018886
10238a860435O622588J980016l998592m939383k257498j227814j586518L39503
10230f928133K991428J783349j516756p68145L440924M080177j20307k397632
10222E64905J14294J836695o85411l068786k155907j720654l933939l796637J622124
$$ y = [-409698, -2397999, -1551189, 5225193, 12313122, 12741154, 8590761, 7680904, 11428735, 13468694, 10452545, 6374841, 4474404, 2636281, -60042, 81983, 3433320, 2727190, -6495654, -16351780, -15555577, -5098888, 3025993, 1882181, -3414510, -5659997, -5068080, -5516152, -7158109, -7883589, -8721562, -12106768, -15854759, -14328768, -6579672, 1102282, 2815435, -318165, -3683964, -5800343, -7427813, -6879321, -1860435, 4762153, 6742169, 2743577, -2195806, -4453304, -5681118, -7267636, -6928133, -3936705, -2153356, -3670112, -4438257, -997333, 3082844, 2962537, 564905, 679199, 2515894, 1830483, -1238303, -3394210, -5114864, -9048803, -12845440, -11223316]
10213a1223316O173584L852220j615806l383800j640952k30748J045634L439773
10205c583411L889534J81000l135182j243401K902808L966178K877057K885690
10197H740273K087979k014150n325962l255375M69538J59964j274653J660122
10189A247736M887159P03809o935648o443354K473170P305289K048985m663653
10181F23493m450840o06742O45348L32021J818744L598129L207300K167644J858988
10172I194085L07641k394247j721585L323883O137959K025500l953676m814121
10164H105439k120794j780179l688514l185588q6401J318394N1111o24419L05280
10155a705671M24210n54178Q7218K370913K479696p58824k989888q44818K364087
$$ y = [-11223316, -5049732, -1197512, -2813318, -6197118, -7838070, -8068818, -7023184, -3583411, 306123, 487123, -2648059, -3891460, -988652, 2977526, 5854583, 8740273, 10828252, 8814102, 3488140, 232765, 702303, 862267, -412386, 1247736, 6134895, 6838704, -96944, -6540298, -4067128, 3238161, 5287146, 623493, -3827347, -4434089, -3788741, -3456720, -1637976, 1960153, 5167453, 7335097, 9194085, 9501726, 7107479, 5385894, 8709777, 14847736, 16873236, 12919560, 8105439, 5984645, 4204466, 515952, -2669636, -2756037, -1437643, -1386532, -2010951, -1705671, -1281461, -1835639, -1748421, 622492, 3102188, 2343364, -646524, -1491342, 872745]
10146H72745J312411l038773m167671Q37690O614539O227809L32303l811034k237034
10137B942985Q13599l7362k935764k006552K783230M859088J081812l132581j997716
10128B370739J810736J487129l222937n505939j703161L272542L045791j354990
10120A99910l358101j47983L712199K821444j722708m068660j641144J807572
10112b397471K109523O13118J313592L839097L597630o60300l769245j212632
10104C433312L863922M578826j71678m455194l865282j159072j226915l621366
10096b623447l681760J67248M040488L966468N64423k913073m652420m478056
10088i610129k107725K013501N195701M762524J738994k22454K56120R19140j62790
$$ y = [872745, 2185156, -853617, -5021288, -4183598, 2430941, 8658750, 8991053, 5180019, 2942985, 3756584, 3719222, 783458, -1223094, 1560136, 6419224, 7501036, 4368455, 2370739, 4181475, 5668604, 2445667, -3060272, -4763433, -1490891, 1554900, 199910, -3158191, -3306174, 406025, 3227469, 1504761, -2563899, -4205043, -2397471, -287948, 325170, 1638762, 5477859, 9075489, 8415189, 4645944, 3433312, 7297234, 11876060, 11704382, 7249188, 3383906, 2224834, 997919, -2623447, -6305207, -6137959, -2097471, 1868997, 2433420, -479653, -5132073, -9610129, -11717854, -9704353, -4508652, 253872, 1992866, 1770412, 2026532, 2945672, 2782882]
10079B782882j861341k236335j261418m9443O98003L10284j618824l195778r45085
10070g377055N067275R018097N602527k491531o945215l805758K054185L497622
10062D620147m70345m670977m486059m14112L665832M765356K739958n59597k739293
10053B450910k104990Q64293L160239K095006r10110j452069J613198L513525
10045I230002o2492n860900o524340p78165M376099K872214k963646o411922m778704
10036a0901854j017992J159151J024518L76009J161236L308899M403937K452716
10028A966620j029980k500408j069960O57840Q08046M33914N81089J76869j544345
10019a520315l063189k755127j057032P21151J745783J291223m53639j146739
$$ y = [2782882, 921541, -1314794, -2576212, -2625655, -1927652, -1617368, -3236192, -6431970, -7377055, -2309780, 6708317, 12310844, 9819313, 2874098, -931660, 1122525, 4620147, 4149802, -521175, -5007234, -5421346, -1755514, 3009842, 5749800, 5190203, 2450910, 345920, 1210213, 4370452, 6465458, 5555348, 4103279, 5716477, 9230002, 9167510, 3306610, -3217730, -3995895, 380204, 3252418, 288772, -6123150, -10901854, -11919846, -10760695, -9736177, -9360168, -8198932, -4890033, -486096, 1966620, 936640, -1563768, -2633728, -1975888, -1167842, -733928, -152839, 24030, -1520315, -4583504, -7338631, -8395663, -7674512, -5928729, -4637506, -5091145, -6237884]
10011f237884P72967K175404r69278n828627n160257J076149M123314k27602m627385
10002a4903199j884148L962149N584289M396130N338803N411716j151957r536153
9994b782370q755286P50273O177599J442366m115640r04310O690410Q129827K006827
9985H639696m005881m757259k464650j232848j615380j054028K264526O224558
9977A998734O034710L18126n497866n302624m49327K778830K457179J766254J403744
9968E507760j078498l881236j591899M464555N419243j532098p387557m803122
9960d882852J003531K024046M11516K409274N494068K650558l932986m969619
9952B07536P49959M084937M3568m919077l399611K701268O482328N060724M59178
$$ y = [-6237884, -5464917, -3289513, -4258791, -10087418, -15247675, -14171526, -10048212, -10275814, -14903199, -16787347, -12825198, -7240909, -2844779, 2494024, 7905740, 6753783, -2782370, -11537656, -10787383, -4609784, -3167418, -7283058, -8187368, -1496958, 6632869, 8639696, 4633815, -123444, -2588094, -3820942, -5436322, -6490350, -4225824, 1998734, 8033444, 8351570, 2853704, -2448920, -2898247, -119417, 2337762, 4104016, 5507760, 4429262, 548026, -1043873, 3420682, 8839925, 7307827, -79730, -4882852, -3879321, -1855275, -1443759, 965515, 6459583, 9110141, 5177155, 207536, 957495, 5042432, 5086000, 166923, -3232688, -531420, 5950908, 11011632, 11470810]
9943A1470810m352140o873938n534782j444607K217518L694155L506451K118046
9935D801513k4471o80605J681052L896104J616960l271105m589203j624186j28448
9926A677611k205482k948092j31582R43934k715674m978571n49609N049264L992684
9917a865517p59085o77745L757457M504182L86670j123288K576838M501788j36308
9908A1164992o419511p947991n156786j554341J631382L274147J263019k577401
9900f322490k728320J243041K888868l14597k125737J413287M341654J101986
9892e02308l297556j796317K973190M572163L828403M051314J857430n572769
9884F113550j0586289o382796k339195j0603487k0978878j0594842J9127569L7338861
$$ y = [11470810, 7118670, 244732, -5290050, -6734657, -4517139, -822984, 2683467, 4801513, 4777042, 4096437, 5777489, 9673593, 11290553, 8019448, 3430245, 1806059, 1677611, -527871, -3475963, -3607545, -2663611, -5379285, -10357856, -10907465, -5858201, -1865517, -2624602, -3302347, 455110, 4959292, 5345962, 4222674, 6799512, 11301300, 11164992, 4745481, -3202510, -8359296, -9913637, -8282255, -5008108, -3745089, -6322490, -9050810, -7807769, -4918901, -5233498, -7359235, -5945948, -1604294, -502308, -3799864, -5596181, -2622991, 1949172, 5777575, 9828889, 11686319, 6113550, -4472739, -10855535, -13194730, -23798217, -44777095, -55371937, -36244368, 1094493]
9876A094493K4218797k603199j4275303p088357K327863M933120M581778L340803
9868A6529995q48243m929901l673000j95385j510035n672906m983816O9331J910794
9859c303166m25791n54786K710186L676978J174551N10488K792351K849459m53303
9850H976967j888760Q0203N62423k112253l249329p82783J420377J506728K048254
9841F561827K647674k35365m037690j488631N649395N986571l443005j0524712
9833A116064o438070Q58860O41038l502321j886376M080649N475636J518138n95947
9824A267671J143892J642317j080523l246211k669437r65027J023585L156564
9816B72831K761810j545275m612992r91292N146136M754882k114410o108795l014913
$$ y = [1094493, 25313290, 22710091, 8434788, 1346431, 3674294, 8607414, 13189192, 16529995, 15681752, 10751851, 7078851, 6883466, 5373431, -299475, -5283291, -5213960, -3303166, -3728957, -4283743, -1573557, 2103421, 3277972, 3788460, 6580811, 9430270, 8976967, 7088207, 7168410, 7730833, 5618580, 2369251, 1586468, 3006845, 4513573, 6561827, 9209501, 8974136, 4936446, 3447815, 9097210, 15083781, 11640776, 1116064, -5322006, -4463146, -3822108, -7324429, -9210805, -5130156, 345480, 1863618, 1267671, 2411563, 4053880, 2973357, -272854, -2942291, -3907318, -2883733, 272831, 3034641, 1489366, -3123626, -4114918, 1031218, 5786100, 3671690, -2437105, -5452018]
9807e452018P08520o17311l258776j402449L112906L881411n39193m802086l547091
9798a1916087K399725O572835L750302l126645n162743J047968P529661N199142
9790F294158k950930n867973l16809N376260M359986j00819k058716j757740k339283
9781F38134l101691j538485J224000K017641P29069j80155J04167K06637p27828
9772f28511k118052k855327j804194J094518L407564K340821p27353j040767K623081
9763B91780N488134L714393J29427m91936J230516R82585k235049n196282n434666
9754a521098l222698M52276L967521M001861j151509p239499p510397j451390
9746a3674933L960273L269953p98026j920908J414441M859809M146209j71174
$$ y = [-5452018, -4743498, -5360809, -8619585, -10022034, -6909128, -3027717, -3566910, -8368996, -11916087, -9516362, -2943527, 806775, -2319870, -7482613, -6434645, 1095016, 6294158, 3343228, -2524745, -2841554, 2534706, 6894692, 6793873, 4735157, 2977417, 638134, -2463557, -4002042, -2778042, -760401, -31332, -211487, -107320, 99317, -628511, -2746563, -5601890, -7406084, -6311566, -2904002, -563181, -1290534, -2331301, 291780, 5779914, 9494307, 9623734, 9131798, 10362314, 11344899, 9109850, 3913568, -1521098, -4743796, -4291520, -323999, 3677862, 2526353, -4713146, -12223543, -13674933, -9714660, -6444707, -7242733, -9163641, -7749200, -2889391, 1256818, 1085644]
9738A085644l507508j938378L227727N823277J710229n041045o229999l64359
9730e234412M957744L666434n28091p22590K465752L027477L8718j442506J37809
9721F366335R2660l668933o112294l274660Q68379P36375k263880l033562j000427
9712a1290007R73824K960512O479905Q518253M475122l114980o103375k108194
9704G91060K356634J990737o53753j475078j330636k009481j267777K696959N933253
9695G031918L772640j504553l766063k049469q23773k091020k984326j738465
9687d153111p10296j498419j295951K725890P766880P721911J170259n565879
9679F161284n171815J559534N949971K135913m963256n984739j12763L720797
$$ y = [1085644, -2421864, -4360242, -1132515, 4690762, 6400991, 1359946, -4870053, -5234412, -276668, 3389766, 2861675, 2139085, 4604837, 7632314, 7671032, 6228526, 6366335, 6458995, 2790062, -3322232, -6596892, -5728513, -4992138, -7256018, -10289580, -11290007, -10316183, -7355671, -875766, 7642487, 12117609, 9002629, 2899254, 791060, 3147694, 5138431, 4484678, 3009600, 1678964, -330517, -1598294, 1098665, 7031918, 10804558, 9300005, 5533942, 3484473, 2660700, 569680, -2414646, -4153111, -4863407, -6361826, -7657777, -4931887, 2834993, 10556904, 11727163, 6161284, 989469, 2549003, 8498974, 10634887, 5671631, -313108, -425871, 3294926]
9671C294926k19808o107730m998655K619291Q024798N957457m903l332187j734033
9662C499156J877703K977599j11976m003087l783523J31409J776466j517260m342595
9653c496108j551851K972893K391637j512269j208424L337257L769364k756039
9645A946460p946728m745814K332180M817227K252859J61708M50230P56177P26877
9636G51176K080772L413668J235298l571069n761147l198084L39518J276031R53286
9627b480551J933740L027688J340344k372809l730213l46142M638116N748831
9619G759004J333605m478165o390431l811373q09768l45847p69974O31087K787762
9610d094100K382936p18812k887689j885142M29110J560177J698047J844260J206432
$$ y = [3294926, 3075118, -3032612, -8031267, -5411976, 2612822, 8570279, 8565376, 5233189, 3499156, 5376859, 8354458, 8242482, 4239395, 455872, 587281, 2363747, 846487, -3496108, -5047959, -2075066, 316571, -1195698, -2404122, 933135, 4702499, 1946460, -6000268, -10746082, -8413902, -3596675, -1343816, -1182108, -731878, 24299, 751176, 2831948, 6245616, 7480914, 3909845, -1851302, -5049386, -4709868, -3433837, -2480551, -546811, 2480877, 3821221, 1448412, -2281801, -2627943, 2010173, 7759004, 9092609, 4614444, -1775987, -5587360, -6397128, -6742975, -7512949, -6881862, -4094100, -1711164, -2429976, -5317665, -7202807, -6773697, -5213520, -3515473, -1671213, -464781]
9601d64781r11383k421292q03387K655492M058479K172675m21695j594113j952047
9592C17948k161478j233885R72517K425307K025821J410452J581518O98816j976950
9583D060066l108271k93494K693313R76635k928571k169088L147197M870390j032437
9574F215740p963556q147368l065844N16254P01677P56179J825260J587417l34705
9565g908946j018924Q68143K866249K626781J027896Q9670l1551n85967j960060
9556d026709k926688j988577O16109K443341J337087j555048k824689j161219
9548a0086393J332728K584298K644655J618286j031256l543191k187278K764553
9540e903598N300494J633333l630995l836874K61528K693689J547594M9372k53106
$$ y = [-464781, -1376164, -3797456, -4600843, -1945351, 2113128, 4285803, 3864108, 2269995, 317948, -1843530, -3077415, -2104898, 320409, 2346230, 3756682, 5338200, 6037016, 4060066, 951795, 658301, 3351614, 4328249, 1399678, -769410, 2377787, 7248177, 6215740, -1747816, -9895184, -12961028, -12444774, -11743097, -10986918, -9161658, -7574241, -7908946, -8927870, -8059727, -5193478, -2566697, -1538801, -1449131, -1480682, -2066649, -4026709, -6953397, -8941974, -8325865, -5882524, -4545437, -6100485, -8925174, -10086393, -8753665, -6169367, -3524712, -1906426, -2937682, -6480873, -8668151, -5903598, -603104, 1030229, -2600766, -6437640, -6176112, -3482423, -1934829, -1885457, -2138563]
9531b138563j003438j894109k58078L242730M167494J175603j605784j046684
9523F39171O63014M83411p22094p53205k20457r88789k402900j878114J359444
9514c820519M718563M480159k03031n030638l877052L628159R710823O974725
9506A6581189k081277q156828o794300k062159J167276K942702M765538N526763
9498A1888904L725196L89688k563978m453912m991115l930382k414825j868398
9490d218822j211385J432027M223468L285364n27225j725547J364092L623158
9482F245130J234471k365310k253416O09698K028500J243943M95250J74295j268089
9473F144472l603372m442504k397819J242104L607130K425271j561543m259638
$$ y = [-2138563, -3142001, -5036110, -5294188, -2051458, 2116036, 3291639, 1685855, 639171, 1302185, 1785596, 1063502, 310297, 89840, -898949, -3301849, -5179963, -3820519, 898044, 5378203, 5175172, 144534, -3732518, -104359, 9606464, 16581189, 14499912, 6343084, -451216, -2513375, -1346099, 1596603, 6362141, 11888904, 15614100, 16003788, 13439810, 8985898, 3994783, 64401, -2350424, -4218822, -5430207, -3998180, 225288, 3510652, 2983427, 1257880, 2621972, 6245130, 7479601, 5114291, 2860875, 3470573, 5499073, 6743016, 7238266, 7412561, 6144472, 2541100, -1901404, -4299223, -3057119, 550011, 2975282, 1413739, -2845899]
9465b845899k446966J760299L457563J630071l61462o14000m02605r5979J283916
9456A364938K060772m46214l559909j638962L723249M150471k008644n667622
9448b021921j286031L963855K156424k771441l078483n67641j581228m223746
9440i410212j909485L694421M642454K25684k126802O59984L652768L358154J891648
9431D678614P03091j568704l770013k532090R23571J696936k40452j20522K243537
9422B013968J672628k297500l574419l66377J216874j741390l189569J245055
9414e020730N929068M230835p37898j807049P48754J093343j821785l127396k19371
9405g32229L756528M681816J886983k184783m358903l297717r42829j52462p08842
$$ y = [-2845899, -5292865, -3532566, -75003, 1555068, 1193606, 579606, 177001, 81022, 1364938, 3425710, 2979496, -580413, -2219375, 1503874, 5654345, 3645701, -2021921, -3307952, 655903, 2812327, 40886, -3037597, -3605238, -5186466, -9410212, -11319697, -7625276, -2982822, -2757138, -4883940, -4223956, -571188, 2786966, 4678614, 5381705, 3813001, 42988, -2489102, -1565531, 131405, -109047, -229569, 2013968, 3686596, 1389096, -2185323, -2551700, -1334826, -3076216, -6265785, -5020730, 908338, 5139173, 4401275, 2594226, 3342980, 4436323, 2614538, -512858, -732229, 3024299, 7706115, 9593098, 7408315, 3049412, -248305, -1191134, -1343596, -2052438]
9396b052438k91865P60701r5549k022205r62566L300712N899061M432954J673950
9387A0642755j098454n918927j0372057p058794L676014R560798K960511o437466
9379d045620n391552L298605O677802K030964j834823j052146n41051j560443
9371b418264O76337M796941K240426p164952j1303807l852903N246631N355097
9363f424494P18978P47012L751284K207142k223152j856899K332870K066946l270377
9354a950690n332526j413641J332486r79722k534949R57250M380614K612584n15620
9345c444214K91126K367404J006859j107221Q02027L509637P94710m461377l823024
9336d064073K074913L588238j984716n620968j453853L936363L064464o94940
$$ y = [-2052438, -2344303, -1583602, -1679151, -3701356, -4663922, -1363210, 4535851, 8968805, 10642755, 9544301, 3625374, -6746683, -13805477, -10129463, -568665, 2391846, -4045620, -9437172, -6138567, 539235, 2570199, 735376, -316770, -857821, -2418264, -1741927, 3055014, 5295440, -1869512, -13173319, -17026222, -11779591, -6424494, -5705516, -4958504, -1207220, 999922, -1223230, -3080129, -747259, 1319687, -1950690, -7283216, -8696857, -7364371, -8344093, -10879042, -9921792, -5541178, -2928594, -3444214, -3153088, -785684, 221175, -886046, -84019, 3425618, 4220328, -241049, -4064073, -1989160, 1599078, -385638, -6006606, -7460459, -3524096, -459632, -1154572]
9328a154572o79089J156388p66540m078527k149216L615274N409101J920522k26801
9319C046540J760278L150904J370771K35468J614590J413019k107355l814099
9311F670116m68403K953209J303670k511819l344307k184430k226511j806968
9303a615443J380048L578253O42352l234273j322066L737576L411113k566950
9295D010610n562350k061728J630203Q30466q94673j83304k29647l598682o039811
9286a2098916l363367J302708K932839K332052K736087L207285J451795n68955
9278b068472N9237J459367M41950j286641m91113R68282l99093k198210L22759
9269c191934M880298M549605p44582l571116r06349J632813j8733j892851J68393
$$ y = [-1154572, -1833661, -677273, -1443813, -5522340, -7671556, -4056282, 1352819, 3273341, 3046540, 4806818, 7957722, 9328493, 9563961, 11178551, 12591570, 10484215, 6670116, 6201713, 9154922, 10458592, 7946773, 4602466, 2418036, 191525, -1615443, -235395, 3342858, 3985210, 750937, -571129, 3166447, 6577560, 4010610, -1551740, -3613468, -1983265, -1152799, -2047472, -2230776, -2460423, -6059105, -12098916, -15462283, -14159575, -11226736, -8894684, -6158597, -2951312, -1499517, -2068472, -2009235, -549868, -107918, -1394559, -1885672, -917390, -1316483, -3514693, -3191934, 1688364, 6237969, 5493387, 1922271, 1015922, 2648735, 2630002, 737151, 905544]
9260I05544K985761J709491k046059l352745j698701k20333K76836J442811K994476
9251B997081K724580M40430j404758q00330K050747N083205N183223P29211n097602
9242A1905787o337366j812854K408339J025182l168686l777575K9700L348633
9234C621160K936055M05585j242414o95077J495187L088874J682418j682610k671327
9225F937851M3579J960041k37108k881118j606910O69148j165033m685563l442785
9216d407898J808255M169086K008028K10425J85689j563637m054442j680891M165003
9207H39618M536869j823313m190420K772710Q604117L120958o846253q086352
9199a072066j031129L148668N34576k876072l538204l276464j338537M650633
$$ y = [905544, 3891305, 5600796, 3554737, 201992, -1496709, -1717042, -1440206, 2605, 2997081, 5721661, 6162091, 4757333, 3957003, 6007750, 11090955, 16274178, 17003389, 11905787, 5568421, 3755567, 6163906, 7189088, 4020402, 242827, 272527, 3621160, 6557215, 6962800, 5720386, 5025309, 6520496, 9609370, 11291788, 9609178, 6937851, 6981430, 8941471, 8704363, 5823245, 4216335, 4885483, 3720450, -965113, -4407898, -2599643, 1569443, 3577471, 3787896, 3973585, 2409948, -1644494, -3325385, 839618, 5376487, 3553174, -637246, 2135464, 10739581, 13860539, 7014286, -1072066, -2103195, 1045473, 1580049, -1296023, -4834227, -8110691, -9449228, -4798595]
9191d798595J0028972O923443k261661o209492j428048L183715J365241j771480
9183E032095o20086J462298o5859k190113o65461J623167J06438k913363k546775
9174g77659r2723l03020k845365l413819j385895N1072J87570J224315K902858
9165d452666K169710j367309m037894l023360M05359L096570L217603J135802
9157b856185j278052k500279l168035m482383m474581N12571Q770859J2168341
9149B692256O221439k446155m072684J309722N008077K492544j645273k267876
9141G292050p80756q09220j654711k74899K619452K609383k299959q196179r051184
9132a0546023l324175M142299P215642M819258R86818r78881j954903l765219
$$ y = [-4798595, 5230377, 12153820, 9892159, 3682667, 2254619, 5438334, 6803575, 5032095, 4412009, 5874307, 5808448, 3618335, 2952874, 4576041, 4682479, 1769116, -777659, -870382, -1173402, -4018767, -7432586, -8818481, -8767409, -8579839, -7355524, -4452666, -2282956, -3650265, -7688159, -10711519, -10306160, -7209590, -3991987, -2856185, -4134237, -6634516, -9802551, -14284934, -18759515, -18246944, -9476085, 2692256, 8913695, 6467540, 2394856, 3704578, 8712655, 11205199, 9559926, 7292050, 6511294, 5702074, 4047363, 3772464, 6391916, 9001299, 6701340, -1494839, -10546023, -13870198, -9727899, -2512257, 2307001, 3293819, 2314938, 360035, -3405184]
9124c405184n215577l742982M35910M156585M672810J873624j747865k431177
9116e403856J489496O310797N877149k26722m810918k613627J869447R49623m603049
9107a161660o746248k079558L961614N669843L886105K156705J076037m98679
9099F264159k136059k787635k768336k547668j580758l0277N46839j19702O6924
9090e092513K127321L676431K227074r21158k458946j649809q78096j925457l471699
9081h366852k803483N92239L818251L747429J329443P47427L209327M370951P38322
9072G383054m175108m678612j817281j317782l413095k191768L580421O886636
9064B56465L332817j628012j642864P36665l2736k087333k9514M211680L600701
$$ y = [-3405184, -8620761, -12363743, -11927833, -7771248, -3098438, -1224814, -2972679, -5403856, -3914360, 2396437, 8273586, 8046864, 3235946, 622319, 2491766, 3441389, -1161660, -7907908, -9987466, -6025852, -356009, 3530096, 5686801, 6762838, 6264159, 4128100, 1340465, -1427871, -3975539, -5556297, -5586574, -5039735, -5159437, -5092513, -2965192, 711239, 2938313, 2017155, -441791, -2091600, -2969696, -4895153, -8366852, -11170335, -10578096, -6759845, -3012416, -1682973, -935546, 2273781, 6644732, 7383054, 3207946, -1470666, -3287947, -4605729, -8018824, -10210592, -6630171, 256465, 3589282, 1961270, 318406, 1055071, 1022335, -1064998, -1094512, 3117168, 6717869]
9055F717869k049013n286866k754290O77641J211846J466913L387738L329782
9047F701620j052698n090199l780049M30033K122106J355836J697559K806751
9039E190959J550446j086447q67054K085210K798739m07568k978310j394325J448394
9030F340044J092546j917529l713905k923790j452853p20221n1033J394030K984862
9021A032151L074155N03606l770724o508237n178070j378456R26738J119576K716247
9012g463014O803226Q511033L878105k608606k881368L031354O243643J486749
9004A7001122n261175n448706j63614J957851k434438o824813m686323J116820
8996d743276K840729q71866l491966o15055L571735K839052j510436k491804K093371
$$ y = [6717869, 4668856, -618010, -3372300, -2694659, -1482813, -15900, 3371838, 6701620, 5648922, 558723, -3221326, -2791293, -669187, 686649, 2384208, 5190959, 6741405, 5654958, 4787904, 6873114, 9671853, 9264285, 6285975, 4891650, 6340044, 7432590, 5515061, 1801156, -1122634, -2575487, -3295708, -3346741, -1952711, 1032151, 4106306, 4609912, 839188, -5669049, -10847119, -12225575, -11298837, -10179261, -7463014, -659788, 7851245, 11729350, 9120744, 6239376, 9270730, 15514373, 17001122, 11739947, 6291241, 6127627, 8085478, 5651040, -1173773, -5860096, -4743276, -1902547, -2774413, -6266379, -6881434, -3309699, -470647, -1981083, -4472887, -2379516]
8987b379516O372744N063855P64028p18272J045219J628394q65136l711560m609082
8978B590674m334008l615424j491462J596325K669610M85676j870729j185570
8970e154908J347278K372822J250380q2456o33000q89744r10194o40221j198468
8961d538511k940699l155850P44445N960218O278045L94631n406218n004908K1586
8952g647261L352401K320193Q295k43476J038021J649440J460468K006232L241555
8943G185868K768577r22477n520655o857631m038181q28487n74054j455572M68879
8934i773733M541910N926686L265352J126328K347547K797488j526322o252282
8926B452974m462167J446189K362729k745004m303113K128115P343795K896489
$$ y = [-2379516, 3993228, 9057083, 9821111, 9102839, 10148058, 11776452, 10911316, 7199756, 2590674, -1743334, -5358758, -6850220, -5253895, -2584285, -2098609, -3969338, -5154908, -3807630, -1434808, -184428, -266884, -899884, -1789628, -2699822, -3340043, -4538511, -7479210, -10635060, -9890615, -3930397, 2347648, 2742279, -2663939, -7668847, -7647261, -4294860, -1974667, -1966372, -2209848, -1171827, 477613, 1938081, 3944313, 7185868, 9954445, 9031968, 3511313, -3346318, -7384499, -8212986, -8787040, -10242612, -9773733, -5231823, 694863, 3960215, 5086543, 7434090, 10231578, 8705256, 2452974, -2009193, -563004, 1799725, -945279, -5248392, -3120277, 4223518, 7120007]
8918G120007m342732k629856N150388N566037l310780q157373j682192N880059
8910C593558L683639k703005j659991N108528O041324j280918p057059m930255
8902G95821K44777K210906J523063P24275p76016k827016j965876K657025N856825
8893H443784L534650r42265k055629k39440K10578j465820k412449j878886j899304
8884A295219k642971j750340R91174K213587j63975l402172l385563j7570L054202
8875c808409L519433K793941K639926J837407j236077m158730k705211K064249
8867I46529L680051m91750m644322l212792L78665k67991l323582j651644M469111
8858d117725O640371J618219l375706j939382K405112K993107j64879k520267
$$ y = [7120007, 2777275, 147419, 5297807, 10863844, 7553064, -604309, -2286501, 3593558, 7277197, 4574192, 2914201, 8022729, 14064053, 12783135, 5726076, 795821, 1040598, 3251504, 4774567, 5498842, 4722826, 1895810, -70066, 2586959, 8443784, 11978434, 11036169, 8980540, 8741100, 8951678, 7485858, 5073409, 3194523, 1295219, -1347752, -3098092, -2106918, 106669, -57306, -3459478, -6845041, -6862611, -3808409, -288976, 2504965, 5144891, 6982298, 5746221, 1587491, -1117720, 946529, 4626580, 4134830, -509492, -3722284, -3343619, -3611610, -6935192, -8586836, -4117725, 2522646, 4140865, 765159, -1174223, 1230889, 4223996, 4059117, 1538850]
8850A538850k315634q00688J215993K630272J229852k387357l507744J91680M352056
8841B147280M129167J103106k40525M90756N59484r19031l016179n053537n253885
8832f053364j247392M609197N505344J58387l360707M79160N318430L060223k781348
8823E687930l595102m87844j006323m204588j971506N168113O867154Q725n380366
8814A086193j961493L909527L304694j920921m128501j725689J220329K640157
8806B424296L206086K530848R1566k212760k507201j853227j725353j216308M97249
8797g64804J756357J148437r7094o38942j011283j306085l62119R83774j37570
8788d29329l418597m527164j783756R99004J012098O78544K045449K362397k51841
$$ y = [1538850, -776784, -1577472, -361479, 2268793, 3498645, 1111288, -2396456, -2204776, 2147280, 6276447, 7379553, 7139028, 7629784, 8189268, 7270237, 4254058, -799479, -6053364, -7300756, -2691559, 2813785, 2972172, -388535, 90625, 5409055, 8469278, 5687930, 2092828, 1604984, 598661, -3605927, -5577433, -409320, 6457834, 6466559, 1086193, -875300, 3034227, 6338921, 4418000, 289499, -1436190, -215861, 2424296, 5630382, 8161230, 8252796, 6040036, 3532835, 1679608, -45745, -1262053, -764804, 991553, 2139990, 2042896, 1403954, 392671, -913414, -1275533, -291759, -429329, -3847926, -8375090, -10158846, -9159842, -8147744, -7469200, -5423751, -3061354, -3313195]
8779c313195j831459J146737M692656K797483l010882n959874l849301m09289
8771i737124J799086L648603M959016L585871j86817k918141k653083q14632Q97070
8762a420151K142467K371762J077208j84148N18570J554712o84444n505498p344536
8753g474058l418240J773771K721217Q66145J940133O446088Q044612L105625
8745A4005293k810597k374232K396641K656191l794677q669656n664928J24080
8737d131885R50736j164888R07591N833037N046478k652508p832752m272061K704918
8728d611334N518521M186459K231609k13750l542842m679301j890631R75934M31415
8719a593920r48173J03481J393924K71738l24394K379557M029417l6981n024898
$$ y = [-3313195, -5144654, -3997917, 694739, 3492222, 481340, -5478534, -9327835, -9737124, -7938038, -4289435, 669581, 4255452, 4068635, 1150494, -1502589, -2317221, -1420151, 722316, 3094078, 4171286, 3987138, 4505708, 6060420, 5375976, -129522, -7474058, -10892298, -9118527, -6397310, -5531165, -3591032, 2855056, 10899668, 14005293, 11194696, 8820464, 11217105, 13873296, 10078619, 1408963, -4255965, -4131885, -3181149, -4346037, -3438446, 2394591, 7441069, 4788561, -3044191, -7316252, -4611334, 907187, 5093646, 7325255, 7111505, 3568663, -1110638, -3001269, -2025335, -1593920, -2542093, -2438612, -1044688, -772950, -1097344, 1282213, 5311630, 5274649, 249751]
8710B49751k909483M159467O469704J806837k033132m83597J774949M74100j533190
8701G975406j186865j074409l247086l579261J500858P095721N353410l072588
8693I765186q998724o142964J730685O069032L229840k493033m550083j577555
8685b967616J663530Q24646k324568k704782P17288L552410K209768j585613l721786
8676d336723k722302k40906J661928J981815O36730j471004k669668j909354J54964
8667h914520J933101K426097J673079K19362j190669j536706j6748K633344L751679
8658I78019J244227k981116l969016K13007N121461N297836J489952j127614r40465
8649E326291j237546l270787l484543J59173L979397M015093J818512J129125
$$ y = [249751, -2659732, 1499735, 7969439, 9776276, 7743144, 7259547, 9034496, 9508596, 7975406, 6788541, 5714132, 2467046, -1112215, 388643, 7484364, 12837774, 9765186, 766462, -5376502, -3645817, 2423215, 5653055, 3160022, -1390061, -2967616, -1304086, -479440, -2804008, -5508790, -4791502, -1239092, 970676, -614937, -4336723, -7059025, -7299931, -5638003, -3656188, -3019458, -4490462, -7160130, -9069484, -8914520, -6981419, -4555322, -2882243, -2662881, -3853550, -5390256, -5407004, -2773660, 978019, 2222246, -758870, -4727886, -4514879, 606582, 5904418, 7394370, 6266756, 5326291, 4088745, 817958, -2666585, -2507412, 1471985, 5487078, 7305590, 8434715]
8641H434715J815022J068021j399447k989670j982118Q19162L199127K996346
8633A1961158J43410k252130j570624k91851k542319o074599m250075K563785
8625b313245N618100J326367k500742K09126L237902o81381n828301k170368O970355
8616C867813Q796771Q35839n719069l433966J945831K481553j050791l426112
8608D297869k988314j247222N07944J210466M35082K3111J497966K285889n76473
8599E446318m114231l135927P39212J378270r50978K22015N496049P163875J715870
8590A3960473m138809m198768j552447j495192k628783j054302J836640J858132
8582B586944j085347l520597l376434j084983J816282L059126J543512r7115J253090
$$ y = [8434715, 10249737, 11317758, 9918311, 6928641, 4946523, 5765685, 8964812, 11961158, 12104568, 9852438, 8281814, 7989963, 5447644, -626955, -4877030, -2313245, 3304855, 4631222, 2130480, 2339606, 5577508, 4896127, -932174, -3102542, 3867813, 12664584, 13500423, 7781354, 4347388, 6293219, 8774772, 7723981, 4297869, 1309555, 62333, 570277, 1780743, 2215825, 2238936, 3736902, 6022791, 5446318, 1332087, -1803840, -1064628, 313642, -637336, -415321, 5080728, 12244603, 13960473, 9821664, 5622896, 4070449, 2575257, -53526, -1107828, 728812, 2586944, 1501597, -2019000, -5395434, -6480417, -4664135, -1605009, -61497, -158612, 1094478]
8573A094478L114458K54840n762655p129739j853429K686104J580744m68390J276818
8564e206771L098230O28348k073237N27428M916963L823796j699575m293597k143854
8555b422269k96524r90418p23960K291050M553599L050017k86826j890645j075013
8546B209011K70998L94666q20003j969176j710368n84950k20544p05535q29651
8537c965552p35791j119941j12695M184240P716072L610682o469720j1267544
8529h160249m567589N658549Q433723M192579J051703J615006J846507K14882
8521A0285111n78664k06263j529314m423931n017762j988480J321325J877262
8513b60716J02007k211501l631300k828544J97030K921375L029746J533152P74405
$$ y = [1094478, 4208936, 4463776, -1298879, -8428618, -10282047, -7595943, -6015199, -6483589, -5206771, -2108541, -1480193, -3553430, -3026002, 1890961, 5714757, 4015182, -278415, -2422269, -2718793, -3709211, -4433171, -2142121, 2411478, 5461495, 5174669, 3284024, 2209011, 2480009, 2874675, 2054672, 85496, -1624872, -2209822, -2430366, -3135901, -3965552, -4701343, -5821284, -5933979, -1749739, 5966333, 9577015, 3107295, -8160249, -12727838, -7069289, 1364434, 5557013, 6608716, 8223722, 10070229, 10285111, 9706447, 9500184, 7970870, 3546939, -1470823, -3459303, -2137978, -260716, -158709, -2370210, -6001510, -8830054, -8633024, -5711649, -2681903, -1148751, -374346]
8504c74346Q99462Q50064Q19202J027190M62991n71374O4910J509282q75583p201366
8494c389568r229571j249163R543441J1279332L164740n008462p015423n278983
8486g183657k764811J056697N055833N405928J993669n95063l81680l36598j872009
8477C78309k132279J76823K001719J342866L59685Q69638J394014N91227p27466
8468D254536k260926m240507m188971N19573N962337M601963k878661o301053
8460d531709m58039O588611N368290j386188m333096j858308k67826k039734k553807
8451e471806J068581N062980N039822J837389r62674j784404j162304K84842J883075
8442E795501K409847J128623j348806l733480m847621l930958j465236M91524
$$ y = [-374346, 525116, 1375180, 2194382, 3221572, 3684563, 3113189, 3178099, 4687381, 3811798, -3389568, -12619139, -13868302, -4324861, 6954471, 10119211, 5110749, -1904674, -7183657, -9948468, -8891771, -3835938, 1569990, 3563659, 2968596, 2586916, 2250318, 378309, -1753970, -1577147, 424572, 1767438, 2127123, 2996761, 4390775, 4982002, 4254536, 1993610, -2246897, -6435868, -5916295, 46042, 4648005, 1769344, -4531709, -4989748, 1598863, 6967153, 5580965, 1247869, -610439, -878265, -2917999, -5471806, -4403225, 659755, 5699577, 7536966, 6574292, 4789888, 3627584, 3912426, 5795501, 8205348, 9333971, 7985165, 4251685, -595936, -4526894, -5992130, -5500606]
8434e500606M13943l44007P07522K973242K918433m55602l071908j208235K672259
8425h94959L166969q334j732458K27451J653977q46248l664558j815704K635654
8416a278210L579700M74125j486289m28261j74905k353607k954770L58172L583644
8407f80401K958337R66594J196038J763053p71202m445473m614101j401190R29773
8398d098572O66269p2861J95116P24521P61563J53630j229846k305930j128545
8389f334655J331919J232756j417066q24570N255573R456903M746773l901863
8381I545770n984200p20036L111547J134086k169722l051002l291612l781826
8373e206995j864911K110040L063825o56523l840903k499571M15334P58736o38977
$$ y = [-5500606, -5086663, -5430670, -4723148, -1749906, 1168527, 712925, -2358983, -3567218, -894959, 2272010, 2263676, 531218, 758669, 2412646, 1566398, -2098160, -3913864, -1278210, 2301490, 2775615, 1289326, 861065, 686160, -1667447, -4622217, -4264045, -680401, 2277936, 3244530, 4440568, 6203621, 5432419, 986946, -3627155, -5028345, -4098572, -3432303, -3505164, -3310048, -2585527, -1823964, -1670334, -2900180, -5206110, -6334655, -5002736, -3769980, -5187046, -6011616, -756043, 8700860, 13447633, 9545770, 3561570, 2841534, 5953081, 7087167, 4917445, 1866443, -1425169, -5206995, -7071906, -4961866, -1898041, -2554564, -6395467, -8895038, -8479704, -7720968, -8359945]
8364h359945j046426m45661K05203J240116K097679R27123j328492q87164K537684
8355e059883M160201J515519j554611j424218j51719o32981j089799R81316L308818
8346E2643K265068j109102l114735l045409k528605j437362J085082L142709K064267
8337b625444r23281j899771J52715K304262K298004J306286J355045K007653R17703
8328D893172k630518n588495l862631K100639O265792L888563j995877m340685
8320a270040j391842K014873K218102Q39121K43601n5519n20384K65207K036960
8311D380079J614733j858369m251540k344750R13289P30715k481688m149538k017942
8302i465011J700567L719954K679794n37241l583053m248604k341754N72186L131995
$$ y = [-8359945, -9406371, -9852032, -9646829, -8406713, -6309034, -5381911, -6710403, -7597567, -5059883, -899682, 615837, -938774, -2362992, -2514711, -3147692, -4237491, -3256175, 52643, 2317711, 1208609, -1906126, -4951535, -7480140, -8917502, -7832420, -4689711, -2625444, -3548725, -5448496, -5295781, -2991519, -693515, 612771, 1967816, 3975469, 4893172, 2262654, -3325841, -7188472, -5087833, 1177959, 5066522, 3070645, -1270040, -2661882, -647009, 1571093, 2410214, 2653815, 2598296, 2077912, 2343119, 4380079, 5994812, 4136443, -115097, -2459847, -1546558, -815843, -3297531, -7447069, -9465011, -7764444, -4044490, -1364696, -1901937, -5484990, -9733594, -12075348, -11503162, -8371167]
8293h371167M395021K937682j276820m478623k336037L884996Q112054P012564
8285I879670K932498j018381m055295n062406k413774J547557J415150l010187
8277B14832m805116p3334N195182L465478l237505o390996k723792K724597M355308
8268a275346K028142q40254j721636p40656L15963L40613K99105J326151K094329
8259A826411O57887j471848q12977K214434L206491O41409j619709m11094K359244
8250F590248L341192J868447j188293m702072o121698l439605O22249J410125
8242a619407l2087J467370N096731L807937l150557o636827j514491M678171L671310
8233E768150r98364j544874J036393R50369r24856K36671K789844J233008k928925
$$ y = [-8371167, -3976146, -1038464, -2315284, -6793907, -9129944, -5244948, 2867106, 9879670, 12812168, 11793787, 7738492, 2676086, 262312, 1809869, 3225019, 214832, -4590284, -4663618, 531564, 3997042, 759537, -5631459, -8355251, -5630654, -1275346, 752796, -87458, -1809094, -2549750, -2233787, -1893174, -1594069, -267918, 1826411, 2484298, 1012450, 199473, 2413907, 5620398, 6261807, 4642098, 4231004, 6590248, 9931440, 11799887, 10611594, 5909522, -212176, -3651781, -3029532, -1619407, -1651494, -184124, 4912607, 8720544, 5569987, -1066840, -2581331, 2096840, 5768150, 4769786, 3224912, 4261305, 5211674, 4286818, 4523489, 7313333, 8546341, 5617416]
8224E617416k892687J651463L720386M31660l094893k527010k0614O72911n79427
8215B979205j632286r81758J188010K489504K83660l587639l501723J223080L320639
8206A780692j563988o591100l569008L972863O470160L087146P43601J148436
8198E478802k26648l270907k508021J996524L395024m94271l925817l423075k217171
8189e195560k264107p75880K444021K822937l94339j383926K682348O596509N370541
8180I902544Q60941l084295n445971n209461r32556L899550K754014l372465n388190
8171f015889m7144M317887J229877l692499k903479Q27648Q32872j507448o56925
8162g615100K146500J510798j643934j445652K644804N084877L176405j85464
$$ y = [5617416, 2724729, 4376192, 8096578, 8528238, 5433345, 2906335, 2885721, 3558632, 2979205, 1346919, 365161, 1553171, 4042675, 4326335, 738696, -2763027, -1539947, 1780692, 216704, -6374396, -9943404, -5970541, 499619, 3586765, 4330366, 5478802, 5252154, 1981247, -526774, 1469750, 4864774, 4370503, 444686, -2978389, -5195560, -7459667, -8235547, -5791526, -2968589, -3362928, -4746854, -2064506, 4532003, 9902544, 10763485, 7679190, 2233219, -2976242, -3908798, -9248, 2744766, -627699, -6015889, -6063033, -1745146, -515269, -4207768, -7111247, -6283599, -5450727, -6958175, -7615100, -5468600, -3957802, -5601736, -7047388, -4402584, 682293, 3858698, 3673234]
8154C673234k279328l083634k530541n18241J049228P88268Q43407K923248M020348
8145D885989J506588o94318K017633N611733K427418n885736r651785n674679
8137e457157j080569q75240j091245J994330M603686K815642k15440n99053q55625
8128g60671l761980m814837O92721P268004N598945k519453n645113M40824O945797
8119C444237N729683q896l066456k652402j656681K75856L906237N127045K27082
8110A1325705o218049o365614p24223K687029M75245k337923j594562K36805m2548
8101b558135j003299k93083J294800K339790K947357K113632k152699p609397
8093d921034q016721j747249M993443O840103N678238M735043K542246k033250
$$ y = [3673234, 1393906, -1689728, -4220269, -4738510, -3689282, -2901014, -2057607, 865641, 4885989, 6392577, 5698259, 7715892, 13327625, 15755043, 9869307, 217522, -5457157, -6537726, -7412966, -8504211, -6509881, -1906195, 909447, 694007, 94954, -760671, -4522651, -9337488, -8644767, -1376763, 4222182, 1702729, -3942384, -3501560, 3444237, 9173920, 9165024, 6098568, 3446166, 1789485, 2065341, 5971578, 11098623, 11325705, 5107656, -1257958, -1982181, 704848, 1180093, -1157830, -2752392, -2515587, -2558135, -3561434, -3854517, -2559717, -219927, 2727430, 4841062, 2688363, -4921034, -12937755, -14685004, -9691561, -2851458, 2826780, 7561823, 10104069, 8070819]
8085H070819m718040k281158Q99138m08909l368038k205705J674849K620028O10956
8076H93940Q7767J345122J221535L08092J300609K116688p89035m029322j459293
8067I96103M470074N368174M64232k723906j532298j143214l113507k196456K483177
8058C072379M077940k1981l253363j700573o07322l318499l908326J769177O931608
8049C041040M455481j188661j870737R09879N21692k262854j646847J637191J404897
8040E001081k815574m973756k668909p9089j85903j009635o42445k40488o80305
8031h295023p50725K18924J338100K185670L009872L101155J627561l74739j125176
8022I35619l81691J169195L144533M292895K481454j864761m802838l749512p55963
$$ y = [8070819, 3352779, 1071621, 1970759, 1561850, -1806188, -4011893, -2337044, 282984, 893940, 981707, 2326829, 3548364, 3856456, 5157065, 7273753, 6484718, 2455396, 996103, 5466177, 10834351, 11298583, 8574677, 7042379, 5899165, 2785658, 589202, 3072379, 7150319, 7128338, 3874975, 2174402, 1567080, -1751419, -5659745, -3890568, 3041040, 7496521, 6307860, 4437123, 5347002, 5868694, 3605840, 1958993, 3596184, 5001081, 2185507, -2788249, -5457158, -5536247, -5722150, -6731785, -7374230, -7614718, -8295023, -9045748, -8826824, -7488724, -5303054, -2293182, 807973, 2435534, 2060795, 935619, 553928, 1723123, 4867656, 9160551, 11642005, 9777244, 4974406, 1224894, 468931]
8013D68931J232460K159243K510889J059520j886534k822742k65438K048239R08680
8004E413248j251844j022103K03817l41061j387551n15910J050853J266285J233370
7995D649104J779848M42482l030137l313575J988397N811591J525544n451621
7987D401633n286381P61420K946901j059109l962636k020796O71421K030388N188752
7978C671593R327601P679564j151524q778596q622887m154492r53421J669439
7970a312723N384755O308066J083859n361983n550196p9675L930459L090809M06743
7961G900114j330485k970563n035019m956714p09400M958568O531564K228784
7953F616849l151577l728851k70727R07962k325500m070891J56664N044511L051605
$$ y = [468931, 1701391, 3860634, 6371523, 7431043, 5544509, 2721767, 2456329, 4504568, 5413248, 4161404, 3139301, 3343118, 3002057, 1614506, 1098596, 2149449, 3415734, 4649104, 6428952, 6871434, 3841297, 527722, 2516119, 8327710, 9853254, 4401633, -884748, -123328, 2823573, 1764464, -2198172, -4218968, -3547547, -1517159, 3671593, 12999194, 20678758, 19527234, 10748638, 2125751, -2028741, -2982162, -1312723, 4072032, 10380098, 11463957, 6101974, 551778, 472103, 4402562, 7493371, 7900114, 6569629, 3599066, -1435953, -6392667, -7102067, -2143499, 4388065, 6616849, 3465272, -263579, -534306, 373656, -1951844, -6022735, -5866071, -821560, 2230045]
7944B230045l122079m179421R97522L837151L65635k881877o37604K739749K126712
7935A475833O03360K411359L745205p44851o852275n653245K464276P456594L557484
7926H463740l874838o891636m336705n36716R10339l18876k073691j462193K226367
7917g894209N799339N460889J812378r55014p67038L62312K55146p55995j856602
7908A461206l228777m049182k052246K569526N232317K144985l648266m887818
7900f458255P51619P113127O934362P40200m326412l706702j00807J774909J591093
7891D313134J873419K572344J306413j589718k555586k86876J978893J441808
$$ y = [2230045, -892034, -5071455, -4073933, -236782, 128853, -2753024, -3390628, -650879, 1475833, 2079193, 4490552, 8235757, 7490906, 638631, -5014614, -2550338, 4906256, 8463740, 4588902, -2302734, -6639439, -7176155, -6265816, -6584692, -8658383, -10120576, -7894209, -2094870, 3366019, 5178397, 4223383, 3456345, 3818657, 4073803, 3317808, 1461206, -1767571, -5816753, -7868999, -5299473, -67156, 2077829, -1570437, -6458255, -5706636, 1406491, 8340853, 9081053, 4754641, 1047939, 947132, 2722041, 4313134, 6186553, 8758897, 10065310, 8475592, 5920006, 5633130, 7612023, 9053831]
$$ [...]
##END NTUPLES=NMR SPECTRUM
##END=
