##TITLE=31Pdec_LY-3Dix.HYD.1
 CD3CN, 24 sc
 5.03.2021
##JCAMPDX= 6.0         $$ Bruker NMR JCAMP-DX V2.0
##DATA TYPE= NMR SPECTRUM
##DATA CLASS= NTUPLES
##ORIGIN= UXNMR, Bruker Analytische Messtechnik GmbH
##OWNER= root
$$ XWIN-NMR		Version 3.5
$$ Fri Mar  5 12:14:28 2021 Russian Standard Time (UT+4h)  she@DPX200
##.OBSERVE FREQUENCY= 81.013821
##.OBSERVE NUCLEUS= ^31P
##.ACQUISITION MODE= SIMULTANEOUS
##.ACQUISITION SCHEME= undefined
##.AVERAGES= 24
##.DIGITISER RES= 16
##SPECTROMETER/DATA SYSTEM= spect
##.PULSE SEQUENCE= zgpg30
##.SOLVENT NAME= CDCl3
##.SHIFT REFERENCE= (INTERNAL, CDCl3, 0, 248.564)
##AUDIT TRAIL= $$ (NUMBER, WHEN, WHO, WHERE, WHAT)
$$ ##TITLE= Audit trail, XWIN-NMR		Version 3.5
$$ ##JCAMPDX= 5.01
$$ ##ORIGIN= Bruker BioSpin GmbH
$$ ##OWNER= she
$$ F:/spectra/data/she/nmr/P31/1/pdata/1/auditp.txt
$$ ##AUDIT TRAIL=  $$ (NUMBER, WHEN, WHO, WHERE, WHAT)
(   1,<2021-03-05 12:13:23.40 +0400>,<she>,<DPX200>,
      <created by zg, POWCHK disabled, PULCHK disabled
       configuration hash MD5:
       00 E9 B6 7A A2 85 ED C7 34 08 36 98 17 FE 4E 26
       data hash MD5: 32K
       68 C5 17 F8 89 F4 29 0F DF 67 D2 87 5C 20 4A 88>)
(   2,<2021-03-05 12:13:26.00 +0400>,<she>,<DPX200>,
      <Start of raw data processing
       efp BC_mod = 2 LB = 1 FT_mod = 6 PKNL = 1 PHC0 = -3207.152 PHC1 = -231.599 SI = 64K 
       data hash MD5: 64K
       D8 94 DE C6 B6 36 29 97 FD F8 5B 7D 61 4F FC 04>)
(   3,<2021-03-05 12:13:55.92 +0400>,<she>,<DPX200>,
      <pk PHC0 = 200.5941 PHC1 = -393.8 
       data hash MD5: 64K
       4B 4C B4 0B 96 F0 7E 3C 4C CB DE 5A 56 77 15 2D>)
(   4,<2021-03-05 12:13:59.39 +0400>,<she>,<DPX200>,
      <abs ABSG = 5 
       data hash MD5: 64K
       53 31 87 44 40 7B 33 E1 9C 0D B9 AF A4 6B 71 55>)
$$ ##END=
$$ 
$$ hash MD5
$$ 06 CF 8F B1 C9 A9 1E 7B 0A 7A 72 37 B0 DC 15 7F
##$RELAX= 
##$RELAX= 
##$RELAX= 
##$RELAX= 
##$RELAX= 
##$RELAX= 
##$RELAX= 
##$RELAX= 
$$ Bruker specific parameters
$$ --------------------------
##$DU= <F:/spectra>
##$EXPNO= 1
##$NAME= <P31>
##$PROCNO= 1
##$TYPE= <nmr>
##$USER= <she>
##$AMP= (0..31)
100 100 100 100 100 100 100 100 100 100 100 100 100 100 100 100 100 100 
100 100 100 100 100 100 100 100 100 100 100 100 100 100 
##$AQSEQ= 0
##$AQ_mod= 1
##$AUNM= <au_zg>
##$AUTOPOS= <>
##$BF1= 81.014009
##$BF2= 200.13
##$BF3= 200.13
##$BF4= 200.13
##$BF5= 200.13
##$BF6= 200.13
##$BF7= 200.13
##$BF8= 200.13
##$BYTORDA= 1
##$CFDGTYP= 0
##$CFRGTYP= 5
##$CHEMSTR= <none>
##$CNST= (0..31)
1 1 145 1 1 1 1 1 1 1 1 1 1 1 1 1 1 1 1 1 1 1 1 1 1 1 1 1 1 1 1 1 
##$CPDPRG= <waltz16>
##$CPDPRG1= <>
##$CPDPRG2= <waltz16>
##$CPDPRG3= <>
##$CPDPRG4= <mlev>
##$CPDPRG5= <mlev>
##$CPDPRG6= <mlev>
##$CPDPRG7= <mlev>
##$CPDPRG8= <mlev>
##$CPDPRGB= <>
##$CPDPRGT= <>
##$D= (0..31)
0 1 0 0 0 0 0 0 0 0 0 0.03 2e-05 3e-06 0 0 0 0 0 0 0 0 0 0 0 0 0 0 0 0 
0 0 
##$DATE= 1614932002
##$DBL= (0..7)
120 120 120 11 120 120 24 19 
##$DBP= (0..7)
150 150 150 150 150 150 150 150 
##$DBP07= 0
##$DBPNAM0= <>
##$DBPNAM1= <>
$$ [...]
##$SUBNAM3= <"">
##$SUBNAM4= <"">
##$SUBNAM5= <"">
##$SUBNAM6= <"">
##$SUBNAM7= <"">
##$SUBNAM8= <"">
##$SUBNAM9= <"">
##$SW= 501.771253377433
##$SWIBOX= (0..15)
0 1 3 0 0 0 0 0 0 0 0 0 0 0 0 0 
##$SW_h= 40650.406504065
##$TD= 32768
##$TD0= 1
##$TE= 0
##$TE2= 300
##$TE3= 300
##$TEG= 300
##$TL= (0..7)
0 120 53 12 22 120 120 120 
##$TP= (0..7)
150 150 150 150 150 150 150 150 
##$TP07= 0
##$TPNAME0= <>
##$TPNAME1= <>
##$TPNAME2= <>
##$TPNAME3= <>
##$TPNAME4= <>
##$TPNAME5= <>
##$TPNAME6= <>
##$TPNAME7= <>
##$TPOAL= (0..7)
0.5 0.5 0.5 0.5 0.5 0.5 0.5 0.5 
##$TPOFFS= (0..7)
0 0 0 0 0 0 0 0 
##$TUNHIN= 0
##$TUNHOUT= 0
##$TUNXOUT= 0
##$USERA1= <user>
##$USERA2= <user>
##$USERA3= <user>
##$USERA4= <user>
##$USERA5= <user>
##$V9= 5
##$VALIST= <valist>
##$VCLIST= <CCCCCCCCCCCCCCC>
##$VD= 0
##$VDLIST= <DDDDDDDDDDDDDDD>
##$VPLIST= <PPPPPPPPPPPPPPP>
##$VTLIST= <TTTTTTTTTTTTTTT>
##$WBST= 1024
##$WBSW= 4
##$XGAIN= (0..3)
0 0 0 0 
##$XL= 0
##$YL= 0
##$YMAX_a= 7184
##$YMIN_a= -9182
##$ZGOPTNS= <>
##$ZL1= 120
##$ZL2= 120
##$ZL3= 120
##$ZL4= 120
##$ABSF1= 248.5645
##$ABSF2= -253.2056
##$ABSG= 5
##$ABSL= 3
##$ALPHA= 0
##$AQORDER= 0
##$ASSFAC= 0
##$ASSFACI= 0
##$ASSFACX= 0
##$ASSWID= 0
##$AUNMP= <proc_1d>
##$AZFE= 0.1
##$AZFW= 0.5
##$BCFW= 0
##$BC_mod= 2
##$BYTORDP= 0
##$COROFFS= 0
##$CY= -3
##$DATMOD= 1
##$DC= 0
##$DFILT= <>
##$DTYPP= 0
##$F1P= 0
##$F2P= 0
##$FCOR= 1
##$FTSIZE= 65536
##$FT_mod= 6
##$GAMMA= 0
##$GB= 0
##$INTBC= 1
##$INTSCL= 5.30512e-09
##$ISEN= 30
##$LB= 1
##$LEV0= 0
##$LPBIN= 0
##$MAXI= 10000
##$MC2= 0
##$MEAN= 0
##$ME_mod= 0
##$MI= 50
##$NCOEF= 0
##$NC_proc= -7
##$NLEV= 6
##$NOISF1= 182.463
##$NOISF2= 159.3651
##$NSP= 0
##$NTH_PI= 0
##$NZP= 0
##$OFFSET= 248.5645
##$PC= 4
##$PHC0= -3006.558
##$PHC1= -625.399
##$PH_mod= 1
##$PKNL= yes
##$PPARMOD= 0
##$PSCAL= 0
##$PSIGN= 0
##$REVERSE= no
##$SF= 81.014009
##$SI= 65536
##$SIGF1= 159.3651
##$SIGF2= -187.1042
##$SINO= 113.3802
##$SIOLD= 16384
##$SREGLST= <1H.CDCl3>
##$SSB= 0
##$STSI= 65536
##$STSR= 0
##$SW_p= 40650.406504065
##$SYMM= 0
##$S_DEV= 0
##$TDeff= 32768
##$TDoff= 0
##$TI= <>
##$TILT= no
##$TM1= 0
##$TM2= 0
##$TOPLEV= 0
##$USERP1= <user>
##$USERP2= <user>
##$USERP3= <user>
##$USERP4= <user>
##$USERP5= <user>
##$WDW= 1
##$XDIM= 65536
##$YMAX_p= 453626152
##$YMIN_p= -32751781
$$ End of Bruker specific parameters
$$ ---------------------------------
##NTUPLES= NMR SPECTRUM
##VAR_NAME=  FREQUENCY,     SPECTRUM/REAL,   SPECTRUM/IMAG
##SYMBOL=    X,             R,               I
##VAR_TYPE=  INDEPENDENT,   DEPENDENT,       DEPENDENT
##VAR_FORM=  AFFN,          ASDF,            ASDF
##VAR_DIM=   65536,         65536,           65536
##UNITS=     HZ,            ARBITRARY UNITS, ARBITRARY UNITS
##FACTOR=    0.620285442955139, 1,           1
##FIRST=     20137.2065510759, 0,            0
##LAST=      -20513.1999529892, 0,           0
##MIN=       -20513.1999529892, -32751781,   0
##MAX=       20137.2065510759, 453626152,    0
$$ Real data points
##PAGE= N=1
##DATA TABLE= (X++(R..R)), XYDATA
$$ [...]
35915D768179j734281k470508j106037l97064j014648j673011j124818L04691
35907d447497J048677O70065R27502K683292L277553L92516k847901j740250J531604
35898A495561m1837o485329q720040k050293N611742N207594Q636n73711L714103
35889a833574M675000Q3748k814853L01261M024227K444090k038263l799644k428683
35880a386691j091554n59621J35058P0358j720687k952352j191397J439733J178835
35871f078318j063508j089263J482800K517998K69102j826292q20659J432904
35863e175236J935505J088028Q63033J153794Q65092M56530M32726o13710l049441
35854b043679l361219J193419O360976M998273k181462o080524j818086L978451
$$ y = [4768179, 3033898, 563390, -542647, -939711, -1954359, -3627370, -4752188, -4447497, -3398820, -2728755, -1801253, 882039, 4159592, 4552108, 1704207, -36043, 1495561, 1453724, -5031605, -13751645, -15801938, -10190196, -4982602, -4973966, -5547677, -1833574, 2841426, 2925174, 110321, 411582, 4435809, 6879899, 4841636, 1041992, -1386691, -2478245, -3037866, -2902808, -2832450, -4553137, -7505489, -8696886, -7257153, -6078318, -7141826, -8231089, -6748289, -4230291, -3961189, -5787481, -6608140, -5175236, -3239731, -2151703, -1288670, -134876, 730216, 1186746, 1619472, 1005762, -2043679, -5404898, -4211479, 2149497, 7147770, 4966308, -1114216, -2932302, 1046149]
35846A046149K913058k899545m573818J53893M352996K607833k139491m106597
35838b645522j954288J722507M250279L991058Q98444k105693j499484J460384
35830D117685J510259k411258m209119N43164O840795O296439j425454q268894
35822B993617p831163j476236M881225O319592J934670m125990n442303n46054
35814c292642L940917J442543m815954n645995R20083O579290M396054k364676
35806A159620o060559m535776j156828J516207L379650L777564J413486k476819
35798b983455m099315j455484K864331M337610J462402k604882l394646K94513
35790e578926N491439Q155515O143521j49127p586844j0665696n813907K941684
$$ y = [1046149, 3959207, 1059662, -3514156, -3360263, 992733, 3600566, 1461075, -2645522, -4599810, -2877303, 1372976, 5364034, 6262478, 4156785, 2657301, 4117685, 5627944, 3216686, -992433, -449269, 6391526, 12687965, 11262511, 2993617, -4837546, -6313782, -1432557, 4887035, 6821705, 2695715, -2746588, -3292642, 648275, 2090818, -2725136, -8371131, -7451048, -871758, 3524296, 1159620, -4900939, -9436715, -10593543, -9077336, -5697686, -1920122, -506636, -2983455, -7082770, -8538254, -5673923, -1336313, 126089, -2478793, -5873439, -5578926, -87487, 8068028, 14211549, 14062422, 6475578, -4190118, -10004025, -7062341]
35782g062341O464672J690885l509291r74972N948342P409359J364766m539337
35774F792083m830561k319965j161543r08962r1581J88986o01730k57542K411944
35765g78871N283374O121097M568673N63429m648062o315714j470085L740750
35757G064591M58529q057323q357444K884835J1706809O712921m424660p670547
35749C17711k822945M24047k88472L53665K441602O62582m253277n580511k051244
35740a0796842J017641J951138M025873O503007M654719m45867k272051j71303
35732D466315k28942l408775l586708K88753J336530k371594l421722J486337
35724e439806M876957J644745j937464r6874J872556j706294n054616r05175N410553
$$ y = [-7062341, -597669, 1093216, -2416075, -3391047, 2557295, 9966654, 11331420, 6792083, 1961522, -358443, -1519986, -2428948, -2520529, -2331543, -2933273, -3190815, -778871, 4504503, 10625600, 15194273, 15757702, 11109640, 4793926, 3323841, 7064591, 7523120, -534203, -8891647, -6006812, 5699997, 12412918, 7988258, 317711, -2505234, -2081187, -2369659, -2015994, 425608, 1088190, -3165087, -8745598, -10796842, -9779201, -7828063, -3802190, 2700817, 7355536, 6909669, 4637618, 4466315, 4237373, 828598, -2758110, -2469357, -1132827, -3504421, -6926143, -5439806, -562849, 1081896, -855568, -952442, 920114, -786180, -5840796, -6745971, -1335418]
35715a335418M151079k283740l821536K03626J635495r82800r24138K723571K769607
35706B135746k258528m270628N82689N234478L745883J83194k50199J09331j713756
35697C498210k008127K046724M435711q69567q333437p999437q58224L237906
35689f850241J455974Q83707M576684N566656q43936p713276o127887J570589
35681g481730N511341K054312l084557m190085j751241J037721K735645L073874
35673b094720J730647l53298q92567Q28148K580260J931335q37183l260481l117366
35664c485225j58045L356199L932825K45784m709212o364835l404608J478745
35656i108372M861115M833531J333215k981615l561146O49228L982348J028924
$$ y = [-1335418, 2815661, 531921, -3289615, -3085989, -1450494, -2433294, -3357432, -633861, 2135746, -122782, -4393410, -3810721, 1423757, 5169640, 5352834, 5102635, 5211966, 3498210, 1490083, 3536807, 7972518, 7102951, -1230486, -9229923, -10088147, -6850241, -5394267, -4510560, 66124, 5632780, 4788844, -2924432, -9052319, -7481730, -1970389, 83923, -3000634, -7190719, -8941960, -7904239, -5168594, -2094720, -364073, -717371, -1609938, -781790, 1798470, 3729805, 2892622, -367859, -3485225, -3643270, -287071, 3645754, 3891538, -817674, -7182509, -10587117, -9108372, -4247257, 586274, 1919489, -1062126, -4623272, -3974044, 8304, 1037228]
35648A037228m259613l028428M606394Q070775J521286p285167q300435k610184
35640a0248144J844008K419073K201656K226766R58520p87376j161251j448185
35632c994933k933296k598140J443239L870829k76901n318499k186890O085678
35624e908913P516966j63313n912894k781924K649460K736865J83152O43571K455895
35615A418865R68991l013322n595971n861807m515063j205083K534241K887098
35607a2382051K32587J00491L658002M270410j297836n816868k626352L300342
35599a0561275L703418M68030J067751M877757M474017j252874n095490k792419
35591e111085J782783L550072J875923j433378m378438m523219j038742K927763
$$ y = [1037228, -3222385, -6250813, -1644419, 6426356, 7947642, 662475, -7637960, -10248144, -8404136, -5985063, -3783407, -1556641, -598121, -1385497, -2546748, -3994933, -6928229, -9526369, -8083130, -4212301, -4489202, -9807701, -11994591, -5908913, 1608053, 1444740, -4468154, -7250078, -4600618, -1863753, -1680601, -1037030, 1418865, 2387856, -625466, -6221437, -12083244, -16598307, -17803390, -15269149, -12382051, -12149464, -12048973, -8390971, -4120561, -5418397, -11235265, -13861617, -10561275, -6857857, -6389827, -5322076, -444319, 4029698, 2776824, -2318666, -5111085, -3328302, 221770, 2097693, 664315, -3714123, -8237342, -9276084, -6348321]
35583f348321L576207J292506j091816k765317l844643k597133J515642M568869
35575e694006K927819j076120k909323k385793j602225N2155L143329M261121
35567c283043J244002j512997Q3900J935730j181931n069690k460692L613621
35559f631100M000782j186767l282863l40879P66404j840858j893694K082113
35551h326862L206874o38000k207534J668257L669212p73416m727521j732466
35543i861456L230808L031460P4058q1154Q09821j113010k605768R32792N601198
35534A8749M573306l70341k249802o67801q38330l064895k608809O85563J432528
35525c089832k008839m732024l043800R07868L454697L570199J955998j1878j98423
$$ y = [-6348321, -2772114, -1479608, -2571424, -5336741, -9181384, -11778517, -10262875, -5694006, -2766187, -3842307, -6751630, -9137423, -10739648, -10687493, -7544164, -3283043, -2039041, -3552038, -3468138, -1532408, -2714339, -7784029, -10244721, -6631100, -2630318, -3817085, -7099948, -7440827, -6674423, -8515281, -10408975, -8326862, -5119988, -5757988, -7965522, -6297265, -2628053, -3401469, -8128990, -9861456, -6630648, -3599188, -3525130, -3606284, -2796463, -3909473, -6515241, -5582449, 18749, 4592055, 4221714, 1971912, 1304111, 465781, -2599114, -5207923, -4522360, -3089832, -5098671, -9830695, -12874495, -11966627, -8511930, -4941731, -2985733, -2997611, -3196034]
35516c196034J928331L299122R92152k995040m242218j993661P60815J887703
35508c558830J355330l34325j476463P46526N658670P401398K455212m085024
35500H162494n139452j721370j77202j845342k644087j390882p81754n72893K260549
35491c849939O000126M815076j293195m794116j844068J687391n00547n467383
35483e246655n602347O78103P361344Q334624L536265j508204j287823L386970
35475I652277N410093J83847p366906q994127m600930j160243r93018P21696N483169
35466a664142P380406L213874j363193j124083M25329j571475l902830j003903
35458C89983M542707N579737J627032j491017j554784j668599k834133k430420
$$ y = [-3196034, -1267703, 2031419, 3023571, 28531, -4213687, -6207348, -5446533, -3558830, -2203500, -2537825, -4014288, -3267762, 2390908, 9792306, 12247518, 8162494, 3023042, 1301672, 1124470, -720872, -3364959, -4755841, -5537595, -6110488, -3849939, 2150187, 6965263, 5672068, 877952, -966116, 721275, 220728, -5246655, -10849002, -10170899, -2809555, 5525069, 9061334, 7553130, 6265307, 9652277, 15062370, 15246217, 7879311, -1114816, -5715746, -6875989, -7869007, -7147311, -1664142, 5716264, 8930138, 7566945, 6442862, 6868191, 5296716, 1393886, 389983, 4932690, 10512427, 12139459, 10648442, 9093658, 7425059, 4590926, 2160506]
35450B160506m49673k57786k137090k459941n57069j21238j962594j696307K454759
35441e026433N432925K983597j365454j988158k73747k099572p474234q696615
35433a8507691o43242J0828893J4155298N386076o383356q867355q73251O687935
35425A783307N105096j192348k155310K856670M699320j065882p056583m890527
35417a916257K718884O065948J644146m131509l858270K081143O499892L569542
35409A2673519m511142r320429n707044J645825M087069M90806k047681N19482
35401b169595L481088J781160j839232j975741P52835J825655M35266o46474n37770
35392A107192l97411q6610O18276j72712k778835l160757P98226L905515J253099
$$ y = [2160506, 1710833, 1453047, -684043, -3143984, -3701053, -3822291, -5784885, -7481192, -5026433, 406492, 3390089, 2024635, 36477, -237270, -2336842, -9811076, -18507691, -19150933, -8322040, 5833258, 11219334, 4835978, -4031377, -4904628, 1783307, 6888403, 5696055, 3540745, 6397415, 11096735, 10030853, 2974270, -1916257, 802627, 6868575, 8512721, 4381212, 522942, 2604085, 9103977, 12673519, 8162377, -1158052, -6865096, -5219271, -1132202, -641396, -2689077, -2169595, 1311493, 3092653, 1253421, -722320, 30515, 1856170, 2291436, 1644962, 1107192, 709781, 623171, 1241447, 1068735, -1710100, -4870857, -4072631, -167116, 1085983]
35383A085983k656645q54712L420220J596683m531783m424847L126697O732056
35375C493652Q44618n424971m092994p09231k346240m127648J016906P609869
35367c736039N512543k771198n660096n88398L894582L171666J760702K591988
35359D175750K174968r56652k579756r42717k93423k592318l260969O09925M564238
35350H99046M008014J387406J174920K493480J884535l45028j535863j546561
35342H419949j707014j398076J05182O72079j592543m319603m194396k482928
35334f497350k621698l639124j223610M717746Q679690O906535J845630k300302
35326E867517m453904m959141l015812P24810K180349j083340m832708l317240
$$ y = [1085983, -1570662, -2425374, 994846, 2591529, -1940254, -6365101, -3238404, 3493652, 4338270, -1086701, -5179695, -5888926, -8235166, -12362814, -11345908, -3736039, 1776504, -994694, -6654790, -7243188, -3348606, -176940, 1583762, 4175750, 6350718, 5394066, 2814310, 1871593, 1578170, -1014148, -4275117, -3665192, 899046, 4907060, 6294466, 7469386, 9962866, 11847401, 11502373, 9966510, 8419949, 6712935, 5314859, 5420041, 6092120, 4499577, 179974, -4014422, -6497350, -9119048, -12758172, -13981782, -9264036, -584346, 6322189, 8167819, 5867517, 1413613, -3545528, -6561340, -5836530, -3656181, -4739521, -9572229, -12889469]
35318a2889469J612296K529795j964422m455218k41028N122160M974909K328402
35310b982575L948103P852725O189161r34231m676288j640036J118214j495959
35302G379114m583750k863578M9383j150986l820075k724072L54345O03612n31781
35293g287788J240701L609688R41691m669713n123362Q31274N364614L676818
35285a416077K58089L46194K092781J169836j773383k477778O26408M458689M725474
35276H010233M50228m329488m451405k98026K096261l13216k919599j266003J320430
35267a700585p637k163729Q47165O431147O374701J76873m189405l043515j010022
35258A714993j085566k74454K372846K476331j365222m136351l051633j879970
$$ y = [-12889469, -11277173, -8747378, -10711800, -15167018, -15408046, -10285886, -5310977, -2982575, 965528, 8818253, 15007414, 14073183, 9396895, 7756859, 8875073, 7379114, 2795364, -68214, -18831, -1169817, -4989892, -7713964, -7359619, -6756007, -7287788, -6047087, -2437399, -1495708, -6165421, -11288783, -10457509, -5092895, -1416077, -1157988, -811794, 1280987, 2450823, 677440, -1800338, -1173930, 3284759, 8010233, 8460461, 4130973, -320432, -618458, 1477803, 1164587, -1755012, -3021015, -1700585, -1708222, -3871951, -3024786, 3406361, 9781062, 9957935, 5768530, 2725015, 1714993, 629427, 354973, 2727819, 5204150, 3838928, -297423, -3349056, -5229026]
35250e229026k641651r25067N357595R824400O501945q54165m608384l881322
35242C544325l187630l899856l187771P2879L051297K521140j337386m341149
35234f764151k074280L833143N628688q4041n347076j774462M985210K826590
35226A229621o285378p569894K639599R789056M285209l393058j043442N203141
35218D854854K797678n443481o923625k54792M653401L963578K904978L009807
35210I562398R5624m754744m827083j35915J053222m175769q023892l813106M685884
35201a0333381R436339P622127K081809k813152l688719o54338J837358J93910
35193C681953k936319k642059O49135K821780L225304L809960L190648q79001
$$ y = [-5229026, -7870677, -8795744, -3438149, 6386251, 12888196, 12034031, 7425647, 3544325, 356695, -3543161, -6730932, -6658053, -3606756, -1085616, -2423002, -6764151, -8838431, -5005288, 623400, 539359, -4807717, -6582179, -1596969, 1229621, -5055757, -12625651, -9986052, -196996, 4088213, 695155, -348287, 4854854, 7652532, 2209051, -4714574, -4969366, -315965, 3647613, 6552591, 9562398, 9658022, 4903278, 76195, -59720, 993502, -3182267, -11206159, -15019265, -10333381, -897042, 6725085, 8806894, 5993742, 2305023, 1650685, 3488043, 3681953, 745634, -1896425, -1247290, 1574490, 4799794, 8609754, 11800402, 10921401]
35185A0921401m642069k506003K560475K131392l663929n295224O90612N538369
35177E735024K231329l595438l279904J489370K697830j145413l993116k191070
35169b051388J157059J781581l42309k025415r89691J564911K065946r56984l898875
35160c695165k056864L429946O190743L134349j566854k943978j783142j602966
35152h93931k324200j174587J750056L179872J824399J18302p6198l66047k477796
35143d40130m315772k418360K448496N590073M815428K966049K306232N40857
35135A1492873l768938n742640n10041P112540P209218p16286o130739k730733
35127F215254K872163K123667l108211n250601k643228J48803Q0447j949324l685887
$$ y = [10921401, 6279332, 3773329, 6333804, 8465196, 4801267, -493957, 196655, 5735024, 7966353, 4370915, 1091011, 2580381, 5278211, 4132798, 139682, -2051388, -894329, 887252, 544943, -1480472, -2470163, -905252, 1160694, 203710, -3695165, -5752029, -2322083, 3868660, 7003009, 5436155, 2492177, 709035, -893931, -3218131, -4392718, -2642662, 537210, 2361609, 2479911, 2403713, 2037666, -440130, -4755902, -7174262, -4725766, 864307, 5679735, 8645784, 10952016, 11492873, 7723935, 1981295, 1471254, 8583794, 15793012, 15076726, 8945987, 6215254, 9087417, 11211084, 8102873, 2852272, 209044, 357847, 438294, -1511030, -5196917]
35118e196917k450858L020270Q397380O472367k253846q039657n518385j243344
35110f812990j603654k126835K302225N469119J62523o701346l600540N717593
35102g193905P413364K11408l418206J112552M282838Q46139j591915J846513
35094C508788L676231j931430p647575m839841K561051N374025K878834M13644
35086C993727o00838j867532k353378q71760m39678l220484m977500j205326M610531
35077f932238N442692R19539k973295k632990p091J762972J515514k22535j505749
35068d633181j05494L271277M605035J488364l407060n460244k890143K379657
35060d751789O334580N293356j39446l936763j490852L241758K798441k415958
$$ y = [-5196917, -7647775, -4627505, 3769875, 10242242, 7988396, -51261, -5569646, -6812990, -8416644, -10543479, -8241254, -2772135, -2609612, -9310958, -12911498, -7193905, 219459, 430867, -2987339, -1874787, 2408051, 3254190, 1662275, 3508788, 7185019, 5253589, -2393986, -7233827, -4672776, 701249, 3580083, 3993727, 3392889, 1525357, -828021, -1699781, -2139459, -5359943, -10337443, -11542769, -6932238, -1489546, -570007, -3543302, -6176292, -6183383, -4420411, -2904897, -3127432, -4633181, -4738675, -1467398, 3137637, 4626001, 1218941, -4241303, -7131446, -4751789, 1582791, 6876147, 6736701, 2799938, 1309086, 4550844, 7349285, 4933327]
35052D933327m856010k044322K83791j067714j757611Q67788K244050o29193k709004
35043d734898N69305M946331M333576P21859M8118K316742K729626j40440l311890
35034G478329m555354l881656j731106P75247J892157J897171K663674L211562
35026G750024M31457m192261m857450r31772R99797j937359l829161o35148K345429
35017d856444J29568k748255n48642L292276K914240Q17870K237886M252547J119251
35008F610297l767399k541712L114825L982158j612917n599626l554049l18240
35000c686663o06961k636401l243592k147209O37898N132377P903297M713194
34992F065940k048209m869886j506253K186299J428274j349670j766253K46669
$$ y = [4933327, 77317, -1967005, -1683214, -2750928, -4508539, -3640751, -1396701, -2025894, -4734898, -4165593, 780738, 5114314, 5836173, 5884291, 8201033, 10930659, 10790219, 7478329, 2922975, -958681, -2689787, -1914540, -22383, 1874788, 4538462, 7750024, 8181481, 3989220, -868230, -1800002, -800205, -2737564, -6566725, -7201873, -4856444, -4726876, -7475131, -8023773, -4731497, -1817257, -999387, 1238499, 5491046, 6610297, 2842898, 301186, 3416011, 7398169, 5785252, 185626, -3368423, -3686663, -4293624, -6930025, -10173617, -12320826, -11682928, -6550551, 1352746, 6065940, 4017731, -852155, -2358408, -172109, 1256165, -93505, -1859758, -1613089]
34984a613089K028559K226727J174525k0092J18536J507729J424921j729162m908481
34975B10173m444204j882122j080484j249675J204302M960928M668227j82672
34967B204473l861070l092763j000308n19021K62412L342989O218722N514772
34959I070206K047933p03682j182859p25923j276745l243311m790415l453888
34951d258684M68426L319861K511475j71250j691969j837012j560958j51679K417641
34942i54149L176921L95558k500430j654405J257804K340181J665429J156070
34934D882979j28738k731488k738971J969941N270097R45534n988638n622755
34926d142039J553591N918762L754951J93603k028818n021593o688379j794453
$$ y = [-1613089, 415470, 2642197, 3816722, 3796630, 3915166, 5422895, 6847816, 5118654, 210173, -4234031, -6116153, -7196637, -8446312, -7242010, -2281082, 2387145, 2204473, -1656597, -4749360, -5749668, -6268689, -6006277, -2663288, 3555434, 9070206, 11118139, 10414457, 9231598, 8505675, 7228930, 3985619, -804796, -4258684, -3790258, -470397, 2041078, 1869828, 177859, -1659153, -3220111, -3371790, -954149, 2222772, 2618330, 117900, -1536505, -278701, 2061480, 3726909, 4882979, 4754241, 2022753, -716218, 1253723, 6523820, 7469354, 1480716, -4142039, -2588448, 3330314, 7085265, 7278868, 5250050, 228457, -6459922, -8254375]
34918h254375O081651O476853r10985m181007J301286N148432L62750m394410
34910A630195o54139M407416Q86577n657245l354992N503514Q080919J472403
34902A2314648m536494m042142j581894j542255k188172j907444j948965j219480
34894f652198L107097Q115416O619205j556823p487640n317664L72049K724922
34886g5636J814940J453497J855616M82522k544974m060614j975880K351794N200053
34877D501318L491570j831579n699982m266500K77685K855535K370990J722300
34869C421337J778601J32337l617056n942806m291618l54443K887870M260992
34861a724786L634733J376641m54778L73060K598377K499952o20026l325900l120764
$$ y = [-8254375, -2172724, 4304129, 3393144, -787863, 513423, 5661855, 6024605, 1630195, 976056, 5383472, 6270049, 612804, -2742188, 2761326, 10842245, 12314648, 7778154, 3736012, 2154118, 611863, -1576309, -3483753, -5432718, -6652198, -3545101, 4570315, 11189520, 9632697, 2145057, -3172607, -2800558, -75636, 1739304, 3192801, 5048417, 5530939, 2985965, -1074649, -3050529, -698735, 4501318, 7992888, 6161309, 461327, -3805173, -3527488, -671953, 1699037, 3421337, 5199938, 5332275, 1715219, -4227587, -8519205, -8873648, -5985778, -1724786, 1909947, 3286588, 2831810, 3204870, 5803247, 8303199, 7683173, 4357273, 1236509]
34852A236509j123608Q52390J997633R17563k945272n695266k464733M151434
34844c073350N734323O40621k490946J693354N986228K163819m907979m615835
34836A130235K102467M189873j733414o463569l242405K627744L640879R67613
34828C219423l92523m97286j721951k253711M06388K944404O81926l588637k836859
34819d038826K782433N493341K051493j184202J340551N357677L648392k331035
34811A3119824m481027l52297L329955Q06444m624699o063896k743273L66045
34803f42924Q27416J257048L188718L646405M49371l075859k649082J95462M08860
34794C605415k648364m255863j510598K750667M320175K566426k66171k013708
$$ y = [1236509, 112901, 965291, 2962924, 3880487, 935215, -4760051, -7224784, -3073350, 2660973, 3301594, 810648, 2504002, 8490230, 10654049, 5746070, 1130235, 3232702, 7422575, 5689161, -774408, -4016813, -1389069, 2251810, 3219423, 2826900, 2329614, 607663, -1646048, -1239660, 1704744, 2386670, -1201967, -4038826, -1256393, 4236948, 6288441, 5104239, 6444790, 11802467, 15450859, 13119824, 8638797, 8286500, 11616455, 12422899, 7798200, 1734304, -1008969, -642924, 184492, 1441540, 4630258, 8276663, 8726034, 5650175, 3001093, 3196555, 3605415, 957051, -3298812, -4809410, -2058743, 2261432, 4827858, 4561687, 2547979]
34786B547979j813641o44615r94529l542916m696600j045435M332871N013125
34778h43761P71166j995619m46842R67587o82022j738642K31252J053800j902735
34769d585816l297903J223846O118256M638044P43530K105013N722850K528667
34761A5196487n862514p925903n22099N857196L253302l139580n014513k437369
34753e94993p2271N97502J36697j631572k961147m63715M328744M814441n82091
34744C571595m650402k030056K775630L058179j83255j530281K91754K388963
34736C692127K598556L77044l500968n331880j514517M301096L669084l696459
34728E94083p310535j382940N514824L697846k481705k495778L140404M733403
$$ y = [2547979, 734338, 89723, -904806, -4447722, -9144322, -10189757, -5856886, -843761, -72595, -2068214, -2515056, -1547469, -2229491, -3968133, -3736881, -2683081, -4585816, -7883719, -6659873, -541617, 4096427, 4839957, 6944970, 12667820, 15196487, 9333973, 1408070, 885971, 6743167, 9996469, 6856889, 1842376, -594993, -667264, -69762, 66935, -1564637, -4525784, -4989499, -660755, 4153686, 3571595, -1078807, -3108863, -333233, 2724946, 2541691, 1011410, 1303164, 3692127, 6290683, 6667727, 3166759, -2165121, -3679638, 621458, 4290542, 594083, -6716452, -8099392, -2584568, 1113278, -1368427, -3864205, -723801, 4009602]
34720D009602m06693m771798l432385k25059M61633J32792J620527L745390L587994
34711D722003Q46346k140165l076754j736087r3389N1734m02925L18849J024286
34702d86102o25238k658181p94539L325500K843930l199124o904196l109054L441142
34693h165862O494823O199124M248813m08691n692068n135736J214797L979493
34685B734693n17551k841848L255676Q494701L429089m742472m568953K22025
34677E465360n15154l679678J02351O397083L406414n453556n732119K704063
34669B694764N065495k547454p151082k276056K335784K90247p53753M087093
34661A745038O240973l66668o982488m147503L448100O074541L141491m19124
$$ y = [4009602, 3602909, -1168889, -4601274, -4826333, -4364700, -4231908, -2611381, 1134009, 4722003, 5568349, 3428184, 351430, -1384657, -1478046, -1426312, -1829237, -1510388, -486102, -1111340, -3769521, -4564060, -1238560, 1605370, -1593754, -8497950, -11607004, -8165862, -1671039, 4528085, 8776898, 8368207, 2676139, -2459597, -1244800, 2734693, 2217142, -624706, 2630970, 11125671, 14554760, 9812288, 5243335, 5465360, 4950206, 1270528, 1372879, 7769962, 11176376, 5722820, -9299, 2694764, 7760259, 5212805, -1938277, -4214333, -1878549, -1588302, -2342055, 1745038, 7986011, 7619343, 636855, -3510648, -62548, 6011993, 9153484, 8734360]
34653H734360l030249m023401q01382M693429M981778j510782o587652n005352
34645b549251j540453l77360J691006N519577M636395k551805o750310k323603
34637d245804K785052O07396l678553j910113L177811M488034K640882J565460
34629E430165j53631l901738m762359j41435L124836k37705m014584j458100K470115
34620c644436Q27905j865784J636811O693588M416463k032878k657464K172056
34612E546261L306427j157158m125505k268918N40409J417473R51405n17222j466618
34603B226554J983727Q400037Q509244q71511q306139m140084L168392P92469
34595A1762689o662303n723082K086999L824526j237672j579863L828223L097991
$$ y = [8734360, 5704111, 1680710, 879328, 5572757, 10554535, 9043753, 2456101, -2549251, -4089704, -4467064, -2776058, 2743519, 7379914, 4828109, -1922201, -4245804, -1460752, -853356, -4531909, -6442022, -3264211, 1223823, 3864705, 5430165, 5276534, 1374796, -3387563, -3528998, -404162, -641867, -4656451, -6114551, -3644436, -2816531, -4682315, -3045504, 3648084, 8064547, 6031669, 3374205, 5546261, 8852688, 7695530, 3570025, 1301107, 1841516, 3258989, 4210394, 3693172, 2226554, 4210281, 12610318, 21119562, 20248051, 11941912, 7801828, 10970220, 11762689, 5100386, -622696, 1464303, 5288829, 4051157, 2471294, 6299517, 9397508]
34587I397508o000083j0440770l781306L933105M194446J949034K660716K408335
34579D320985j374537k869567L75386J262228l237199m712216J553309O220464
34571A538853J133560n950601l765686M104440N904677M72676l174120j203090
34563i39291J561870J681288P41741l30896k359714l535468q82520L815617N335368
34554E087995K439822q25971j435027p79860j204448k388217k267802K0990K827569
34545A475051L459457J201723j733444l140531l279538k849222r49767K133152
34537c683119L136480R11279p6479L210564N563378J128830n475630m975627J607106
34528A346782M355868L04824l422866l249065l908807o726804n140289L020053
$$ y = [9397508, 3397425, -7043345, -10824651, -6891546, -2697100, -748066, 1912650, 4320985, 2946448, 76881, 452267, 1714495, -1522704, -6234920, -4681611, 1538853, 2672413, -3278188, -7043874, -2939434, 2965243, 3437919, 263799, -939291, 622579, 2303867, 3045608, 2714712, 354998, -3180470, -4062990, -247373, 5087995, 7527817, 6701846, 5266819, 4486959, 3282511, 894294, -1373508, -1352518, 1475051, 4934508, 6136231, 4402787, 1262256, -2017282, -4866504, -5816271, -3683119, -546639, 364640, 288161, 3498725, 9062103, 10190933, 4715303, -260324, 1346782, 5702650, 6007474, 2584608, -664457, -4573264, -11300068, -16440357, -13420304]
34520a3420304R433101P475405J396854k287986l760936m743199l270266N31144
34512h646187J976374N59628K076211O816437O328717j538353o127303j041371
34504D04153M235478M38709n423619l078116K606672J390887l039102m28714O029664
34495C136012M982921k095806l681257K83931j199727p957725o533892N692499
34487g373044J2842281M409444q878601j2034705n645615P16518L860076N729818
34479f373828N534394K837145J825541M178611M014610k293429p836353n135523
34471c248832J558804L088591l04370j223896J542206J965942j842749m370644
34463b834948k021801J469080J238732j897774l217147k70329M030089M125694
$$ y = [-13420304, -3987203, 3488202, 4885056, 2597070, -1163866, -5907065, -9177331, -8646187, -6669813, -6110185, -4033974, 2782463, 9111180, 7572827, 1445524, 404153, 4639631, 5078340, -345279, -3423395, -816723, 574164, -2464938, -2893652, 3136012, 8118933, 6023127, 2341870, 2625801, 1426074, -6531651, -13065543, -7373044, 5469237, 9878681, 1000080, -11034625, -16680240, -15963722, -12103646, -6373828, -839434, 1997711, 3823252, 8001863, 12016473, 9723044, 1886691, -3248832, -1690028, 1398563, 1094193, -129703, 1412503, 3378445, 1535696, -2834948, -4856749, -3387669, -2148937, -4046711, -7263858, -7534187, -3504098, 621596]
34455F21596j428262o256819k962412N729760Q580981J446545n769674l434024
34447c472309L406015L559622k584415m875434n69278K372953j9396j547866J886214
34438a843894M473478J104971l020136j230373K902511J668418l425221m055957
34430c426203J088783M416085J797077j896910j971778q93970j963822k334768
34422e185506J787627O943989N982976j436040p667237o879624j463346K653061
34414e264100L261629K195802J129144J08653o52534j96459J501443K722441J636237
34405F442256j646100m973509o048053m401801j507624R75643K579009L379150
34397e201029K933957J145271l27024N68230L169014M289309K409689j82827q47504
$$ y = [621596, -806666, -7063485, -10025897, -4296137, 4284844, 5731389, -38285, -3472309, -66294, 3493328, 908913, -3966521, -4535799, -2162846, -2182242, -3730108, -1843894, 2629584, 3734555, 714419, -515954, 2386557, 4054975, 629754, -3426203, -2337420, 2078665, 3875742, 1978832, 7054, -886916, -2850738, -5185506, -3397879, 3546110, 9529086, 8093046, 425809, -6453815, -7917161, -5264100, -2002471, 193331, 1322475, 1431128, 778594, 582135, 2083578, 4806019, 6442256, 4796156, -177353, -6225406, -10627207, -12134831, -11159188, -8580179, -5201029, -2267072, -1121801, -1448825, -880595, 2288419, 6577728, 8987417, 8804590, 7957086]
34388G957086l17890p53056j531901j55021K968341M050950J214610k676345m174515
34379F582259l755041l760322l824664j669796K279519M620239L814998K144682
34371F431874J588440Q04316j532379l081634j116114K050636J343530l218650
34363C270019n529047k057846K690650K752783o15254j638311N32239R99482k075208
34354a670493l986350j269781K259633J393456k342843l479099j121458Q08547
34346i408388P29103R93567K116685J285538j636205k089028K053667N848968
34338a06093L871944j850737m877677k935323R92668M279009O456430O400882
34330A2231103K848268k037389m118346k966106k076801k882827k902521q74344
$$ y = [7957086, 7639196, 6886140, 5354239, 5199218, 8167559, 12218509, 13433119, 10756774, 6582259, 2827218, -933104, -4757768, -6427564, -4148045, 472194, 4287192, 6431874, 8020314, 8824630, 7292251, 4210617, 3094503, 5145139, 6488669, 3270019, -2259028, -4316874, -1626224, 1126559, 511305, -1127006, -594767, 404715, -1670493, -5656843, -6926624, -4666991, -3273535, -5616378, -9095477, -10216935, -9408388, -8679285, -7685718, -5569033, -4283495, -5919700, -8008728, -5955061, -106093, 3765851, 1915114, -2962563, -5897886, -4905218, -626209, 5830221, 12231103, 15079371, 13041982, 8923636, 5957530, 3880729, 997902, -1904619, -2778963]
34322b778963Q09025N57541J71333P90972M93331j364816j593880J544709M239460
34313B868712K399142k039448m314115l663399k532798j439477M82850J757652
34305f480881N31999j089724K01234K897429K655114m74685k229202j112410M12747
34296d688379J484101L498399M917059K102678l262220m363515N71349M636577
34288D896049K241397l051795m893290l216640j952268j714589k28311K399724
34280e519723L740441L075435J735556N92947j15311J5536M70878p1071r89263
34271B935425L702K252068J756876k261498m813039k470806J104352J067816j296271
34262a721375j955023j121555j415679j926081J31342L646643M788883K734201
$$ y = [-2778963, -1969938, -1412397, -1241064, -450092, 43239, -1321577, -2915457, -1370748, 2868712, 5267854, 3228406, -1085709, -4749108, -7281906, -8721383, -8238533, -6480881, -5948882, -7038606, -6837372, -3939943, -1284829, -1759514, -3988716, -5101126, -4688379, -3204278, 294121, 5211180, 7313858, 4051638, -311877, 259472, 4896049, 7137446, 4085651, -807639, -4024279, -5976547, -7691136, -7919447, -5519723, -1779282, 1296153, 3031709, 3624656, 3509345, 3524881, 3995759, 3924688, 2935425, 2939127, 5191195, 6948071, 4686573, -126466, -2597272, -1492920, -425104, -1721375, -3676398, -4797953, -6213632, -8139713, -8008371, -4361728, 427155, 3161356]
34254C161356j29569k190415k897727j253949J897719K674431m27594k977088
34246b142836j269421J112054o77753l879356k631950J622492K593316J15533
34238e157921l00522J836568J197472k698116l406482J403921N367964L467263
34230A710147o21528j328838P30482J730582Q52024l53580j090344r91597j56
34221F37192m1036k798276n146020k169146M259638O343793J762530k638946j556245
34212a346516J350546R80655q69404k65939J184475k73548l272592l516100p53028
34203f781451J620219J990985J268347J04736r21900l86810J506621J898972m00916
34194a01197k553471k591367k904854n088227n481641j031236L874316K709159
$$ y = [3161356, 3031787, 841372, -2056355, -3310304, -1412585, 1261846, 834252, -2142836, -3412257, -2300203, -2977956, -6857312, -9489262, -7866770, -5273454, -5157921, -5458443, -3621875, -2424403, -5122519, -8529001, -7125080, -1757116, 1710147, 1088619, -240219, 490263, 2220845, 3072869, 2719289, 1628945, 637348, 637192, 596156, -2202120, -7348140, -9517286, -5257648, 1086145, 2848675, 209729, -1346516, 4030, 984685, 115281, -150658, 1033817, 760269, -2512323, -6028423, -6781451, -5161232, -3170247, -1901900, -1797164, -2719064, -3105874, -1599253, 299719, -101197, -2654668, -5246035, -8150889, -13239116, -18720757, -19751993, -15877677, -13168518]
34186a3168518k986210n130681m25362N682987P077822M029324N73127j245419
34178e592930k067177k349372j351718J121751L361044L270290J411061R71393
34170a225658L218781M738112K092185k328131l426526j495509j621136m665019
34162d712901n248925p82215L789210L680435J148782N63793J528177J498962
34154A465318J005173J472625J466675l19140j682626q05583J1735j190371j708139
34145b84333R20553L571192K372058p20628j673240j146777j735948k066935p1953
34136h36011J277781j362308m304108j865483L501368M406041L24260k453787
34128a312247j988420k664460n378715m973714K21281M616495M425330L162169
$$ y = [-13168518, -16154728, -21285409, -21710771, -16027784, -8949962, -4920638, -4347511, -5592930, -7660107, -10009479, -11361197, -10239446, -6878402, -3608112, -2197051, -1225658, 1993123, 6731235, 8823420, 6495289, 3068763, 1573254, -47882, -4712901, -9961826, -10744041, -6954831, -3274396, -2125614, -1561821, -33644, 1465318, 2470491, 3943116, 5409791, 5090651, 3408025, 2602442, 2614177, 1423806, -284333, 636220, 4207412, 6579470, 5858842, 4185602, 3038825, 1302877, -764058, -836011, 441770, -920538, -5224646, -7090129, -3588761, 817280, 1141540, -1312247, -3300667, -5965127, -11343842, -16317556, -16096275, -11479780, -7054450, -3892281]
34120c892281M228828M668674J116807l321237l420277M21279L467848L369764
34112F639405J732028N02329q9362o77546j659740k538730k155765o60893l44211
34103G47515k235250l213280r1394M478981M792679M68276l013521k514443o81360
34094a261797j55213K24889J528884K057494R02625k01967o49231k084231l829485
34085c468032k317355K339321M649111K049183n50452J082171L186700O30746
34077G601393l747387l542645M71107J786372q38537j734604J537966L753812
34069E287477M66867m925338o395542l507097l52472R79014J659252K274870J809783
34060b703186M12659j59493M72183N25061q13686j884177j516114j149772j977769
$$ y = [-3892281, 336547, 5005221, 6122028, 2800791, -619486, -198207, 3269641, 6639405, 8371433, 8873762, 8784400, 8106854, 6447114, 3908384, 1752619, 1091726, 747515, -1487735, -4701015, -4792409, -313428, 4479251, 4947527, 1934006, -580437, -1261797, -1417010, -1192121, 336763, 2394257, 3296882, 3094915, 2445684, 361453, -3468032, -5785387, -3446066, 1203045, 3252228, 2701776, 3783947, 6970647, 7601393, 3854006, 311361, 782468, 2568840, 1730303, -4301, 1533665, 5287477, 5754344, 829006, -5566536, -9073633, -9426105, -8447091, -6787839, -4512969, -2703186, -2290527, -2450020, -1977837, -1452776, -2266462, -4150639, -5666753, -6816525, -8794294]
34051h794294k164105R6411K471530J550955p56366R15442O218951P573724J064573
34042H176821o296751n546658J483161M925038Q93787m195746l984364l47662
34034d892374J458677P91186P79288K379832L281740J905721l52309j089938K61525
34025D523348J916061J845080K40095j006336j591161l488799o657740o710109
34017a0929561o52299O717104P302854P45845m324457j773258M128122N341613
34009F555963Q10296l552351l517161q92030N30740n5684o78834O6127J378121
34000F45187J752508J110011N60496L00622p24528k472352k971244j289773M94176
33991b594897M02080j09672J305151L419738K839311q29675m363258n061766k833414
$$ y = [-8794294, -10958399, -10861988, -8390458, -6839503, -7595869, -6680427, -461476, 7112248, 8176821, 1880070, -3666588, -2183427, 2741611, 3635398, -560348, -4544712, -4892374, -3433697, -2642511, -1863223, 516609, 3798349, 5704070, 5351761, 4261823, 4523348, 6439409, 8284489, 8524584, 7518248, 5927087, 2438288, -4219452, -10929561, -11581860, -4864756, 2438098, 3183943, -1140514, -2913772, 1214350, 6555963, 7366259, 3813908, 296747, -595283, -64543, -120227, -799061, -732934, 645187, 2397695, 3507706, 4068202, 4368824, 3644296, 1171944, -1799300, -3089073, -2594897, -2192817, -2302489, -997338, 2422400, 5261711, 4432036, 68778, -4992988, -7826402]
33982g826402R50626L906878L425009K47759p59948K575259M890235R35882m669287
33973C676011l287311L496543N203857r73983n453634j839045K976275P12038
33965D510751n035473n816689k000266j35229j197246r23991R71644J213312R94829
33956g418358M380664Q935922P095485j610295p977142n658912O59384L203602
33948A610350J361804l73048k91264l69501j554873k346674j509404L14453J554713
33939a603444J273155K38600L36189J737753J618260j848858n255339l645110
33931g148794J644486L604957o06894n223359l957762J642343N549642N461388
33923I66007L263876N0780m003660o154860l211137K486136M433954P95301k828614
$$ y = [-7826402, -6875776, -2968898, 456111, 703870, -56078, 2519181, 7409416, 8345298, 3676011, 388700, 3885243, 9089100, 8115117, 2661483, 822438, 3798713, 4510751, -524722, -6341411, -8341677, -8476906, -9674152, -10598143, -9626499, -8413187, -7418358, -3037694, 5898228, 12993713, 11383418, 3406276, -2252636, -1593252, 1610350, 2972154, 2599106, 2307842, 1938341, 383468, -1963206, -3472610, -3158157, -1603444, -330289, -91689, 244500, 1982253, 3600513, 1751655, -3503684, -7148794, -5504308, -1899351, -2506245, -7729604, -11687366, -10045023, -4495381, 966007, 4229883, 4280663, 277003, -5877857, -9088994, -6602858, -2168904, -1373603, -4202217]
33914d202217j743378J169558P45316k110004k273274J310496M433829M297033
33906A627359K431999N52715j586928k969019j044348K945283L358254j598569
33898C716746n702128l522645R20825N55844l145740k876684J852540L744647
33890d456595J11679k787014o96521J800487J63143j919696L52439L717862K459089
33881a255127j286172j202358K046032K183427j250147j933872J844011L598476
33873B744270m79837m701748k812278K087547K618903j497577l655671p55868
33865f452259K691738K012055p29103k54909L766262N806394K197023l225141
33857E812060l932373O6147J931306j927041n887530l033726M168444O828275
$$ y = [-4202217, -5945595, -4776037, -4030721, -6140725, -8413999, -7103503, -2669674, 1627359, 4059358, 4612073, 3025145, 56126, -988222, 1957061, 5315315, 3716746, -1985382, -5508027, -4587202, -4031358, -7177098, -10053782, -8201242, -4456595, -4344916, -7131930, -7828451, -6027964, -5864821, -7784517, -7432078, -3714216, -1255127, -2541299, -3743657, -1697625, 485802, -764345, -2698217, -854206, 2744270, 2264433, -2437315, -5249593, -3162046, -543143, -2040720, -5696391, -6452259, -3760521, -1748466, -2477569, -2732478, 1033784, 6840178, 9037201, 5812060, 1879687, 1945834, 3877140, 1950099, -3937431, -6971157, -2802713, 4025562]
33849D025562K220401k956813k989673n05892k15231p93957J621288N221200M257494
33840I884379j608812n587141k968775K378584L576155o541k682775q36421K284970
33831D433623J620691k330005m313152k107756K18582j188719l429758j037045
33823h133539M718653O254600N51361n721746n222848J59337L089555J546321
33815b758306L4555J175510K277751J226534J72609Q98901J167113q65302k287017
33806A042348J77561L906852L465898j008602l559107j116845K241686J792136
33798F941927r99510j571233K97030N55514k035518l358236k64161L896754L500256
33789F962823j089167l589196o25853L526052L370118L1316j336661K7687k5514
$$ y = [4025562, 6245963, 3289150, 299477, -206415, -421646, -1215603, 405685, 5626885, 9884379, 8275567, 2688426, -280349, 2098235, 5674390, 5667849, 2985074, 2148653, 4433623, 6054314, 3724309, -588843, -2696599, -2478017, -3666736, -7096494, -8133539, -3414886, 2839714, 3391075, -2330671, -7553519, -7394182, -4304627, -2758306, -2723751, -1548241, 729510, 1956044, 2128653, 3027554, 4194667, 3329365, 1042348, 1219909, 5126761, 8592659, 7584057, 4024950, 2908105, 5149791, 6941927, 5942417, 4371184, 4668214, 5223728, 3188210, -170026, -434187, 3462567, 6962823, 5873656, 2284460, 1658607, 5184659, 8554777, 8586093, 7249432, 7277119, 7251605]
33780G251605k693654l595693j74312L380687K354026j353997k857759j845767
33772D65136j211786o36664K171803N129492L630845j087984k569734M53489J541954
33763G886551k695939o561318m599857m23699J9285j475663K97862L465807J870955
33754b216016l221931l595115K648899O929449K781573m353699n077395Q86573
33746e217662N435295L795492j72628q46481J259322J071633l121796o535670
33738d332495m140885J959669M910363K722072Q26607K873967M125023q77750
33730H066571p945354p962356o75553M321341J609204k825801j851769K082491
33722e181226K112470j619395k381552K692905Q269891P757329J124919n450663
$$ y = [7251605, 4557951, 962258, 787946, 4168633, 6522659, 5168662, 2310903, 465136, -746650, -1383314, 788489, 5917981, 9548826, 8460842, 5891108, 6344597, 7886551, 5190612, -1370706, -5970563, -6394262, -6374977, -7850640, -7552778, -4086971, -2216016, -5437947, -9033062, -6384163, 545286, 3326859, -1026840, -6104235, -5217662, 217633, 4013125, 3840497, 2994016, 4253338, 5324971, 2203175, -4332495, -8473380, -6513711, -1603348, 1118724, 1945331, 4819298, 8944321, 8066571, 121217, -7841139, -8516692, -4195351, -2586147, -5411948, -7263717, -5181226, -3068756, -4688151, -7069703, -4376798, 3893093, 11650422, 12775341, 7324678]
33714G324678o151690j075783M172445M409338K18672l473290l552234j364246
33706E07890N89295J686994K166145J897595J408026J626951J596757o75931l905775
33697F897947l625202J221614N234284L260774k553128n912335m481942j166930
33689a124918J143421K109350J871757L18168j268021r17384J046127K141052
33681E319552J291183l4012p26852j627277l096214l293486r21481J683888P97787
33672f06912l394408o155407l898884J369338N007824N457671M393513K474754
33664D647489j104345m806095n013477j527921J492881J969338K437215L597379
33656A692464J431869m528809o466865P64645R195707P691290j221583n278856
$$ y = [7324678, 1172988, 97205, 4269650, 8678988, 8897660, 5424370, 1872136, 507890, 1097185, 2784179, 4950324, 6847919, 8255945, 9882896, 11479653, 10803722, 6897947, 3272745, 4494359, 9728643, 12989417, 10436289, 4523954, 42012, -1124918, 18503, 2127853, 3999610, 4317778, 3049757, 2132373, 3178500, 5319552, 6610735, 6576723, 5849871, 4222594, 1126380, -2167106, -3088587, -1404699, -606912, -4001320, -10156727, -14055611, -12686273, -7678449, -2220778, 2172735, 4647489, 3543144, -1262951, -6276428, -7804349, -6311468, -4342130, -1904915, 1692464, 3124333, -1404476, -7871341, -7106696, 2089011, 9780301, 8558718, 3279862]
33648C279862j368318J589845r49908k765888j69131Q48900l226147n319939J21576
33639g959148O187443M030751k722348l948200J385256N072364K348639l395043
33631I99714o954167o019058j062762M678784P090062O186098N648915N278992
33623A5846578N17838p198877q530133o55984N794840K497025l306374j689352
33615C275561L089555J711520k360335J00871N198452J754251p109444p088948
33607a428517K597322O751665l94744n969610r46391N453565K969266l014636
33599F017920k985043N66228K13297k552098j908326J100135K331546L306046
33591F089705O514992P628741J976413n837296p832941m258845j109218m4619
$$ y = [3279862, 1911544, 3501389, 2551481, -214407, -383538, 465362, -2760785, -8080724, -7959148, -1771705, 2259046, -463302, -4411502, -3026246, 2046118, 4394757, 999714, -5954453, -11973511, -13036273, -8357489, -1267427, 4918671, 10567586, 15846578, 16364416, 9165539, 635406, -20578, 5774262, 8271287, 4964913, 3275561, 6365116, 8076636, 5716301, 5817172, 11015624, 12769875, 5660431, -1428517, 1168805, 7920470, 7525726, 1556116, 609725, 6063290, 9032556, 6017920, 3032877, 3599105, 3812402, 1260304, -648022, 452113, 2783659, 6089705, 12604697, 20233438, 22209851, 16372555, 8539614, 4280769, 3171551, 3126932]
33583C126932J087379J449688q10465k844273j037076K245287K902711K488705
33575H608888L913152L930650j254472o499376m014502K964235L663609l243298
33567H068886p064402j587237N845367N956016K45417l285148j572875J827560
33559H433584L210361K053595o33503l622893n228530l940427p4783L611378L817689
33550G626471L22083k796026j689015J813957K566816j61045k105408j921452
33542C656381l281713o548492n744377J248929O690891M122349j006269l84874
33534a247175L306479K058952k374158j361365M548287N532087o85658m613248
33526E164201p29994M283086L896343J658249K427094L049817m77097m112268
$$ y = [3126932, 4214311, 5663999, 4853534, 2009261, 972185, 3217472, 6120183, 8608888, 12522040, 16452690, 15198218, 8698842, 4684340, 7648575, 11312184, 8068886, 1004484, -582753, 5262614, 11218630, 11464047, 8178899, 6606024, 8433584, 11643945, 13697540, 13064037, 9441144, 4212614, 272187, 197404, 3808782, 7626471, 7948554, 5152528, 3463513, 5277470, 7844286, 7683241, 5577833, 3656381, 374668, -6173824, -11918201, -10669272, -3978381, 143968, -862301, -1247175, 2059304, 4118256, 1744098, 382733, 4931020, 10463107, 9777449, 5164201, 4434207, 8717293, 12613636, 14271885, 16698979, 19748796, 19271699, 15159431]
33518A5159431k527152R01143n00025n243531o139417j918325J539649P76225
33510B047998j356447j538781o5838J434792J915859L60063k787575l970601m09879
33501d370409M705546N421183J471961j402995m81045L0811l271828o351902l569526
33492g818204K931757N511664J962099j749962r84100R93453m79411l073105j456468
33483d162277K947447L443215p71157k512135J928570O343841M124550j732241
33475I609813l966275j729308O12385J543664K081009N18312m422783p418378
33467c171561k529688N670649O754157N04194k391027K090640M606991j323891
33459A0210464p303081k977224P204143J0636574N000166o64402j138715r38492
$$ y = [15159431, 12632279, 13533422, 13033397, 7789866, 1650449, -267876, 1271773, 2047998, 691551, -847230, -913068, 521724, 2437583, 2797646, 10071, -3960530, -4370409, 335137, 5756320, 7228281, 5825286, 5344241, 5375052, 2103224, -4248678, -7818204, -4886447, 625217, 2587316, 837354, -146746, 846707, 367296, -2705809, -4162277, -1214830, 2228385, 1457228, -1054907, 873663, 7217504, 11342054, 9609813, 5643538, 3914230, 4526615, 6070279, 8151288, 8669600, 4246817, -3171561, -5701249, -30600, 6723557, 7227751, 4836724, 6927364, 11534355, 10210464, 2907383, -69841, 7134302, 17770876, 22771042, 22106640, 20967925, 20029433]
33451B0029433m279987p765543o181799k08275M820846N181600K056922j03085
33443A3550112J602672M608169L531088k029615n692946l064753J549642J665562
33435A5719931j659314k596532n25478k0364j615658l08514N176387Q524321M615256
33426B7310035k793152o029994k966794J935925L924025K329314j21683j68173
33418B3419503L100073O890226P023125K498906l046182n006657k174361K680644
33410C5385277N579737M635048J638287L88076K606452N893533O708310M817663
33402F7652383L619956O388547J2873298J8992166J9863060J4925937J0205253
33395A54520600J2537130K0767295K6654659K6246885K5219436K9215954L4358111
$$ y = [20029433, 15749446, 7983903, 1802104, 1593829, 6414675, 11596275, 13653197, 13550112, 15152784, 19760953, 23292041, 21262426, 15569480, 12504727, 14054369, 15719931, 14060617, 11464085, 10938607, 10918243, 9302585, 8994071, 14170458, 22694779, 27310035, 24516883, 18486889, 15520095, 17456020, 21380045, 23709359, 23587676, 23419503, 26519576, 33409802, 40432927, 42931833, 39885651, 34878994, 32704633, 35385277, 40965014, 45600062, 47238349, 47626425, 50232877, 56126410, 62834720, 67652383, 71272339, 77660886, 90534184, 109526350, 129389410, 144315347, 154520600, 167057730, 187825025, 214479684, 240726569, 265946005, 295161959, 329520070]
33388C29520070L3607314K8238128K4775311K2757868J4727461j229016j7411459
33381D34985677k6891278l0630622l1988995l1383388k9666458k9993243l1982544
33374B22449149k9837614k1102379j2290919j0548501j3765083j4455293j0430024
33367A10019336o155409n364360p146889q451947o986030k734065R31799k82757
33359G3829678n634958q710185n546620l4721K193903J463421J166697R45175
33351E9672390j371841l726319k351965J039597J250992j589986j884058K005813
33343E3044623M644294K051465k096129j981785K467119O440289O585089L910046
33335G5065011J844475K969588O471940Q378714O100067K711222M009451J0887407
$$ y = [329520070, 363127384, 391365512, 416140823, 438898691, 453626152, 452397136, 434985677, 408094399, 377463777, 345474782, 314091394, 284424936, 254431693, 222449149, 192611535, 171509156, 159218237, 148669736, 134904653, 120449360, 110019336, 103863927, 98499567, 91352678, 82900731, 75914701, 73180636, 74112435, 73829678, 68194720, 59484535, 53937915, 53903194, 56097097, 57560518, 58727215, 59672390, 58300549, 54574230, 52222265, 53261862, 54512854, 52922868, 51038810, 53044623, 57688917, 59740382, 57644253, 55662468, 58129587, 64569876, 71154965, 75065011, 76909486, 79879074, 86351014, 94729728, 100829795, 103541017, 107550468, 118437875]
33327A18437875J7692145J9224205J6450580J3811356J3629365J5217323J7323516
33320B31786365J9061907J9593888J8822444J7786375J7183575J6207193J3650690
33313C54092437R308818L715181k381481p685998j0844930j2162310j3658510
33306C20383207j6413799j8885028j9086648j7735493j7683283j9992892k1783487
33299A88802577j9225791j2704193p514038q005665j1944016j3042362r000532
33292A07365980m022460k463203l403741l743981l450820m241829n366279m798801
33284G5874866l352067l496498m641569l524950O45683M854201O252945M584965
33276G7197576Q92709l156441n015060l458535o48798Q73760J932957L785085
$$ y = [118437875, 136130020, 155354225, 171804805, 185616161, 199245526, 214462849, 231786365, 250848272, 270442160, 289264604, 307050979, 324234554, 340441747, 354092437, 363401255, 367116436, 364734955, 357048957, 346204027, 334041717, 320383207, 303969408, 285084380, 265997732, 248262239, 230578956, 210586064, 188802577, 169576786, 156872593, 149358555, 141352890, 129408874, 116366512, 107365980, 103343520, 100880317, 97476576, 93732595, 90281775, 86039946, 80673667, 75874866, 72522799, 69026301, 64384732, 60859782, 61505465, 66359666, 72612611, 77197576, 78090285, 74933844, 69918784, 66460249, 65811451, 66685211, 68618168, 72403253]
33268G2403253L510139k014989q639399q387141j075634M427211K426559k759368
33260E9890631m776875l412736j245638J407034L573235J577876m623521q285348
33252D4104658n049706n17421j922617o551718o396901j293620J441767o73372
33244B3141070k229910J04657K717801K285977Q51759P09932J43658k261275l894210
33235B1569459k457928l12460q51981l278344m219398k592365k93237M55116j143744
33226F875118l625237l461851J165363O149640M990216j900149o143622k671090
33218A378388K793508K329722k263509k913040J555304L606880q76495n973694
33210c62936m495923J971416O110634M553551K22210k860987k963481n4893M222822
$$ y = [72403253, 75913392, 73898403, 65259004, 56871863, 55796229, 60223440, 62649999, 59890631, 55113756, 51701020, 50455382, 51862416, 55435651, 57013527, 52390006, 44104658, 39054952, 38537531, 36614914, 30063196, 23666295, 22372675, 23814442, 23141070, 20911160, 21015817, 23733618, 26019595, 26871354, 27581286, 27724944, 25463669, 21569459, 19111531, 18799071, 17947090, 14668746, 10449348, 7856983, 7563746, 8018862, 6875118, 3249881, -211970, 953393, 7103033, 12093249, 10193100, 4049478, 1378388, 4171896, 6501618, 4238109, 1325069, 2880373, 6487253, 5610758, -362936, -4858859, -2887443, 3223191, 7776742, 7998952, 5137965, 2174484, 2119591, 6342413]
33201F342413O328605L994079l03549k012254o14717J53458j593402l308727k680995
33192F304911j180889q61839q77435R9994Q04128m4322m65575J642225L844965
33183I266163K042095k745743m968993k254134J602018K390203O47669n63081
33175E416197k65073j06583j810288m992778o538415k907075M818909R660561
33167C275455O295822j109918l582338M15255L485518J000951k731643k980595
33159D068507k185167l857109m880692p49882N604023P449868M105017K60711
33151I815276k275009m751662n092440R3339P026902P157246Q6285m346519n73200
33142G140218M116285J222441n545286o419136q69611K329232p46007l783829
$$ y = [6342413, 12671018, 16665097, 16361548, 14349294, 13734577, 13888035, 12294633, 8985906, 6304911, 5124022, 4262183, 3384748, 3484742, 4288870, 4244548, 3778973, 5421198, 9266163, 11308258, 8562515, 3593522, 1339388, 2941406, 5331609, 5979278, 5416197, 5151124, 5044541, 3234253, -1758525, -8296940, -11204015, -6385106, 3275455, 9571277, 8461359, 4879021, 5294276, 8779794, 9780745, 7049102, 4068507, 1883340, -1973769, -6854461, -7604343, -2000320, 5449548, 9554565, 9815276, 7540267, 2788605, -2303835, -2210496, 4816406, 11973652, 12059937, 7713418, 7140218, 11256503, 12478944, 6933658, 514522, -355089, 1974143, 1228136, -2555693]
33134b555693r78368M163084M953805J406508j308606j376234j528804k556358
33126B19334j462919K508143N031622K909576o93764j170389L01437o36987l556437
33117C449616l780391o19894J209921k61083q95057J928612M083246J345230l456928
33108C003272m936867l014961j024332P04842L460032M987409K262058k087743
33100C353710k650919K43081J339894n53956j248694O43311J215117j328211l271318
33091b257985j854495O53125J920784L009177M135238K743037r03451j996037
33083E449393R77862K482731j119447m660106k415170J944304J313905k911806
33075A061666l662344n51264K52425j920871n65890N455588P646792J138831o190614
$$ y = [-2555693, -3534061, 629023, 5582828, 6989336, 5680730, 4304496, 2775692, 219334, -1243585, 1264558, 6296180, 9205756, 8511992, 7341603, 7643040, 7006053, 3449616, -330775, -950669, 259252, -1831, -896888, 1031724, 5114970, 6460200, 3003272, -1933595, -4948556, -5972888, -5268046, -1808014, 3179395, 5441453, 3353710, 702791, 945872, 2285766, 1731810, 483116, 1126427, 2341544, 1013333, -2257985, -4112480, -3459355, -1538571, 1470606, 5605844, 8348881, 7445430, 5449393, 6427255, 8909986, 7790539, 3130433, 715263, 2659567, 3973472, 1061666, -2600678, -3151942, -2899517, -4820388, -5386278, 69310, 7716102, 8854933, 2664319]
33066B664319n025201J236488K351178k495983m110863J424358O450552L724511
33058F219359k863594m659020l20585M174683M654594K198168j115158m369370
33050C919077n725593l161315J582812L790448J861477q29038j390745j044137
33042i97014j552769j833638p33883J77047k91624n0378K496896M455354K474229
33033D144220j196386j448197J865154L684068J283978k535607m512485m842222
33025c557477m514977k630336J021589L359255J238448l427365m468309J538415
33017a1440757J0038736J2102557M344416o161179r451571m419886R12655J018967
33009c056062p48754L51077K672144K661417J847174K939631L162067r42062n191613
$$ y = [2664319, -2360882, -1124394, 1226784, -1269199, -5380062, -3955704, 2494848, 6219359, 3355765, -1303255, -1623840, 2550843, 7205437, 9403605, 8288447, 3919077, -1806516, -4967831, -3385019, 405429, 2266906, 1437868, 47123, -997014, -2549783, -4383421, -5117304, -4940257, -5231881, -5282259, -2785363, 1669991, 4144220, 2947834, 1499637, 3364791, 7048859, 8332837, 5797230, 1284745, -3557477, -8072454, -10702790, -9681201, -6321946, -5083498, -8510863, -12979172, -11440757, -1402021, 10700536, 15044952, 8883773, -567798, -4987684, -4075029, -3056062, -3804816, -3453739, -781595, 1879822, 3726996, 6666627, 9828694, 8886632, 3695019]
33000C695019k900372L454369M980085L71111k545179k40723J569103q90739l099028
32991D393646j350084P56618J82465L68102L139474K866369l648653q711009m287959
32982f291031M586418O847189J871641j444373K18598J222750j354030l040837
32974B616325j215518n9073k460404m202314j043159L733242M137837N12379j436451
32965E82864P64527L295026K030785j696900l259130j296561M70020j157667l769207
32956d036243k717445J574054L768424J416133j890784k625236j882531j399999
32948g793627N1854K694736K963582o02158l103493m61929L242598K091042j717205
32939b634600j834227J243813J845493q9539L80180K291519o78608p001041n988206
$$ y = [3695019, 794647, 4249016, 9229101, 9600212, 7055033, 6814310, 8383413, 7492674, 4393646, 3043562, 3800180, 3982645, 4350747, 7490221, 10356590, 6707937, -2003072, -6291031, -1704613, 5142576, 7014217, 5569844, 5788442, 7011192, 5657162, 2616325, 1400807, 1341734, -1118670, -5320984, -6364143, -2630901, 1506936, 2019315, 582864, 1347391, 4642417, 6673202, 4976302, 1717172, 420611, 890631, -267036, -4036243, -6753688, -5179634, -1411210, 4923, -1885861, -4511097, -6393628, -7793627, -7741773, -5047037, -2083455, -2685613, -5789106, -6251035, -3008437, -917395, -2634600, -4468827, -3225014, -1379521, -1469060, -1088880, 1202639, 524031, -6477010, -12465216]
32930a2465216N434836J4880575J0821377j233704p497084m808296j238855j676446
32922B217187k992239k532177j944328j414755J803308O729648P427263J775401
32914A1069308m139106m318363j043406m10870l136068m646836k329993J922556
32906g032778N355755O406951L897368j530390n376187l222946K656277N097337
32898F251387J613884k567167k922896j716486k178965k070391J336690M292633
32890B038689J864911k743578k518530J245247O68234m497494m971000K525893
32882f387628Q397203N013767r89675L8252M805736L204226m453340q233129m816394
32873c420982j168519j222612p2187N218646Q654037M533314l349417p369930
$$ y = [-12465216, -7030380, 7850195, 18671572, 17437868, 9940784, 5132488, 3893633, 2217187, -775052, -3307229, -5251557, -6666312, -4863004, 1866644, 9293907, 11069308, 6930202, 2611839, 1568433, 1157563, -1978505, -6625341, -8955334, -7032778, -1677023, 4729928, 8627296, 7096906, 1720719, -1502227, 1154050, 6251387, 7865271, 5298104, 2375208, 658722, -1520243, -3590634, -2253944, 2038689, 3903600, 1160022, -1358508, -113261, 554973, -3942521, -8913521, -6387628, 2009575, 7023342, 6033667, 6071919, 10877655, 14081881, 9628541, 1395412, -3420982, -4589501, -5812113, -5884300, -665654, 7988383, 12521697, 9172280, 1802350]
32865A802350n958336k758666l710K224241L048594J824989L74447N85414J291937
32856B431260L78911j681944k961542k994472k184690j41970K871438M425849
32848A42840K384747k071384n583248n726814k167343L240526O536242M563420
32840A318986p16979l657671k184865j65961n96124q50603J773657M168869K243809
32831A333118j666565k298276j89819k17289k402775j520797L345665O091988
32823B475250K983925j597986k523075j512781k570035m273279k581244J389962
32815h209263K708713P85414J71521K769094M766527L072999J23339m55705O17206
32806F349845L75746j194547j623426m47652J12444j071258k197756j150473J592638
$$ y = [1802350, -4155986, -6914652, -6918362, -4694121, -1645527, 179462, 553909, 1139323, 2431260, 2810171, 1128227, -1833315, -4827787, -7012477, -7154447, -4283009, 142840, 2527587, 456203, -5127045, -10853859, -13021202, -9780676, -3244434, 1318986, 602007, -3055664, -5240529, -5406490, -6002614, -6853217, -5079560, -910691, 1333118, -333447, -2631723, -2821542, -3038831, -5441606, -6962403, -3616738, 2475250, 5459175, 3861189, 1338114, -174667, -2744702, -7017981, -9599225, -8209263, -5500550, -4715136, -4543615, -1774521, 2992006, 6065005, 6188344, 5732639, 6349845, 6725591, 5531044, 3907618, 3459966, 3572410, 2501152, 303396, -847077, 745561]
32797G45561L350254J956294j964099n148028m645834r50260K639249L905572
32789a11291L403253J951658r28617m497880n443119j925056K855137M280934
32781d14981K177529o6266p65009o36162M29890K745709L586304k81455o323755
32772D51804p594814j870073N024457O754099L330791j095870l091375j025154
32764H83865M072103O886985K156901o958081j0381144m245887L331227L860024
32756c94007k80967j992377r06322r54271j088970K375606O615189M992863j509243
32747F857501m490630p84604L184754J687986k834929n193205m181379j167117
32739f921623K650970M956986L203269q58541k229820j50528O97234j486828k151338
$$ y = [745561, 4095815, 6052109, 4088010, -1060018, -5705852, -6656112, -4016863, -111291, 3291962, 5243620, 4315003, -182877, -5625996, -7551052, -4695915, -414981, 1762548, 1696282, 931273, 295111, 725001, 3470710, 7057014, 6775559, 451804, -7143010, -9013083, -3988626, 2765473, 6096264, 5000394, 1909019, 883865, 4955968, 11842953, 13999854, 7041773, -3339371, -7585258, -4254031, -394007, -674974, -2667351, -3573673, -4527944, -5616914, -3241308, 3373881, 8366744, 6857501, 2366871, 1582267, 4767021, 6455007, 3620078, -1573127, -5754506, -6921623, -4270653, 686333, 3889602, 3031061, 801241, 650713, 1347947, -138881, -2290219]
32730b290219J491976M858901L040408j587015l842345l489124l074857j841318
32722f733593K027046N746624N005646J314939R6863J964298K038619j491393
32714I969049m082356k134194J328309J375612j764068l760623k428291K51662
32706a244900J645625J311266J42248j192826k003707j209452J191837K813869
32698A453960J021034l081104m768817j396265L636876N010021K452097M11899
32690D739701J146646K051969P87872r68604j139747j065601k428670l192102
32682f8536p79717K471595J813516k414890m661417k330360O50052M68769q02924
32673e653912L40456K179315O68033k795037k472207K388373N210601J650357
$$ y = [-2290219, -798243, 4060658, 7101066, 5514051, 1671706, -1817418, -4892275, -6733593, -4706547, 1040077, 6045723, 7360662, 7457525, 9421823, 11460442, 9969049, 5886693, 3752499, 5080808, 6456420, 4692352, 931729, -1496562, -1244900, 400725, 1711991, 1854239, 661413, -1342294, -2551746, -1359909, 1453960, 2474994, -606110, -5374927, -6771192, -3134316, 1875705, 4327802, 4739701, 5886347, 7938316, 8726188, 7757584, 6617837, 5552236, 3123566, -68536, -848253, 1623342, 3436858, 1021968, -3639449, -5969809, -5319757, -4850988, -5653912, -5313456, -3134141, -2466108, -5261145, -7733352, -5344979, -134378, 1515979]
32665A515979l513069l343710J023816K663605m83110l376644k482734p08757
32657h704624j667172l666010k549709K328006P608430R412489N773877j828066
32649F707221p840214o669713M89255N795634M005435j480400m278897l194143
32641f465822j267074M4122J280400J840860J000835O14442K499932M290575K269437
32632F107707k295399m046991j010968K673206K468195r71829l356475k438294
32624b870848o44516j479836l746309k025057M831495R212793M410985l938586
32616C750121m742348J249306K501423l324573m608504K977509N819978n308711
32608a685799j6101565q709455R103881J4618984M373111l462704M29819N197980
$$ y = [1515979, -1997090, -5340800, -4316984, -1653379, -2136489, -5513133, -7995867, -8704624, -10371796, -14037806, -16587515, -14259509, -6651079, 2761410, 8535287, 6707221, -1132993, -7802706, -7313451, -1517817, 2487618, 1007218, -3271679, -6465822, -7732896, -7688774, -6408374, -4567514, -3566679, -2952237, -452305, 3838270, 6107707, 3812308, -234683, -1245651, 1427555, 3895750, 2923921, -432554, -2870848, -3515364, -4995200, -8741509, -10766566, -5935071, 3277722, 7688707, 3750121, -992227, 257079, 2758502, -566071, -5174575, -2197066, 3622912, -1685799, -17787364, -26496819, -17392938, -2773954, 1599157, -1863547, -1433728, 3764252]
32600C764252K118772j996058m98866J482737l22094k00811M789992O434181m65135
32591A5106970p545578o511501k222523k036512k800724N06957L118140m74586
32583b859357m370911p26389N803223N746999Q62177m00544J489763o20741n919156
32574i94936o295425m67351M246953M075134K523855J997225Q96661p28462p86061
32565D467593m31616k570005n571522n113481j289762K238382M360080N754854
32557A844523M731901L31884l396696k801922q17976j206439j365282J553734
32549a126273L021871j095991m848374j116444N092273M477329l31765j88208
32541C884418L127504O41552n233570l392445M774573N374247m004460q879642
$$ y = [3764252, 5883024, 3886966, 3388100, 4870837, 4548743, 4347932, 9137924, 15572105, 15106970, 7561392, 1049891, -1172632, -3209144, -6009868, -5502911, -2384771, -2859357, -7230268, -7956657, -2153434, 3593565, 4455742, 4055198, 5544961, 4924220, -994936, -7290361, -7757712, -3510759, 564375, 3088230, 5085455, 5982116, 5253654, 4467593, 4035977, 1465972, -4105550, -9219031, -10508793, -8270411, -3910331, 1844523, 6576424, 6908308, 3511612, 709690, -108286, -1314725, -2680007, -1126273, 1895598, 799607, -4048767, -5165211, -72938, 4404391, 4072626, 3884418, 7011922, 7653474, 2419904, -972541, 3802032, 9176279, 5171819, -3707823]
32533c707823k156671M187793L36995n062723j249240O081454N777106j33140
32525D073751k411189r22691j665343l705412j894823J740157J272556j551899
32517e064893j60801M485897M970740R0862l226667j218317J739475Q96220k453619
32508E8897l946947j354936L801485P022729M273453k664300o573187l589602
32500b972408J499426K354872l08695j884607j829719k588856l417427j537353
32492a0684767K210840M491805M849476M883328L788316L5507m025799m619791
32484I28915k345013m45210J083396M045969O270323L809459j485318l166222
32476H696299K87827L093473P39034m241030o853690n624110k159862J506574
$$ y = [-3707823, -5864494, -1676701, -1339706, -6402429, -7651669, -1570215, 4206891, 4073751, 1662562, 739871, -925472, -4630884, -6525707, -4785550, -3512994, -5064893, -5225694, -739797, 4230943, 4321805, 1095138, -123179, 1616296, 2512516, 58897, -3888050, -5242986, -1441501, 5581228, 9854681, 7190381, 617194, -2972408, -1472982, 881890, 573195, -1311412, -3141131, -5729987, -9147414, -10684767, -8473927, -3982122, 867354, 5750682, 9538998, 9574505, 5548706, 928915, -1416098, -1861308, -777912, 3268057, 9538380, 13347839, 11862521, 8696299, 8984126, 12077599, 12816633, 8575603, 1721913, -3902197, -6062059, -4555485]
32468d555485L337149K109621o88203k186584j903634j506949q97087J714057
32460d577115N262297N595175J517392k548364k305800P97172K210882M52105
32452F403744j966824k510475j154301N71674J318697P72163j72811j65087J075337
32443D172117K232059J847512M519j856015k534836k051574j148117l96278j27892
32434A41495p23037k002802k467376o65029K163103K720496K48710j650133l0208
32425b264781K682687K273437p38691k374350j799337j631431k070544m51032
32417f374042K690312L114169J36808j566056J93956J535478n5235r87276J382051
32408G0165L038272K36898l233078k131356J469646K417708J419295K157359K921735
$$ y = [-4555485, -1218336, 891285, 203082, -1983502, -3887136, -5394085, -6291172, -4577115, 685182, 6280357, 7797749, 5249385, 2943585, 3740757, 5951639, 6403744, 4436920, 1926445, 772144, 1343818, 2662515, 3434678, 3261867, 3096780, 4172117, 6404176, 8251688, 8256207, 6400192, 3865356, 1813782, 665665, 269387, 141495, -581542, -2584344, -5051720, -5716749, -3553646, -833150, -584440, -2234573, -2264781, 417906, 2691343, 1952652, -421698, -2221035, -3852466, -5923010, -6374042, -3683730, -569561, -432753, -1998809, -1804853, -269375, -324610, -1311886, 70165, 3108437, 3345335, 112257, -2019099, -549453, 1868255, 3287550, 5444909, 8366644]
32399H366644l82731n121789m785126j8225K106071j33550j037626J713213L186562
32390C893443O00306j829562r40184K21112n02638M79163M846505O445681r6382
32381A3117444r437927j1416697m342186L993346P046359N377228K416047o1456
32373F692158j346788q06551Q65293J571650J87677j866809j894182J163955M642812
32364I209215L975988j460618n687831l199125K192392J639318m834699o637916
32356d803276J220320Q507399M133056o221928p666125J647688Q033120L081313
32348G931567m949606n417402q51812k43554l782464m052820O64483L857170J683360
32339e161078j640843j496568M28455M74002n48748N66619L478991M507812J987647
$$ y = [8366644, 7983913, 2862124, -1923002, -1941227, 164844, 31294, -1006332, 706881, 3893443, 4493749, 2664187, 1724003, 1945115, 1442477, 1921640, 6768145, 13213826, 13117444, 3679517, -7737180, -12079366, -8086020, -1039661, 4337567, 6753614, 6692158, 5345370, 4538819, 5404112, 6975762, 7163439, 5296630, 3402448, 4566403, 9209215, 13185203, 11724585, 6036754, 2837629, 5030021, 6669339, 1834640, -4803276, -3582956, 4924443, 9057499, 2835571, -4830554, -3182866, 4850254, 7931567, 2981961, -2435441, -3287253, -3530807, -7313271, -11366091, -10701608, -6844438, -5161078, -6801921, -8298489, -7870034, -7396032, -7944780, -7378161, -3899170, 608642, 2596289]
32330B596289j659019l224118k017727K86653J620599J121033k65675p37271J95337
32321b083899R18290q4639j810533j748272Q48034L836507M470560K093150j340284
32312E098914k840803r73511K324585L230461M55331k795173k976644j151398
32304C71762r47408k254322j127846L012991M723706L21714n329474m790360J060393
32295d958844L922549J54742l881731j227521N506677P780864K583033m430892
32287E448877o794773m064329K7710K702887L389307K194380j85234j818615j106533
32278b06323Q47659J029699j795288n173951n373900j321955M142843O741142
32270a110074M528264m50154m256786m806830k991647j91460L487532P155761
$$ y = [2596289, 937270, -2286848, -4304575, -4017922, -2397323, -1276290, -1541965, -2279236, -2083899, -1165609, -1250248, -3060781, -4809053, -3961019, -124512, 4346048, 6439198, 5098914, 2258111, 1284600, 3609185, 6839646, 7294977, 4499804, 1523160, 371762, -575646, -2829968, -3957814, -944823, 3778883, 4100597, -1228877, -6019237, -4958844, -1036295, -881553, -4763284, -5990805, -484128, 7296736, 9879769, 5448877, -1345896, -5410225, -5382515, -2679628, 709679, 2904059, 2718825, 900210, -206323, 641336, 1671035, -124253, -5298204, -10672104, -11994059, -7851216, -1110074, 3418190, 2968036, -1288750, -6095580, -9087227, -9278687, -5791155, 1364606]
32262A364606P441185K284760m140850m629070J570075O453880L224212m760052
32254H808746q702365n500622K73931L725815L782544Q38034l869772n970544
32246f614233j165750P168760R346777J786640o975498p097873K8236N287260
32238A764319M375492O78713k074509l267846k234667J734462N627217M830829
32230A1434010N8809l279492l506941m312563o427839m923910J522874N734182
32222c700870K254404l304147k502723K602490L099077j939338l817799J709798
32214e599108P582308O078893m58894m100417j901326K424154M333946K278755
32206A0638311k050412m662270k771263R73628J187738j790339j375507M191066
$$ y = [1364606, 8805791, 11090551, 6949701, 2320631, 3890706, 10344586, 13568798, 8808746, 106381, -5394241, -5120310, -1394495, 2388049, 3226083, -643689, -6614233, -7779983, -611223, 8735554, 10522194, 3546696, -3551177, -3522941, 1764319, 6139811, 6818524, 4744015, 1476169, -758498, 975964, 6603181, 11434010, 11492819, 8213327, 4706386, 393823, -6034016, -10957926, -9435052, -3700870, -1446466, -4750613, -7253336, -4650846, -1551769, -3491107, -7308906, -5599108, 1983200, 8062093, 7603199, 3502782, 1601456, 4025610, 8359556, 10638311, 8587899, 3925629, 1154366, 2127994, 3315732, 1525393, 149886, 4340952]
32198D340952O572740p46313j0624262j0940908k138339L675762P73830l138742
32190a2225280l97844N325126O315459K476007n15455k17134J346608K575898
32182D683385L152425J927179j528260m584302m383199j695925Q60721K451896
32174H83920L063097J593976j590020k909174m46737J996753L58267k592892j154138
32165g96948L927311O124592K827237j674780l507000l731228m011661l045946
32157c888423J02903L129677L696259K693454K049002J577085J392k513670m323505
32148B524174l890556j207430J352026O31835k989063m614191j131242L535125
32140e789322L700306N46561j42908K278385K693052l80697k130828j38404J328035
$$ y = [4340952, 10913692, 10167379, -456883, -11397791, -13536130, -9860368, -9086538, -12225280, -12623124, -7297998, -982539, 1493468, 978013, 760879, 2107487, 4683385, 7835810, 9762989, 8234729, 3650427, -732772, -2428697, -1567976, 883920, 3947017, 5540993, 3950973, 1041799, 595062, 2591815, 2950082, 357190, -796948, 3130363, 9254955, 12082192, 10407412, 6900412, 3169184, -842477, -3888423, -3785520, -655843, 3040416, 5733870, 7782872, 9359957, 9361349, 6847679, 2524174, -1366382, -2573812, -1221786, -589951, -3579014, -8193205, -9324447, -5789322, -2089016, -1542455, -1685363, 593022, 3286074, 2905377, 774549, 636145, 1964180]
32131A964180j101734m321514m550295l005064j747694N28844L980195M370676
32123c882406k08706m308747k781897J011207J217524m44329J625759O089360
32115a682235O090364N49847m021589l448990o05611P19123L45434r85521k882268
32106e921446k733490K168120Q421467Q499127J192637n681886n820537k122731
32098a998739l94675p89688k70429P52270j24335j858839j411901P96677J674099
32089c625560Q10600N44991J086092L9194k735716l846362j258069K648288M412650
32080a923892L492211J490842m97949k049484k380618j003359J087780K012140
32072B27671O91229k159101m123761k634056K059024N821826M894408J213807
$$ y = [1964180, 862446, -3459068, -8009363, -11014427, -12762121, -12233277, -8253082, -3882406, -4091112, -8399859, -11181756, -10170549, -8953025, -9397354, -7771595, -1682235, 4408129, 4957976, 936387, -2512603, -3118214, -2399091, -2053657, -3039178, -5921446, -8654936, -6486816, 1934651, 10433778, 11626415, 5944529, 123992, -1998739, -2393414, -3183102, -3453531, -2701261, -2825596, -4684435, -6096336, -5299659, -3625560, -2814960, -2269969, -1183877, -1144683, -3880399, -7726761, -8984830, -6336542, -1923892, 1568319, 3059161, 2561212, 511728, -1868890, -2872249, -1784469, 227671, 918900, -1240201, -5363962, -7998018, -5938994, -117168, 4777240, 5991047]
32064E991047K30281K653996K803545k151657o080805k321795N255117O840828
32056A3220557R74236l937177l126557j737724m281316o291590k526009L288685
32048d416895M389536J655977M07070N50397j336870l096855R6677N359339M864376
32039H472752r35211l360679k40925M42525m858196q078752l002393L909810M078001
32030c573068J34314l38609K020459J404387j423950q98480K139501J212723l997977
32021c320700n877219m55522O716885Q536062M478235j164958m429260l466723
32013A016800O55270L608968J785480k692172m377553j977265O69223J290283
32005b0966K052618M347283N250237J952711l209613n117561k083141K317437
$$ y = [5991047, 6221328, 8875324, 11678869, 9527212, 3446407, 1124612, 6379729, 13220557, 14194793, 10257616, 7131059, 5393335, 1112019, -5179571, -7705580, -4416895, -27359, 1628618, 2035688, 2586085, 1249215, -1847640, -1750963, 3608376, 8472752, 7537541, 4176862, 3935937, 4378462, -479734, -8558486, -11560879, -7651069, -3573068, -3438754, -3777363, -1756904, -352517, -1776467, -2674947, -535446, 677277, -3320700, -9197919, -9653441, -2936556, 5599506, 10077741, 8912783, 4483523, 1016800, 1672070, 5281038, 7066518, 4374346, -3207, -1980472, -1311249, -20966, 2031652, 6378935, 11629172, 13581883, 10372270, 5254709, 3171568, 5489005]
31997E489005L410656M56402k884101l238767j707844j571142k705980j970866
31989d722637O22493J099773j319481j796518K036071N176827L212139k73076
31981D035591l05811N94518k333210o288256n122691l06989J688927R13503K772110
31972d352308O266982M263817l436189p900068m624729M14994J716269J892764
31964e758468L873247M262795L72007l388863k439142L96311J58635k254343k870281
31955g648102j226806P36813K505798L461778J590621k297178l338841M65351
31947e750566M516916M504487K114398J26115k380574n294861m266783J733903
31939d696965N571784J773954m042590l500706J381225K356803j097977j906749
$$ y = [5489005, 8899661, 9356063, 6471962, 3233195, 1525351, -45791, -2751771, -4722637, -4100144, -3000371, -4319852, -6116370, -4080299, 1096528, 4308667, 4035591, 3729780, 4324298, 1991088, -4297168, -9419859, -9726848, -8037921, -7124418, -4352308, 1914674, 6178491, 2742302, -5157766, -9782495, -9367501, -7651232, -5758468, -1885221, 2377574, 2749581, -639282, -3078424, -2682113, -2523478, -4777821, -7648102, -8874908, -8138095, -5632297, -2170519, -579898, -2877076, -6215917, -5750566, -1233650, 3270837, 5385235, 5511350, 3130776, -2164085, -6430868, -4696965, 874819, 2648773, -1393817, -4894523, -3513298, -1156495, -2254472, -4161221]
31931d161221J834855L938213P44000l675710m683910k633674M67273L839472
31923d330702N757967L921050k03411k114503q32445j94531k242389l929694k336619
31914f505277Q78465K453587J834143N91577m8834K72208J051825Q90358o00180
31905H17872j130329J411032M888388N010465J462603j563147j424492j80609
31897I291783p32447k832364m272233l824240j806666P68511K827173L813876
31889C233393L612855J711012j908548m371272j522734N785551J0247197O469949
31881B3257403j836122o866064o298970l596635j514153n51621j606928m397542
31873c410632m938605m69498M719366M598593Q46765m7656K285524K180783j455924
$$ y = [-4161221, -2326366, 1611847, 2355847, -1319863, -6003773, -8637447, -8170174, -4330702, 1427265, 5348315, 5144904, 3030401, 2197956, 2003425, -238964, -4168658, -6505277, -5626812, -3173225, -1339082, -747505, -796339, -524131, 527694, 1418052, 817872, -312457, 1098575, 5986963, 10997428, 12460031, 10896884, 9472392, 9291783, 8559336, 5726972, 1454739, -2369501, -4176167, -3407656, -580483, 3233393, 6846248, 8557260, 6648712, 2277440, 754706, 6540257, 16787454, 23257403, 21421281, 14555217, 8256247, 4659612, 3145459, 2593838, 986910, -3410632, -8349237, -8818735, -4099369, 499224, 1345989, 1298333, 3583857, 5764640, 4308716]
31864D308716l305862j238590P86773R03979J858425L397633J111978m296960
31856C526092n748739j517492J045498j814137l446103J117180N574999K847708
31848A585006k890415l594606p1490J829516J826056K574275J840392k683944
31840D14790n459931o42209O261774N358376j878599n208017j911334J307228
31832a757922J502727K226546L118721m61341o016006n017080J835971L497498
31824a070886l023821o381293M61279P905204N061460l275441n546997r20160
31816f790655L163517M337430M968063L472219k599951q044253n634417J521006
31808e607041L647251o66621l313864n21852K375976J620392R01720L249736N036354
$$ y = [4308716, 1002854, -235736, 551037, 1455016, 3313441, 6711074, 7823052, 3526092, -2222647, -3740139, -2694641, -4508778, -7954881, -6837701, -1262702, 1585006, -1305409, -4900015, -4971505, -3141989, -1315933, 1258342, 3098734, 414790, -5045141, -5687350, 574424, 5932800, 4054201, -1153816, -3065150, -1757922, -255195, 1971351, 5090072, 4628731, -1387275, -6404355, -4568384, -1070886, -4094707, -10476000, -10014721, -2109517, 2951943, -323498, -5870495, -6790655, -3627138, 710292, 5678355, 9150574, 6550623, -1493630, -7128047, -5607041, -1959790, -2626411, -5940275, -6462127, -4086151, -2465759, -1564039, 1685697, 6722051]
31799F722051K411013k115406l643766j368757J885942L258433J209997l199480
31791E160027n404041j779238M268857N437654O37871l549092k991501j279311
31783E01226k015353k289473J299311N246275L789651k150972o404855o023828
31775h048018l166547N7758L343095N197386L305278j208553l890173k694889
31767g104663m86899l74380j360114o66715J719288L429172L622380L719182M066420
31758F563671K669128j133450l931101k181514K032998K940880p69685l904948
31750B285979k818860j150557l519010o990524m747566L015342Q167600N519555
31742b38041p34728l501378j402461J791786L142374K858312K246496J789781
$$ y = [6722051, 9133064, 7017658, 3373892, 2005135, 3891077, 7149510, 8359507, 5160027, -244014, -2023252, 2245605, 7683259, 8321130, 4772038, 1780537, 501226, -1514127, -3803600, -2504289, 2741986, 6531637, 4380665, -2024190, -8048018, -11214565, -11156807, -7813712, -2616326, 688952, -519601, -4409774, -7104663, -7591562, -7965942, -9326056, -9992771, -8273483, -4844311, -1221931, 2497251, 6563671, 9232799, 8099349, 4168248, 1986734, 4019732, 6960612, 6190927, 2285979, -532881, -1683438, -5202448, -12192972, -16940538, -13925196, -5757596, -238041, -972769, -4474147, -5876608, -4084822, -942448, 1915864, 4162360, 5952141]
31734E952141R41073r19707k931424k898110m51595J260667l28320k711588j517443
31725c604306K607464M577811K244414j145545k246487j173658P48296K620646
31717D628635K782363J01554l083962l309896j113144N07419J628098L691742
31709E832809L788674j543224p450014n241388L227506O132239n58354o809998
31701b621750m533237J193649L123119L082779M290524L016086k518703m854429
31693A78038K26181L549259k600276q828058k966730P866298P400797k708627
31685B116882n594657K593877P508849J905519l644314j116257K086330q18955
31677E037274l216973Q61621L715383k478974j0057515p314117K414535O682584
$$ y = [5952141, 6893214, 5973507, 3042083, 143973, -307622, 953045, 624725, -2086863, -3604306, -996842, 3580969, 5825383, 4679838, 2433351, 1259693, 2007989, 4628635, 7410998, 7512552, 4428590, 1118694, 5550, 512969, 2141067, 5832809, 9621483, 8078259, 628245, -4613143, -1385637, 4746602, 4188248, -2621750, -7154987, -5961338, -2838219, 244560, 4535084, 7551170, 5032467, 178038, 404219, 3953478, 1353202, -7474856, -10441586, -2575288, 4825509, 2116882, -3477775, -883898, 6624951, 8530470, 4886156, 3769899, 5856229, 5037274, 1820301, 2681922, 6397305, 3918331, -6139184, -13453301, -11038766, -4356182]
31669d356182L565645J920590M706684M970640q72605o465222n270518L78077
31661a422891L587197J981195p76940r34652K17430j582192o252087p280112p61200
31652a3224252O421653M640745l424807n317361K246277P886579L557224l047114
31644b61056j895488L384904L429360n05340l73040L182218K091487m118973o876991
31635a942919k795788J582860J368137p406J186339K684257J903704R18969J461765
31626F359918P58397l102093o328841m660907j4208K527625J807544M35415n64471
31617b781621k368445m119004k588300K486039O078140L794723j474400k506813
31609c479681K377799O415823L735539k144732l680372n37587Q70882j696497
$$ y = [-4356182, -790537, 1130053, 5836737, 10807377, 9934772, 3469550, -1800968, -1422891, 2164306, 4145501, 3368561, 2433909, 2651339, 1069147, -5182940, -12463052, -13224252, -6802599, -2161854, -5586661, -10904022, -8657745, -771166, 2786058, -261056, -2156544, 1228360, 4657720, 4152380, 3779340, 6961558, 9053045, 4934072, -1942919, -4738707, -3155847, -1787710, -1795116, -608777, 2075480, 3979184, 4898153, 6359918, 7118315, 4016222, -2312619, -6973526, -6987734, -4460109, -2652565, -2217150, -2781621, -5150066, -9269070, -11857370, -9371331, -3293191, 501532, -972868, -3479681, -1101882, 5313941, 9049480, 6904748, 3224376, 2686789, 3557671, 1861174]
31601A861174l259821r04447J373541M21324n13340J281433K055719j240382l732950
31592b657749j69035M958128L598980k538418m291013N07836M404184K770957
31584F583870l27718j037767j894441m963252o055578j494202M409948M837253
31576E8113N02268j674711J235427M642559L596748q03507l942188l746648j712520
31567a844459N21554K490616L008196O05319k625483j433855M843917Q390620
31559A3956425K447562p489761r607506k534185K839996K50995l235367m20864
31551c792705L993485K830456m27483J369616M976708J949545n626029p548060
31543b274467k488700N08366j601137j278669M442785P114404J367107m954753
$$ y = [1861174, -1398647, -2303094, -929553, -508229, -1021569, 259864, 2315583, 1075201, -2657749, -2826784, 2131344, 5730324, 3191906, -1099107, -591271, 3812913, 6583870, 6256152, 5218385, 3323944, -1639308, -7694886, -9189088, -4779140, 58113, 560381, -1114330, 121097, 4763656, 8360404, 7556897, 3614709, -131939, -1844459, -1322905, 1167711, 4175907, 4781226, 2155743, 721888, 5565805, 13956425, 16403987, 8914226, -693280, -3227465, -387469, -136474, -3371841, -3792705, 200780, 3031236, 2603753, 3973369, 8950077, 10899622, 5273593, -2274467, -4763167, -4254801, -5855938, -7134607, -2691822, 4422582, 5789689, 834936]
31535H34936l290161K109090K376929j446758k269535k48268j416404n452007
31527h802178n365117M49448N078376L863492O26267K18075J177330k41409l221281
31518f216997l916232j381352J659470K785498K025944P88171M56051J387411
31510b412036K128528P01199k259818l313989q48971J912125J205201j402930
31502d290691j184457K078801L170324m38723m073223k593798K015248M106890
31494a209629K789855J720622J915624N60655k813277m494321k414217P40633
31486c204055K017544J911092J930478K042376K001129J882268N58146k478473
31478F660505l746226L49226N909564M816420k746230p012848l070906J978380
$$ y = [834936, -2455225, -346135, 2030794, 584036, -1685499, -1933767, -3350171, -8802178, -14167295, -13717847, -8639471, -4775979, -4149712, -3931637, -2754307, -2995716, -6216997, -10133229, -11514581, -9855111, -7069613, -5043669, -4255498, -3799447, -2412036, -283508, 417691, -1842127, -5156116, -6005087, -4092962, -2887761, -4290691, -5475148, -3396347, -226023, -664746, -4737969, -7331767, -5316519, -1209629, 1580226, 3300848, 5216472, 5777127, 2963850, -1530471, -3944688, -3204055, -1186511, 724581, 2655059, 4697435, 6698564, 8580832, 9138978, 6660505, 2914279, 3263505, 9173069, 13989489, 11243259, 4230411, 1159505, 3137885]
31470C137885J242591j415908k02090J576453j322059m703740j655057M275261
31462I33336M213203q97142k219400J506719K602375j211549l038400M64450L372831
31453E726423R66772l303288n037445m967511m230740j147987L519333M983723
31445c490720J793171j395355j422794o87456q75722M31025L578919M267550J109115
31436C307733q82474J340471L380148R39038l216827m819963m864507n452264
31428a0268645m355447K22074M110825K867675n72390l63059K798156L141573
31420b419238o07143l198271p05461M132332N694911K203194k505744l451911
31412h57331l62481K158418J234154j30818J462052L307029J065852k687682j740398
$$ y = [3137885, 4380476, 2964568, 2762478, 4338931, 3016872, -1686868, -3341925, 933336, 5146539, 4249397, 2029997, 3536716, 6139091, 4927542, 1889142, 2353592, 5726423, 6693195, 3389907, -1647538, -6615049, -10845789, -11993776, -8474443, -3490720, -1697549, -3092904, -4515698, -5203154, -6078876, -5647851, -2068932, 2198618, 3307733, 2425259, 3765730, 7145878, 8084916, 4868089, 48126, -4816381, -10268645, -14624092, -14402018, -10291193, -7423518, -7995908, -8358967, -5560811, -2419238, -3026381, -6224652, -6930113, -2797781, 2897130, 5100324, 2594580, -857331, -1219812, 938606, 2172760, 2041942, 3503994, 6811023, 7876875, 5189193, 3448795]
31403C448795K990346M282226M38893k558905j998931k140873m538051m382410
31395d458910k64543K000644o4050p89760K475365L341972j657094m956757l35435
31386d708568N628465M269900r10168j423206J453399N06221l941856n745217
31378d871030m295016l428780k369044J779580N640878M148472N66164J409442
31370a419334M402385K669131j938346j965718J253038l52609n725747m923111
31362h000311L150854P024302N95724p375444o836618O61116P559038R791862
31354F570523O376381j771727q463392o179168K700178P041496K624582k814958
31346F083915l624063m038208o581684m805514L944325R559986L808480n018746
$$ y = [3448795, 6439141, 10721367, 11160260, 8601355, 6602424, 4461551, -76500, -4458910, -4723453, -2722809, -2786859, -3576619, -1101254, 2240718, 583624, -4373133, -4708568, 919897, 5189797, 4279629, 2856423, 4309822, 4816043, 874187, -4871030, -9166046, -12594826, -14963870, -13184290, -7543412, -3394940, -2828776, -1419334, 2983051, 5652182, 3713836, 1748118, 3001156, 2648547, -3077200, -8000311, -4849457, 2174845, 2770569, -4604875, -11441493, -10780377, -3221339, 6570523, 12946904, 11175177, 2711785, -3467383, -767205, 6274291, 8898873, 6083915, 2459852, -1578356, -8160040, -12965554, -9021229, 538757, 4347237, -671509]
31338f71509m178838L757577O222362R27029k857041j163864K1114k405853l459988
31329c809011m55338J772791o6747k000612m90603J396305K90918j077090R36951
31320c502436L930246L160396p83148l093423j838360L71001R27715p4580j297963
31311b200552j595923l36438J571231J678635p51209k420466J72685M990546O033761
31302G142270J366548l924827m595141j843639j53624k93883K25983J243782j44383
31293i76914l335025l249229K139250P750334P977742L682040p82976l969385
31285I235837o476883o825368l545343M87706J274122Q4316J145742L863520L571066
31276B814715M9166j453677Q74039K101007j060181m496664l221636J089110L391519
$$ y = [-671509, -4850347, -1092770, 5129592, 6056621, 3199580, 2035716, 2056830, -349023, -3809011, -4264349, -2491558, -2558305, -4558917, -5049520, -3653215, -3362297, -4439387, -3502436, 427810, 3588206, 2805058, -288365, -2126725, -1755724, -828009, -902589, -2200552, -3796475, -4132913, -2561682, -883047, -1634256, -4054722, -3882037, 1108509, 7142270, 8508818, 4583991, -11150, -1854789, -2008413, -2302296, -2076313, -832531, -976914, -4311939, -7561168, -5421918, 2328416, 10306158, 13988198, 13205222, 9235837, 2758954, -4066414, -7611757, -7124051, -5849929, -5765613, -4619871, -756351, 2814715, 2863881, 1410204, 2284243, 4385250, 3325069, -1171595, -4393231, -3304121, 87398]
31267H7398K500689Q74668K7691k7507Q14821J555255j61893l896900m990561
31258c216339j046103L235448K323180j739435k767749l96497J874k809247l214792
31249i629660J751209O277933L745224k937398m639353J199200O497921L277308
31241E542384n244285q415448k146620N564237N329318j095712l762408J259302
31233b969232O605835M428500k705431o018209k604775J901147K086720o62973
31225F1582j728627O110J536529N61174j449729j524278O43290K215098J246455
31216A567604k32492J100169M683470N915666J697558n657779j0650441r324166
31208a0900411j955300O680692R787080M536154l560604n640455k29300M643261
$$ y = [87398, 2588087, 3462755, 3490446, 3462939, 4277760, 5833015, 5671122, 1774222, -3216339, -4262442, -1026994, 1296186, -443249, -3210998, -3607495, -3605621, -6414868, -9629660, -7878451, -1600518, 2144706, -792692, -5432045, -4232845, 2265076, 5542384, 298099, -8117349, -10263969, -4699732, 629586, -466126, -4228534, -2969232, 3636603, 8065103, 5359672, -658537, -3263312, -1362165, 724555, 61582, -1667045, -1660935, -124406, 436768, -1012961, -2537239, -1893949, 321149, 1567604, 1335112, 2435281, 7118751, 13034417, 14731975, 9074196, -1576245, -10900411, -12855711, -6175019, 3612061, 8148215, 4587611, -1052844, -1282144, 3361117]
31200C361117K155459m409027o886404l059221K137627M190586L225032J443359
31192B158528K86725J40820J86108j037265l023017k879334J98402K436656O64430
31183h67947k563923l015626j367211q39476o85887J839277M696572L403285k97514
31174C01550J21237M878345O240478N97782n453649n221048j327282J81614o60839
31165c41812k55384J022718M09695j038882j30623K379144K994980J405544Q7345
31156F532725p27853k625803m547105l775491q49921J150818J711052K707491
31148d24087L686509K172952j319753l263758k438185j057186m32629K87269J014666
31139a774202O90914L25608J564667K483958n6054m023982m138588n15049J324585
$$ y = [3361117, 5516576, 1107549, -5778855, -8838076, -6700449, -2509863, 715169, 2158528, 2445253, 2586073, 2772181, 1734916, -1288101, -4167435, -3969033, -1532377, -867947, -3431870, -6447496, -7814707, -8654183, -9340070, -7500793, -2804221, 599064, 301550, 422787, 5301132, 11541610, 12139392, 6685743, 1464695, 137413, 319027, -341812, -597196, 425522, 835217, -203665, -334288, 2044856, 5039836, 6445380, 6532725, 5804872, 3179069, -1368036, -5143527, -5993448, -4842630, -3131578, -424087, 3262422, 5435374, 4115621, 851863, -1586322, -2643508, -3076137, -2788868, -1774202, -1083288, -757680, 806987, 3290945, 3234891, -789091, -4927679, -5442728, -4118143]
31130d118143J60553J082692N136788N267261k190852r261771o825884J830979
31122h918377O035176L097436K49450K168151M667871K528220k541806m999378
31114B286743l150918n68016p58161k571241j995210J710261L980112J396043
31106C29613k124721n57837L958022L224152l645466p343920k525727L603939
31098e081945K951944r64214m16959L044189K451032j599042k398521Q48280K749368
31089A584132K094714K340814K488716j838093p690629o129254L386253J0050951
31081F287604O696741j141125m941977l854840j602116j47134n11619l297815
31073b512281n102519j199135N551396O358135O0629l949994n11568L298067Q70543
$$ y = [-4118143, -3957590, -2874898, 2261890, 7529151, 5338299, -3923472, -10749356, -8918377, -2883201, 214235, 463685, 2631836, 7299707, 9827927, 7286121, 2286743, -864175, -1432191, -2190352, -4761593, -6756803, -5046542, -1066430, 329613, -1795108, -2352945, 1605077, 4829229, 1183763, -6160157, -8685884, -5081945, -2130001, -3094215, -3511174, -466985, 1984047, 385005, -2013516, -1165236, 1584132, 3678846, 6019660, 8508376, 6670283, -1020346, -7149600, -3763347, 6287604, 12984345, 11843220, 6901243, 3046403, 1444287, 1297153, 785534, -2512281, -7614800, -8813935, -3262539, 3095596, 3156225, -793769, -1305337, 1992730, 2863273]
31064B863273k795071o59109L897986L438451j048638l324958k616311k316646
31056b561023k185305k47918J240961l75597k115395o52784P00364j758080l762885
31047a1717662n1086M997632L956951m67526k23935L306382J954288l434342l483066
31038e162364K760756N140881k50778m192447j98903M607048K029818l512274
31030A221737k931866K628593M278977p15847n722051m498443J601087O327326
31022B189513N280977J16525k952653k38931M136103L360090k078025m723193
31014E090406j243435K926602K324669j204277l440652m480603n864792n612918
31006a1505000j504027L718007N417881L283046L38697k036720l918331l787267
$$ y = [2863273, 68202, -590907, 3307079, 6745530, 5696892, 2371934, -244377, -2561023, -4746328, -4994246, -3753285, -4128882, -6244277, -6897061, -6196697, -7954777, -11717662, -11768748, -6771116, -2814165, -3281691, -3505626, -199244, 1755044, -1679298, -5162364, -2401608, 2739273, 2488495, -1703952, -1902855, 2704193, 4734011, 1221737, -1710129, 918464, 5197441, 4481594, -1240457, -5738900, -4137813, 2189513, 7470490, 7587015, 4634362, 4395431, 8531534, 11891624, 9813599, 5090406, 3846971, 6773573, 9098242, 7893965, 4453313, -27290, -5892082, -11505000, -13009027, -9291020, -3873139, -590093, -251396, -2288116, -6206447, -9993714]
30998i993714m51885L132720K650001j203594l318816j384663J522913K469558
30990f577480K783713M387182N225220K093610l312168n349045j995424K329458
30982d14934L296740K251834K005246Q28909l716570p534206m270788L522685
30974d031084O180622J528331j676992J376190L406592j531633o398773k898232
30966d044979L409042K126820l817213l140830M010073O330319R43217k404769
30958C411680J070144L896369J114643j069699K125121M561180J54122o245736
30950I017824p115995l604295q82159R45228L704308M933039K181255j339281
30942G839924j733405m29319j4535N33466J559225L5114l578117l005353L115200
$$ y = [-9993714, -10445599, -7312879, -4662878, -5866472, -9185288, -10569951, -9047038, -6577480, -3793767, 593415, 5818635, 7912245, 4600077, -748968, -2744392, -414934, 2881806, 5133640, 7138886, 7967795, 4251225, -3282981, -7553769, -4031084, 2149538, 3677869, 2000877, 3377067, 6783659, 5252026, -1146747, -4044979, -635937, 1490883, -2326330, -5467160, -1457087, 4873232, 5816449, 3411680, 4481824, 8378193, 9492836, 8423137, 10548258, 15109438, 15263560, 9017824, 1901829, -1702466, -2584625, -1639397, 2064911, 6997950, 9179205, 7839924, 6106519, 5677200, 5662665, 6196131, 7755356, 7790470, 4212353, 1207000, 4322200]
30933D322200O041357J84850o302998l744615L277514L540208k799097o054179
30925a534760l543912j625822k306878k20600N641359Q106411K997743m187286
30917C326255o223851k653454K241929M942043M241032J221681j296210j909903
30909C889522k090672j920055J727164Q030465Q527506j489743j2254256j0497965
30901f078034J243264P720113K912044l293638k261071J787299J983286k25071
30893C788192r42696j842393m783229n344845K21851O487340N221911k586899
30885B19232q007538n874919L97347M687025M265750P06786j897279m47541L181601
30876b769536L602077n04005l387804j74259N354757N680826L19528l700137j894214
$$ y = [4322200, 10363557, 10548407, 4245409, 500794, 3778308, 7318516, 4519419, -1534760, -5078672, -6704494, -9011372, -9231972, -3590613, 4515798, 7513541, 3326255, -2897596, -5551050, -3309121, 1632922, 5873954, 7095635, 5799425, 3889522, 1798850, -121205, 1605959, 9636424, 18163930, 16674187, 4419931, -6078034, -4834770, 2885343, 5797387, 2503749, 242678, 2029977, 4013263, 3788192, 2845496, 1003103, -3780126, -9124971, -8903120, -2415780, 2806131, 219232, -7788306, -13663225, -13265878, -8578853, -4313103, -3606317, -5503596, -5951137, -2769536, 832541, 328536, -3059268, -3233527, 2121230, 7802056, 8121584, 4421447, 2527233]
30867B527233K163567K747033m98046l422126l542872k408720k043425j535977
30859f013333J144440M863350N491136J501882k784385k086316K814351N885261
30851A0816386L479043j733505m865189m220899j788614l83689j063238k011084
30843a770789k01474M197249O305108K406879l820247n271599j221053K081102
$$ y = [2527233, 4690800, 7437833, 6939787, 3517661, -25211, -2433931, -4477356, -6013333, -4868893, -5543, 5485593, 6987475, 4203090, 2116774, 4931125, 10816386, 14295429, 12561924, 7696735, 3475836, 1687222, 1303533, 240295, -1770789, -1972263, 2224986, 8530094, 10936973, 7116726, 1845127, 624074, 2705176]
$$ [...]
##END NTUPLES=NMR SPECTRUM
##END=
