##TITLE=31Pdec_LY-3Dix.HYD
 CD3CN, 24 sc
 5.03.2021
##JCAMPDX= 6.0         $$ Bruker NMR JCAMP-DX V2.0
##DATA TYPE= NMR SPECTRUM
##DATA CLASS= NTUPLES
##ORIGIN= UXNMR, Bruker Analytische Messtechnik GmbH
##OWNER= root
$$ XWIN-NMR		Version 3.5
$$ Fri Mar  5 10:19:24 2021 Russian Standard Time (UT+4h)  she@DPX200
##.OBSERVE FREQUENCY= 81.013821
##.OBSERVE NUCLEUS= ^31P
##.ACQUISITION MODE= SIMULTANEOUS
##.ACQUISITION SCHEME= undefined
##.AVERAGES= 24
##.DIGITISER RES= 16
##SPECTROMETER/DATA SYSTEM= spect
##.PULSE SEQUENCE= zgpg30
##.SOLVENT NAME= CDCl3
##.SHIFT REFERENCE= (INTERNAL, CDCl3, 0, 248.564)
##AUDIT TRAIL= $$ (NUMBER, WHEN, WHO, WHERE, WHAT)
$$ ##TITLE= Audit trail, XWIN-NMR		Version 3.5
$$ ##JCAMPDX= 5.01
$$ ##ORIGIN= Bruker BioSpin GmbH
$$ ##OWNER= she
$$ F:/spectra/data/she/nmr/P31/1/pdata/1/auditp.txt
$$ ##AUDIT TRAIL=  $$ (NUMBER, WHEN, WHO, WHERE, WHAT)
(   1,<2021-03-05 10:17:58.62 +0400>,<she>,<DPX200>,
      <created by zg, POWCHK disabled, PULCHK disabled
       configuration hash MD5:
       00 E9 B6 7A A2 85 ED C7 34 08 36 98 17 FE 4E 26
       data hash MD5: 32K
       52 F7 74 DB 82 14 C2 15 A4 6A 0C 7E 6F 11 3C 28>)
(   2,<2021-03-05 10:18:01.93 +0400>,<she>,<DPX200>,
      <Start of raw data processing
       efp BC_mod = 2 LB = 1 FT_mod = 6 PKNL = 1 PHC0 = -3321.101 PHC1 = 11.60099 SI = 64K 
       data hash MD5: 64K
       04 89 56 B1 5C E6 9E F5 C7 D4 CD EC 12 42 E5 61>)
(   3,<2021-03-05 10:18:38.51 +0400>,<she>,<DPX200>,
      <pk PHC0 = 113.949 PHC1 = -243.2 
       data hash MD5: 64K
       34 E8 F8 D2 7B 5C BF 39 BE 06 BB 9C 56 B3 47 BE>)
(   4,<2021-03-05 10:18:41.53 +0400>,<she>,<DPX200>,
      <abs ABSG = 5 
       data hash MD5: 64K
       84 2F BF 1F B7 E9 70 41 B7 AD 67 6C 9E 77 9B FD>)
$$ ##END=
$$ 
$$ hash MD5
$$ 6C 3A A6 6C B9 60 D1 23 BB A0 4E 4A 27 32 A5 CA
##$RELAX= 
##$RELAX= 
##$RELAX= 
##$RELAX= 
##$RELAX= 
##$RELAX= 
##$RELAX= 
##$RELAX= 
$$ Bruker specific parameters
$$ --------------------------
##$DU= <F:/spectra>
##$EXPNO= 1
##$NAME= <P31>
##$PROCNO= 1
##$TYPE= <nmr>
##$USER= <she>
##$AMP= (0..31)
100 100 100 100 100 100 100 100 100 100 100 100 100 100 100 100 100 100 
100 100 100 100 100 100 100 100 100 100 100 100 100 100 
##$AQSEQ= 0
##$AQ_mod= 1
##$AUNM= <au_zg>
##$AUTOPOS= <>
##$BF1= 81.014009
##$BF2= 200.13
##$BF3= 200.13
##$BF4= 200.13
##$BF5= 200.13
##$BF6= 200.13
##$BF7= 200.13
##$BF8= 200.13
##$BYTORDA= 1
##$CFDGTYP= 0
##$CFRGTYP= 5
##$CHEMSTR= <none>
##$CNST= (0..31)
1 1 145 1 1 1 1 1 1 1 1 1 1 1 1 1 1 1 1 1 1 1 1 1 1 1 1 1 1 1 1 1 
##$CPDPRG= <waltz16>
##$CPDPRG1= <>
##$CPDPRG2= <waltz16>
##$CPDPRG3= <>
##$CPDPRG4= <mlev>
##$CPDPRG5= <mlev>
##$CPDPRG6= <mlev>
##$CPDPRG7= <mlev>
##$CPDPRG8= <mlev>
##$CPDPRGB= <>
##$CPDPRGT= <>
##$D= (0..31)
0 1 0 0 0 0 0 0 0 0 0 0.03 2e-05 3e-06 0 0 0 0 0 0 0 0 0 0 0 0 0 0 0 0 
0 0 
##$DATE= 1614925078
##$DBL= (0..7)
120 120 120 11 120 120 24 19 
##$DBP= (0..7)
150 150 150 150 150 150 150 150 
##$DBP07= 0
##$DBPNAM0= <>
##$DBPNAM1= <>
##$DBPNAM2= <>
$$ [...]
##$SUBNAM3= <"">
##$SUBNAM4= <"">
##$SUBNAM5= <"">
##$SUBNAM6= <"">
##$SUBNAM7= <"">
##$SUBNAM8= <"">
##$SUBNAM9= <"">
##$SW= 501.771253377433
##$SWIBOX= (0..15)
0 1 3 0 0 0 0 0 0 0 0 0 0 0 0 0 
##$SW_h= 40650.406504065
##$TD= 32768
##$TD0= 1
##$TE= 0
##$TE2= 300
##$TE3= 300
##$TEG= 300
##$TL= (0..7)
0 120 53 12 22 120 120 120 
##$TP= (0..7)
150 150 150 150 150 150 150 150 
##$TP07= 0
##$TPNAME0= <>
##$TPNAME1= <>
##$TPNAME2= <>
##$TPNAME3= <>
##$TPNAME4= <>
##$TPNAME5= <>
##$TPNAME6= <>
##$TPNAME7= <>
##$TPOAL= (0..7)
0.5 0.5 0.5 0.5 0.5 0.5 0.5 0.5 
##$TPOFFS= (0..7)
0 0 0 0 0 0 0 0 
##$TUNHIN= 0
##$TUNHOUT= 0
##$TUNXOUT= 0
##$USERA1= <user>
##$USERA2= <user>
##$USERA3= <user>
##$USERA4= <user>
##$USERA5= <user>
##$V9= 5
##$VALIST= <valist>
##$VCLIST= <CCCCCCCCCCCCCCC>
##$VD= 0
##$VDLIST= <DDDDDDDDDDDDDDD>
##$VPLIST= <PPPPPPPPPPPPPPP>
##$VTLIST= <TTTTTTTTTTTTTTT>
##$WBST= 1024
##$WBSW= 4
##$XGAIN= (0..3)
0 0 0 0 
##$XL= 0
##$YL= 0
##$YMAX_a= 59108
##$YMIN_a= -81045
##$ZGOPTNS= <>
##$ZL1= 120
##$ZL2= 120
##$ZL3= 120
##$ZL4= 120
##$ABSF1= 248.5645
##$ABSF2= -253.2056
##$ABSG= 5
##$ABSL= 3
##$ALPHA= 0
##$AQORDER= 0
##$ASSFAC= 0
##$ASSFACI= 0
##$ASSFACX= 0
##$ASSWID= 0
##$AUNMP= <proc_1d>
##$AZFE= 0.1
##$AZFW= 0.5
##$BCFW= 0
##$BC_mod= 2
##$BYTORDP= 0
##$COROFFS= 0
##$CY= -3
##$DATMOD= 1
##$DC= 0
##$DFILT= <>
##$DTYPP= 0
##$F1P= 0
##$F2P= 0
##$FCOR= 1
##$FTSIZE= 65536
##$FT_mod= 6
##$GAMMA= 0
##$GB= 0
##$INTBC= 1
##$INTSCL= 5.30512e-09
##$ISEN= 30
##$LB= 1
##$LEV0= 0
##$LPBIN= 0
##$MAXI= 10000
##$MC2= 0
##$MEAN= 0
##$ME_mod= 0
##$MI= 50
##$NCOEF= 0
##$NC_proc= -1
##$NLEV= 6
##$NOISF1= 182.463
##$NOISF2= 159.3651
##$NSP= 0
##$NTH_PI= 0
##$NZP= 0
##$OFFSET= 248.5645
##$PC= 4
##$PHC0= -3207.152
##$PHC1= -231.599
##$PH_mod= 1
##$PKNL= yes
##$PPARMOD= 0
##$PSCAL= 0
##$PSIGN= 0
##$REVERSE= no
##$SF= 81.014009
##$SI= 65536
##$SIGF1= 159.3651
##$SIGF2= -187.1042
##$SINO= 113.3802
##$SIOLD= 16384
##$SREGLST= <1H.CDCl3>
##$SSB= 0
##$STSI= 65536
##$STSR= 0
##$SW_p= 40650.406504065
##$SYMM= 0
##$S_DEV= 0
##$TDeff= 32768
##$TDoff= 0
##$TI= <>
##$TILT= no
##$TM1= 0
##$TM2= 0
##$TOPLEV= 0
##$USERP1= <user>
##$USERP2= <user>
##$USERP3= <user>
##$USERP4= <user>
##$USERP5= <user>
##$WDW= 1
##$XDIM= 65536
##$YMAX_p= 277589798
##$YMIN_p= -882383
$$ End of Bruker specific parameters
$$ ---------------------------------
##NTUPLES= NMR SPECTRUM
##VAR_NAME=  FREQUENCY,     SPECTRUM/REAL,   SPECTRUM/IMAG
##SYMBOL=    X,             R,               I
##VAR_TYPE=  INDEPENDENT,   DEPENDENT,       DEPENDENT
##VAR_FORM=  AFFN,          ASDF,            ASDF
##VAR_DIM=   65536,         65536,           65536
##UNITS=     HZ,            ARBITRARY UNITS, ARBITRARY UNITS
##FACTOR=    0.620285442955139, 1,           1
##FIRST=     20137.2065510759, 0,            0
##LAST=      -20513.1999529892, 0,           0
##MIN=       -20513.1999529892, -882383,     0
##MAX=       20137.2065510759, 277589798,    0
$$ Real data points
##PAGE= N=1
##DATA TABLE= (X++(R..R)), XYDATA
$$ [...]
$$ plain form
36264 66461 115201 89992 -4807 -118339 -166274 -97578 28990 80403 -353 -122870 -174177
36253 -174177 -160465 -152555 -145665 -83169 7933 33273 -12157 -29952 13756 33226 -18076 -60358
36241 -60358 -31133 -498 -49396 -129569 -150145 -124068 -116268 -112549 -61193 4082 8812 -24920
36229 -24920 -10773 47142 55633 -9129 -62729 -50624 -18762 -18798 -38660 -59283 -91231 -119495
36217 -119495 -98171 -41713 -36795 -110834 -168858 -127215 -39038 -5678 -19564 7091 85488 126440
36205 126440 81112 14000 -1367 9544 -24907 -102963 -150217 -131030 -92775 -77693 -48589
36194 -48589 44461 155897 176182 76310 -45051 -83639 -41414 18063 66514 106499 116939
36183 116939 74988 7499 -44623 -88534 -136972 -136921 -38294 82155 85993 -20371 -71077 14559
$$ packed form
36264F6461M8740k5209r4799j13532m7935O8696J26568N1413q0756j22517n1307
36253a74177J3712P910O890O2496R1102K5340m5430j7795M3708J9470n1302m2282
36241f0358K9225L0635m8898q0173k0576K6077P800L719N1356O5275M730l3732
36229b4920J4147N7915Q491o4762n3600J2105L1862l6j9862k0623l1948k8264
36217a19495K1324N6458M918p4039n8024M1643Q8177L3360j3886K6655P8397M0952
36205A26440m5328o7112j5367J0911l4451p8056m7254J9187L8255J5082K9104
36194d8589R3050J11436K0285r9872j21361l8588M2225N9477M8451L9985J0440
36183A16939m1951o7489n2122m3911m8438N1R8627J20449L838j06364n0706Q5636
$$ plain form
36171 14559 96927 20481 -147030 -209471 -119503 -19243 -16463 -56438 -44775 16465 69568
36160 69568 92209 82789 16912 -108851 -223243 -237186 -145346 -26832 43840 47293 -3251
36149 -3251 -82629 -145635 -142501 -68170 20402 54619 19769 -35406 -54150 -35308 -34435 -90087
36137 -90087 -158051 -150626 -50081 52774 60185 -18992 -90553 -88905 -30459 32388 63382 47744
36125 47744 -10381 -80564 -123269 -126146 -107450 -86230 -69912 -62436 -57527 -35762 680 10648
36113 10648 -24834 -50011 -9398 43840 5329 -110832 -162472 -72338 67243 133161 120220
36102 120220 84815 35191 -28457 -43507 32897 124886 132886 83118 66385 69439 4046 -115150
36090 -115150 -169089 -121068 -65215 -60635 -52713 -4887 21334 -16457 -58045 -47771 -24621 -29537
$$ packed form
36171A4559Q2368p6446j67511o2441Q9968J00260K780l9975J1663O1240N3103
36160F9568K2641r420o5877j25763j14392j3943R1840J18514P0672L453n0544
36149c251p9378o3006L134P4331Q8572L4217l4850n5175j8744J8842Q73n5652
36137i0087o7964P425J00545J02855P411p9177p1561J648N8446O2847L0994j5638
36125D7744n8125p0183m2705k877J8696K1220J6318P476M909K1765L6442R968
36113A0648l5482k5177M0613N3238l8511j16161n1640R0134J39581O5918j2941
36102A20220l5405m9624o3648j5050P6404R1989Q000m9768j6733L054o5393j19196
36090a15150n3939M8021N5853M580P922M7826K6221l7791m1588J0274K3150m916
$$ plain form
36078 -29537 -19447 41788 96474 89597 69776 94567 113916 61353 -8204 -1603 43600 15728
36066 15728 -74046 -101523 -36206 11791 -17972 -40748 15934 79650 47766 -49888 -101825 -78290
36054 -78290 -48986 -59546 -76509 -60507 -28254 -20034 -45155 -79964 -95887 -74981 -18115 44847
36042 44847 66686 26089 -43222 -85492 -87489 -89384 -122600 -163187 -171221 -153577 -148641 -160843
36030 -160843 -157484 -130520 -111460 -113515 -106680 -69158 -21954 4618 -2534 -55466 -151170 -226290
36018 -226290 -197568 -80509 7435 8075 4585 75253 150289 115890 -1514 -73277 -55088 -17047
36006 -17047 -8108 -11517 -28927 -83989 -130986 -83405 40234 118468 109402 107082 165199 196762
35994 196762 133157 59973 76642 118235 59447 -66881 -111733 -48341 -11859 -79703 -153492
$$ packed form
36078b9537J0090O1235N4686o877j9821K4791J9349n2563o9557O601M5203k7872
36066A5728q9774k7477O5317M7997k9763k2776N6682O3716l1884r7654n1937K3535
36054g8290K9304j0560j6963J6002L2253Q220k5121l4809j5923K0906N6866O2962
36042D4847K1839m0597o9311m2270j997j895l3216m0587q034J7644M936j2202
36030a60843L359K6964J9060k055O835L7522M7204K6572p152n2932r5704p5120
36018b26290K8722J17059Q7944O40l490P0668P5036l4399j17404p1763J8189L8041
36006a7047Q939l409j7410n5062m6997M7581J23639P8234r066k320N8117L1563
35994A96762o3605p3184J6669M1593n8788j26328m4852O3392L6482o7844p3789
$$ plain form
35983 -153492 -119560 -18023 30125 -6907 -60869 -83460 -94158 -116690 -135440 -129624 -109130
35972 -109130 -97418 -98804 -94503 -63042 -4508 49363 60396 32615 18512 49393 74638 17213
35960 17213 -105964 -175646 -116469 -4654 28778 -25991 -55444 3986 78010 76868 26533
35949 26533 5687 6654 -42904 -136084 -169552 -95765 -4792 -2804 -73567 -124147 -121650 -109243
35937 -109243 -109725 -93718 -49071 -14172 -21281 -58089 -104798 -156861 -184072 -124653 29458 182256
35925 182256 227271 165867 76038 -6518 -97292 -167285 -140055 -13539 101375 113620 55308
35914 55308 2044 -36806 -76094 -70671 25042 149211 190044 139023 87561 74476 42620 -36972
35902 -36972 -103364 -106475 -79178 -62087 -36261 16600 57843 52998 30581 27947 34351 33704 39402
$$ packed form
35983a53492L3932J01537M8148l7032n3962k2591j0698k2532j8750N816K0494
35972a09130J1712j386M301L1461N8534N3871J1033k7781j4103L0881K5245n7425
35960A7213j23177o9682N9177J11815L3432n4769k9453N9430P4024j142n0335
35949B6533k0846R67m9558r3180l3468P3787R0973J988p0763n0580K497J2407
35937a09243m82J6007M4647L4899p109l6808m6709n2063k7211N9419J54111J52798
35925A82256M5015o1404q9829q2556r0774o9993K7230J26516J14914J2245n8312
35914E5308n3264l8850l9288N423R5713J24169M0833n1021n1462j3085l1856p9592
35902c6972o6392l111K7297J7091K5826N2861M1243m845k2417k634O404o47N698
$$ plain form
35889 39402 35589 -41943 -196662 -312878 -291987 -191744 -140259 -160370 -177529 -161593 -149457
35878 -149457 -145489 -110508 -51945 -26167 -39886 -37239 1366 30295 25257 20276 35755 40480
35866 40480 11104 -29942 -55697 -60351 -35173 21380 64946 45625 -5998 -10435 31126 28096
35854 28096 -49080 -101786 -40983 81799 144181 99040 -5684 -103074 -145056 -107525 -18943
35843 -18943 43630 35090 -6825 -24249 -9873 23828 88568 170696 189763 92286 -42190 -80887
35831 -80887 -15531 31781 -9937 -68318 -55642 -5299 -11213 -83036 -141898 -140565 -110141 -82434
35819 -82434 -39317 28218 68064 28311 -58065 -104138 -73328 -4157 60308 109175 125352 78155
35807 78155 -13362 -64173 -17938 76187 125758 106988 70674 58807 62624 54855 28094 7856
$$ packed form
35889C9402l813p7532j54719j16216K0891J00243N1485k0111j7159J5936J2136
35878a49457L968L4981N8563K5778j3719K647L8605K8929n038m981J5479M725
35866D0480k9376m1046k5755m654K5178N6553M3566j9321n1623m437M1561l030
35854B8096p7176n2706O0803J22782O2382m5141j04724r7390m1982L7531Q8582
35843a8943O2573q540m1915j7424J4376L3701O4740Q2128J9067r7477j34476l8697
35831h0887O5356M7312m1718n8381J2676N0343n914p1823n8862J333L0424K7707
35819h2434M3117O7535L9846l9753q6376m6073L0810O9171O4465M8867J6177m7197
35807G8155r1517n0811M6235R4125M9571j8770l6314j1867L817p769k6761k0238
$$ plain form
35795 7856 46265 175084 336935 399818 286598 68129 -110654 -170412 -128376 -35278 57925
35784 57925 101067 78873 32757 5321 -9930 -26027 -23694 -11976 -58546 -172389 -225464 -111957
35772 -111957 65461 110928 9183 -70147 -35549 25732 33325 30914 60363 71442 34588
35761 34588 11208 29750 16405 -62258 -108236 -43637 58150 99521 109330 147864 164549 91407
35749 91407 -2931 -3498 63839 83184 42146 23431 31965 -12256 -110333 -161780 -126376 -79298
35737 -79298 -74351 -66620 -9963 64351 105031 99669 51913 -24998 -76286 -48271 20390 32567
35725 32567 -27016 -74300 -66691 -60337 -91957 -107383 -66111 -26607 -54896 -118310 -142750 -117731
35713 -117731 -75239 -19581 46413 73711 28846 -30953 -28248 13764 7991 -53068 -85207 -49832
$$ packed form
35795G856L8409J28819J61851O2883j13220k18469j78783n9758M2036R3098R3203
35784E7925M3142k2194m6116k7436j5251j6097K333J1718m6570j13843n3075J13507
35772a11957J77418M5467j01745p9330L4598O1281P593k411K9449J1079l6854
35761C4588k3380J8542j3345p8663m5978O4599J01787M1371R809L8534J6685p3142
35749I1407r4338n67O7337J9345m1038j8715Q534m4221r8077n1447L5404M7078
35737g9298M947P731N6657P4314M0680n362m7756p6911n1288K8015O8661J2177
35725C2567n9583m7284P609O354l1620j5426M1272L9504k8289o3414k4440K5019
35713a17731M2492N5658O5994K7298m4865n9799K705M2012n773o1059l2139L5375
$$ plain form
35701 -49832 -7894 -6551 -579 57919 122940 122800 77622 62998 80342 57949 -15185 -54938
35689 -54938 -18150 16589 -27615 -92197 -66432 37041 96930 61942 4518 -18583 -47321
35678 -47321 -113895 -158992 -127821 -73438 -77095 -120658 -130011 -104706 -103341 -119996 -82733 14315
35666 14315 74164 27744 -71306 -126643 -121047 -109390 -122106 -126697 -83357 -6045 49634 56318
35654 56318 52781 87499 136567 130592 73771 61918 132013 168447 52766 -140621 -217466 -122067
35642 -122067 1545 27271 -1126 5221 19009 -36481 -131476 -160541 -106573 -65913 -99649
35631 -99649 -150080 -140730 -93385 -91369 -157874 -224971 -222430 -156471 -83005 -30730 13214 46492
35619 46492 28194 -56970 -143105 -144488 -68245 -13282 -44059 -115588 -151779 -150768 -162357 -190352
$$ packed form
35701d9832M1938J343N972N8498O5021j40m5178j4624J7344k2393p3134l9753
35689e4938L6788L4739m4204o4582K5765J03473N9889l4988n7424k3101k8738
35678d7321o6574m5097L1171N4383l657m3563r353K5305J365j6655L7263R7048
35666A4315N9849m6420r9050n5337N596J1657j2716m591M3340P7312N5679O684
35654E6318l537L4718M9068n975n6821j1853P0095L6434j15681j93387p6845R5399
35642a22067J23612K5726k8397O347J3788n5490r4995k9065N3968M0660l3736
35631i9649n0431R350M7345K016o6505o7097K541O5959P3466N2275M3944L3278
35619D6492j8298q5164q6135j383P6243N4963l0777p1529l6191J011j1589k7995
$$ plain form
35607 -190352 -182625 -120300 -57787 -47877 -69439 -69541 -51092 -64702 -113619 -125198 -51675 41519
35595 41519 46192 -41842 -111033 -83361 -11882 10997 -12377 -10337 29097 39098 -11234 -63555
35583 -63555 -65293 -51650 -77167 -111439 -75902 29770 110873 101527 45378 20302 30245 22606
35571 22606 -14271 -35088 -21357 -20197 -70371 -134483 -148537 -112038 -79843 -77513 -77502 -61380 -52821
35558 -52821 -69210 -83549 -64911 -28587 -15103 -35563 -62297 -62115 -21609 45946 101636 103799
35546 103799 49085 -18675 -53092 -47033 -21974 4603 26393 39451 41897 32054 1401 -52944
35534 -52944 -105226 -116249 -79986 -29480 9443 38760 57157 50502 27929 22580 34297 17109
35522 17109 -47175 -106487 -102907 -40606 38621 101148 114581 56706 -25848 -36504 34438 65817
$$ packed form
35607a90352P727O2325O2513R910k1562j02J8449j3610m8917j1579P3523R3194
35595D1519M673q8034o9191K7672P1479K2879k3374K040L9434J0001n0332n2321
35583f3555j738J3643k5517l4272L5537J05672Q1103r346n6149k5076R943p639
35571B2606l6877k0817J3731J160n0174o4112j4054L6499L2195K330J1J6122Q559
35558e2821j6389j4339J8638L6324J3484k0460k6734J82M0506O7555N5690K163
35546A03799n4714o7760l4417O059K5059K6577K1790J3058K446r843l0653n4345
35534e2944n2282j1023L6263N0506L8923K9317J8397o655k2573n349J1717j7188
35522A7109o4284n9312L580O2301P9227O2527J3433n7875q2554j0656P0942L1379
$$ plain form
35510 65817 -19735 -113286 -69609 58590 89120 -5191 -51816 46478 158057 133120 32236
35499 32236 12986 75448 75607 -32480 -117459 -67496 48142 85344 24331 -23744 13385 78139
35487 78139 83025 34473 1973 219 -24136 -89098 -136644 -125901 -101168 -114327 -132686 -96268
35475 -96268 -32770 -28952 -93248 -132063 -82976 -552 26153 -11127 -49553 -47124 -23575 -21221
35463 -21221 -52660 -88494 -90929 -60544 -38518 -50994 -72406 -68912 -53204 -56989 -71459 -66219
35451 -66219 -51183 -59186 -74645 -47539 16282 47831 14891 -35495 -56806 -60938 -66611 -55305
35439 -55305 -22376 -14239 -59043 -104851 -88407 -35210 -26163 -77030 -113727 -76811 -3663 16420
35427 16420 -53649 -160889 -223463 -214035 -172149 -142516 -130789 -134015 -176086 -266362 -343557 -321415
$$ packed form
35510F5817q5552r3551M3677J28199L0530r4311m6625R8294J11579k4937j00884
35499C2236j9250O2462J59j08087q4979M9963J15638L7202o1013m8075L7129O4754
35487G8139M886m8552l2500j754k4355o4962m7546J0743K4733j3159j8359L6418
35475i6268O3498L818o4296l8815M9087Q2424K6705l7280l8426K429K3549K354
35463b1221l1439l5834k435L0385K2026j2476k1412L494J5708l785j4470N240
35451f6219J5036q003j5459K7106O3821L1549l2940n0386k1311m132n673J1306
35439e5305L2929Q137m4804m5808J6444N3197R047n0867l6697L6916P3148K0083
35427A6420p0069j07240o2574R428M1886K9633J1727l226m2071r0276p7195K2142
$$ plain form
35415 -321415 -194333 -47239 45343 80576 85137 73965 67496 87546 109030 74024 -15410
35404 -15410 -78668 -69163 -43429 -66648 -108446 -100699 -53101 -32188 -51729 -63574 -48329 -41030
35392 -41030 -62482 -89813 -106845 -127115 -150957 -151324 -124836 -111702 -134289 -150719 -107183 -16918
35380 -16918 52347 67218 67790 100172 136317 102210 -9205 -96649 -59131 76678 184900
35369 184900 188696 128854 82501 73676 85319 101805 102980 63761 -54 -29420 -6899 4616
35357 4616 -40211 -84463 -53915 16653 32563 -10450 -26581 13015 41027 22911 18564 66816
35345 66816 102689 60582 -15038 -45725 -48441 -92656 -162627 -167000 -81944 12052 53143 71414
35333 71414 106993 132911 111517 69723 57379 68769 65867 53804 69998 108623 119107 88539
$$ packed form
35415c21415J27082J47094R2582L5233M561j1172o469K0050K1484l5006q9434
35404a5410o3258R505K5734k3219m1798P747M7598K0913j9541j1845J5245P299
35392d1030k1452k7331j7032k0270k3842l67K6488J3134k2587j6430M3536R0265
35380a6918O9265J4871N72L2382L6145l4107j11415q7444L7518J35809J08222
35369A84900L796n9842m6353q825J1643J6486J175l9219o3815k9366K2521J1515
35357D616m4827m4252L0548P0568J5910m3013j6131L9596K8012j8116m347M8252
35345F6816L5873m2107p5620l0687k716m4215o9971m373Q5056R3996M1091J8271
35333G1414L5579K5918k1394m1794j2344J1390k902j2063J6194L8625J0484l0568
$$ plain form
35321 88539 71887 115727 187340 209444 150361 57085 1826 9353 43164 59536 57351 55430
35309 55430 39419 -19054 -88158 -89223 -17841 18296 -56583 -168732 -204995 -181334 -187136 -203911
35297 -203911 -128257 25299 103672 39645 -49793 -55275 -26226 -42945 -69680 -47453 -17663
35286 -17663 -26802 -13110 71736 128165 59110 -33426 8430 126257 131152 23136 -14520 56580
35274 56580 62895 -61851 -140999 -51699 67788 61369 10823 59483 137959 85514 -59213
35263 -59213 -116281 -57385 -20528 -51360 -45647 27820 48114 -49117 -150074 -138231 -60888 -23640
35251 -23640 -22953 7892 59523 66207 26850 3925 14562 10861 -28293 -62858 -65075 -58575 -54179
35238 -54179 -9717 92330 171381 127196 -19150 -136276 -144916 -96623 -63772 -33730 25065
$$ packed form
35321H8539j6652M3840P1613K2104n9083r3276n5259P527L3811J6372k185j921
35309E5430j6011n8473o9104j065P1382L6137p4879j12149l6263K3661n802j6775
35297b03911P5654J53556P8373o4027q9438n482K9049j6719k6735K2227K9790
35286a7663r139J3692Q4846N6429o9055r2536M1856J17827M895j08016l7656P1100
35274E6580O315j24746p9148Q9300J19487o419n0546M8660P8476n2445j44727
35263e9213n7068N8896L6857l0832N713P3467K0294r7231j00957J1843P7343L7248
35251b3640O87L0845N1631O684l9357k2925J0637l701l9154l4565k217O500M396
35238e4179M4462J02047P9051m4185j46346j17126q640M8293L2851L0042N8795
$$ plain form
35227 25065 65714 30339 -29464 -15298 50646 45017 -58128 -137092 -113907 -71249 -102009 -149564
35215 -149564 -104156 13611 80265 44925 -23972 -53107 -41736 -27239 -34938 -59329 -56641 19982
35203 19982 141564 204033 159235 95265 120161 212978 267193 238218 160916 59898 -55679
35192 -55679 -130657 -104220 -11742 43730 21440 -36306 -98213 -161632 -186436 -124102 -21846
35181 -21846 14766 -17472 -11932 63621 100071 23282 -79391 -93778 -43141 -16294 -6255 61856
35169 61856 179960 248245 214538 132406 68546 23829 -30259 -88051 -115971 -103381 -84259
35158 -84259 -101986 -151216 -169881 -115355 -36584 -21357 -69847 -86418 -23894 33161 -14675 -132467
35146 -132467 -189588 -123501 313 81663 79792 14405 -73465 -144318 -173903 -160328 -114077
$$ packed form
35227B5065M0649l5375n9803J4166O5944n629j03145p8964K3185M2658l0760m7555
35215a49564M5408J17767O6654l5340o8897k9135J1371J4497p699k4391K688P6623
35203A9982J21582O2469m4798o3970K4896R2817N4215k8975p7302j01018j15577
35192e5679p4978K6437R2478N5472k2290n7746o1907o3419k4804O2334J02256
35181b1846L6612l2238N540P5553L6450p6789j02673j4387N0637K6847J0039O8111
35169F1856J18104O8285l3707q2132o3860m4717n4088n7792k7920J2590J9122
35158h4259j7727m9230j8665N4526P8771J5227m8490j6571O2524N7055m7836j17792
35146a32467n7121O6087J23814Q1350j871o5387q7870p0853k9585J3575M6251
$$ plain form
35135 -114077 -51737 -4120 1411 -12830 15545 97840 151068 97638 -20420 -87825 -59836
35124 -59836 3507 36959 33242 3523 -49261 -92300 -65373 36229 130782 148284 121499 129655
35112 129655 180518 206406 167176 99575 54757 35083 17927 6523 17683 32740 5319
35101 5319 -69418 -129074 -120311 -80483 -94819 -170089 -207151 -131368 -2987 58135 29055 -4759
35089 -4759 13329 41470 27528 -8224 -26144 -44504 -98396 -156915 -154244 -92807 -47189 -57247
35077 -57247 -76695 -51417 -3681 -3482 -77196 -172806 -210966 -159559 -63311 -2598 -16695 -71865
35065 -71865 -110976 -116186 -104101 -83652 -55284 -34734 -33268 -26304 8217 31880 -9718 -87585
35053 -87585 -112635 -72375 -57042 -113061 -160582 -120817 -44738 -26601 -50351 -27160 48819 91712
$$ packed form
35135a14077O2340M7617N531j4241K8375Q2295N3228n3430j18058o7405K7989
35124e9836O3343L3452l717k9719n2784m3039K6927J01602R4553J7502k6785Q156
35112A29655N0863K5888l9230o7601m4818j9674j7156j1404J1160J5057k7421
35101E319p4737n9656Q763L9828j4336p5270l7062P5783J28381O1122k9080l3814
35089d759J8088K8141j3942l5752j7920j8360n3892n8519K671O1437M5618j0058
35077e7247j9448K5278M7736J99p3714r5610l8160N1407R6248O0713j4097n5170
35065g1865l9111n210J2085K0449K8368K0550J466O964L4521K3663m1598p7867
35053h7585k5050M0260J5333n6019m7521L9765P6079J8137k3750K3191P5979M2893
$$ plain form
35041 91712 62475 16273 4946 20718 48430 89726 119233 98479 53821 58775 112965 123083
35029 123083 41914 -55499 -83505 -59409 -48755 -61915 -65327 -41040 18609 116141 194748 152974
35017 152974 -10707 -140602 -110515 -7988 -12590 -131510 -197200 -123385 -18340 -8110 -74785
35006 -74785 -131960 -155432 -160166 -127973 -46681 28691 32429 -27514 -101831 -174327 -238458 -245298
34994 -245298 -160003 -42194 19119 33809 77829 139186 112823 -20979 -128539 -103660 -25518
34983 -25518 -38866 -136278 -173224 -80570 47684 92683 44786 -32371 -95069 -129125 -122070 -81230
34971 -81230 -50485 -64335 -101675 -114913 -88273 -46196 -24471 -46855 -99740 -118096 -43613 78162
34959 78162 114254 3211 -150934 -200046 -124547 -20171 46174 81847 92850 61070 6646
$$ packed form
35041I1712k9237m6202j1327J5772K7712M1296K9507k0754m4658M954N4190J0118
35029A23083q1169r7413k8006K4096J0654j3160l412K4287N9649R7532P8607m1774
35017A52974j63681j29895L0087J02527m602j18920o5690P3815J05045J0230o6675
35006g4785n7175k3472m734L2193Q1292P5372L738n9943p4317p2496o4131o840
34994b45298Q5295J17809O1313J4690M4020O1357k6363j33802j07560K4879P8142
34983b5518j3348r7412l6946R2654J28254M4999m7897p7157o2698l4056P055M0840
34971h1230L0745j3850l7340j3238K6640M2077K1725k2384n2885j8356P4483J21775
34959G8162L6092j11043j54145m9112P5499J04376O6345L5673J1003l1780n4424
$$ plain form
34948 6646 -10557 23644 54616 40967 1263 -36547 -69210 -81418 -40565 40832 95367 87256
34936 87256 57351 52246 64059 74080 95286 125314 114473 38293 -46214 -80075 -96291 -160598
34924 -160598 -246952 -255869 -155160 -28396 31548 18382 -16962 -38010 -34087 -129 54693
34913 54693 96803 101135 86214 86339 92456 57362 -27105 -94728 -82397 -19585 10887 -5753
34901 -5753 1140 68401 134366 136659 107619 104989 103812 46709 -35165 -55076 -11136 12479 -10420
34888 -10420 -11038 42787 82472 50555 -15382 -64147 -111627 -174671 -199084 -135704 -40790 -19735
34876 -19735 -91154 -167634 -161975 -74295 15267 21778 -55585 -117724 -78326 15657 43951 -10767
34864 -10767 -44609 -8973 13341 -36353 -78776 -28312 58855 75516 25824 -16344 -47714 -110059
$$ packed form
34948F646j7203L4201L0972j3649l9704l7810l2663j2208M0853Q1397N4535q111
34936H7256k9905n105J1813J0021K1206L0028j0841p6180q4507l3861j6216o4307
34924a60598q6354q917J00709J26764N9944j3166l5344k1048L923L3958N4822
34913E4693M2110M332j4921J25O117l5094q4467o7623J2331O2812L0472j6640
34901e753O893O7261O5965K293k9040k630j177n7103q1874j9911M3940K3615k2899
34888a0420o18N3825L9685l1917o5937m8765m7480o3044k4413O3380R4914K1055
34876a9735p1419p6480N659Q7680Q9562O511p7363o2139L9398R3983K8294n4718
34864a0767l3842L5636K2314m9694m2423N0464Q7167J6661m9692m2168l1370o2345
$$ plain form
34852 -110059 -167818 -140412 -40479 35154 46254 37497 32667 6011 -35961 -44214 -13157 12096
34840 12096 27063 75529 145320 149921 57024 -39797 -32581 65562 144243 124405 25263 -76439
34828 -76439 -119631 -94344 -26721 52007 110614 111515 44265 -31418 -32483 36888 81529 50929
34816 50929 6646 9032 19952 -7712 -23418 35841 114717 111993 44394 14190 36246 28377
34804 28377 -27267 -46765 5315 48961 19204 -35486 -41453 -8413 8577 -1992 -11608 -6188
34792 -6188 4215 5085 -15895 -58054 -94999 -99288 -78186 -55450 -31215 782 16447 -5819
34780 -5819 -33289 -18915 21584 35134 20042 21766 48874 61857 42392 11800 -12055 -18602
34768 -18602 14941 83265 122966 97633 74426 122012 174144 117452 -12003 -63708 -1815
$$ packed form
34852a10059n7759K7406R9933P5633J1100q757m830k6656m1972q253L1057K5253
34840A2096J4967M8466O9791M601r2897r6821P216R8143P8681j9838r9142j01702
34828g6439m3192K5287O7623P8728N8607R01o7250p5683j065O9371M4641l0600
34816E0929m4283K386J0920k7664j5706N9259P8876k724o7599l0204K2056p869
34804B8377n5644j9498N2080M3646k9757n4690n967L3040J6990j0569r616N420
34792f188J0403Q70k0980m2159l6945m289K1102K2736K4235L1997J5665k2266
34780e819k7470J4374M0499J3550j5092J724K7108J2983j9465l0592k3855o547
34768a8602L3543O8324L9701k5333k3207M7586N2132n6692j29455n1705O1893
$$ plain form
34757 -1815 52001 24898 -13172 -5681 -5450 -44579 -52893 1835 22241 -59346 -141885 -103625 -2406
34744 -2406 10205 -81497 -152197 -133928 -90510 -91691 -121988 -136639 -126000 -96361 -45378 16295
34732 16295 57089 58556 35590 14879 8551 8894 -1608 -28884 -51453 -42269 -10799 392 -31166
34719 -31166 -82589 -119002 -123158 -87212 -12539 67688 99674 64637 4690 -18935 17473 81369
34707 81369 109012 67389 8142 23283 116998 177365 133272 74077 116673 208561 197916 77431
34695 77431 3539 53680 119092 95578 39101 42293 70610 31849 -65305 -127492 -108374 -41340
34683 -41340 26179 65408 64120 43883 48022 76144 74560 22939 -27821 -39552 -40022 -48086 -21886
34670 -21886 57380 122239 113578 77477 87743 122985 106020 29071 -43939 -76692 -85565 -79977
$$ packed form
34757a815N3816k7103l8070P491K31l9129q314N4728K0406q1587q2539L8260J01219
34744b406J2611r1702p0700J8269M3418j181l0297j4651J0639K9639N0983O1673
34732A6295M0794J467k2966k0711o328L43j0502k7276k2569R184L1470J1191l1558
34719c1166n1423l6413m156L5946P4673Q0227L1986l5037n9947k3625L6408O3896
34707H1369K7643m1623n9247J5141R3715O0367m4093n9195M2596R1888j0645j20485
34695G7431p3892N0141O5412k3514n6477L192K8317l8761r7154o2187J9118O7034
34683d1340O7519L9229j288k0237M139K8122j584n1621n0760j1731m70q064K6200
34670b1886P9266O4859q661l6101J0266L5242j6965p6949p3010l2753q873N588
$$ plain form
34658 -79977 -47881 1633 36246 43290 39155 40962 54029 75381 92224 94534 95082 106023 97699
34645 97699 32450 -57733 -95086 -71654 -64921 -112710 -154034 -133370 -83519 -55719 -43069 -27831
34633 -27831 -33505 -72620 -108404 -120577 -139627 -166189 -138557 -41835 34776 21256 -33099 -55633
34621 -55633 -59637 -74796 -60475 8673 53700 3122 -78446 -93862 -77900 -124470 -205746 -211863
34609 -211863 -138739 -87748 -89024 -67353 7936 67604 57773 5234 -46771 -74517 -46329 39021
34597 39021 88969 4962 -158498 -236849 -172883 -75224 -37480 -24806 13436 40570 17656
34586 17656 -5006 30221 80807 63156 -23407 -106580 -147552 -170708 -197460 -204347 -155309 -50880
34574 -50880 60887 120877 113929 79972 53771 13239 -75276 -177118 -210528 -151329 -65606
$$ packed form
34658g9977L2096M9514L4613P044m135J807J3067K1352J6843K310N48J0941q324
34645I7699o5249r0183l7353K3432O733m7789m1324K0664M9851K7800J2650J5238
34633b7831n674l9115l5784j2173j9050k6562K7632R6722P6611j3520n4355k2534
34621e5633m004j5159J4321O9148M5027n0578q1568j5416J5962m6570q1276o117
34609b11863P3124N0991j276K1671P5289N9668r831n2539n2005k7746K8188Q5350
34597C9021M9948q4007j63460p8351O3966R7659L7744J2674L8242K7134k2914
34586A7656k2662L5227N0586j7651q6563q3173m0972k3156k6752o887M9038J04429
34574e0880J11767N9990o948l3957k6201m0532q8515j01842l3410N9199Q5723
$$ plain form
34563 -65606 -25823 -37498 -60594 -61104 -26530 29896 61754 21057 -80457 -167142 -177509 -130503
34551 -130503 -97719 -118370 -154740 -137286 -55014 15589 -1033 -74230 -101673 -52245 -4269
34540 -4269 -14758 -32435 592 37892 6704 -62150 -85068 -65477 -70907 -96486 -75985 -26039
34528 -26039 -46725 -148648 -203126 -123312 5065 45287 -14629 -81315 -91512 -52937 8861
34517 8861 72252 109527 109482 92101 64908 2137 -86645 -115404 -24581 103515 122903 17279
34505 17279 -75733 -58070 333 -17859 -104504 -162137 -166962 -184189 -224379 -202912 -87647 13240
34493 13240 -9524 -108818 -154835 -118121 -76555 -68698 -54626 -21893 -17319 -50123 -64346 -39854
34481 -39854 -26211 -41375 -36935 -9468 -36739 -132679 -174527 -76406 52520 47364 -72802 -137555
$$ packed form
34563f5606L9783j1675k3096n10L4574N6426L1858m0697j01514q6685j0367M7006
34551a30503L2784k0651l6370J7454Q2272P0603j6622p3197k7443M9428M7976
34540d269j0489j7677L3027L7300l1188o8854k2918J9591n430k5579K0501M9946
34528b6039k0686j01923n4478P9814J28377M0222n9916o6686j0197L8575O1798
34517H861O3391L7275m5j7381k7193o2771q8782k8759R0823J28096J9388j05624
34505A7279r3012J7663N8403j8192q6645n7633m825j7227m0190K1467J15265J00887
34493A3240k2764r9294m6017L6714M1566P857J4072L2733M574l2804j4223K4492
34481c9854J3643j5164M440K7467k7271r5940m1848R8121J28926n156j20166o4753
$$ plain form
34469 -137555 -72850 14371 9651 -62209 -101342 -67132 -2813 35748 43148 63442 126075 184515
34457 184515 155592 36010 -74219 -100288 -84596 -97788 -122660 -104959 -67311 -76126 -123099
34446 -123099 -133967 -82309 -9446 57181 118712 145498 96286 6369 -29243 18054 73676
34435 73676 70268 26386 -11316 -39196 -69883 -82299 -45503 26511 75996 54937 -31263 -127373
34423 -127373 -173899 -152659 -85254 -329 69019 70050 -25111 -147402 -173484 -76209 30785
34412 30785 40487 -22447 -75748 -105258 -142078 -175616 -176647 -164386 -168340 -161497 -111523 -59650
34400 -59650 -64443 -102481 -111088 -96089 -107245 -136461 -132592 -92195 -46521 11104 88980 122426
34388 122426 48479 -66316 -92851 -26770 11818 -31764 -82324 -79373 -62932 -75227 -86179
$$ packed form
34469a37555O4705Q7221m720p1860l9133L4210O4319L8561P400K0294O2633N8440
34457A84515k8923j19582j10229k6069J5692j3192k4872J7701L7648q815m6973
34446a23099j0868N1658P2863O6627O1531K6786m9212q9917l5612M7297N5622
34435G3676l408m3882l7702k7880l0687j2416L6796P2014M9485k1059q6200r6110
34423a27373m6526K1240O7405Q4925O9348J031r5161j22291k6082R7275J06994
34412C0785R702o2934n3301k9510l6820l3538j031J2261l954O843M9974N1873
34400e9650m793l8038q607J4999j1156k9216L869M0397M5674N7625P7876L3446
34388A22426p3947j14795k6535O6081L8588m3582n0560K951J6441j2295j0952
$$ plain form
34377 -86179 -69610 -62356 -89160 -100989 -45446 53880 132352 153607 113365 23954 -70872 -108899
34365 -108899 -72956 -13934 12179 6109 9671 48812 101592 114463 59250 -20361 -48582 -15182
34353 -15182 13741 2938 -1884 26247 23867 -62341 -170369 -205704 -175430 -149941 -141627 -117967
34341 -117967 -90926 -94181 -109427 -107962 -119310 -163721 -176367 -109405 -43036 -62641 -90544 1132
34329 1132 159584 210241 119717 17988 -29980 -83048 -145110 -126028 -24173 31868 -18706
34318 -18706 -87344 -102018 -96014 -82389 -9060 96741 110066 15799 -31353 48546 116682 34074
34306 34074 -120032 -182847 -142212 -97885 -85676 -78570 -89846 -144759 -201159 -207617 -193597 -209562
34294 -209562 -231065 -211114 -170718 -147017 -109300 -25449 36795 -16983 -155302 -236994 -180636
$$ packed form
34377h6179J6569P254k6804j1829N5543R9326P8472K1255m0242q9411r4826l8027
34365a08899L5943N9022K6113o070L562L9141N2780J2871n5213p9611k8221L3400
34353a5182K8923j0803m822K8131k380q6208j08028l5335L0274K5489Q314K3660
34341a17967K7041l255j5246J465j1348m4411j2646O6962O6369j9605k7903R1676
34329A132J58452N0657r0524j01729m7968n3068o2062J9082J01855N6041n0574
34318a8706o8638j4674O004J3625P3329J05801J3325r4267m7152P9899O8136q2608
34306C4074j54106o2815M0635M4327J2209P106j1276n4913n6400o458J4020j5965
34294b09562k1503J9951M0396K3701L7717Q3851O2244n3778j38319q1692N6358
$$ plain form
34283 -180636 -50563 30777 13024 -43997 -46355 17038 52565 -7119 -85885 -58035 63569
34272 63569 141306 111427 46334 5057 -42048 -103245 -120769 -93751 -109003 -177273 -174757 -38385
34260 -38385 108778 133333 77610 55566 68189 50433 17560 33432 90260 130643 137552 113749
34248 113749 41557 -47545 -49861 57482 129625 45645 -95444 -114564 -20538 24386 -32273
34237 -32273 -74978 -26308 41902 38257 -20695 -52628 -5161 109831 220396 236251 142493
34226 142493 33734 -1822 4879 -20463 -54422 -14745 84929 134694 88372 22053 10562
34215 10562 30039 16340 -41034 -96226 -101874 -49665 20296 51784 34261 15724 33326 65344
34203 65344 83500 108416 164121 217730 223048 193448 173251 163381 133178 83513 43157 21075
$$ packed form
34283a80636J30073Q1340j7753n7021k358O3393L5527n9684p8766K7850J21604
34272F3569P7737k9879o5093m1277m7105o1197j7524K7018j5252o8270K516J36372
34260c8385J47163K4555n5723k2044J2623j7756l2873J5872N6828M0383O909k3803
34248A13749p2192q9102k316J07343P2143q3980j41089j9120R4026M4924n6659
34237c2273m2705M8670O8210l645n8952l1933M7467J14992J10565J5855r3758
34226A42493j08759l5556O701k5342l3959L9677R9674M9765m6322o6319j1491
34215A0562J9477j3699n7374n5192n648N2209O9961L1488j7523j8537J7602L2018
34203F5344J8156K4916N5705N3609N318k9600k0197r870l0203m9665m0356k2082
$$ plain form
34191 21075 9437 11449 23216 16987 -14551 -32446 -15355 -7154 -46343 -90868 -78737 -28031
34179 -28031 -4581 -14174 -171 59973 118948 122512 65237 -13869 -61382 -46727 7314 48499
34167 48499 59360 62336 55984 7836 -68186 -100205 -62737 -20171 -19413 -17027 24674 47505 -12353
34154 -12353 -104474 -126510 -67600 -5441 11739 4654 4142 15796 28842 19959 -24098 -62128
34142 -62128 -30468 50735 78829 21979 -17581 37901 110511 86994 -6701 -56280 -23695 44282
34130 44282 117634 183544 190793 107037 724 -38091 -28470 -50021 -99329 -105432 -61980 -29875
34118 -29875 -23256 -4272 15661 -21186 -109369 -169063 -151097 -73501 37001 152230 204766
34107 204766 144327 33591 -8473 33887 61254 13235 -59324 -92316 -88921 -77396 -66978
$$ packed form
34191B1075j1638K012J1767o229l1538j7895J7091Q201l9189m4525J2131N0706
34179b8031K3450r593J4003O0144N8975L564n7275p9106m7513J4655N4041M1185
34167D8499J0861K976o352m8148p6022l2019L7468M2566P58K386M1701K2831n9858
34154a2353r2121k2036N8910O2159J7180p085n12J1654J3046q883m4057l8030
34142f2128L1660Q1203K8094n6850l9560N5482P2610k3517r3695m9579L2585O7977
34130D4282P3352O5910P249q3756j06313l8815R621k1551m9308o103M3452L2105
34118b9875O619J8984J9933l6847q8183n9694J7966P7596J10502J15229N2536
34107B04766o0439j10736m2064M2360K7367m8019p2559l2992L395J1525J0418
$$ plain form
34096 -66978 -72262 -112485 -162159 -164408 -113822 -68018 -61309 -66386 -58048 -54549 -71993 -89021 -82039
34083 -82039 -56752 -28100 -3292 6342 -9142 -36328 -54201 -69373 -99922 -130234 -123771 -78853
34071 -78853 -30046 6741 49231 102594 134504 109252 25652 -84655 -180266 -228606 -214928
34060 -214928 -144071 -45373 22148 4057 -75703 -109734 -35084 63893 62582 -18935 -50343 -5016
34048 -5016 1793 -78348 -133127 -84085 -35604 -110968 -246230 -283133 -196623 -97906 -58122 -52388
34036 -52388 -49181 -44051 -22061 19791 30323 -34894 -131782 -178455 -159964 -117913 -74914 -37272
34024 -37272 -29149 -52778 -57920 -17763 16598 6795 11704 101234 242322 352191 408975 429321
34012 429321 397692 304324 196543 113923 37461 -27011 -8081 99176 165190 102674 8571
$$ packed form
34096f6978n284m0223m9674k249N0586M5804O709n077Q338L499j7444j7028O982
34083h2039K5287K8652K4808R634j5484k7186j7873j5172l0549l0312O463M4918
34071g8853M8807L6787M2490N3363L1910k5252q3600j10307r5611m8340J3678
34060b14928P0857R8698O7521j8091p9760l4031P4650R8977j311q1517l1408M5327
34048e016O809q0141n4779M9042M8481p5364j35262l6903Q6510R8717L9784N734
34036e2388L207N130K1990M1852J0532o5217r6888m6673J8491M2051M2999L7642
34024c7272Q123k3629n142M0157L4361r803M909Q9530J41088J09869N6784K0346
34012D29321l1629r3368j07781q2620p6462o4472J8930J07257O6014o2516r4103
$$ plain form
34001 8571 4526 45740 36243 20847 80408 135068 62901 -57715 -52445 47419 48333 -73901
33989 -73901 -133718 -52793 22876 -15183 -80441 -85302 -93706 -164412 -207494 -129340 1145 56078
33977 56078 27599 -5445 -15143 -26155 -32043 -1729 54640 87505 62516 -12436 -90551 -108555
33965 -108555 -42098 59003 125686 145068 140621 113194 65268 44624 82184 120328 91545
33954 91545 33546 29421 71221 92642 98467 133658 155341 82803 -36423 -64666 12586 63072
33942 63072 21004 -27349 -14017 676 -43477 -90474 -62901 15401 67912 75756 78220 102320
33930 102320 131317 122464 52990 -30366 -41808 23197 57905 1192 -54155 -12936 45429 -13577
33918 -13577 -145588 -185318 -107431 -50228 -83560 -128273 -120883 -92689 -61236 1068 64479 56820
$$ packed form
34001H571m045M1214r497j5396N9561N4660p2167j20616N270R9864R14j22234
33989g3901n9817Q0925P5669l8059o5258m861q404p0706m3082P8154J30485N4933
33977E6078k8479l3044r698j1012n888L0314N6369L2865k4989p4952p8115j8004
33965a08555O6457J01101O6683J9382m447k7427m7926k0644L7560L8144k8783
33954I1545n7999m125M1800K1421N825L5191K1683p2538j19226k8243P7252N0486
33942F3072m2068m8353J3332J4693m4153m6997K7573P8302N2511P844K464K4100
33930A02320K8997q853o9474q3356j1442O5005L4708n6713n5347M1219N8365n9006
33918a3577j32011l9730P7887N7203l3332m4713P390K8194L1453O2304O3411p659
$$ plain form
33906 56820 2032 -3921 31708 7795 -72102 -87429 -15782 23448 -15489 -33058 12071 17698
33894 17698 -62381 -116280 -72328 -31226 -85379 -156413 -136279 -62293 -29436 -36683 -33217 -21548
33882 -21548 -14865 17321 74615 90237 45569 17879 43192 48443 -1328 -15682 65282 151631
33870 151631 149537 111057 119893 134654 76593 -14549 -45266 -22277 -20944 -56340 -93796 -131894
33858 -131894 -172301 -163236 -76297 10297 4760 -66178 -110226 -108589 -107448 -110670 -80549 -25867
33846 -25867 -1996 -26047 -51833 -26282 61778 167815 206346 122395 -26103 -106018 -55668
33835 -55668 55815 132988 153693 142005 113548 82718 67232 62363 62001 99421 189852 247562
33823 247562 171744 16382 -54210 883 46955 -7889 -84676 -84320 -32698 1563 18335 37071
$$ packed form
33906E6820n4788n953L5629k3913p9897j5327P1647L9230l8937j7569M5129N627
33894A7698q0079n3899M3952M1102n4153p1034K0134P3986L2857p247L466J1669
33882b1548O683L2186N7294J5622m4668k7690K5313N251m9771j4354Q0964Q6349
33870A51631k094l8480Q836J4761n8061r1142l0717K2989J333l5396l7456l8098
33858a31894m0407R065Q6939Q6594n537p0938m4048J637J141l222L0121N4682
33846b5867K3871k4051k5786K5551Q8060J06037L8531q3951j48498p9915N0350
33835e5668J11483P7173K0705j1688k8457l0830j5486m869l62L7420R0431N7710
33823B47562p5818j55362p0592N5093M6072n4844p6787L56N1622L4261J6772J8736
$$ plain form
33811 37071 38333 23537 36966 72448 62456 9424 7883 79792 116791 52209 -39705 -83753
33799 -83753 -104504 -115982 -64883 27833 32238 -72825 -113225 14191 152636 126426 17151
33788 17151 2279 48156 -5200 -135515 -159394 -40586 47277 -8110 -108137 -115015 -31526
33777 -31526 49296 74029 55272 30015 25021 31198 11553 -41826 -87376 -97887 -95367 -87839
33765 -87839 -39122 48141 94482 54027 -10016 -31224 -44486 -102142 -161638 -155287 -111109 -103224
33753 -103224 -128979 -130252 -96669 -59572 -20423 32406 68947 53218 2395 -46410 -85271 -102739
33741 -102739 -64675 14429 49944 2604 -53020 -41865 3164 16428 5960 7326 6627 -11296
33729 -11296 -12726 10171 -2838 -67952 -97968 -49416 -28532 -131993 -271146 -291160 -197717
$$ packed form
33811C7071J262j4796J3429L5482r992n3032j541P1909L6999o4582r1914m4048
33799h3753k0751j1478N1099R2716M405j05063m0400J27416J38445k6210j09275
33788A7151j4872M5877n3356j30315k3879J18808Q7863n5387j00027o878Q3489
33777c1526Q0822K4733j8757k5257m994O177j9645n3379m5550j0511K520P528
33765h7839M8717Q7263M6341m0455o4043k1208j3262n7656n9496O351M4178P885
33753a03224k5755j273L3583L7097L9149N2829L6541j5729n0823m8805l8861j7468
33741a02739L8064P9104L5515m7340n5624J1155M5029J3264j0468J366o99j7923
33729a1296j430K2897j3009o5114l0016M8552K0884j03461j39153k0014R3443
$$ plain form
33718 -197717 -124845 -124777 -128111 -86148 -26874 19337 45959 34303 -21625 -73439 -78552 -73105 -110012
33705 -110012 -158999 -145912 -62621 29780 78543 69944 25650 8670 70850 157418 148243 35770
33693 35770 -46165 -26703 -902 -46141 -78801 -15397 55342 11589 -97490 -144127 -126568
33682 -126568 -119352 -102439 -15343 80886 74778 -2636 -24816 21550 38983 6800 1207 33729
33670 33729 24141 -55170 -138386 -177795 -185366 -168070 -124510 -88655 -80560 -51321 21356 45047
33658 45047 -50946 -158776 -131807 -24942 -9634 -85050 -84084 31306 99327 29687 -56384
33647 -56384 -38904 22206 24799 -1453 24476 85483 112101 105438 112143 125981 102694 43395
33635 43395 -6140 -22338 -21821 -25760 -36574 -38034 -7314 51950 88308 50125 -39472 -92636
$$ packed form
33718a97717P2872O8l334M1963N9274M6211K6622j1656n5928n1814n113N447l6907
33705a10012m8987J3087Q3291R2401M8763q599m4294j6980O2180Q6568r175j12473
33693C5770q1935J9462K5801m5239l2660O3404P0739m3753j09079m6637J7559
33682a26568P216J6913Q7096R6229o108p7414k2180M6366J7433l2183n593L2522
33670C3729r588p9311q3216l9409p571J7296M3560L5855Q095K9239P2677K3691
33658D5047r5993j07830K6969J06865J5308p5416R66J15390O8021o9640q6071
33647e6384J7480O1110K593k6252K5929O1007K6618o663O705J3838k3287n9299
33635D3395m9535j6198N17l939j0814j460L0720N9264L6358l8183q9597n3164
$$ plain form
33623 -92636 -53041 47455 134197 161956 135252 84480 37179 6160 435 34324 101064 145920
33611 145920 111178 14794 -64730 -92454 -109486 -147709 -180330 -182990 -172162 -149680 -86459 -4109
33599 -4109 10356 -68897 -141649 -113073 -23347 27053 20422 10519 16892 12224 -12393 -34549 -35495
33586 -35495 -9616 34712 64369 55257 45282 89117 156265 163660 120062 125779 202303 248319
33574 248319 210129 163431 164655 157834 106832 81745 118000 123523 37488 -43506 -18792 53379
33562 53379 73198 67831 104780 138682 94339 21996 22358 79038 100296 73052 53992 60370
33550 60370 77357 115091 161205 148192 63173 6454 42561 86989 46144 -31636 -57577 -47115
33538 -47115 -41684 -293 94335 135534 50675 -46835 -23939 53258 35774 -63223 -113471 -80497
$$ packed form
33623i2636L9595J00496Q6742K7759k6704n0772m7301l1019n725L3889O6740M4856
33611A45920l4742r6384p9524k7724j7032l8223l2621k660J0828K2482O3221Q2350
33599d109J4465p9253p2752K8576Q9726N0400o631r903O373m668k4617k2156r46
33586c5495K5879M4328K9657r112r975M3835O7148P395m3598N717P6524M6016
33574B48319l8190m6698J224o821n1002k5087L6255N523q6035q0994K4714P2171
33562E3379J9819n367L6949L3902m4343p2343L62N6680K1258k7244j9060O378
33550F0370J6987L7734M6114j3013q5019n6719L6107M4428m0845p7780k5941J0462
33538d7115N431M1391R4628M1199q4859r7510K2896P7197j7484r8997n0248L2974
$$ plain form
33526 -80497 -25101 35691 102113 103576 5993 -70049 -11364 86097 59482 -52994 -81108 2559
33514 2559 75125 82913 75250 59112 7208 -26140 20465 65472 -6223 -124709 -119606 6624
33502 6624 84378 38746 -40486 -79384 -93096 -86704 -47653 -25674 -69715 -114464 -78116 -19447
33490 -19447 -31094 -45866 49782 169717 125770 -59899 -176370 -149964 -112488 -131640 -111343
33479 -111343 -6740 76737 64544 16077 -6043 -10678 10786 87111 156323 118008 17559
33468 17559 5156 89266 117672 40550 -2275 78441 174722 161669 74251 15725 13308 42656
33456 42656 88025 111979 63628 -27148 -54464 21129 124122 192565 261350 375799 504073
33445 504073 578006 562804 466015 332298 234366 214167 235102 235590 204637 160583 104467 51923
$$ packed form
33526h0497N5396O0792O6422J463r7583p6042N8685R7461k6615j12476k8114Q3667
33514B559P2566P788p663j6138n1904l3348M6605M5007p1695j18486N103J26230
33502F624P7754m5632p9232l8898j3712O392L9051K1979m4041m4749L6348N8669
33490a9447j1647j4772R5648J19935m3947j85669j16471K6406L7476j9152K0297
33479a11343J04603Q3477j2193m8467k2120m635K1464P6325O9212l8315j00449
33468A7559j2403Q4110K8406p7122m2825Q0716R6281j3053q7418n8526k417K9348
33456D2656M5369K3954m8351r0776k7316P5593J02993O8443O8785J14449J28274
33445E04073P3933j5202r6789j33717r7932k0199K0935M88l0953m4054n6116n2544
$$ plain form
33433 51923 50766 99245 114239 52349 -15451 -24544 -15847 -28853 -10658 59302 77886 -11733
33421 -11733 -78705 7459 154549 185506 105316 52856 68889 91587 110210 145651 144489 63501
33409 63501 -6900 34167 128771 171531 189931 239835 238044 105921 -29611 -10047 73686
33398 73686 21680 -129344 -162798 -37612 74343 85736 79136 95677 71757 4312 -24483
33387 -24483 -6394 -16804 -61254 -69158 -30423 1978 15875 22701 -205 -31217 27277 169018
33375 169018 213828 80467 -37572 30838 145024 105314 9472 60256 180820 156963 35582
33364 35582 29949 123054 121643 34928 41422 126821 109336 -5029 -38311 13690 -5516 -76720
33352 -76720 -31275 97431 102704 -11526 -28142 85583 129686 52051 30007 122867 175077
$$ packed form
33433E1923j157M8479J4994o1890o7800r093Q697j3006J8195O9960J8584q9619
33421a1733o6972Q6164J47090L0957q0190n2460J6033K2698J8623L5441j162q0988
33409F3501p0401M1067R4604M2760J8400M9904j791j32123j35532J9564Q3733
33398G3686n2006j51024l3454J25186J11955J1393o600J6541k3920o7445k8795
33387b4483J8089j0410m4450p904L8735L2401J3897O826k2906l1012N8494J41741
33375A69018M4810j33361j18039O8410J14186l9710r5842N0784J20564k3857j21381
33364C5582n633R3105j411q6715O494Q5399j7485j14365l3282N2001j9206p1204
33352g6720M5445J28706N273j14230j6616J13725M4103p7635k2044R2860N2210
$$ plain form
33341 175077 123331 86360 96409 48266 -36955 -4674 127776 161969 63226 15321 84667
33330 84667 129877 93778 85619 121701 81274 -25929 -39096 56727 97850 46663 40683 101058
33318 101058 88941 -5054 -24049 57339 89866 46662 71655 187037 240652 191738 171416
33307 171416 218039 219868 148418 89996 42521 -55421 -116972 -12275 154804 174027 82994
33296 82994 76824 130653 65348 -72037 -72777 40049 72763 57797 172099 317931 242942
33285 242942 43004 59799 283873 362762 224711 174755 312295 375891 262199 190269
33275 190269 234727 193889 50659 70574 292901 404362 278273 172810 232204 256589
33265 256589 141398 85788 173354 185239 25927 -82640 -16991 44453 5157 31233 181170
$$ packed form
33341A75077n1746l6971J0049m8143q5221L2281J32450L4193r8743m7905O9346
33330H4667M5210l6099q159L6082m0427j07203j3167R5823M1123n1187n980O0375
33318A01058j2117r3995j8995Q1388L2527m3204K4993J15382N3615m8914k0322
33307A71416M6623J829p1450n8422m7475r7942o1551J04697J67079J9223r1033
33296H2994o170N3829o5305j37385p40J12826L2714j4966J14302J45832p4989
33285B42942j99938J6795K24074P8889j38051m9956J37540O3596j13692p1930
33275A90269M4458m0838j43230J9915K22327J11461j26089j05463N9394K4385
33265B56589j15191n5610Q7566J1885j59312j08567O5649O1444l9296K6076J49937
$$ plain form
33254 181170 256779 185578 157325 235128 233939 120949 119566 278613 360139 287052 270007
33243 270007 361333 333196 139606 46082 150637 221750 153566 131551 211591 195956 62511
33232 62511 52390 202857 262644 182790 201532 342374 349460 220901 250749 431480 404300
33221 404300 137068 39670 243075 384029 286726 226062 315122 280225 72034 46585 286339
33210 286339 391914 213501 130006 318293 417925 238400 127132 284397 372081 180575
33200 180575 46525 213043 385095 314189 232771 324420 351123 183747 113679 269975
33190 269975 328335 160961 144239 438963 618310 430077 272397 457763 657835 575815
33180 575815 529278 813523 1086237 988541 848720 1129591 1611855 1800220 1870295 2564147
$$ packed form
33254A81170P5609p1201k8253P7803j189j12990j383J59047Q1526p3087j7045
33243B70007R1326k8137j93590r3524J04555P1113o8184k2015Q0040j5635j33445
33232F2511j0121J50467N9787p9854J8742J40842P086j28559K9848J80731k7180
33221D04300k67232r7398K03405J40954r7303o0664Q9060l4897k08191k5449K39754
33210B86339J05575j78413q3495J88287R9632j79525j11268J57265Q7684j91506
33200A80575j34050J66518J72052p0906q1418R1649K6703j67376p0068J56296
33190B69975N8360j67374j6722K94724J79347j88233j57680J85366K00072q2020
33180E75815m6537K84245K72714r7696j39821K80871M82264J88365P0075O93852
$$ plain form
33170 2564147 4151173 5866406 6471813 5382485 3343293 1830730 1531113 1695377 1375283
33161 1375283 783464 687899 969095 879119 450849 409097 766951 792191 414417 360536
33151 360536 742037 822813 425579 258457 551407 673206 427318 411852 742932 759524
33141 759524 370041 326045 765552 887233 482240 338703 691151 776311 395696 352435
33131 352435 827360 941191 478947 375579 901929 1102561 662533 530640 1014045 1127531
33121 1127531 569349 408297 1016279 1303694 834685 650510 1146399 1282459 779360
33112 779360 821833 1653953 1880951 1142256 927923 1701303 1943014 1176656 1007549 1911987
33102 1911987 2142311 1209032 1081655 2378852 2971230 2101820 2026049 3622868 4548581
$$ packed form
33170B564147J587026J715233O05407j089328k039192j512563k99617J64264l20094
33161A375283n91819r5565K81196q9976m28270m1752L57854K5240l77774n3881
33151C60536L81501Q0776l97234j67122K92950J21799k45888j5466L31080J6592
33141G59524l89483m3996M39507J21681m04993j43537L52448Q5160l80615m3261
33131C52435M74925J13831m62244j03368N26350K00632m40028j31893M83405J13486
33121A127531n58182j61052O07982K87415m69009j84175M95889J36060n03099
33112G79360M2473Q32120K26998p38695k14333P73380K41711p66358j69107R04438
33102A911987K30324r33279j27377J297197N92378q69410p5771J596819R25713
$$ plain form
33093 4548581 3920365 4307505 6624447 7995916 7477731 8436567 12053994 14586008 14817570
33084 14817570 17267173 23481366 28320951 30716622 38485676 54609878 70532118 85389868
33076 85389868 118516482 181250954 243303371 254183634 202365424 130551232 84319580
33069 84319580 66555983 54070026 38045445 27517163 25205426 22610370 16448536
33062 16448536 12512600 12765542 12002210 8409043 6356755 7314969 7383151 5242729 4311351
33053 4311351 5600460 5812393 3919622 2963287 3976433 4230521 2797751 2178270 3148021
33044 3148021 3288197 1867113 1229513 2143296 2426800 1338746 905728 1785858 2033950
33035 2033950 1049495 721003 1611093 1869700 932186 569630 1314127 1465908 576477
$$ packed form
33093D548581o28216L87140K316942J371469n18185R58836L617427K532014K31562
33084A4817570K449603O214193M839585K395671P769054J6124202J5922240J4857750
33076H5389868L3126614O2734472O2052417J0880263n1818210p1814192m6231652
33069H4319580j7763597j2485957j6024581j0528282k311737k595056o161834
33062A6448536l935936K52942p63332l593167k052288R58214O8182k140422r31378
33053D311351J289109K11933j892771r56335J013146K54088j432770o19481R69751
33044C148021J40176j421084o37600R13783K83504j088054m33018Q80130K48092
33035B033950r84455l28492Q90090K58607r37514l62556P44497J51781q89431
$$ plain form
33026 576477 373458 1298294 1580927 686688 321213 1084125 1404626 724407 527889 1282324
33016 1282324 1490779 714767 474561 1225982 1447617 645575 308295 961171 1183836
33007 1183836 475675 234203 953614 1254745 626302 382668 992031 1165850 493767
32998 493767 297751 988896 1232467 596670 386885 1012325 1174556 503966 344274 1078991
32988 1078991 1336819 694908 507395 1199974 1416527 720330 468479 1123485 1365803
32979 1365803 753707 584738 1239557 1371742 618257 391894 1095863 1305557 607602
32970 607602 449978 1256467 1540106 832257 618200 1387021 1659503 948674 746181 1544844
32960 1544844 1852687 1190222 1043323 1815041 1933910 1027049 790986 1663145 1920883
$$ packed form
33026E76477k03019R24836K82633q94239l65475P62912L20501o80219j96518P54435
33016A282324K08455p76012k40206P51421K21635q02042l37280O52876K22665
33007A183836p08161k41472P19411L01131o28443k43634O09363J73819o72083
32998D93767j96016O91145K43571o35797k09785O25440J62231o70590j59692P34717
32988A078991K57828o41911j87513O92579K16553o96197k51851O55006K42318
32979A365803o12096j68969O54819J32185p53485k26363P03969K09694o97955
32970F07602j57624Q06489K83639p07849k14057P68821K72482p10829k02493P98663
32960A544844L07843o62465j46899P71718J18869r06861k36063Q72159K57738
$$ plain form
32951 1920883 1143157 1127589 2263808 2587532 1619245 1409682 2517094 2842061 1804964
32942 1804964 1606531 2874451 3307888 2229355 2039470 3447162 3931997 2792692 2781369
32933 2781369 4711045 5690602 4906423 5507621 8314365 9789454 9038833 10140621 14317256
32924 14317256 17166685 17437127 20304905 27381513 32911922 35774875 44388500 61880288
32916 61880288 79524992 97101421 134717859 202589311 267618284 277589798 221779519
32909 221779519 144776985 93578088 72046876 57560224 40838168 29812824 26837147
32902 26837147 23876056 17683678 13493321 13253340 12347915 8960764 6836520 7437147
32894 7437147 7486431 5630230 4595168 5423418 5595922 4146081 3324550 3991953 4105682
$$ packed form
32951A920883p77726j5568J136219L23724r68287k09563J107412L24967j037097
32942A804964j98433J267920M33437j078533j89885J407692M84835j139305j1323
32933B781369J929676R79557p84179O01198K806744J475089p50621J101788M176635
32924A4317256K849429K70442K867778P076608N530409K862953Q613625J7491788
32916F1880288J7644704J7576429L7616438O7871452O5028973R971514n5810279
32909B21779519p7002534n1198897k1531212j4486652j6722056j1025344k975677
32902B6837147k961091o192378m190357k39981r05425l387151k124244O00627
32894G437147M9284j856201j035062Q28250J72504j449841q21531O67403J13729
$$ plain form
32885 4105682 2900827 2268308 2908968 3045840 1988530 1379845 1910821 2109511 1344839
32876 1344839 967437 1543241 1791473 1159919 828373 1314277 1528997 997086 714838
32867 714838 1076975 1133832 589970 443190 975589 1126452 521057 191156 619785 918228
32857 918228 608396 455558 855946 1071814 743654 585232 924318 1054906 664977 461350
32847 461350 768313 906952 563541 407528 749060 912985 560837 347574 637584 811441
32837 811441 492029 264328 517655 715063 481234 323003 593326 786638 547729 378828
32827 378828 653182 885113 678308 479991 686292 881433 685429 509662 730847 922709
32817 922709 672186 400135 587314 887393 801325 581389 668564 839468 715717 555074
$$ packed form
32885D105682j204855o32519O40660J36872j057310o08685N30976J98690p64672
32876A344839l77402N75804K48232o31554l31546M85904K14720n31911k82248
32867G14838L62137N6857n43862j46780N32399J50863o05395l29901M28629K98443
32857I18228l09832j52838M00388K15868l28160j58422L39086J30588l89929k03627
32847D61350L06963J38639l43411j56013L41532J63925l52148k13263K90010J73857
32837H11441l19412k27701K53327J97408k33829j58231K70323J93312k38909j68901
32827C78828K74354K31931k06805j98317K06301J95141j96004j75767K21185J91862
32817I22709k50523k72051J87179L00079q6068k19936Q7175J70904j23751j60643
$$ plain form
32807 555074 728385 942580 800490 622196 864680 1210517 1125316 875904 1047700 1440125
32797 1440125 1450263 1239461 1450722 1987815 2190040 2094285 2362699 2992401 3330874 3447884
32787 3447884 4154623 5428671 6292718 6732920 8126911 10952234 13887823 16703456 22233540
32778 22233540 32701435 44569209 50043898 44812473 32618216 21253799 15373402
32771 15373402 14010613 13473660 10999117 6361738 1584445 -882383 -552913 645509
32763 645509 779770 77059 -107340 382269 556634 170449 10699 337124 463404 114426
32753 114426 -70211 244644 492673 279456 50882 185180 319473 128567 -33651 154537
32743 154537 348016 188891 -46931 -20189 51351 -98216 -215548 -37230 151207 32416
$$ packed form
32807E55074J73311K14195j42090j78294K42484L45837q5201k49412J71796L92425
32797A440125J0138k10802K11261N37093K02225r5755K68414O29702L38473J17010
32787C447884P06739J274048Q64047M40202J393991K825323K935589K815633N530084
32778B2233540J0467895J1867774N474689n231425j2194257j1364417n880397
32771A5373402j362789n36953k474543m637379m777293k466828L29470J198422
32763F45509J34261p02711j84399M89609J74365l86185j59750L26425J26280l48978
32753A14426j84637L14855K48029k13217k28574J34298J34293j90906j62218J88188
32743A54537J93479j59125k35822K6742P1540j49567j17332J78318J88437j18791
$$ plain form
32733 32416 -144479 -42316 138284 71912 -74954 -2322 136563 61359 -82728 -38335
32723 -38335 44166 -68551 -188490 -62861 94841 -24538 -237852 -206771 -65447 -139510
32713 -139510 -307418 -232914 -13220 -5391 -176135 -191793 -25575 57911 15987 29199 88591
32702 88591 44656 -31009 32819 135457 70729 -64126 -41263 55740 -11761 -172844 -170103
32691 -170103 -31094 5060 -70837 -72658 5559 29699 30675 105834 148338 36847 -60971 50931
32679 50931 205475 136429 -46523 -66807 14794 -44644 -175803 -135952 -6652 -60094 -229065
32668 -229065 -205227 871 84274 -10153 -39622 57416 85447 -3668 -52871 -48366 -125648
32657 -125648 -234827 -192312 -54277 -50397 -161838 -154671 -15967 38805 -18951 -8719 68018
$$ packed form
32733C2416j76895J02163J80600o6372j46866P2632J38885p5204j44087M4393
32723c8335Q2501j12717j19939J25629J57702j19379k13314L1081J41324p4063
32713a39510j67908P4504K19694P829j70744j5658J66218Q3486m1924J3212N9392
32702H8591m3935p5665O3828J02638o4728j34855K2863R7003o7501j61083K741
32691a70103J39009L6154p5897j821P8217K4140R76P5159M2504j11491r7818J11902
32679E0931J54544o9046j82952k0284Q1601n9438j31159L9851J29300n3442j68971
32668b29065K3838K06098Q3403r4427k9469R7038K8031q9115m9203M505p7282
32657a25648j09179M2515J38035L880j11441P167J38704N4772n7756J0232P6737
$$ plain form
32646 68018 17454 -148463 -196326 -83247 -7494 -19800 37509 165057 158858 -9662 -122244
32635 -122244 -91628 -74944 -141488 -153530 -56694 14999 2750 11846 70350 64862 -23565 -68592
32623 -68592 -29639 -665 -4863 29950 87005 80772 45811 73937 103541 21099 -84245 -43743
32611 -43743 72468 59885 -51048 -53523 45117 32976 -115053 -195886 -142649 -103191 -130983
32600 -130983 -116239 -55638 -79655 -175522 -183809 -103269 -99318 -178243 -159642 -15312 69245 25663
32588 25663 1025 67445 118275 113637 149648 218739 175012 10790 -91160 -52118 1816
32577 1816 -4548 16337 104728 164946 154502 149065 164858 118577 3645 -88140 -140298 -212751
32565 -212751 -271154 -220333 -97191 -21156 20808 119113 214702 172365 41121 -13011 8801
$$ packed form
32646F8018n0564j65917m7863J13079P5753j2306N7309J27548o199j68520j12582
32635a22244L0616J6684o6544j2042R6836P1693j2249R096N8504n488q8427m5027
32623f8592L8953K8974m198L4813N7055o233l4961K8126K9604q2442j05344M0502
32611d3743J16211j2583j10933k475R8640j2141j48029q0833N3237L9458k7792
32600a30983J4744O0601k4017r5867q287Q0540L951p8925J8601J44330Q4557m3582
32588B5663k4638O6420N0830m638L6011O9091m3727j64222j01950L9042N3934
32577A816o364K0885Q8391O0218j0444n437J5793m6281j14932r1785n2158p2453
32565b12751n8403N0821J23142P6035M1964R8305R5589m2337j31244n4132K1812
$$ plain form
32554 8801 -13945 -44238 48202 192401 198153 97702 82721 133435 59629 -103035 -108773 66886
32542 66886 178479 130635 82407 86406 1620 -160894 -184722 -44040 10631 -118149 -211963
32531 -211963 -136645 -61866 -126917 -209231 -191295 -161404 -186245 -164354 -61802 -22556 -96333
32520 -96333 -124646 -37035 14748 -43230 -60571 34209 79228 -2361 -25352 120900 243072
32509 243072 170202 47281 67715 148485 118018 23624 5820 38569 27118 13121 64687
32498 64687 98856 17469 -102748 -137974 -112406 -98676 -55826 59068 139958 69138 -90923
32487 -90923 -192679 -195212 -135620 -22931 110287 164885 111897 62619 86880 86311 -25598
32476 -25598 -144785 -124238 655 74815 33557 -67295 -157470 -188671 -138223 -58525 -46266
$$ packed form
32554H801k2746l0293R2440J44199N752j00451j4981N0714p3806j62664n738J75659
32542F6886J11593m7844m8228L999q4786j62514k3828J40682N4671j28780r3814
32531b11963P5318P4779o5051q2314J7936K9891k4841K1891J02552L9246p3777
32520i6333k8313Q7611N1783n7978j7341R4780M5019q1589k2991J46252J22172
32509B43072p2870j22921K0434Q0770l0467r4394j7804L2749j1451j3997N1566
32498F4687L4169q1387j20217l5226K5568J3730M2850J14894Q0890p0820j60061
32487i0923j01756k533N9592J12689J33218N4598n2988m9278K4261n69j11909
32476b5598j19187K0547J24893P4160m1258j00852r0175l1201N0448P9698J2259
$$ plain form
32465 -46266 -100638 -107199 -18470 64621 57403 15634 15851 26475 -13400 -81930 -121459 -119988 -89354
32452 -89354 -37623 2500 -1596 -16377 8451 35090 -3170 -61085 -42484 21421 21242 -22601
32440 -22601 10222 110882 147286 103242 96385 142532 128032 45112 22797 82511 95185 26653
32428 26653 -12415 -8294 -82151 -225281 -258752 -136676 -29410 -19664 14439 116740 137791
32417 137791 25972 -45356 16489 62570 -2939 -42706 31283 71700 -16414 -69161 45716
32406 45716 187648 213758 240373 398138 574103 658960 808238 1153489 1461029 1411018
32396 1411018 1066160 743952 550074 359545 160015 80193 119446 145768 141783 189353
32386 189353 233844 128099 -86447 -187978 -91656 47012 74445 6940 -66854 -94004 -46942
$$ packed form
32465d6266n4372o561Q8729Q3091p218m1769K17J0624l9875o8530l9529J471L0634
32452h9354N1731M0123m096j4781K4828K6639l8260n7915J8601O3905j79m3843
32440b2601L2823J00660L6404m4044o857M6147j4500q2920k2315N9714J2674o8532
32428B6653l9068M121p3857j43130l3471J22076J07266R746L4103J02301K1051
32417A37791j11819p1328O1845M6081o5509l9767P3989M0417q8114n2747J14877
32406D5716J41932K6110K6615J57765J75965Q4857J49278L45251L07540n0011
32396A411018l44858l22208j93878j90529j99530p9822L9253K6322l985M7570
32386A89353M4491j05745k14546j01531R6322J38668K7433o7505p3794k7150M7062
$$ plain form
32375 -46942 61489 140492 107471 2743 -74258 -101695 -108273 -74037 17584 86925 48274
32364 48274 -55267 -124976 -152244 -170305 -139764 -29268 59390 10222 -110568 -137521 -50749
32353 -50749 17364 -4771 -59014 -88446 -96378 -78255 -21146 28028 3309 -73237 -118256 -107070
32341 -107070 -81026 -60938 -40456 -35538 -54510 -52629 713 50314 33218 -19209 -41743 -42755
32329 -42755 -59753 -66266 -25995 12482 -16840 -78855 -92177 -62615 -55991 -72895 -58075 -10746
32317 -10746 15648 9310 8012 23555 32825 30381 29383 30788 39370 75217 124801 127721 57895
32304 57895 -33813 -95453 -124438 -107232 -4004 147224 210999 122191 -9181 -42576 20824
32293 20824 86421 102320 65861 -18984 -101992 -88773 25207 104738 51870 -51680 -76545
$$ packed form
32375d6942J08431P9003l3021j04728p7001k7437o578L4236R1621O9341l8651
32364D8274j03541o9709k7268j8061L0541J10496Q8658m9168j20790k6953Q6772
32353e0749O8113k2135n4243k9432p932J8123N7109M9174k4719p6546m5019J1186
32341a07070K6044K0088K0482M918j8972J881N3342M9601j7096n2427k2534j012
32329d2755j6998o513M0271L8477k9322o2015j3322K9562O624j6904J4820M7329
32317a0746K6394o338j298J5543R270k444r98J405Q582L5847M9584K920o9826
32304E7895r1708o1640k8985J7206J03228J51228O3775q8808j31372l3395O3400
32293B0824O5597J5899l6459q4845q3008J3219J13980P9531n2868j03550k4865
$$ plain form
32282 -76545 -31549 -6649 -12623 -1972 14284 -4809 -31024 -9353 37866 47696 19732 -5129
32270 -5129 -26622 -63701 -97057 -109992 -136390 -194472 -227402 -181241 -86010 2442 73016 114567
32258 114567 89118 19739 9602 92103 159297 126538 62870 57643 69620 31645 -1569 42250
32246 42250 86979 9024 -148913 -221559 -151536 -38559 24177 37238 26035 -1637 -20761
32235 -20761 1855 52285 78173 51094 -10632 -59117 -42303 40414 101905 59930 -31719 -46684
32223 -46684 15574 31717 -25417 -38420 31120 59206 -10425 -45425 39457 112809 53426 -24534
32211 -24534 36242 163805 185687 115376 93750 129459 113408 37306 -2603 16184 36872
32200 36872 57001 100791 102280 -12510 -161362 -189802 -92536 668 26346 24309 11818 -23651
$$ packed form
32282g6545M4996K4900n974J0651J6256j9093k6215K1671M7219R830k7964k4861
32270e129k1493l7079l3356j2935k6398n8082l2930M6161R5231Q8452P0574M1551
32258A14567k5449o9379j0137Q2501O7194l2759o3668n227J1977l7975l3214M3819
32246D2250M4729p7955j57937p2646P0023J12977O2736J3061j1203k7672j9124
32235b0761K2616N0430K5888k7079o1726m8485J6814Q2717O1491m1975r1649j4965
32223d6684O2258J6143n7134j3003O9540K8086o9631l5000Q4882P3352n9383p7960
32211b4534O0776J27563K1882p0311k1626L5709j6051p6102l9909J8787K0688
32200C6872K0129M3790J489j14790j48852k8440R7266R3204K5678k037j2491l5469
$$ plain form
32188 -23651 -38280 11086 57432 16587 -54421 -45824 8757 -2447 -50989 -8221 113293 156078
32176 156078 69880 -15449 -5713 28385 -12842 -120535 -221583 -263087 -227421 -144853 -92765
32165 -92765 -107683 -126135 -95844 -87216 -177443 -285275 -270303 -154182 -81041 -83842 -61547 16443
32153 16443 57847 22170 -10490 15682 53041 55615 45248 35744 -3839 -74562 -122941 -114529
32141 -114529 -62303 14747 86951 92293 10665 -69017 -56239 2141 3668 -31558 -5045 66394
32129 66394 63109 -27564 -74563 -10295 66892 49796 -33084 -88358 -86934 -69816 -82564 -137126
32117 -137126 -202037 -228274 -215475 -220210 -257642 -258544 -192245 -152667 -219177 -307550 -289592 -198503
32105 -198503 -164547 -189522 -152218 -28170 59063 27971 -54021 -84260 -40397 39009 103186
$$ packed form
32188b3651j4629M9366M6346m0845p1008Q597N4581j1204m8542M2768J21514M2785
32176A56078q6198q5329R736L4098m1227j07693j01048m1504L5666Q2568N2088
32165i2765j4918j8452L0291Q628r0227j07832J4972J16121P3141k801K2295P7990
32153A6443M1404l5677l2660K6172L7359K574j0367r504l9583p0723m8379Q412
32141a14529N2226P7050P2204N342q1628p9682J2778N8380J527l5226K6513P1439
32129F6394l285r0673m6999O4268P7187j7096q2880n5274J424J7118j2748n4562
32117a37126o4911k6237J2799m735l7432r02O6299L9578o6510q8373J7958R1089
32105a98503L3956k4975L7304J24048Q7233l1092q1992l0239M3863P9406O4177
$$ plain form
32094 103186 110889 73959 63297 107406 132709 82635 24770 36032 61486 15923 -54495 -61848
32082 -61848 -48643 -97561 -141268 -62636 66032 63260 -62991 -119541 -35659 51909 47006 15945
32070 15945 17832 12467 -6327 28973 105113 109843 31693 6564 94177 172021 130464 22210
32058 22210 -60229 -110994 -136786 -97679 -6863 37241 -1442 -34641 -3503 29106 8966 -14372
32046 -14372 684 4216 -36218 -60872 -34073 -19775 -55518 -65138 7829 86194 82418 43271
32034 43271 61894 119766 126092 63465 -3806 -32040 -28014 -3705 30507 43777 7312 -65211
32022 -65211 -121474 -109680 -24404 64933 64764 -20306 -67032 -5242 55245 -20670 -170594 -213165
32010 -213165 -115199 -14668 12830 31157 70426 62264 -2297 -23831 27444 43199 -35027
$$ packed form
32094A03186P703l6930j0662M4109K5303n0074n7865J1262K5454m5563p0418p353
32082f1848J3205m8918m3707P8632J28668k772j26251n6550Q3882Q7568m903l1061
32070A5945J887n365j8794L5300P6140M730p8150k5129Q7613P7844m1557j08254
32058B2210q2439n0765k5792L9107R0816M4104l8683l3199L1138L2609k0140k3338
32046a4372J5056L532m0434k4654K6799J4298l5743r620P2967P8365l776l9147
32034D3271J8623N7872O326o2627o7271k8234M026K4309L4212J3270l6465p2523
32022f5211n6263J1794Q5276Q9337j69q5070m6726O1790O0487p5915j49924m2571
32010b13165R7966J00531K7498J8327L9269q162o4561k1534N1275J5755p8226
$$ plain form
31999 -35027 -108392 -88617 -33332 -17535 -229 73435 150095 158555 127206 108295 73944 -8800
31987 -8800 -78724 -62291 4919 31384 -5203 -60818 -101280 -109646 -71316 -10809 11310 -12470
31975 -12470 -12965 45664 105047 110306 91056 90003 87236 54697 14947 -10181 -38465 -63269 -29833
31962 -29833 64876 126311 83946 -8067 -54963 -41187 -4633 43345 102083 135615 108102 35786
31950 35786 -33402 -58518 -13851 81928 139323 83448 -22145 -38073 40633 56062 -78574
31939 -78574 -234841 -240437 -98623 53984 131786 147361 129909 90631 46148 11082 -19247
31928 -19247 -47152 -61315 -62788 -60589 -36712 25546 77475 47012 -45541 -98078 -67081 -10735
31916 -10735 20014 36388 41792 12856 -24570 -6956 51817 65642 22572 6941 43900 53577
$$ packed form
31999c5027p3365J9775N5285J5797J7306P3664P6660Q460l1349j8911l4351q2744
31987h800o9924J6433O7210K6465l6587n5615m0462q366L8330O0507K2119k3780
31975a2470m95N8629N9383N259j9250j053k767l2539l9750k5128k8284k4804L3436
31962b9833R4709O1435m2365r2013m6896J3776L6554M7978N8738L3532k7513p2316
31950C5786o9188k5116M4667R5779N7395n5875j05593j5928P8706J5429j34636
31939g8574j56267n596J41814J52607P7802J5575j7452l9278m4483l5066l0329
31928a9247k7905j4163j473K199K3877O2258N1929l0463r2553n2537L0997N6346
31916a0735L0749J6374N404k8936l7426J7614N8773J3825m3070j5631L6959R677
$$ plain form
31904 53577 8453 1930 91192 192083 204634 137857 47069 -41995 -86156 -24633 99742
31893 99742 138160 37187 -68832 -49240 49824 111119 117010 118086 124449 121765 118559 104666
31881 104666 41626 -52695 -104660 -109185 -132615 -155854 -74124 87131 141766 27864 -64363
31870 -64363 16733 146089 139336 44240 22865 79218 110058 117181 158414 175213 83243 -30967
31858 -30967 -16869 82174 87137 -26277 -100529 -58332 -992 -22752 -89988 -136018 -143603 -110589
31846 -110589 -45269 -2212 -20750 -40966 12857 91264 83266 -583 -37477 22735 101742 120576
31834 120576 78700 12417 -34025 -16228 49034 73978 33118 26954 104641 130826 -9217
31823 -9217 -173739 -147008 10346 39122 -112545 -220661 -150474 -36105 -22076 -57990 -59577
$$ packed form
31904E3577m5124o523Q9262J00891J2551o6777r0788q9064m4161O1523J24375
31893I9742L8418j00973j06019J9592R9064O1295N891J076O363k684l206j3893
31881A04666o3040r4321n1965m525k3430k3239Q1730J61255N4635j13902r2227
31870f4363Q1096J29356o753r5096k1375N6353L0840P123M1233J6799r1970j14210
31858c0967J4098R9043M963j13414p4252M2197N7340k1760o7236m6030p585L3014
31846a10589O5320M3057j8538k0216N3823P8407p998q3849l6894O0212P9007J8834
31834A20576m1876o6283m6442J7797O5262K4944m0860o164P7687K6185j40043
31823i217j64522K6731J57354K8776j51667j08116P0187J14369J4029l5914j587
$$ plain form
31812 -59577 -73523 -151016 -218220 -202003 -151532 -121925 -70843 14203 24855 -93552 -200118
31801 -200118 -146637 -7620 42057 -1664 -2321 66349 90610 32523 -5906 28183 41788 -41436
31789 -41436 -144571 -154295 -89893 -56744 -80422 -87212 -36404 19369 24995 3982 9956 43304
31777 43304 62679 52625 32521 13750 -4026 -3252 32047 69435 59253 17043 6704 26372
31765 26372 -5910 -111107 -178193 -107720 37638 113838 82490 24297 -3028 -16255 -23471
31754 -23471 4606 57030 63529 -7306 -93294 -122228 -103771 -98018 -123074 -132809 -79899 18758
31742 18758 85533 59892 -25454 -74504 -50070 -23691 -65069 -127356 -110570 -11458 73078 87759
31730 87759 77127 83652 73276 11738 -49177 -31138 54202 114137 95608 39310 544 -29560
$$ packed form
31812e9577j3946p7493o7204J6217N0471K9607N1082Q5046J0652j18407j06566
31801b00118N3481J39017M9677m3721o57O8670K4261n8087l8429L4089J3605q3224
31789d1436j03135r724O4402L3149k3678o790N0808N5773N626k1013N974L3348
31777D3304J9375j0054k0104j8771j7776P74L5299L7388j0182m2210j0339J9668
31765B6372l2282j05197o7086P0473J45358P6200l1348n8193k7325j3227p216
31754b3471K8077N2424O499p0835q5988k8934J8457N753k5056r735N2910R8657
31742A8758O6775k5641q5346m9050K4434K6379m1378o2287J6786R9112Q4536J4681
31730H7759j0632O525j0376o1538o0915J8039Q5340N9935j8529n6298l8766l0104
$$ plain form
31718 -29560 -82629 -128911 -102646 -13813 38601 3917 -34687 17708 109581 108769 9259 -47084
31706 -47084 19645 109987 97568 5247 -52953 -38664 -6996 3696 13736 45814 89667 119384
31694 119384 111556 64620 21313 31482 70495 56883 -13883 -33850 56152 151059 119791 -5598
31682 -5598 -87795 -85247 -74127 -91526 -84669 -29061 14926 -897 -42477 -56211 -36630 -2054
31670 -2054 39614 72631 70145 34288 -977 -22416 -48774 -75295 -58113 17696 96538 115636
31658 115636 83306 56365 53980 37042 -16349 -52628 -3661 99613 132248 28793 -116341
31647 -116341 -163976 -110893 -70897 -92098 -100282 -40586 35367 69702 84145 101939 77847 -10602
31635 -10602 -79673 -42328 61240 126442 129554 119503 106648 57520 -22107 -86226 -118074 -131046
$$ packed form
31718b9560n3069m6282K6265Q8833N2414l4684l8604N2395R1873q12r9510n6343
31706d7084O6729R0342j2419r2321n8200J4289L1668J0692J0040L2078M3853K9717
31694A19384p828m6936m3307J0169L9013j3612p0766j9967R0002R4907l1268j25389
31682e598q2197K548J1120j7399O857N5608M3987j5823m1580j3734J9581L4576
31670b054M1668L3017k486l5857l5265k1439k6358k6521J7182P5809P8842J9098
31658A15636l2330k6941k385j6938n3391l6279M8967J03274L2635j03455j45134
31647a16341m7635N3083L9996k1201q184N9696P5953L4335J4443J7794k4092q8449
31635a0602o9071L7345J03568O5202L112j0051j2855m9128p9627o4119l1848j2972
$$ plain form
31623 -131046 -120219 -78190 -34317 -14857 5604 50303 78542 50709 12463 28114 65456
31612 65456 42428 -33267 -68795 -26139 28942 24132 -40270 -111933 -134676 -85297 -4737 32219
31600 32219 14960 16277 70095 104628 67034 27696 57105 82423 3799 -109536 -101508 21439
31588 21439 89506 20661 -83010 -111674 -77520 -35283 -3806 -5076 -59266 -100586 -19181 164112
31576 164112 282065 240216 144071 138078 213678 256938 211108 112101 17130 -33437 -24734 8977
31564 8977 4944 -50182 -106456 -135942 -170073 -222895 -246696 -207346 -141120 -89134 -33480 48966
31552 48966 120545 128879 84546 43372 37158 58184 83089 79763 22928 -63060 -106848 -70571
31540 -70571 -4682 9055 -47248 -113677 -120977 -56488 28624 70373 55867 28031 18219 3318
$$ packed form
31623a31046J0827M2029M3873J9460K0461M4699K8239k7833l8246J5651L7342
31612F5456k3028p5695l5528M2656N5081m810o4402p1663k2743M9379Q0560L6956
31600C2219j7259J317N3818L4533l7594l9338K9409K5318p8624j13335Q028J22947
31588B1439O8067o8845j03671k8664L4154M2237L1477j270n4190m1320Q1405J83293
31576A64112J17953m1849r6145n993P5600M3260m5830r9007r4971n0567Q703L3711
31564H977m033n5126n6274k9486l4131n2822k3801L9350O6226N1986N5654Q2446
31552D8966P1579Q334m4333m1174o214K1026K4905l326n6835q5988m3788L6277
31540g0571O5889J3737n6303o6429p300O4489Q5112M1749j4506k7836r812j4901
$$ plain form
31528 3318 -42619 -91322 -104500 -102195 -122525 -140184 -104215 -41071 -29138 -70386 -83383 -40684
31516 -40684 -14613 -49220 -80507 -43880 14767 9347 -55779 -100665 -87716 -56529 -50199 -64497
31504 -64497 -77029 -85062 -96545 -104876 -92104 -54419 -10476 22954 51294 80523 88469 51994
31492 51994 -4023 -32498 -38301 -63979 -94967 -65386 11664 21883 -78188 -167329 -129695 -24500
31480 -24500 31866 65488 171463 298885 291768 138333 6332 2647 51060 51754 21186 14546
31468 14546 30793 58786 113267 165610 138250 27832 -60618 -60540 -29026 -24939 -6720 65624
31456 65624 121590 76967 -26827 -82635 -70456 -55649 -70085 -88607 -103671 -134595 -165177
31445 -165177 -148243 -81753 -19460 9287 39383 103846 164549 150393 60178 -13042 9815
$$ packed form
31528C318m5937m8703j3178K305k0330j7659L5969O3144J1933m1248j2997M2699
31516d0684K6071l4607l1287L6627N8647n420o5126m4886J2949L1187O330j4298
31504f4497j2532q033j1483q331J2772L7685M3943L3430K8340K9229P946l6475
31492E1994n6017k8475n803k5678l0988K9581P7050J0219j00071q9141L7634J05195
31480b4500N6366L3622J05975J27422p117j53435j32001l685M8413O94l0568o640
31468A4546J6247K7993N4481N2343k7360j10418q8450P8L1514M087J8219P2344
31456F5624N5966m4623j03794n5808J2179J4807j4436j8522j5064l0924l0582
31445a65177J6934O6490O2293K8747L0096O4463O0703j4156r0215p3220K2857
$$ plain form
31434 9815 82479 82055 -27782 -146628 -176815 -139419 -98049 -47175 32352 74338 8976 -93683
31422 -93683 -100278 -22538 -2631 -77006 -111613 -25659 67356 34489 -75467 -117668 -62564 -8259
31410 -8259 -20376 -59382 -59691 -10750 45467 60296 24082 -18477 -16238 20006 30913 -3673
31398 -3673 -34211 -11701 52666 109666 116859 59897 -30057 -86817 -82443 -70590 -98108 -105891
31386 -105891 -7707 153164 236756 196899 125454 93863 71879 35044 29030 70215 89309
31375 89309 41510 -13825 -6231 47892 91976 100938 65183 -15653 -84207 -61632 24050 42587
31363 42587 -56326 -166731 -186831 -146470 -107519 -52358 38580 102218 88335 51818 49490 32224
31351 32224 -51124 -126141 -95135 -2839 29746 -8509 -25854 9335 34808 10990 -35649 -79311
$$ packed form
31434I815P2664m24j09837j18846l0187L7396M1370N0874P9527M1986o5362j02659
31422i3683o595P7740J9907p4375l4607Q5954R3015l2867j09956m2201N5104N4305
31410h259j2117l9006l09M8941N6217J4829l6214m2559K239L6244J0907l4586
31398c673l0538K2510O4367N7000P193n6962q9954n6760M374J1853k7518p783
31386a05891R8184J60871Q3592l9857p1445l1591k1984l6835o014M1185J9094
31375H9309m7799n5335P594N4123M4084Q962l5755q0836o8554K2575Q5682J8537
31363D2587r8913j10405k0100M0361L8951N5161R0938O3638j3883l6517k328j7266
31351C2224q3348p5017L1006R2296L2585l8255j7345L5189K5473k3818m6639m3662
$$ plain form
31339 -79311 -112070 -102586 -25019 75912 125567 115601 89567 53946 -14491 -88416 -106368 -69334
31327 -69334 -38818 -31453 5371 92384 162442 143512 57490 478 37518 135972 204328 192519
31315 192519 139546 106817 89175 37238 -49127 -116300 -142977 -154419 -146526 -87773 -15673 -25265
31303 -25265 -118972 -174895 -125445 -60333 -70874 -97189 -40386 57697 76548 9188 -33800 7495
31291 7495 76477 95855 45359 -49396 -137443 -163214 -121383 -70652 -51626 -33899 9714 39583
31279 39583 25716 21916 78165 133607 91964 -32500 -131255 -135693 -64674 23970 64181 14446
31267 14446 -73664 -82926 4254 53762 -16478 -84440 -8504 130311 142873 26870 -44572
31256 -44572 -4014 38261 15583 7772 74142 147890 163054 150266 140435 97298 15246 -28581
$$ packed form
31339g9311l2759R484P7567J00931M9655r966k6034l5621o8437p3925j7952L7034
31327f9334L0516P365L6824Q7013P0058j8930q6022n7012L7040R8454O8356j1809
31315A92519n2973l2729j7642n1937q6365o7173k6677j1442P893N8753P2100r592
31303b5265r3707n5923M9450O5112j0541k6315N6803R8083J8851o7360m2988M1295
31291G495O8982J9378n0496r4755q8047k5771M1831N0731J9026J7727M3613K9869
31279C9583j3867l800N6249N5442m1643j24464r8755m438P1019Q8644M0211m9735
31267A4446q8110r262Q7180M9508p0240o7962P5936J38815J2562j16003p1442
31256d4572M0558M2275k2678p811O6370P3748J5164j2788r831m3137q2052m3827
$$ plain form
31244 -28581 5943 48658 37511 18218 49935 94560 82679 24636 -22392 -45236 -60990 -57813
31232 -57813 -17567 35490 63546 61955 36201 -24337 -102705 -130911 -69397 22839 55002 16976
31220 16976 -27635 -38072 -28895 -18013 178 24921 37424 31639 25441 29633 31387 22119 19722
31207 19722 41311 65566 50227 -8030 -55630 -40510 29032 104061 153936 174267 155054 90481
31195 90481 17713 -6887 20678 51954 62943 74385 87492 71036 34502 35190 74278 67607
31183 67607 -23618 -111092 -101127 -30338 2947 -15899 -32817 -38119 -64763 -102618 -109894 -93495
31171 -93495 -93141 -102416 -88078 -70193 -97191 -153367 -176379 -159262 -151605 -163764 -153687 -112025
31159 -112025 -81567 -82346 -83645 -57030 -2300 72391 140838 148004 73141 -17344 -46949 -30314
$$ packed form
31244b8581L4524M2715j1147j9293L1717M4625j1881n8043m7028k2844j5754L177
31232e7813M0246N3057K8056j591k5754o0538p8368k8206O1514R2236L2163l8026
31220A6976m4611j0437R177J0882J8191K4743J2503n785o198M192J754r268k397
31207A9722K1589K4255j5339n8257m7600J5120O9542P5029M9875K0331j9213o4573
31195I0481p2768k4600K7565L1276J0989J1442J3107j6456l6534O88L9088o671
31183F7607r1225q7474R965P0789L3285j8846j6918n302k6644l7855p276J6399
31171i3495L54r275J4338J7885k6998n6176k3012J7117P657j2159J0077M1662
31159a12025L0458p79j299K6615N4730P4691O8447P166p4863r0485k9605J6635
$$ plain form
31147 -30314 -23447 -14134 38212 87160 46481 -56204 -98375 -44132 15745 25370 39048 93281
31135 93281 123145 72805 -6078 -41995 -59031 -128091 -244707 -320127 -280334 -144130 -14431
31124 -14431 10042 -58563 -99516 -37523 43647 20589 -72222 -80088 41269 159283 156507 71684
31112 71684 1888 -31155 -53425 -59638 -29276 30763 101702 162696 168328 84077 -41056 -115829
31100 -115829 -131846 -154365 -179735 -125814 700 63760 -6516 -103030 -112415 -77908 -86313 -101672
31088 -101672 -43820 46266 59403 -10850 -76629 -99191 -104631 -88072 -26727 28081 -3037 -87784
31076 -87784 -105371 -23696 56444 59360 30187 29285 28329 -19447 -74343 -56587 33547 112228 122353
31063 122353 93982 86348 107906 115570 77456 14189 -25014 -14518 28381 68585 84503 76747
$$ packed form
31147c0314O867R313N2346M8948m0679j02685m2171N4243N9877R625J3678N4233
31135I3281K9864n0340p8883l5917j7036o9060j16616p5420L9793J36204J29699
31124a4431K4473o8605m0953O1993Q1170k3058r2811p866J21357J18014k776q4823
31112G1684o9796l3043k2270o213L0362O0039P0939O0994N632q4251j25133p4773
31100a15829j6017k2519k5370N3921J26514O3060p0276r6514r385L4507q405j5359
31088a01672N7852R0086J3137p0253o5779k2562n440J6559O1345N4808l1118q4747
31076h7784j7587Q1675Q0140K916k9173r02r56m7776n4896J7756R0134P8681J0125
31063A22353k8371p634K1558P664l8114o3267l9203J0496M2899M0204J5918p756
$$ plain form
31051 76747 58991 43077 28460 10989 2043 16944 35106 7996 -64486 -106680 -67277 -10040
31039 -10040 -30264 -101754 -98726 23986 164118 211762 173900 122669 95278 92188 108802 117137
31027 117137 71728 -16937 -67696 -35257 21964 29837 -2080 -25373 -40041 -67943 -85067 -53972
31015 -53972 8305 59323 94118 116264 88991 -6329 -98057 -99900 -38393 -14947 -52295 -73893
31003 -73893 -39055 -1433 -9992 -38958 -50881 -51922 -42575 13103 111628 164594 103059 -7797
30991 -7797 -34463 54963 154710 161338 89689 26620 17316 35166 37255 9952 -30452 -50964
30979 -50964 -24250 30438 40488 -40056 -146933 -164024 -81924 -25601 -77486 -146702 -99326
30968 -99326 34580 100226 47923 -5854 27026 77455 53115 -2728 11899 86997 119188
$$ packed form
31051G6747j7756j5914j4617j7471q946J4901J8162k7110p2482m2194L9403N7237
31039a0040k0224p1490L028J22712J40132M7644l7862n1231k7391l090J6614Q335
31027A17137m5409q8665n0759L2439N7221P873l1917k3293j4668k7902j7124L1095
31015e3972O2277N1018L4795K2146k7273r5320r1728j843O1507K3446l7348k1598
31003g3893L4838L7622q559k8966j1923j041R347N5678R8525N2966o1535j10856
30991g797k6666Q9426R9747O628p1649o3069r304J7850K089k7303m0404k0512
30979e0964K6714N4688J0050q0544j06877j7091Q2100N6323n1885o9216M7376
30968i9326J33906O5646n2303n3777L2880N0429k4340n5843J4627P5098L2191
$$ plain form
30957 119188 76077 37781 68186 128783 144681 96654 21420 -35477 -41244 15369 105706 165570
30945 165570 142434 43597 -65273 -115112 -99087 -82155 -122672 -182684 -157109 -15398 130706
30934 130706 150519 55617 -27591 -35777 -39445 -111228 -198933 -196549 -102246 -21227 -9732 -1495
30922 -1495 67247 131114 80523 -57070 -127279 -57815 44118 57780 20464 40564 104749
30911 104749 95984 -14300 -115915 -121061 -70494 -42402 -46466 -56849 -73332 -93851 -87174 -45007
30899 -45007 -7751 6322 37640 101799 135147 89374 22319 17062 54505 48171 -23824 -99690
30887 -99690 -125705 -96212 -25775 43688 32118 -92990 -227463 -219517 -60465 96048 125162
30876 125162 61928 11632 7734 13548 9681 14077 36700 64662 86479 99226 95875 67889
$$ packed form
30957A19188m3111l8296L0405O0597J5898m8027p5234n6897n767N6613R0337N9864
30945A65570k3136r8837j08870m9839J6025J6932m0517o0012K5575J41711J46104
30934A30706J9813r4902q3208q186l668p1783q7705K384R4303Q1019J1495Q237
30922a495O8742O3867n0591j37593p0209O9464J01933J3662l7316K0100O4185
30911A04749q765j10284j01615n146N0567K8092m064j0383j6483k0519O677M2167
30899d5007L7256J4073L1318O4159L3348m5773o7055n257L7443o334p1995p5866
30887i9690k6015K9493P0437O9463j1570j25108j34473P946J59052J56513K9114
30876A25162o3234n0296l898N814l867M396K2623K7962K1817J2747l351k7986
$$ plain form
30864 67889 18766 -36079 -78735 -95274 -83583 -57760 -35520 -24277 -29943 -66113 -131529 -190489
30852 -190489 -206939 -189791 -168679 -134239 -53453 51905 102144 61329 -9803 -42484 -57281
30841 -57281 -117251 -211333 -252936 -198359 -108044 -65871 -77990 -84446 -46989 11788 51257 61845
30829 61845 60433 56142 39715 5464 -29588 -37619 -9857 32158 58071 56479 37407 14502
30817 14502 -4780 -15779 -18154 -19983 -23645 -9356 38721 81820 42512 -93405 -220879 -215394
30805 -215394 -81907 49138 79135 39986 18917 40829 62871 47200 -1992 -51127 -57980
30794 -57980 -5654 60604 66152 4729 -39953 -8848 45414 41255 -9689 -37799 -37474 -62872
30782 -62872 -114098 -122057 -59555 13404 37315 17420 -20433 -69472 -109387 -97999 -32194 32606
$$ packed form
30864F7889m9123n4845m2656j6539J1691K5823K2240J1243n666l6170o5416n8960
30852a90489j6450J7148K1112L4440Q0786J05358N0239m0815p1132l2681j4797
30841e7281n9970r4082m1603N4577R0315M2173j2119o456L7457N8777L9469J0588
30829F1845j412m291j6427l4251l5052q031K7762M2015K5913j592j9072k2905
30817A4502j9282j0999k375j829l662J4289M8077M3099l9308j35917j27474N485
30805b15394J33487J31045K9997l9149k1069K1912K2042j5671m9192m9135o853
30794e7980N2326O6258N548o1423m4682L1105N4262m159n0944k8110L25k5398
30782f2872n1226p959O2502P2959K3911j9895l7853m9039l9915J1388O5805O4800
$$ plain form
30770 32606 54129 47764 36450 11519 -25675 -38027 -7652 29365 39605 39291 50078 55474
30758 55474 40933 31590 47438 63447 55450 40356 28321 -11159 -80562 -107916 -42960 45037
30746 45037 51019 -15223 -54572 -35931 -24450 -49060 -51167 -1278 30782 -15361 -85575 -90945
30734 -90945 -41951 -19187 -39104 -40395 -3333 9038 -39825 -87792 -68603 -21067 -25867 -65348
30722 -65348 -41326 60873 121037 43980 -98128 -150723 -65589 61418 120145 90620 25925
30711 25925 -12361 847 31987 16618 -53737 -94189 -30879 78145 101410 8412 -97773
30700 -97773 -133173 -126888 -126966 -102452 -9610 103818 142324 86103 4234 -43854 -62021 -73622
30688 -73622 -75866 -54420 -14481 20430 31691 20850 4336 -5775 -11979 -18606 -19679 -12429 -10403
$$ packed form
30770C2606K1523o365j1314k4931l7194j2352L0375L7017J0240l14J0787N396
30758E5474j4541r343J5848J6009p997j5094j2035l9480o9403k7354O4956Q7997
30746D5037N982o6242l9349J8641J1481k4610k107M9889L2060m6143p0214n370
30734i0945M8994K2764j9917j291L7062J2371m8863m7967J9189M7536m800l9481
30722f5348K4022J02199O0164p7057j42108n2595Q5134J27007N8727k9525o4695
30711B5925l8286J3208L1140j5369p0355m0452O3310J09024K3265r2998j06185
30700i7773l5400O285p8K4514R2842J13428L8506n6221q1869m8088j8167j1601
30688g3622k244K1446L9939L4911J1261j0841j6514j0111o204o627j073P250K026
$$ plain form
30675 -10403 -22629 -31404 -16744 5845 -701 -48859 -114761 -159513 -146071 -66580 18916 15311
30663 15311 -88067 -176102 -149432 -60698 -27971 -58639 -67308 -35867 -24394 -31014 14558 96743
30651 96743 99577 -4552 -88129 -58389 11850 23729 1862 4803 -3482 -70114 -125857 -75266
30639 -75266 37675 81194 24840 -35850 -28787 21447 66288 91480 92435 54700 -24585 -120742
30627 -120742 -180845 -140574 6802 151771 162185 61536 10475 65960 89655 -16599 -123542
30616 -123542 -65852 90167 148298 80891 32970 60337 62796 -7717 -55939 -10482 66691
30605 66691 98813 101204 110252 109553 85505 68993 70555 52886 11309 3288 53244 100302 84663
30592 84663 22562 -40378 -87059 -108298 -88950 -47428 -30729 -45760 -55185 -54947 -81030 -122341
$$ packed form
30675a0403j2226q775J4660K2589o546m8158o5902m4752J3442P9491Q5496l605
30663A5311j03378q8035K6670Q8734L2727l0668q669L1441J1473o620M5572Q2185
30651I6743K834j04129q3577K9740P0239J1879k1867K941q285o6632n5743N0591
30639g5266J12941M3519n6354o0690P063N0234M4841K5192R55l7735p9285r6157
30627a20742o0103M0271J47376J44969J0414j00649n1061N5485K3695j06254j06943
30616a23542N7690J56019N8131o7407m7921K7367K459p0513m8222M5457P7173
30605F6691L2122K391R048o99k4048j6512J562j7669m1577q021M9956M7058j5639
30592H4663o2101o2940m6681k1239J9348M1522J6699j5031r425K38k6083m1311
$$ plain form
30580 -122341 -114832 -53316 -19830 -58106 -106603 -107337 -96107 -122069 -156675 -155999 -146153 -167736 -189748
30567 -189748 -158017 -85613 -19446 43559 128736 202885 201076 120917 26328 -29076 -29973 22355
30555 22355 97798 128327 79413 13112 12884 64258 85378 60230 51227 78563 86159 52624
30543 52624 38777 75017 88685 16750 -77444 -90227 -36307 -21791 -77389 -122900 -106493 -76374
30531 -76374 -77250 -70521 -21477 13384 -24738 -75415 -33908 74390 109651 22141 -67448 -39546
30519 -39546 61699 107994 65078 6738 -14015 -17678 -23764 -3520 63323 134269 145853 91267
30507 91267 27278 6399 21145 23601 -8680 -43701 -38399 5504 45644 46515 4049 -61109
30495 -61109 -108816 -96862 -30540 20836 719 -55689 -68869 -24033 29979 73356 122610 149158
$$ packed form
30580a22341P509O1516L3486l8276m8497p34J1230k5962l4606O76R846k1583k2012
30567a89748L1731P2404O6167O3005Q5177P4149j809q0159r4589n5404q97N2328
30555B2355P5443L0529m8914o6301k28N1374K1120k5148r003K7336P596l3535
30543E2624j3847L6240J3668p1935r4194j2783N3920J4516n5598m5511J6407L0119
30531g6374q76O729M9044L4861l8122n0677M1507J08298L5261q7510q9589K7902
30519c9546J01245M6295m2916n8340k0753l663o086K0244O6843P0946J1584n4586
30507I1267o3989k0879J4746K456l2281l5021N302M3903M0140Q71m2466o5158
30495f1109m7707J1954O6322N1376k0117n6408j3180M4836N4012M3377M9254K6548
$$ plain form
30483 149158 93218 -16638 -59087 18904 126780 168856 168067 184363 196409 153779 82454
30472 82454 43650 29207 -16729 -101469 -180036 -217729 -196910 -102014 37945 132661 123502 59110
30460 59110 22094 24117 29782 30771 31412 13164 -23208 -37302 -27599 -53066 -112646 -106165 -6860
30447 -6860 44004 -54774 -174470 -143025 -26372 -19318 -118808 -138322 -33471 25636 -57010
30436 -57010 -163363 -179153 -153656 -149769 -111559 3226 102336 92734 23387 -16777 -43320 -107189
30424 -107189 -168006 -152495 -78858 -20702 5787 31828 57683 63386 58933 56226 31764 -20180
30412 -20180 -41295 17954 115159 165648 143762 83950 18264 -32458 -38356 9856 68423 83944
30400 83944 58773 42730 71086 128116 157199 104054 -23203 -139594 -165064 -114807 -65372
$$ packed form
30483A49158n5940j09856m2449P7991J07876M2076p89J6296J2046m2630p1325
30472H2454l8804j4443m5936q4740p8567l7693K0819R4896J39959R4716r159o4392
30460E9110l7016K023N665R89O41j8248l6372j4094R703k5467n9580O481R9305
30447f860N0864r8778j19696L1445J16653P054r9490j9514J04851N9107q2646
30436e7010j06353j5790K5497L887L8210J14785R9110r602o9347m0164k6543o3869
30424a07189o0817J5511P3637N8156K6489K6041K5855N703m453k707k4462n1944
30412b0180k1115N9249R7205N0489k1886n9812o5686n0722n898M8212N8567J5521
30400H3944k5171j6043K8356N7030K9083n3145j27257j16391k5470N0257M9435
$$ plain form
30389 -65372 -45315 -19452 28539 69499 84552 79060 45274 -15989 -48009 -265 72056 71394
30377 71394 12995 -1490 33468 12087 -87260 -139314 -65910 40674 67471 38576 37057 68562
30365 68562 90671 95211 81659 23636 -69265 -129372 -124905 -95306 -55394 24927 101901 61599
30353 61599 -82057 -144435 -32697 96018 71350 -38029 -70739 -40307 -59483 -97164 -35173
30342 -35173 82252 79811 -71434 -206089 -211172 -145029 -86052 -32100 8386 -18930 -100097
30331 -100097 -133262 -80518 -26145 -32933 -51266 -26013 11956 23818 37776 78222 100180 62271
30319 62271 -1058 -40427 -62863 -86409 -87144 -54348 -40630 -86459 -141146 -133841 -88624 -88276 -140212
30306 -140212 -161936 -108599 -40317 -30066 -60954 -65146 -32051 -16412 -42934 -64983 -43198 -14522
$$ packed form
30389f5372K0057K5863M7991M0960J5053n492l3786o1263l2020M7744P2321o62
30377G1394n8399j4485L4958k1381r9347n2054P3404J06584K6797k8895j519L1505
30365F8562K2109M540j3552n8023r2901o0107M467K9599L9912Q0321P6974m0302
30353F1599j43656o2378J11738J28715k4668j09379l2710L0432j9176l7681O1991
30342c5173J17425k441j51245j34655n083O6143N8977N3952M0486k7316q1167
30331a00097l3165N2744N4373o788j8333K5253L7969J1862J3958M0446K1958l7909
30319F2271o3329l9369k2436k3546p35L2796J3718m5829n4687P305M5217L48n1936
30306a40212k1724N3337O8282J0251l0888m192L3095J5639k6522k2049K1785K8676
$$ plain form
30294 -14522 -37257 -100934 -146910 -158452 -166066 -169358 -124382 -22351 81256 135783 139283 101256
30282 101256 27502 -37786 -28893 46094 95090 69584 35561 66053 126129 128336 57300 -20328
30270 -20328 -39819 7423 70064 66410 -30561 -124935 -92141 39222 101691 22337 -78300
30259 -78300 -83834 -46654 -56989 -77254 -42695 -18300 -93611 -200166 -204457 -127592 -97820 -121363
30247 -121363 -83375 32886 107883 82216 27508 -2767 -35671 -60240 -6180 105932 141713
30236 141713 49407 -51752 -53715 -7329 -3814 -22652 -1314 31397 3452 -72086 -114027 -87586
30224 -87586 -28135 23793 53932 66472 88213 148512 219687 221845 130091 31830 25270 96663
30212 96663 151715 140918 98571 73334 74401 89219 112354 137422 138767 86678 -7649 -77401
$$ packed form
30294a4522k2735o3677m5976j1542p614l292M4976J02031J03607N4527L500l8027
30282A01256p3754o5288Q893P4987M8996k5506l4023L0492O0076K207p1036p7628
30270b0328j9491M7242O2641l654r6971r4374L2794J31363O2469p9354j00637
30259g8300n534L7180j0335k0265L4559K4395p5311j06555m291P6865K9772k3543
30247a21363L7988J16261P4997k5667n4708l0275l2904k4569N4060J12112L5781
30236A41713r2306j01159j963M6386L515j8838K1338L2711k7945p5538m1941K6441
30224h7586N9451N1928L0139J2540K1741O0299P1175K158r1754r8261o560P1393
30212I6663N5052j0797m2347k5237J067J4818K3135K5068J345n2089r4327o9752
$$ plain form
30200 -77401 -63983 1589 27154 -12098 -33903 19007 75766 45657 -27208 -27949 38352 46022
30188 46022 -53138 -153304 -154842 -96995 -73000 -93926 -104419 -80834 -50027 -36440 -34089 -20438
30176 -20438 16988 55720 51653 4046 -23941 42 5134 -77055 -172566 -149089 -26408 36556
30164 36556 -15571 -53645 16824 99075 66116 -37110 -76010 -32683 -168 -13909 -15317 24972
30152 24972 54645 26921 -35059 -80868 -89062 -67977 -37875 -20680 -22823 -29146 -29940 -38426 -60437
30139 -60437 -68652 -37673 10415 27880 3774 -20414 224 61207 107891 90279 20774 -38615
30127 -38615 -57584 -75596 -128526 -173651 -144235 -55704 10748 20373 8852 -3078 -40033 -103802
30115 -103802 -147502 -139172 -92064 -22538 56537 97184 53643 -26967 -38345 35548 90799 53180
$$ packed form
30200g7401J3418O5572K5565l9252k1805N2910N6759l0109p2865p41O6301P670
30188D6022r9160j00166j538N7847K3995k0926j0493K3585L0807J3587K351J3651
30176b0438L7426L8732m067m7607k7987K3983N092q2189r5511K3477J22681O2964
30164C6556n2127l8074P0469Q2251l2959j03226l8900M3327L2515j3741j408M0289
30152B4972K9673k7724o1980m5809q194K1085L0102J7195k143o323p94q486k2011
30139f0437q215L0979M8088J7465k4106k4188K0638O0983M6684j7612o9505n9389
30127c8615j8969j8012n2930m5125K9416Q8531O6452R625j1521j1930l6955o3769
30115a03802m3700Q330M7108O9526P9075M0647m3541q0610j1378P3893N5251l7619
$$ plain form
30103 53180 -30393 -84745 -98629 -81166 -22148 48273 54432 -2661 -7815 104342 229778 229740
30091 229740 117166 14485 -20022 -28271 -52829 -88596 -111901 -96680 -32844 28170 3762
30080 3762 -94211 -139605 -62127 48246 86381 83933 110023 120862 51601 -24587 334 64021
30068 64021 20114 -99574 -115370 -1121 58201 -34811 -137142 -107999 -22282 -7335 -16399
30057 -16399 68377 207192 252736 178626 96811 68187 44821 3429 -3491 39053 61406 23306
30045 23306 -17196 -850 43021 58509 49644 44678 27946 -24543 -78716 -80432 -37671 -1230
30033 -1230 19014 50951 81839 57908 -24287 -91914 -87952 -38455 -1876 2559 -11442 -31437
30021 -31437 -43347 -31165 -5956 -265 -16789 -27687 -36026 -70972 -101893 -47564 82362 153633
$$ packed form
30103E3180q3573n4352j3884J7463N9018P0421O159n7093n154J12157J25436l8
30091B29740j12574j02681l4507q249k4558l5767k3305J5221O3836O1014k4408
30080C762r7973m5394P7478J10373L8135k448K6090J0839o9261p6188K4921O3687
30068F4021m3907j19688j5796J14249N9322r3012j02331K9143Q5717J4947r064
30057a6399Q4776J38815M5544p4110q1815k8624k3366m1392o920M2544K2353l8100
30045B3306m0502J6346M3871J5488q865m966j6732n2489n4173j716M2761L6441
30033a230K0244L1937L0888k3931q2195o7627L962M9497L6579M435j4001j9995
30021c1437j1910J2182K5209N691j6524j0898q339l4946l0921N4329J29926P1271
$$ plain form
30009 153633 89565 -9166 -21168 19882 29639 49214 145736 221813 146043 35492 148948
29998 148948 465170 629953 430591 93683 -43424 33791 99285 51501 -21805 -57434
29988 -57434 -81749 -90627 -42246 34060 62137 46039 52490 82584 78694 41083 20156 10966
29976 10966 -25209 -52904 -3518 86227 108488 56073 26212 44235 24240 -64492 -127436 -92423
29964 -92423 -12606 32332 35982 14132 -45635 -122555 -142027 -83916 -34842 -67635 -137836 -163029
29952 -163029 -138867 -109382 -81030 -38047 538 5434 -13023 -29645 -43343 -48379 -13301 59618
29940 59618 99337 51056 -38704 -81218 -59106 -21118 7786 41743 71173 53302 -23278 -109598
29928 -109598 -144200 -105424 -20197 52010 52793 -24335 -117402 -155102 -128309 -81483 -46265 -16516
$$ packed form
30009A53633o4068r8731j2002M1050R757J9575R6522P6077p5770j10551J13456
29998A48948L16222J64783j99362l36908j37107P7215O5494m7784p3306l5629
29988e7434k4315q878M8381P6306K8077j6098O451L0094l890l7611k0927r190
29976A0966l6175k7695M9386Q9745K2261n2415k9861J8023j9995q8732o2944L5013
29964i2423P9817M4938L650k1850n9767p6920j9472N8111M9074l2793p0201k5193
29952a63029K4162K9485K8352M2983L8585M896j8457j6622j3698n036L5078P2919
29940E9618L9719m8281q9760m2514K2112L7988K8904L3957K9430j7871p6580q6320
29928a09598l4602L8776Q5227P2207P83p7128r3067l7700K6793M6826L5218K9749
$$ plain form
29916 -16516 16350 41119 49031 49898 51457 41810 8644 -35519 -63505 -64060 -46961 -19369 21526
29903 21526 62069 62837 7623 -48646 -25406 78304 164878 150023 60996 -7588 -7733 28286
29891 28286 46326 25288 -10991 -7294 75842 199599 263150 218897 132743 83276 51603 -15629
29879 -15629 -81295 -62174 19661 47765 -11891 -58043 -16757 46811 41198 -11712 -27612 7125
29867 7125 32583 14682 -18778 -26810 4759 56813 82368 45858 -18738 -29912 29378 70112
29855 70112 14477 -90304 -136961 -104956 -71208 -85613 -108005 -85392 -37321 -27842 -73675 -115215
29843 -115215 -88699 -10833 35851 7893 -45051 -59638 -51239 -68463 -88177 -44998 39763 61251
29831 61251 -11446 -80578 -69477 -32725 -49934 -94399 -93333 -52425 -26395 -14467 20088 62653
$$ packed form
29916a6516L2866K4769P912Q67J559r647l3166m4163k7986n55J7099K7592M0895
29903B1526M0543P68n5214n6269K3240J03710Q6574j4855q9027o8584j45L6019
29891B8286J8040k1038l6279L697Q3136J23757O3551m4253q6154m9467l1673o7232
29879a5629o5666J9121Q1835K8104n9656m6152M1286O3568n613n2910j5900L4737
29867G125K5458j7901l3460q032L1569N2054K5555l6510o4596j1174N9290M0734
29855G0112n5635j04781m6657L2005L3748j4405k2392K2613M8071R479m5833m1540
29843a15215K6516P7866M6684k7958n2944j4587Q399j7224j9714M3179Q4761K1488
29831F1251p2697o9132J1101L6752j7209m4465J066M0908K6030J1928L4555M2565
$$ plain form
29819 62653 72155 64609 81271 99357 69198 20105 27715 84735 108250 78777 67289 107438
29807 107438 142674 129787 100531 83079 51631 672 -13014 41443 107247 120623 90765
29796 90765 48810 -12726 -84707 -93620 3935 123773 142632 61642 -3735 13446 61970 70897
29784 70897 41565 18892 28279 67168 117418 144185 117664 55789 15061 21191 37280 19473
29772 19473 -23199 -48691 -41155 -22269 -12406 -7876 -2256 -11751 -60787 -139419 -191016 -165321 -85714
29759 -85714 -36180 -63751 -118583 -120746 -66331 -23171 -27692 -39452 -13806 28566 38392 11152
29747 11152 -15513 -17504 2220 42552 102442 150988 143845 84463 34669 42496 83540 96800
29735 96800 60362 6373 -26982 -30549 -13416 17467 57359 95648 117352 112894 87525 60273
$$ packed form
29819F2653R502p546J6662J8086l0159m9093P610N7020K3515k9473j1488M0149
29807A07438L5236j2887k9256j7452l1448n0959j3686N4457O5804J3376k9858
29796I0765m1955o1536p1981q913R7555J19838J8859q0990o5377J7181M8524Q927
29784G0897k9332k2673R387L8889N0250K6767k6521o1875m0728O130J6089j7807
29772A9473m2672k5492P536J8886R863M530N620r495m9036p8632n1597K5695P9607
29759h5714M9534k7571n4832k163N4415M3160m521j1760K5646M2372R826k7240
29747A1152k6665j991J9724M0332N9890M8546p143n9382m9794P827M1044J3260
29735I6800l6438n3989l3355l567J7133L0883L9892L8289K1704m458k5369k7252
$$ plain form
29723 60273 46239 40311 31848 34575 74243 134712 152097 96948 34169 48585 121090 141022
29711 141022 55596 -51092 -62964 26170 118428 132115 71130 -9904 -62578 -66299 -32510
29700 -32510 211 -2085 -33115 -56422 -50607 -26896 -2477 21306 46575 62322 54037 25107
29688 25107 -800 -2334 15043 22813 3309 -28625 -50916 -68272 -92978 -102281 -61796 3681
29676 3681 20832 -24722 -51480 236 68304 53966 -33968 -100368 -102517 -78102 -47938 7075
29664 7075 61554 43356 -47569 -111257 -87481 -36513 -21746 -2406 70926 132406 86687 -27340
29652 -27340 -79782 -39369 -1296 -22589 -49832 -40731 -42377 -87270 -106852 -34157 72553 104234
29640 104234 63351 53812 114873 158791 100709 -22405 -109817 -125940 -113595 -101122 -61149
$$ packed form
29723F0273j4034n928q463K727L9668O0469J7385n5149o2779J4416P2505J9932
29711A41022q5426j06688j1872Q9134R2258J3687o0985q1034n2674l721L3789
29700c2510L2721k296l1030k3307N815K3711K4419K3783K5269J5747q285k8930
29688B5107k5907j534J7377P770j9504l1934k2291j7356k4706r303M0485O5477
29676C681J7151m5554k6758N1716O8068j4338q7934o6400k149K4415L0164N5013
29664G075N4479j8198r0925o3688K3776N0968J4767J9340P3332O1480m5719j14027
29652b7340n2442M0413L8073k1293k7243R101j646m4893j9582P2695J06710L1681
29640A04234m0883r539O1061M3918n8082j23114q7412j6123J2345J2473L9973
$$ plain form
29629 -61149 24621 109044 126412 76684 25352 21497 49333 68607 70285 70689 73484 65941 43151
29616 43151 11936 -23562 -59248 -78571 -62617 -12077 52961 107644 125652 85742 -726 -80431
29604 -80431 -102336 -65448 -4684 52928 92464 96844 70790 60549 98359 139665 115934 44474
29592 44474 12421 40654 46151 -23232 -95268 -78970 -5086 20385 -27143 -63866 -24068 58778
29580 58778 113276 118341 105990 110942 139787 170711 170889 127216 62198 5028 -46985 -113809
29568 -113809 -181885 -200170 -142028 -52586 -14280 -63299 -145452 -162545 -73093 55209 112047
29557 112047 66016 -6898 -25920 -122 6777 -29225 -80095 -126433 -171701 -195279 -150368 -35202
29545 -35202 73006 91327 22984 -50757 -62763 -20733 24054 44413 54492 67034 63630 27479
$$ packed form
29629f1149Q5770Q4423J7368m9728n1332l855K7836J9274J678M04K795p543k2790
29616D3151l1215l5498l5686j9323J5954N0540O5038N4683J8008l9910q6468p9705
29604h0431k1905L6888O0764N7612L9536M380k6054j0241L7810M1306k3731p1460
29592D4474l2053K8233N497o9383p2036J6298P3884K5471m7528l6723L9798Q2846
29580E8778N4498N065j2351M952K8845L0924J78m3673o5018n7170n2013o6824
29568a13809o8076j8285N8142Q9442L8306m9019q2153j7093Q9452J28302N6838
29557A12047m6031p2914j9022K5798O899l6002n0870m6338m5268k3578M4911J15166
29545c5202J08208J8321o8343p3741j2006M2030M4787K0359J0079J2542l404l6151
$$ plain form
29533 27479 -14062 -14998 26150 68191 94709 130939 176920 180109 115268 44754 41743 83230
29521 83230 82613 14512 -56636 -72922 -49387 -31196 -32005 -36761 -36180 -38734 -58185 -90027 -97116
29508 -97116 -44372 35327 52404 -21093 -88631 -49261 56441 106387 81219 82805 160671 230202
$$ packed form
29533B7479m1541r36M1148M2041K6518L6230M5981L189o4841p0514l011M1487
29521H3230o17o8101p1148j6286K3535J8191q09m756N81k554j9451l1842p089
29508i7116N2744P9699J7077p3497o7538L9370J05702M9946k5168J586P7866O9531
$$ [...]
##END NTUPLES=NMR SPECTRUM
##END=
