##TITLE=31Pdec_LY-2Dix.5.R.t
 CD3CN, 24 sc
 2.03.2021
##JCAMPDX= 6.0         $$ Bruker NMR JCAMP-DX V2.0
##DATA TYPE= NMR SPECTRUM
##DATA CLASS= NTUPLES
##ORIGIN= UXNMR, Bruker Analytische Messtechnik GmbH
##OWNER= root
$$ XWIN-NMR		Version 3.5
$$ Wed Mar  3 10:58:43 2021 Russian Standard Time (UT+4h)  she@DPX200
##.OBSERVE FREQUENCY= 81.013821
##.OBSERVE NUCLEUS= ^31P
##.ACQUISITION MODE= SIMULTANEOUS
##.ACQUISITION SCHEME= undefined
##.AVERAGES= 24
##.DIGITISER RES= 16
##SPECTROMETER/DATA SYSTEM= spect
##.PULSE SEQUENCE= zgpg30
##.SOLVENT NAME= CDCl3
##.SHIFT REFERENCE= (INTERNAL, CDCl3, 0, 248.564)
##AUDIT TRAIL= $$ (NUMBER, WHEN, WHO, WHERE, WHAT)
$$ ##TITLE= Audit trail, XWIN-NMR		Version 3.5
$$ ##JCAMPDX= 5.01
$$ ##ORIGIN= Bruker BioSpin GmbH
$$ ##OWNER= she
$$ F:/spectra/data/she/nmr/P31/1/pdata/1/auditp.txt
$$ ##AUDIT TRAIL=  $$ (NUMBER, WHEN, WHO, WHERE, WHAT)
(   1,<2021-03-03 10:57:11.57 +0400>,<she>,<DPX200>,
      <created by zg, POWCHK disabled, PULCHK disabled
       configuration hash MD5:
       00 E9 B6 7A A2 85 ED C7 34 08 36 98 17 FE 4E 26
       data hash MD5: 32K
       2C 6B 3D FB 0A 6E 9B DE 5E 43 92 14 19 B6 F2 05>)
(   2,<2021-03-03 10:57:14.39 +0400>,<she>,<DPX200>,
      <Start of raw data processing
       efp BC_mod = 2 LB = 1 FT_mod = 6 PKNL = 1 PHC0 = -2859.708 PHC1 = -191.3973 SI = 64K 
       data hash MD5: 64K
       74 C4 76 F3 67 EF BC 1A 23 46 0B 50 53 C7 75 85>)
(   3,<2021-03-03 10:57:47.51 +0400>,<she>,<DPX200>,
      <pk PHC0 = 203.0843 PHC1 = -402.1999 
       data hash MD5: 64K
       1E 16 FB BB 97 33 48 FA FA DD C0 DA AB 1D 92 42>)
(   4,<2021-03-03 10:57:50.73 +0400>,<she>,<DPX200>,
      <abs ABSG = 5 
       data hash MD5: 64K
       E9 59 AE 5E 18 D5 34 FD FA 02 E0 2C 55 32 FB E3>)
$$ ##END=
$$ 
$$ hash MD5
$$ E2 FE 21 61 67 70 20 20 B7 01 76 82 ED 3B 20 45
##$RELAX= 
##$RELAX= 
##$RELAX= 
##$RELAX= 
##$RELAX= 
##$RELAX= 
##$RELAX= 
##$RELAX= 
$$ Bruker specific parameters
$$ --------------------------
##$DU= <F:/spectra>
##$EXPNO= 1
##$NAME= <P31>
##$PROCNO= 1
##$TYPE= <nmr>
##$USER= <she>
##$AMP= (0..31)
100 100 100 100 100 100 100 100 100 100 100 100 100 100 100 100 100 100 
100 100 100 100 100 100 100 100 100 100 100 100 100 100 
##$AQSEQ= 0
##$AQ_mod= 1
##$AUNM= <au_zg>
##$AUTOPOS= <>
##$BF1= 81.014009
##$BF2= 200.13
##$BF3= 200.13
##$BF4= 200.13
##$BF5= 200.13
##$BF6= 200.13
##$BF7= 200.13
##$BF8= 200.13
##$BYTORDA= 1
##$CFDGTYP= 0
##$CFRGTYP= 5
##$CHEMSTR= <none>
##$CNST= (0..31)
1 1 145 1 1 1 1 1 1 1 1 1 1 1 1 1 1 1 1 1 1 1 1 1 1 1 1 1 1 1 1 1 
##$CPDPRG= <waltz16>
##$CPDPRG1= <>
##$CPDPRG2= <waltz16>
##$CPDPRG3= <>
##$CPDPRG4= <mlev>
##$CPDPRG5= <mlev>
##$CPDPRG6= <mlev>
##$CPDPRG7= <mlev>
##$CPDPRG8= <mlev>
##$CPDPRGB= <>
##$CPDPRGT= <>
##$D= (0..31)
0 1 0 0 0 0 0 0 0 0 0 0.03 2e-05 3e-06 0 0 0 0 0 0 0 0 0 0 0 0 0 0 0 0 
0 0 
##$DATE= 1614754631
##$DBL= (0..7)
120 120 120 11 120 120 24 19 
##$DBP= (0..7)
150 150 150 150 150 150 150 150 
##$DBP07= 0
##$DBPNAM0= <>
##$DBPNAM1= <>
$$ [...]
##$SUBNAM3= <"">
##$SUBNAM4= <"">
##$SUBNAM5= <"">
##$SUBNAM6= <"">
##$SUBNAM7= <"">
##$SUBNAM8= <"">
##$SUBNAM9= <"">
##$SW= 501.771253377433
##$SWIBOX= (0..15)
0 1 3 0 0 0 0 0 0 0 0 0 0 0 0 0 
##$SW_h= 40650.406504065
##$TD= 32768
##$TD0= 1
##$TE= 0
##$TE2= 300
##$TE3= 300
##$TEG= 300
##$TL= (0..7)
0 120 53 12 22 120 120 120 
##$TP= (0..7)
150 150 150 150 150 150 150 150 
##$TP07= 0
##$TPNAME0= <>
##$TPNAME1= <>
##$TPNAME2= <>
##$TPNAME3= <>
##$TPNAME4= <>
##$TPNAME5= <>
##$TPNAME6= <>
##$TPNAME7= <>
##$TPOAL= (0..7)
0.5 0.5 0.5 0.5 0.5 0.5 0.5 0.5 
##$TPOFFS= (0..7)
0 0 0 0 0 0 0 0 
##$TUNHIN= 0
##$TUNHOUT= 0
##$TUNXOUT= 0
##$USERA1= <user>
##$USERA2= <user>
##$USERA3= <user>
##$USERA4= <user>
##$USERA5= <user>
##$V9= 5
##$VALIST= <valist>
##$VCLIST= <CCCCCCCCCCCCCCC>
##$VD= 0
##$VDLIST= <DDDDDDDDDDDDDDD>
##$VPLIST= <PPPPPPPPPPPPPPP>
##$VTLIST= <TTTTTTTTTTTTTTT>
##$WBST= 1024
##$WBSW= 4
##$XGAIN= (0..3)
0 0 0 0 
##$XL= 0
##$YL= 0
##$YMAX_a= 5525
##$YMIN_a= -24684
##$ZGOPTNS= <>
##$ZL1= 120
##$ZL2= 120
##$ZL3= 120
##$ZL4= 120
##$ABSF1= 248.5645
##$ABSF2= -253.2056
##$ABSG= 5
##$ABSL= 3
##$ALPHA= 0
##$AQORDER= 0
##$ASSFAC= 0
##$ASSFACI= 0
##$ASSFACX= 0
##$ASSWID= 0
##$AUNMP= <proc_1d>
##$AZFE= 0.1
##$AZFW= 0.5
##$BCFW= 0
##$BC_mod= 2
##$BYTORDP= 0
##$COROFFS= 0
##$CY= -3
##$DATMOD= 1
##$DC= 0
##$DFILT= <>
##$DTYPP= 0
##$F1P= 0
##$F2P= 0
##$FCOR= 1
##$FTSIZE= 65536
##$FT_mod= 6
##$GAMMA= 0
##$GB= 0
##$INTBC= 1
##$INTSCL= 5.30512e-09
##$ISEN= 30
##$LB= 1
##$LEV0= 0
##$LPBIN= 0
##$MAXI= 10000
##$MC2= 0
##$MEAN= 0
##$ME_mod= 0
##$MI= 50
##$NCOEF= 0
##$NC_proc= -2
##$NLEV= 6
##$NOISF1= 182.463
##$NOISF2= 159.3651
##$NSP= 0
##$NTH_PI= 0
##$NZP= 0
##$OFFSET= 248.5645
##$PC= 4
##$PHC0= -2656.624
##$PHC1= -593.5972
##$PH_mod= 1
##$PKNL= yes
##$PPARMOD= 0
##$PSCAL= 0
##$PSIGN= 0
##$REVERSE= no
##$SF= 81.014009
##$SI= 65536
##$SIGF1= 159.3651
##$SIGF2= -187.1042
##$SINO= 113.3802
##$SIOLD= 16384
##$SREGLST= <1H.CDCl3>
##$SSB= 0
##$STSI= 65536
##$STSR= 0
##$SW_p= 40650.406504065
##$SYMM= 0
##$S_DEV= 0
##$TDeff= 32768
##$TDoff= 0
##$TI= <>
##$TILT= no
##$TM1= 0
##$TM2= 0
##$TOPLEV= 0
##$USERP1= <user>
##$USERP2= <user>
##$USERP3= <user>
##$USERP4= <user>
##$USERP5= <user>
##$WDW= 1
##$XDIM= 65536
##$YMAX_p= 352766543
##$YMIN_p= -1724256
$$ End of Bruker specific parameters
$$ ---------------------------------
##NTUPLES= NMR SPECTRUM
##VAR_NAME=  FREQUENCY,     SPECTRUM/REAL,   SPECTRUM/IMAG
##SYMBOL=    X,             R,               I
##VAR_TYPE=  INDEPENDENT,   DEPENDENT,       DEPENDENT
##VAR_FORM=  AFFN,          ASDF,            ASDF
##VAR_DIM=   65536,         65536,           65536
##UNITS=     HZ,            ARBITRARY UNITS, ARBITRARY UNITS
##FACTOR=    0.620285442955139, 1,           1
##FIRST=     20137.2065510759, 0,            0
##LAST=      -20513.1999529892, 0,           0
##MIN=       -20513.1999529892, -1724256,    0
##MAX=       20137.2065510759, 352766543,    0
$$ Real data points
##PAGE= N=1
##DATA TABLE= (X++(R..R)), XYDATA
$$ [...]
##PAGE= N=2
##DATA TABLE= (X++(I..I)), XYDATA
35758B41976J32721J36832L5734m3403l5993k1683o0045p4046J6376J38806J56277
$$ 241976 374697 511529 547263 503860 467867 446184 386139 312093 328469 467275 623552
35747F23552N6685n5593j21296j57955j48373m5317Q6022Q4841o9323j75808q0128
$$ 623552 680237 624644 503348 345393 197020 151703 237725 322566 253243 77435 -2693
35736b693R8816J52144Q6289N9880Q6544K6303j32961k15870j35402k2783N320
$$ -2693 96123 248267 334556 394436 480980 507283 374322 158452 23050 267 5587
35725E587K1692J11663J85087J16306m3438j38757j09935q74J36400K23184J49465
$$ 5587 27279 138942 324029 440335 396897 258140 148205 147331 283731 506915 656380
35714F56380o4525k03933j22660K5476J0327j11813j00478N5239J09919k4032
$$ 656380 591855 387922 265262 290738 301065 189252 88774 144013 253932 229900
35704B29900j21354j2145J41251J05649o6319j38685l9938Q3816J08653N9447
$$ 229900 108546 96401 237652 343301 276982 138297 98359 182175 290828 350275
35694C50275J3470O712L4585N6085J2234q8533j43673r3782k8744n1601r4738
$$ 350275 363745 370457 405042 461127 473361 384828 241155 147373 118629 67028 -27710
35683b7710j5165J54840K19513J02894m0632n8409M402L2079L0567O1156P8144
$$ -27710 -42875 111965 331478 434372 393740 335331 339733 371812 402379 463535 541679
35672E41679l461j19550j08028L7688J24649K9524j22774j46292n5125o249m2728
$$ 541679 538218 418668 310640 348328 472977 502501 379727 233435 178310 172061 129333
35661A29333n0093L1123J01581O8607q621l2254k8189o9905j02213k351J84956
$$ 129333 79240 110363 211944 280551 271930 239676 211487 141582 39369 37018 221974
35650B21974K45098R2536p7603n6429P6804Q6004n6667j41708o2110L1631j625
$$ 221974 467072 559608 482005 425576 502380 588384 531717 390009 327899 359530 357905
35639C57905o2584R50J14168Q2420q6970j78446q4787N9059J01072O1687K3295
$$ 357905 295321 296271 410439 492859 405889 227443 142656 201715 302787 364474 387769
35628C87769j8608q2889r9121j0765R4795R7402L7709N6265J56627J81200N4624
$$ 387769 369161 286272 187151 176386 271181 368583 406292 462557 619184 800384 855008
35617H55008q7257r2918k0690n0463k06004k93317j56001R7801K13701J08001
$$ 855008 767751 674833 654143 603680 397676 104359 -51642 46159 259860 367861
35607C67861l6036j9027J18591J73318N7567j07345j70523j16485k2736N3551
$$ 367861 331825 312798 431389 604707 662274 554929 384406 267921 245185 298736
35597B98736R1053P3128O681n7617o6503q989Q7086J64243J45181L534j60565
$$ 298736 389789 462917 469598 411981 345478 336489 423575 587818 732999 736533 575968
35586E75968j92518o1229J02421J68427J32229N2845l8758j21907j59283j40138
$$ 575968 383450 322221 424642 593069 725298 778143 739385 617478 458195 318057
35576C18057q9673j6159P1277R7265K85j17114q5788N5586Q8282k5296n4704J04705
$$ 318057 228384 212225 283502 380767 381052 263938 178150 233736 322018 296722 242018 346723
35564C46723K19434R7850p4165m8520N8763o824j60112j17606P9685J08016q3358
$$ 346723 566157 664007 589842 541322 600085 593261 433149 315543 395228 503244 419886
35553D19886j76722j7683J44397Q2039q0048j29791p9851l3553K1907J06097J29932
$$ 419886 243164 225481 369878 451917 371869 242078 162227 128674 150581 256678 386610
35542C86610N6299j35K7460M1101j2378j8587P3584J08978j5853j49863j26838
$$ 386610 442909 442774 470234 511335 498957 480370 553954 662932 647079 497216 370378
35531C70378k1474K4538M5583J07830J01903p0067k41597j81259M8130J78571
$$ 370378 348904 373442 419025 526855 628758 558691 317094 135835 183965 362536
35521C62536J17559P578m1923n6995n9743k4662L3917P8381J17420J40741P2131
$$ 362536 480095 487673 445750 388755 329012 304350 338267 416648 534068 674809 746940
35510G46940p6509j28304N058J26429K7480j67509j90863n7019J359m5302j026
$$ 746940 670431 542127 547185 673614 701094 533585 342722 285703 287062 241760 240734
35499B40734J57841J99263K4741j49275j16004M4379J29532P5685m4873j34717
$$ 240734 398575 597838 622579 473304 357300 401679 531211 606896 562023 427306
35489D27306j09514L3617J47494Q5184o8178r3720K4550P9493j5022j02742p0368
$$ 427306 317792 351409 498903 584087 515909 422189 446739 526232 511210 408468 338100
35478C38100o326J7759P5216J69914J38022p3231k46402j97277m6861Q04k6326
$$ 338100 331774 349533 424749 594663 732685 659454 413052 215775 168914 169718 143392
35467A43392J1683Q6015P1981o277k6739J5501M4017O9559J23496J08712o1309
$$ 143392 155075 241090 313071 306794 280055 295556 339573 409132 532628 641340 580031
35456E80031k39480j99170J8916J49067Q5510q815k407K9456k511m1847k0183
$$ 580031 340551 141381 160297 309364 394874 386059 383652 413108 410597 368750 348567
35445C48567J6570K2018M6602J10539J08310k8950j73193j46057K7351J47540
$$ 348567 365137 387155 433757 544296 652606 623656 450463 304406 331757 479297
35435D79297J06165J526k5027L3290Q1175O6432K6051L022k0040p3502j22698
$$ 479297 585462 586988 561961 595251 676426 742858 768909 771931 751891 678389 555691
35424E55691r6657K542Q2912Q6321O7027R0343J12345N2125n0190o4318L1141
$$ 555691 459034 461576 544488 630809 697836 788179 900524 952649 902459 838141 869282
35413H69282R3215P950j46950k02593j07366L6260J12747J03201O1217L6625M1002
$$ 869282 962497 970447 823497 620904 513538 549798 662545 765746 826963 863588 904590
35402I04590O1871Q9350J23264J55618J63638J38073J00732O7270K1844k2006
$$ 904590 966461 1055811 1179075 1334693 1498331 1636404 1737136 1804406 1826250 1804244
35392A804244K4011K02112L43945J71439l51797q73192r83035o51164k19324R624
$$ 1804244 1828255 2030367 2374312 2545751 2193954 1320762 337727 -313437 -532761 -523137
35382e23137M1429M8032J05456J51671J18070J3227r5460j33092p4397K1521O4417
$$ -523137 -481708 -433676 -328220 -176549 -58479 -45252 -140712 -273804 -348201 -326680 -262263
35371b62263L7792P056J1756J5683r306k6641q865P069r83K0036J03412J76630
$$ -262263 -224471 -217415 -205659 -189976 -199282 -225923 -234788 -227719 -228702 -208666 -105254 71376
35359G1376J60397R0849M2702l991r3792j49509n8607J12081J62333M1065q4153
$$ 71376 231773 322622 365324 361333 267541 118032 59425 171506 333839 374904 290751
35348B90751q6447m2024n5178q0703l9679J7031L706l4864j848P2697Q4725M7989
$$ 290751 204304 162280 107102 26399 -13280 3751 7457 -27407 -29255 43442 128167 176156
35336A76156P0497J42195J10441q2409k70795k63666q5684P6405J18957J02634
$$ 176156 246653 388848 499289 416880 146085 -117581 -203265 -126860 -7903 94731
35326I4731R3232M4288q7319j92708j14810J03796K23817J22225l3217l6219N4252
$$ 94731 187963 232251 144932 -47776 -162586 -58790 165027 287252 254035 217816 272068
35315B72068L8072q0930j01903L0808J29107O2449n3135o2697J0514O5172Q1785
$$ 272068 310140 229210 127307 158115 287222 349671 296536 233839 244353 309525 391310
35304C91310O9344k746j05414j20505j9896O6599O1590N0985P6790K5391j25748
$$ 391310 460654 457908 352494 231989 212093 278692 340282 391267 468057 493448 367700
35293C67700j73669r318J44375O5764r7506r0155J0511l0046j39837n9070J65148
$$ 367700 194031 184713 329088 394852 297346 207191 217702 187656 47819 -11251 153897
35282A53897K33907J18147Q3024J68106J06156j42317k36676k0892J82441Q6767
$$ 153897 387804 505951 588975 757081 863237 720920 484244 463352 645793 732560
35272G32560j20275j36099k0570q41o0463m9400j572k6909m8731N0242J54341
$$ 732560 612285 476186 455616 454775 394312 344912 343340 316431 267700 317942 472283
35261D72283P7516j06593j66849o1031N9539J04292Q3910k030j09074j01356L1639
$$ 472283 549799 443206 276357 215326 274865 379157 463067 461037 351963 250607 282246
35250B82246O9084r7368k07173j6361K54593K32082o629p4616P4999J19095l2891
$$ 282246 351330 253962 46789 30428 285021 517103 510474 435858 510857 629952 597061
35239E97061j05869K59K6288j38613k23340o6105P7478j1947j25116k758K03238
$$ 597061 491192 491451 517739 379126 155786 89681 167159 155212 30096 27338 230576
35228B30576J96436K3540n7192j1995O289j1975K7133O6752N675m2190P8807K21130
$$ 230576 427012 450552 393360 381365 387654 375679 402812 469564 475239 433049 511856 732986
35216G32986J15247j53794k24705k3462J24938J6670j54684j64691p6147k4493
$$ 732986 848233 694439 469734 446272 571210 587880 433196 268505 192358 167865
35206A67865K7790J23682J45609L5301l5068N3637J10804o0574k65367j54015
$$ 167865 195655 319337 464946 500247 465179 518816 629620 569046 303679 149664
35196A49664K15458L99906J79794j64635k74865j44319J2867J00977J55004J53563
$$ 149664 365122 765028 944822 780187 505322 361003 373870 474847 629851 783414
35186G83414L3671j47430k29477j38524L6259J54983J50818N6806l2931m5370
$$ 783414 817085 669655 440178 301654 337913 492896 643714 700520 667589 622219
35176F22219j0574k5122j01845j28485l8059O3370M0139o9907j20110p2961j0950
$$ 622219 611645 586523 484678 356193 318134 381504 421643 351736 231626 158665 147715
35165A47715L8100J19378J93210J41709j7125r5845o388R2192L1701j13587j57467
$$ 147715 185815 305193 498403 640112 622987 527142 520754 612946 644647 531060 373593
35154C73593p8304n93K7472N9462Q6107K6602r9891j51517n8824P6847J25730
$$ 373593 295289 294696 322168 381630 467737 494339 394448 242931 184107 260954 386684
35143C86684P0246l4768j40260j91127j31332J1720J18557J17282P3653Q1351
$$ 386684 456930 422162 281902 90775 -40557 -28837 89720 207002 280655 362006
35133C62006J18269Q7054l1119j35937j23236O52J26512J47741N9266m6205q3507
$$ 362006 480275 567329 536210 400273 277037 277689 404201 551942 611208 565003 481496
35122D81496n5541r294M3913J03893J16047K8415r3732j21429m9611j5750q7781
$$ 481496 425955 416661 460574 564467 680514 708929 615197 493768 444157 428407 340626
35111C40626j53678r9273J5595O8320O9441J07736J56800R8875o2613j70659j35074
$$ 340626 186948 87675 103270 171590 241031 348767 505567 604442 541829 371170 236096
35100B36096n1160k8179j6592Q1597K06548J90820J1064j46725j27351q098L0275
$$ 236096 184936 156757 140165 221762 428310 619130 630194 483469 356118 348020 378295
35089C78295l7339p6155k2064L1257J2233k602O9370J63638J74861J23529Q1266
$$ 378295 340956 264801 242737 273994 286227 283625 352995 516633 691494 815023 896289
35078H96289J7756j07689j79596p3164P4594J1162j99430k03837Q1866K72404
$$ 896289 914045 806356 626760 553596 628190 639352 439922 236085 317951 590355
35068E90355Q1531k12929j86598P9307J58167l4922j54023k2310J05904O232j53528
$$ 590355 671886 458957 272359 351666 509833 474911 320888 298578 404482 410714 257186
35057B57186j16207O4709J55172R0260j5917p9848q4328r474J07982J36732J8156
$$ 257186 140979 205688 360860 451120 435203 355355 271027 261553 369535 506267 524423
35046E24423j15734j23874n6123l1574k4658N8249J74105J96843J20962M1903
$$ 524423 408689 284815 228692 197118 172460 230709 404814 601657 722619 764522
35036G64522k0531j11487j92229j72257o9218J8245P0331J24303J33573L0346
$$ 764522 743991 632504 440275 268018 198800 217045 287376 411679 545252 575598
35026E75598r6803q7166L1742P0151k4198j01652p6571l6224k6673L8352J57043
$$ 575598 478795 391629 423371 493522 469324 367672 291101 254877 228204 266556 423599
35015D23599J56025k6798j73060p5103J55496K49988J31892o3966k07006k32222
$$ 423599 579624 552826 379766 304663 460159 710147 842039 778073 571067 338845
35005C38845r5550J39864K57978J26069q8861j29964r394N2305j1594n6410j7170
$$ 338845 243295 383159 641137 767206 678345 548381 538987 591292 579698 523288 506118
34994E06118j019m9103m7904M1589Q3552L010p1680k9361L2934j1058r2552p3919
$$ 506118 505099 455996 408092 449681 533233 536243 464563 435202 468136 457078 364526 290607
34982B90607P491L612r5360j45678o4582P6610J69796J75159J15941N1742L9360
$$ 290607 298098 301710 206350 60672 -3910 72700 242496 417655 533596 585338 624698
34971F24698N5247N299j15588j56303j9895J40193J02189r1997j82498o6120Q3757
$$ 624698 679945 685244 569656 413353 393458 533651 635840 543843 361345 295225 378982
34960C78982J14834R7596J26193J15936l2152k04353k07676n5004O7008P1634
$$ 378982 493816 591412 717605 833541 801389 597036 389360 334356 401364 472998
34950D72998L5220Q879m4498j07237q4066K0177O3394r395n3688M6808J68080
$$ 472998 508218 517097 472599 365362 281296 301473 364867 355472 301784 348592 516672
34939E16672J15757p3811j74567q6694N2717R2841N5293L8472N1560L5454j2188
$$ 516672 632429 558618 384051 297357 350074 442915 498208 536680 588240 623694 611506
34928F11506k3324L9678J23763J31377J3444j69147k73721k02598k0373R2864
$$ 611506 588182 627860 751623 883000 896444 727297 453576 250978 230605 323469
34918C23469L5777r5452j19259J6535J71749J72642R701j47163j38870q89Q6168
$$ 323469 359246 263794 144535 161070 332819 505461 515162 367999 229129 228240 314408
34907C14408L0027o3386o0999j0m440o0061l4338P7216J10414O699n5945N6963
$$ 314408 344435 281049 220050 220040 215600 155539 121201 198417 308831 315530 259585 316548
34895C16548J84483J00670j09120j54377P774J00641l1600j75225q8863J17488
$$ 316548 501031 601701 492581 338204 345978 446619 415019 239794 150931 268419
34885B68419J61758J5230r4617n0336L1126N2477Q3203J71935K01392O3179j43008
$$ 268419 430177 445407 350790 300454 331580 384057 467260 639195 840587 903766 760758
34874G60758k20918j21396L4593J21787J01155l125j14298j29806l5037M6810
$$ 760758 539840 418444 453037 574824 675979 672854 558556 428750 393713 440523
34864D40523J3969n4698j9253Q9513J12350J9055n0283k3710J149m4777p3164
$$ 440523 454492 399794 380541 470054 582404 601459 551176 527466 528615 483838 410674
34853D10674p619O3733K7681p5543j34271j25746p8377J8770J37445J51811J6365
$$ 410674 403055 466788 494469 418926 284655 158909 80532 99302 236747 388558 404923
34842D04923r9167l5204Q8118M3218j26993j55169L4750K12803J88600M0937o7312
$$ 404923 305756 270552 358670 401888 274895 119726 154476 367279 555879 596816 529504
34831E29504r1274l8926Q8358J88217R3260j58440k80480j15262J25147J66721
$$ 529504 438230 399304 487662 675879 769139 610699 330219 214957 340104 506825
34821E06825N1519K07M1819L0334n5328q6592l4765r269l6949j7379O6699R0395
$$ 506825 558344 558551 600370 630704 575376 488784 454019 444750 407801 390422 457121 547516
34809E47516R7q1855m5030N2360R6747P5840L7377j3458q2235j17480o7715K5302
$$ 547516 547613 465758 420728 473088 569835 645675 683052 669594 587359 469879 402164 427466
34797D27466O2901R093p1040q6869j3259Q4866J11995M2905l9829l9629K7899
$$ 427466 490367 499460 428420 341551 328292 413158 525153 568058 528229 488600 516499
34786E16499M9901k8792j14046o9941R7033K12352J25113r4115k06360q1124J40170
$$ 516499 566400 537608 423562 353621 450654 663006 788119 694004 487644 406520 546690
34775E46690K23560J32779K9818J0834n169q7214j49471r7872N20K3649j0649
$$ 546690 770250 903029 932847 943681 938512 851298 701827 603955 604475 628124 617475
34764F17475O887Q1276J05085L5262m4036n3452k0470j6488m9257n4899J4503
$$ 617475 624362 705638 810723 845985 801949 748497 728027 711539 662282 607383 621886
34753F21886J10007J19133J2036q5125m5591O0684N4055p7667j55789r4231j6344
$$ 621886 731893 851026 863062 777937 732346 793030 847085 769418 613629 519398 503054
34742E03054j9219k7455N597l2748j78171k30703m9924J71075J76868L8914n816
$$ 503054 483835 456380 461977 429229 251058 20355 -29569 141506 318374 357288 351472
34731C51472L2826k4391j28174n0542J79171K55188P1013j19846j18083m6085
$$ 351472 384298 359907 231733 181191 360362 615550 686563 566717 448634 402549
34721D02549o4020r4888j4391R9316J00062J2332l2758R4M1477L6947q739m4921
$$ 402549 338529 243641 229250 328566 428628 440960 408202 408296 449773 486720 477981 433060
34709D33060n052R6006J18786j6924j54785r9995N5095O0207o3105m4289J47358
$$ 433060 428008 524014 642800 625876 471091 371096 426191 486398 423293 379004 526362
34698E26362K04324l186j80492q6301Q0014M5165p5216j5749J56007J62303j2167
$$ 526362 730686 727500 547008 460707 540721 585886 510670 494921 650928 813231 801064
34687H01064j23589p6920j0465l837O907K6155k4762j10585r6395J1772M8786
$$ 801064 677475 600555 590090 586253 593160 619315 594553 483968 387573 399345 448131
34676D48131n0474j56069j45935m8293N0286J03480R1723L0548l107L7447P2894
$$ 448131 397657 241588 95653 47360 97646 201126 292849 323397 320290 357737 430631
34665D30631J3374p2370n0400N5339J04654Q0405R3095J44194R4963p6899j86396
$$ 430631 444005 371635 321235 376574 481228 561633 654728 798922 893885 816986 630590
34654F30590j04456M4255O5504l6413j01752n5342K4079N3695N6215Q9466J29868
$$ 630590 526134 570389 635893 599480 497728 442386 466465 520160 576375 665841 795709
34643G95709Q7410o1298k05910k15590r5437L4866J03263J33780J33064N8317
$$ 795709 883119 821821 615911 400321 304884 339750 443013 576793 709857 768174
34633G68174n5067p1509M4902J27325K7064j53656j89407l4289J37229J60001
$$ 768174 713107 641598 686500 813825 840889 687233 497826 463537 600766 760767
34623G60767L5067j17941j71501q1716N7338R5922K0580k3629K8880L7856j03912
$$ 760767 795834 677893 506392 424676 482014 577936 598516 574887 603767 641623 537711
34612E37711k41950j62809O5138J72897P5212m1998k2061P3440J12757O4346l0914
$$ 537711 295761 132952 198090 370987 446199 404201 382140 455580 568337 632683 601769
34601F01769j24382j51673p1916M9477R4134M8537J4927M9746Q6228M3081o2674
$$ 601769 477387 325714 253798 303275 397409 445946 460873 510619 596847 639928 577254
34590E77254j32691p9525P9301J92260J08388j10425k17207j00807N5073N8856
$$ 577254 444563 365038 444339 636599 744987 634562 417355 316548 371621 430477
34580D30477N97N8130J55904Q8388r5705j38699N120J00081K9663l0352N2854
$$ 430477 431074 489204 645108 733496 637791 499092 504212 604293 633956 603604 656458
34569F56458J29531K7415j56750k11121j08811J9180J01192J49295J43188M9626
$$ 656458 785989 813404 656654 445533 336722 355902 457094 606389 749577 799203
34559G99203p3205j18030p0434j9744k7444n0870j3917Q0653J38962R1017k339
$$ 799203 725998 607968 537534 517790 490346 439476 425559 506212 645174 736191 733852
34548G33852k0247L4006K4120r2036j57148m9351J03641J10167J0091j8083L2941
$$ 733852 713605 747611 771731 679695 522547 473196 576837 687004 697095 679012 711953
34537G11953K0115n8007n0330N3046P3314n2763j54819r9835K2888P8019O2717
$$ 711953 732068 674061 623731 676777 750091 697328 542509 442674 465562 543581 606298
34526F06298K2486l8480q0304k8061P5816R0708J5153J2218J20780J57010J6134
$$ 606298 628784 590304 510000 481939 557755 648463 663616 675834 796614 953624 969758
34515I69758j41774j50766q2508o5069m8115N3186J39229P1818p2823j11970m0589
$$ 969758 827984 677218 594710 529641 481526 534712 673941 745759 672936 560966 520377
34504E20377n579m6597n3926L0308J29000J54429R9785M490q5385j25512j00678
$$ 520377 514798 468201 414275 444583 573583 728012 827797 832287 746902 621390 520712
34493E20712l5205M0710R4149P0691l7664j18735o3429M5824L8102n4681k8286
$$ 520712 485507 526217 620366 691057 653393 534658 471229 517053 555155 500474 472188
34482D72188J37964K14425R6835k6410j7608j2900j11144j31624N2317J99768
$$ 472188 610152 824577 921412 895002 877394 864494 753350 621726 674043 873811
34472H73811N1727k10569k21403j77J15100J6715p3932k6718M4373O3163R0290
$$ 873811 925538 714969 493566 493389 608489 625204 551272 524554 568927 632090 722380
34461G22380J08038K1373r0603m1291J00794N3231j96690l01915q9262J56645
$$ 722380 830418 851791 761188 719897 820691 873922 677232 375317 286055 442700
34451D42700J44075K308R90R4891O0755p5599p7660R5536K10895J08165r1494
$$ 442700 586775 589083 590073 684964 745719 670120 592460 687996 898891 1007056 915562
34440I15562j75730r3444L6747Q1102J4296p0374o9021K807L3412j2573l0269
$$ 915562 739832 646388 683135 764237 778533 708159 639138 641945 675357 662784 632515
34429F32515N9512J69326J63671N5032k6248k5336j8995p5657j46329j29669o165
$$ 632515 692027 861353 1025024 1080056 1053808 1028472 1009477 933820 787491 657822 651657
34418F51657J26543J54980P5020j0481k8796k2271n2901q5191n4896p030l9503
$$ 651657 778200 933180 1008200 997719 968923 946652 893751 808560 753664 746634 707131
34407G07131j24896j26935r478J04916J15877N7570m537n8180q1916l2433N0833
$$ 707131 582235 455300 445822 550738 666615 724185 719648 661468 579552 547119 597952
34396E97952N8948j3574m5981M081K9949k1380n1608r288K943n8200n4758Q0854
$$ 597952 656900 643326 597345 601426 631375 609995 558387 549099 552042 493842 439084 519938
34384E19938J73890Q9071j4310L9567J00209n3041k62245j90671R4475J68585
$$ 519938 693828 782899 768589 808156 908365 855324 593079 402408 496883 665468
34374F65468q4007k74900j18982J47413J73732O186p5460L62R5765J41618J56710
$$ 665468 581461 306561 187579 334992 508724 514910 439450 439812 535577 677195 833905
34363H33905J05962k4321j04706l4806N1233l0495k01419k20443m3812J39279
$$ 833905 939867 915546 810840 776034 827267 796772 595353 374910 331098 470377
34353D70377K00092J80927J25453J5634j03671j29033o0249l166p70j0737l8479
$$ 470377 670469 851396 976849 992483 888812 759779 699530 696364 695594 684857 646378
34342F46378j20193j81515j01398P4603J70173J35876Q2840O1132J9374j0900
$$ 646378 526185 344670 243272 317875 488048 623924 706764 767896 787270 776370
34332G76370O1794J55688P9983j12933j42414L5922J11084p3462k26914p5460
$$ 776370 838164 993852 1073835 960902 818488 854410 965494 892032 665118 589658
34322E89658J82178J97539Q586r7006p0173q0798j36263r5276R822K3447r055
$$ 589658 771836 969375 977961 880955 810782 729984 593721 498445 508267 531714 522659
34311E22659P8267K03981J26570j03185j69525j3948P0468m2130j05201L0670
$$ 522659 600926 804907 931477 828292 658767 644819 715287 673157 567956 598626
34301E98626J37605K5167j17365o7251M7823J9112n1895K6446J34987L8075j60802
$$ 598626 736231 761398 644033 576782 624605 643717 591822 618268 753255 791330 630528
34290F30528j45058R3429K28683J03745p5013j04102m8629l9242m3515K3453J19970
$$ 630528 485470 578899 807582 911327 836314 732212 683583 644341 600826 624279 744249
34279G44249J34635L4200j13250j96245j28920N2548J74641J12440l3759p1566
$$ 744249 878884 913084 799834 603589 474669 527217 701858 814298 780539 708973
34269G08973R386N3249K482m0785k2858j0125j8500K9768J19053J08024k7887
$$ 708973 718359 771608 774090 733305 710447 700322 681822 711590 830643 938667 910780
34258I10780j11752l7309N2743L585r7207p7290L3207O8916P434j7602M4379Q5493
$$ 910780 799028 761719 814462 818047 720840 643550 676757 745673 753107 735505 779884 865377
34246H65377J9303r5080j37522n4825R9861J96501J25543o8375j94773j35793
$$ 865377 884680 789600 652078 597253 697114 893615 1019158 950783 756010 620217
34236F20217m19L1922l9903o5828K2466J34151J57378O7529p8782j63995p8081
$$ 620217 619798 651720 611817 545989 568455 702606 859984 927513 848731 684736 606655
34225F06655J21989K00149L8402j44925q0202J29855J46274p4497k11740r7314
$$ 606655 728644 928793 967195 822270 742068 871923 1018197 943700 731960 634646
34215F34646M1231l279q2690L340J44756J36413L9788L1386N9736k9793j54503
$$ 634646 675877 672598 589908 593248 738004 874417 914205 945591 1005327 975534 821031
34204H21031j10059N2605R6684K744k6696M7774M6906p2332j33038o7841k1276
$$ 821031 710972 763577 860261 863005 836309 884083 930989 858657 725619 657778 636502
34193F36502m9101k4357O5514M7192r0365j02905Q6588J94197K3473j90888j54644
$$ 636502 587401 563044 628558 675750 585385 482480 569068 763265 786738 595850 441206
34182D41206L1226R0821L2035M9509J25129P5145q5659j50664o1659L4378N1207
$$ 441206 472432 563253 595288 644797 769926 845071 759412 608748 547089 581467 632674
34171F32674M0917K3131l3137p0176j041J02231Q4232m1786j13381p5445k4621
$$ 632674 673591 696722 663585 593409 592368 694599 778831 737045 623664 548219 523598
34160E23598j2983K625K9119L6316O4050J50802J96445R2902n5749o5307J7319
$$ 523598 510615 513240 542359 578675 642725 793527 989972 1082874 1027125 961818 979137
34149I79137j8212j85350k70860j78153m0473M1985J18823J89142J42838j1179
$$ 979137 960925 775575 504715 326562 286089 328074 446897 636039 778877 767698
34139G67698r1217j5079Q2197R1190P7416R0743M0799j09585k15909j59588l3379
$$ 767698 676481 661402 743599 834789 912205 1002948 1043747 934162 718253 558665 525286
34128E25286J0323l1361o4144l9699M3802J64887K29047J29401o7517j37245J4450
$$ 525286 535609 504248 440104 400405 444207 609094 838141 967542 900025 762780 777230
34117G77230K09096K28040O9696j02519j58392q3220L2099M1802j01049k27727
$$ 777230 986326 1214366 1284062 1181543 1023151 939931 972030 1013832 912783 685056
34107F85056j34941J11027K32915J26233k3661n3184k2571k6596l0008n051k5654
$$ 685056 550115 661142 894057 1020290 996629 943445 920874 894278 864270 859219 833565
34096H33565r7194q4613N6070J57906R6195j2882j8212K4731j5022j07270j26157
$$ 833565 736371 651758 707828 865734 961929 949047 930835 955566 940544 833274 707117
34085G07117n6280J2944K7634k667m7822n7009M126P9182Q6186O3629J09495J81143
$$ 707117 650837 663781 691415 688748 640926 583917 588043 667225 753411 817040 926535 1107678
34073A107678J42574J0423o5641o8616j05188j31870n427J65491R4294j71304
$$ 1107678 1250252 1260675 1195034 1126418 1021230 889360 883933 1049424 1143718 972414
34063I72414k24603N2761K50241P7891j68050j19733O7143M1611j29025j27833
$$ 972414 747811 800572 1050813 1128704 960654 840921 908064 949675 820650 692817
34053F92817M5289J23672N0383m599k049l9719q8608n4956q873m2722l1367J42465
$$ 692817 738106 861778 912161 907562 905513 865794 777186 722230 713357 670635 639268 781733
34041G81733K75774J25041j40918j68963R604O4177o0863j07349r693J7062p4906
$$ 781733 1057507 1182548 1041630 872667 882271 946448 885585 778236 768543 785605 710699
34030G10699o8113R1871J69404M8468q3143p1945p054R685J0155m394q7466j44594
$$ 710699 642586 734457 903861 952329 869186 797241 790187 799872 810027 805633 718167 573573
34018E73573r272K15313K14770m8670k35377j30708P2389J31561Q5316N7988K1177
$$ 573573 564301 779614 994384 945714 710337 579629 652018 783579 868895 926883 948060
34007I48060n7919p4315J6607O6505k6252j32574j03177J7002J20110J92554K11346
$$ 948060 890141 815826 832433 898938 872686 740112 636935 653937 774047 966601 1177947
33996A177947Q6655j43301k54473j34731L6260N9015j0280j9274K0010J9815K1834
$$ 1177947 1264602 1121301 866828 732097 768357 827372 817092 797818 817828 837643 859477
33985H59477J10201K14178J84964J9000j37920j74006j02182r806J8581k1782
$$ 859477 969678 1183856 1368820 1387820 1249900 1075894 973712 963906 982487 960705
33975I60705l2811N5057J40316P2101r7565j66930r9308o0571r7829m2370J55878
$$ 960705 927894 982951 1123267 1195368 1097803 930873 831565 770994 673165 630795 786673
33964G86673K60104R7491j36987j50210L2087J46444Q1206l8768r4582r5350p6783
$$ 786673 1046777 1144268 1007281 857071 889158 1035602 1116808 1078040 983458 888108 811325
33953H11325m2871j2979j1141j0701K6611P4159P3007J9369l3379l6109J9222
$$ 811325 768454 755475 744334 733633 760244 834403 907410 926779 893400 857291 876513
33942H76513Q4953P6685k7277j15142o8445N1049P3695j6899n9810J3070O5113
$$ 876513 961466 1038151 1010874 895732 827287 878336 952031 935132 875322 888392 953505
33931I53505j1020j19494j28234o0993j258O7348J88168K92160K65044J04739
$$ 953505 942485 822991 694757 633764 632506 699854 888022 1180182 1445226 1549965
33921A549965p9171j80428j60424o2869m88m7515j24676r2850L0458Q7422L1194
$$ 1549965 1470794 1290366 1129942 1067073 1066585 1019070 894394 801544 832002 919424 950618
33910I50618j0910K8080M8163o955k8178M6554P9972m3319j90825j58792K5863
$$ 950618 939708 967788 1015951 1008996 980818 1027372 1107344 1064025 873200 714408 740271
33899G40271J54979J27794L8593J2214O9295J32215R7656n0770j70893j01153
$$ 740271 895250 1023044 1061637 1073851 1143146 1275361 1373017 1322247 1151354 1050201
33889A050201R3588J61005J4723j23638n4605R9337R7857n0744j36601q1019j0963
$$ 1050201 1143789 1304794 1319517 1195879 1141274 1240611 1338468 1287724 1151123 1070104 1059141
33878A059141k6657p7343p9345k2117N7607J11760R6044K5125j5679J4966M0838
$$ 1059141 1032484 955141 875796 853679 911286 1023046 1119090 1144215 1128536 1143502 1184340
33867A184340o896n9214j6524P0977O6448l6937j00928m9768L0203L0497l4920
$$ 1184340 1177444 1118230 1101706 1172683 1239131 1202194 1101266 1051498 1081701 1112198 1077278
33856A077278p0937k8423N0647Q6110L6331o0246j12108n6577P8294J90796J82446
$$ 1077278 1006341 977918 1028565 1114675 1151006 1090760 978652 922075 1000369 1191165 1373611
33845A373611L9363j37611k06401j26752q698K5027j1328k0797J2404J3558m0915
$$ 1373611 1412974 1275363 1068962 942210 933512 958539 947211 926414 938818 952376 911461
33834I11461p9173m6411K3180O2341L5934m0291q6549q727J56571K17829P3773
$$ 911461 832288 785877 809057 871398 907332 867041 780492 771765 928336 1146165 1219938
33823A219938r7692p1703P1112N7944j35533k33159r2481Q7171J01378K9117K3156
$$ 1219938 1122246 1050543 1121655 1179599 1044066 810907 718426 805597 906975 936092 959248
33812I59248L5416m0887j23288o3930Q1978J28905M5442k7065j0633K9513L8245
$$ 959248 994664 953777 830489 766559 848537 977442 1022884 995819 985186 1014699 1052944
33801A052944M9068Q2540Q5747J8931p1277j06393o4471J2574P7092J14517J21612
$$ 1052944 1102012 1184552 1270299 1289230 1217953 1111560 1047089 1059663 1136755 1251272 1372884
33790A372884P5182k8802j09338o2985O3883P2346j19516l02614k22862O2791
$$ 1372884 1448066 1419264 1309926 1246941 1310824 1383170 1263654 961040 738178 800969
33780H00969K50670J83665K743r4685p3538j0539K4421p34n4242l9876P1560J48423
$$ 800969 1051639 1235304 1238047 1143362 1069824 1059285 1083706 1082972 1028730 988854 1060414 1208837
33768A208837P2633n3308n4915K2472K875q1501k4181J66994K17191Q550k16092
$$ 1208837 1281470 1228162 1173247 1195719 1198594 1117093 1092912 1259906 1477097 1485647 1269555
33757A269555k07116l9579N9937L6313r34J8395O2631P0311J5702m8135k5810
$$ 1269555 1062439 1022860 1082797 1119110 1118176 1136571 1199202 1269513 1285215 1237080 1211270
33746A211270O5004O1596q2575j43492L6376K09791O1443k34843k27878Q4361
$$ 1211270 1276274 1337870 1255295 1111803 1148179 1357970 1419413 1184570 956692 1041053
33736A041053K35348N1265r3332N4356K10407Q0290j45544j57591k8749o97n9029
$$ 1041053 1276401 1327666 1234334 1288690 1499097 1579387 1433843 1276252 1247503 1246806 1187777
33725A187777n7439k5794m8805n2399K1974N2105j4725j98J67921K37652L3021
$$ 1187777 1130338 1104544 1055739 1003340 1025314 1077419 1062694 1062496 1230417 1468069 1501090
33714A501090k07893k01770n4957p655j6586N6695J04228l442r3193J8820J43792
$$ 1501090 1293197 1091427 1036470 1028815 1012229 1068924 1173152 1169710 1076517 1095337 1239129
33703A239129L8056j25198m9774J25864N7679j73758j80714P2671K36703J64247
$$ 1239129 1277185 1151987 1102213 1228077 1285756 1111998 931284 1003955 1240658 1404905
33693A404905N0712l112r9379j95134r8718J32006K03404N8878n0732k0286k0111
$$ 1404905 1455617 1452505 1353126 1157992 1059274 1191280 1394684 1453562 1402830 1382544 1362433
33682A362433j06904j00713M7805J33763N8505j7148J2208M2849K0453M1002R8508
$$ 1362433 1255529 1154816 1202621 1336384 1394889 1377741 1389949 1432798 1453251 1494253 1592761
33671A592761M4418j01869j16577M3963J34790K2731j09402r6254l1889k8024
$$ 1592761 1637179 1535310 1418733 1462696 1597486 1620217 1510815 1414561 1382672 1354648
33661A354648j4617N3084N4041n9000j24053m3609M0196J0544j9041N7662J28356
$$ 1354648 1340031 1393115 1447156 1388156 1264103 1220494 1260690 1271234 1252193 1309855 1438211
33650A438211Q5303M1234J06119J47820J6508j57389j49074o707K8611r1255j61958
$$ 1438211 1523514 1564748 1670867 1818687 1835195 1677806 1528732 1522025 1550636 1459381 1297423
33639A297423n0884J21560J66760N8902o9621r2735j5979M4623J1049m4889N752
$$ 1297423 1246539 1368099 1534859 1593761 1524140 1431405 1415426 1460049 1471098 1426209 1431961
33628A431961J54599K46114J77687J4948j15361j49994q3852M8106J43020R3738
$$ 1431961 1586560 1832674 2010361 2025309 1909948 1759954 1676102 1724208 1867228 1960966
33618A960966o3896j60765j04977M486K6329m5962j14517j12495m8067L6446R8985
$$ 1960966 1897070 1736305 1631328 1635814 1662143 1616181 1501664 1389169 1341102 1377548 1476533
33607A476533J19724J10562Q3584L0980k1986N478J31265K13826J01631j31751
$$ 1476533 1596257 1706819 1790403 1821383 1799397 1804875 1936140 2149966 2251597 2119846
33597B119846k42483j32104K6244L5259p0526j09056j4976R2373R1227J3389k2192
$$ 2119846 1877363 1745259 1771503 1806762 1736236 1627180 1612204 1704577 1795804 1809193 1787001
33586A787001J8191N0109J7892o204O2561J64476J60209L0463j03699j54065j38679
$$ 1787001 1805192 1855301 1873193 1866989 1929550 2094026 2254235 2284698 2180999 2026934 1888255
33575A888255q6493q811K8536l6922j17530o2608Q2676J09683j5632p7463M2240
$$ 1888255 1801762 1792951 1821487 1784565 1667035 1604427 1687103 1796786 1781154 1703691 1745931
33564A745931J78588J66037P5325K9320J0203K105Q8242K30828K01184o0729k59001
$$ 1745931 1924519 2090556 2165881 2195201 2205404 2207509 2295751 2526579 2727763 2667034 2408033
33553B408033j54180O8900J14260L3773O3176J85025J96277R1552N2556J22827
$$ 2408033 2253853 2322753 2437013 2470786 2533962 2718987 2915264 3006816 3059372 3182199
33543C182199J70589J27641M8450k229M0225K16862L95711L47285J18294N5582
$$ 3182199 3352788 3480429 3528879 3526650 3566875 3783737 4179448 4526733 4645027 4700609
33533D700609K72839M40237L44536K16958J38407l65202j528114k558645k428119
$$ 4700609 4973448 5413685 5758221 5975179 6113586 5748384 4220270 1661625 -766494
33524g66494j258131j61963K10544K07875K68029K96232J48222K7516Q6941J57479
$$ -766494 -2024625 -2186588 -1976044 -1768169 -1500140 -1203908 -1055686 -1028170 -941229 -783750
33514g83750J34545J73211K90181K41159O451p3775J16357K15373j3571k68068
$$ -783750 -649205 -475994 -185813 55346 61797 -11978 104379 319752 306181 38113
33504C8113k04323L9983J49504J26147J49826K12507J97020J14755K6850p6167
$$ 38113 -166210 -126227 23277 149424 299250 511757 708777 823532 850382 774215
33494G74215j44426n1056J45699J87747J2310j24914o8370J2839j7580k6115O7215
$$ 774215 629789 578733 724432 912179 924489 799575 731205 744044 726464 700349 767564
33483G67564P7678q5989j82612l4290J42460R8795k8113K1781J79330J84491J0346
$$ 767564 845242 759253 576641 542351 684811 783606 755493 777274 956604 1141095 1151441
33472A151441j45773j72514j07938o327P2597O3354J4422M7922J13595K1979j81892
$$ 1151441 1005668 833154 725216 718889 791486 854840 869262 917184 1030779 1052758 870866
33461H70866j92062N8863K22165P2735j27139q1526O6789N9515K056J14491K60282
$$ 870866 678804 737667 959832 1032567 905428 823902 890691 950206 952262 1066753 1327035
33450A327035J70373m3262n6287R8719R2838j07896j65745N8064K60034J62931
$$ 1327035 1497408 1454146 1397859 1496578 1589416 1481520 1315775 1373839 1633873 1796804
33440A796804q4134j60222k1524R7293L2939j15861j45162o528J39374J26915
$$ 1796804 1712670 1552448 1530924 1628217 1661156 1545295 1400133 1393605 1532979 1659894
33430A659894j6863j38575j65385j35846p2058K4987Q0194K4885m2621K1720J41667
$$ 1659894 1643031 1504456 1339071 1203225 1131167 1156154 1236348 1261233 1218612 1240332 1381999
33419A381999J17090j6897j7558J40685J90769J5388j60018j54356r2801j08379
$$ 1381999 1499089 1482192 1464634 1605319 1796088 1811476 1651458 1497102 1404301 1295922
33409A295922r3841L2686J03705n593j13870k7079J24494J13828r248m6688N059
$$ 1295922 1202081 1234767 1338472 1332879 1219009 1191930 1316424 1430252 1421004 1374316 1379375
33398A379375J1467k7820j6864K7116K8386K6894R6846J78384J69776R8262L9896
$$ 1379375 1390842 1363022 1346158 1373274 1401660 1428554 1525400 1703784 1873560 1971822 2011718
33387B011718k8568j41786k13672j48968l433R3094R2987K5637n9505q5508j4235
$$ 2011718 1983150 1841364 1627692 1478724 1475291 1568385 1661372 1687009 1627504 1541996 1527761
33376A527761M6367k8614j31037l3187K16692K99495J03083j10506j27056n3833
$$ 1527761 1574128 1545514 1414477 1381290 1597982 1897477 2000560 1890054 1762998 1709165
33366A709165l3010r261M3984o426j58457j71641K4146J41681m176j79575j37997
$$ 1709165 1676155 1666894 1710878 1704452 1545995 1374354 1398500 1540181 1536005 1356430 1218433
33355A218433j1326P43J106J17786J69372j4411k11100j36491Q1573J48043Q8485
$$ 1218433 1207107 1207850 1208956 1326742 1496114 1481703 1270603 1134112 1215685 1363728 1452213
33344A452213R2718R7285m3029j65259l9941J56760Q9091j39828j31040J31361
$$ 1452213 1544931 1642216 1599187 1433928 1393987 1550747 1639838 1500010 1368970 1500331
33334A500331K47362N9729j31457r4953J5084K492o2231l7550M7627R3764Q4103
$$ 1500331 1747693 1807422 1675965 1581012 1596096 1598588 1536357 1498807 1546434 1640198 1724301
33323A724301M1527j7049l5223L4075J20695J13386K9075k9260m4648p1379r7602
$$ 1724301 1765828 1748779 1713556 1747631 1868326 1981712 2010787 1981527 1936879 1865500 1767898
33312A767898p1735j6166K0296N6410J00403P6103l7079j06417l7136O3296O7519
$$ 1767898 1696163 1679997 1700293 1756703 1857106 1933209 1896130 1789713 1752577 1815873 1883392
33301A883392L5254O6261R2184Q086j18159j56014j09947m3760M6605J29518Q7734
$$ 1883392 1918646 1984907 2077091 2085177 1967018 1811004 1701057 1657297 1703902 1833420 1921154
33290A921154o1104j02245L6340J23747J5736p5034L3988J33647q566j92034j01727
$$ 1921154 1860050 1757805 1794145 1917892 1933628 1858594 1892582 2026229 2017663 1825629 1723902
33279A723902J41053J88496N0985R242P4454J9759j28032j19500J9371O751j53585
$$ 1723902 1864955 2053451 2104436 2113678 2188132 2207891 2079859 1960359 1979730 1986481 1832896
33268A832896j34488J25950K65912Q7550j18488n7320J12539P6823j30892k10615
$$ 1832896 1698408 1824358 2090270 2177820 2059332 2002012 2114551 2191374 2060482 1849867
33258A849867m8454J57247J85258M1984r3337r5066k0534K047k0369L6147J64391
$$ 1849867 1801413 1958660 2143918 2185902 2092565 1997499 1976965 1979012 1958643 1994790 2159181
33247B159181J66986m2261k43255j91110L4515J58877R5903k198j7799P108j490
$$ 2159181 2326167 2283906 2040651 1849541 1884056 2042933 2138836 2136638 2118839 2125947 2124457
33236B124457m8898r0531o4349M9750J53679J17249j4010m7943O1581J40109Q2213
$$ 2124457 2075559 1985028 1920679 1970429 2124108 2241357 2227347 2179404 2240985 2381094 2463307
33225B463307n022l6070p3522j13856l1109J30037J17934r9793k10579o2712O8633
$$ 2463307 2458285 2422215 2348693 2234837 2203728 2333765 2451699 2351906 2141327 2078615 2147248
33214B147248k1282r2596P8699K43042R8858j49717j22138J05753J73556L8328
$$ 2147248 2125966 2033370 2112069 2355111 2453969 2304252 2182114 2287867 2461423 2499751
33204B499751o5305r7390j74775j96969J8946L15570L47571J01734j21950j76776
$$ 2499751 2434446 2337056 2162281 1965312 1984258 2299828 2647399 2749133 2627183 2450407
33194B450407j51365q1263M9150J10816m1j00122J6438J83876J16062q8616j09165
$$ 2450407 2299042 2217779 2266929 2377745 2377704 2277582 2294020 2477896 2593958 2505342 2396177
33183B396177N1408J12781J6196n3104o3789j32959j88794n9982J47521J65262
$$ 2396177 2447585 2560366 2576562 2523458 2459669 2326710 2137916 2077934 2225455 2390717
33173B390717O006q3433m0566J2069P7743K04648K22908p892k20477p9018K23773
$$ 2390717 2396723 2313290 2272724 2284793 2362536 2567184 2790092 2782200 2561723 2482705 2706478
33162B706478K19501p6450k04999k5387J21364L6593q2814q5839p1848o9265L9287
$$ 2706478 2925979 2849529 2644530 2619143 2740507 2777100 2694286 2608447 2536599 2467334 2506621
33151B506621J90727J63386j0450o2511L9666N8214m3599l7860J01502J14460
$$ 2506621 2697348 2860734 2850284 2787773 2827439 2885653 2842054 2804194 2905696 3020156
33141C020156o7195j74307n0164J20471J39975L8368q1354j49034p1349J37095
$$ 3020156 2952961 2778654 2728490 2848961 2988936 3027304 2945950 2796916 2725567 2862662
33131B862662K20058N104k36312j43080J38152J72441m3827j13298N0892J11341
$$ 2862662 3082720 3087824 2851512 2708432 2846584 3019025 2975198 2861900 2912792 3024133
33121C024133n2056j38810K0600K01079K03934J13739K6108q5611j55851o0404
$$ 3024133 2972077 2833267 2853867 3054946 3258880 3372619 3398727 3313116 3157265 3096861
33111C096861R4779R1959n724J7302P3332p7057k82588j66131J83862K81050L8339
$$ 3096861 3191640 3283599 3277875 3295177 3368509 3291452 3008864 2842733 3026595 3307645 3345984
33100C345984j11620K1837J25021K1762l3927Q8472J21579p3966k22024j25076
$$ 3345984 3234364 3256201 3381222 3402984 3369057 3457529 3579108 3505142 3283118 3158042
33090C158042J2057q435o5158k8287J3145J4022P6716J52633M3556j82985k08608
$$ 3158042 3170099 3161664 3096506 3068219 3081364 3095386 3172102 3324735 3368291 3185306 2976698
33079B976698j640J13058K6358K868J45763K09836J00269N1606J37520J06170
$$ 2976698 2975058 3088116 3114474 3117342 3263105 3472941 3573210 3624816 3762336 3868506
33069C868506j06226j95994l1724J08926N0636n103P2261Q9187n5418j47207o4467
$$ 3868506 3762280 3566286 3534562 3643488 3694124 3689021 3761282 3850469 3795051 3647844 3583377
33058C583377J3690j3451q381M3895k2943j35366j5095K42873K06690j19113j94232
$$ 3583377 3597067 3583616 3575235 3619130 3596187 3460821 3445726 3688599 3895289 3776176 3581944
33047C581944J49109L62102P7479k85569k34954M5538J30979M8154M3675O7301
$$ 3581944 3731053 4093155 4170634 3885065 3650111 3695649 3826628 3874782 3918457 3985758
33037C985758l0842j12967j150J58072J47773M5268J7438J2869n8721j02180m3338
$$ 3985758 3954916 3841949 3840799 3998871 4146644 4191912 4209350 4222219 4163498 4061318 4017980
33026D017980K720k4038k586P8788L6813j31333j50599O4736K16861J00090q8558
$$ 4017980 4020700 3996662 3994076 4072864 4109677 3978344 3827745 3892481 4109342 4209432 4120874
33015D120874j12897k6150M2268R2176J03581K1448k6676J22678K74981R6706
$$ 4120874 4007977 3981827 4024095 4116271 4219852 4241300 4214624 4337302 4612283 4708989
33005D708989k50487k58466Q1613K22329j7251j62175N5424K41559P8862j31096
$$ 4708989 4458502 4200036 4281649 4503978 4486727 4324552 4379976 4621535 4700397 4569301
32995D569301n8583J01780Q1277J6218P0071O2186j25630k21127k5363K07773
$$ 4569301 4510718 4612498 4693775 4709993 4780064 4842250 4716620 4495493 4470130 4677903
32985D677903K02691P6133J8570k9213j06620o2088R7680J18724k8511n6088Q4108
$$ 4677903 4880594 4956727 4975297 4946084 4839464 4777376 4875056 4993780 4965269 4909181 4993289
32974D993289Q2067j10964j39629P2197J39105m3198o2903K06928K99022J0023
$$ 4993289 5075356 4964392 4824763 4896960 5036065 4992867 4929964 5136892 5435914 5445937
32964E445937j67552Q3327L15092J14199j75826r7131J49637J56972J4139k226
$$ 5445937 5278385 5361712 5676804 5791003 5615177 5518046 5667683 5824655 5838794 5836568
32954E836568K6945n0578o6452R8655J86882L3808q2749M0494J49597M8307k1302
$$ 5836568 5863513 5812935 5746483 5845138 6032020 6065828 5983079 6023573 6173170 6221477 6200175
32943F200175J03930J52839k8865j32523J9020J16612o851k2894K05303K55139
$$ 6200175 6304105 6456944 6428079 6295556 6314576 6431188 6424337 6401443 6606746 6861885
32933F861885o9971k76476k6965K30009N4906k11806r9110J75579J82239L4103
$$ 6861885 6791914 6515438 6488473 6718482 6773388 6561582 6462472 6638051 6820290 6854393
32923F854393L9460Q9993j2421q4610M1244J18326k4911r2768J13475K69276J21262
$$ 6854393 6893853 6983846 6971425 6886815 6928059 7046385 7021474 6928706 7042181 7311457 7432719
32912G432719m5238K3769R3833j4190l7596J45868J95025j8840r5700J30227K46341
$$ 7432719 7387481 7411250 7505083 7490893 7453297 7599165 7794190 7775350 7679650 7809877 8056218
32901H056218P5663K7887K30049J98243j70360k44736J79742L87516O838k85967
$$ 8056218 8131881 8159768 8389817 8588060 8417700 8172964 8352706 8740222 8747060 8461093
32891H461093r99L01289J30626l5961J99865L11260n6263k40775K05884N41232
$$ 8461093 8460094 8761383 8892009 8856048 9055913 9367173 9310910 9070135 9276019 9817251
32881I817251J48107k59469Q7737N77084L24520k31998j87868K21497K23229k6816
$$ 9817251 9965358 9705889 9793626 10370710 10695230 10463232 10275364 10496861 10720090 10693274
32871A0693274Q1937L34072J74256j24778K378K96420K26770K9384J02213P9699
$$ 10693274 10775211 11109283 11283539 11158761 11161139 11457559 11684329 11713713 11815926 11895625
32861A1895625l80740o64794k08109L65971K95798K0434K40109N33640K38850
$$ 11895625 11514885 10850091 10641982 11007953 11303751 11324185 11564294 12097934 12336784
32852A2336784j69961K2847L60034J21579k07195J36916O37980M15200r9384L1002
$$ 12336784 12166823 12189670 12549704 12671283 12464088 12601004 13238984 13654184 13554800 13585802
32842A3585802N12501M67273R4578J30703L65629K21434N5983L84845O33621J88702
$$ 13585802 14098303 14565576 14660154 14790857 15156486 15377920 15433903 15818748 16452369 16641071
32832A6641071k29527J81690P02346M04185l3314L72859R34149N76776l5483K50302
$$ 16641071 16411544 16593234 17295580 17699765 17666451 18039310 18973459 19550235 19514752 19765054
32822A9765054Q23301M99019j33303J54859Q21969O48588J61483N21963J107739
$$ 19765054 20588355 21087374 20954071 21108930 21930899 22579487 22740970 23262933 24370672
32813B4370672P54061K21909P08487J158328N9210j307872o99209J090599J523214
$$ 24370672 25124733 25346642 26055129 27213457 27272667 25964795 25265586 26356185 27879399
32804B7879399O65566O23808J454887J430741P37735J054134J967838J694122
$$ 27879399 28544965 29168773 30623660 32054401 32792136 33846270 35814108 37508230
32796C7508230Q10932J295460K486270K224774J279689K048801L631601L262284
$$ 37508230 38319162 39614622 42100892 44325666 45605355 47654156 51285757 54548041
32788E4548041J925617K900387N260514N120354L102013L550344O145065O205457
$$ 54548041 56473658 59374045 64634559 69754913 72856926 76407270 82552335 88757792
32780H8757792M220306O075994J1631989J3111467R119899R466517J8024468J9730153
$$ 88757792 92978098 99054092 110686081 123797548 132917447 142383964 160408432 180138585
32772A80138585m005256n0286222r3759216j08800109q7615862m1929858M663513
$$ 180138585 176133329 125847107 32087891 -76712218 -164328080 -206257938 -201594425
32765b01594425K9834467K8357374J5567128R485216J1742224J2142933P247674
$$ -201594425 -171759958 -143402584 -127835456 -118350240 -106608016 -94465083 -87217409
32758h7217409L809507N339927O797107M653025K550432L520272M578581L013145
$$ -87217409 -83407902 -78067975 -71270868 -66617843 -64067411 -60547139 -55968558 -52955413
32750e2955413J378758K174681L182336K071502P79385J476420K448224J661131
$$ -52955413 -51576655 -49401974 -46219638 -44148136 -43368751 -41892331 -39444107 -37782976
32742c7782976O23588J195659J982657J254176L33396Q72055J616588R69126J11334
$$ -37782976 -37159388 -35963729 -33981072 -32726896 -32393500 -31521445 -29904857 -28935731 -28824397
32733b8824397N98193J318457P57194k1670M99555J322202Q79750J2205K71363
$$ -28824397 -28226204 -26907747 -26150553 -26172223 -25672668 -24350466 -23470716 -23458511 -23187148
32724b3187148J007376P72977N8198J24867N55207L24350l8651L96481R45816
$$ -23187148 -22179772 -21406795 -21348597 -21223730 -20668523 -20344173 -20382824 -19986343 -19040527
32715a9040527N84354j9361K18677P28651M78029o837K26823O18547K45647k58924
$$ -19040527 -18456173 -18475534 -18256857 -17528206 -17050177 -17057014 -16830191 -16211644 -15965997 -16224921
32705a6224921J02593P01088M32427j96290p9391L88326J83956k90376J495O81732
$$ -16224921 -16122328 -15421240 -14988813 -15185103 -15264494 -14876168 -14692212 -14982588 -14981093 -14299361
32695a4299361O39751Q2348L4047L86681K60384j99136j30903L49634M03152N1482
$$ -14299361 -13659610 -13577262 -13543215 -13156534 -12896150 -13095286 -13226189 -12876555 -12473403 -12421921
32685a2421921K195K41637K10357J7000J48965L65098J45740j83633j2163L46375
$$ -12421921 -12419726 -12178089 -11967732 -11950732 -11801767 -11436669 -11290929 -11474562 -11486725 -11140350
32675a1140350K29310r3064M2357L75706K27021j53605l0042M30772M76323J21257
$$ -11140350 -10911040 -11004104 -10961747 -10586041 -10359020 -10512625 -10542667 -10111895 -9635572 -9514315
32665i514315k3962O0857m6304k06526M920L36314K52571l5176K7730K66457J45200
$$ -9514315 -9538277 -9477420 -9523724 -9730250 -9725330 -9389016 -9136445 -9171621 -9143891 -8877434 -8732234
32654h732234j59639j00408J78843J49613p2718j3589J91743J01633j08937n0
$$ -8732234 -8891873 -8992281 -8813438 -8663825 -8736543 -8750132 -8558389 -8456756 -8565693 -8565743
32644h565743K20097R6971j32556K6244L36201K49836n4723l6485J82436J28886
$$ -8565743 -8345646 -8248675 -8381231 -8354987 -8018786 -7768950 -7823673 -7860158 -7677722 -7548836
32634g548836n6833N4942K67396J38706j03331l288J73065o0126l77724j75889
$$ -7548836 -7605669 -7550727 -7283331 -7144625 -7247956 -7251244 -7078179 -7138305 -7516029 -7691918
32624g691918K59441K23037j24437q2980K72195K67027r7243j92661N7745J41665
$$ -7691918 -7432477 -7209440 -7333877 -7416857 -7144662 -6877635 -6974878 -7167539 -7109794 -6968129
32614f968129j6087k1427J09815L1320j13422P3502L55695K01035j73041j22189
$$ -6968129 -6984216 -7005643 -6895828 -6864508 -6977930 -6904428 -6548733 -6347698 -6520739 -6642928
32604f642928K28405J87455k24111l03368O9243K80399J18742J8498J17134O9267
$$ -6642928 -6414523 -6227068 -6451179 -6754547 -6685304 -6404905 -6286163 -6267665 -6150531 -6081264
32594f081264j25451o6477J98521J89113q1751j06486J43245J65458q6905j09824
$$ -6081264 -6206715 -6273192 -6074671 -5885558 -5967309 -6073795 -5930550 -5765092 -5851997 -5961821
32584e961821J60999K02451r8929k15637N0734K31706O4613r4146J5813J50658
$$ -5961821 -5800822 -5598371 -5697300 -5912937 -5862203 -5630497 -5565884 -5660030 -5644217 -5493559
32574e493559J11433N8061P9998L8851m1025J1287P6471q5052k69139r1479K58114
$$ -5493559 -5382126 -5324065 -5244067 -5205216 -5246241 -5234954 -5158483 -5243535 -5512674 -5604153 -5346039
32563e346039K58064j7989k3116K49639K50819q6800j95976J00540K85716P4652
$$ -5346039 -5087975 -5105964 -5129080 -4879441 -4628622 -4715422 -4911398 -4810858 -4525142 -4450490
32553d450490j64769j44240n2989j2299J32910K81760P8507l51603m13468n404
$$ -4450490 -4615259 -4759499 -4812488 -4824787 -4691877 -4410117 -4331610 -4683213 -5096681 -5102085
32543e102085K76909J28881l7769O9826J40015m6740j62816K5658K07838J13327
$$ -5102085 -4825176 -4696295 -4734064 -4664238 -4524223 -4570963 -4733779 -4708121 -4500283 -4386956
32533d386956l5829k1770j6699j26516j02803J43434K74938J11837m0501L0187
$$ -4386956 -4422785 -4444555 -4461254 -4587770 -4690573 -4547139 -4272201 -4160364 -4200865 -4170678
32523d170678P2226q3521j46921P8475K70248J24908j27101j48114k9304j0646
$$ -4170678 -4098452 -4181973 -4328894 -4250419 -3980171 -3855263 -3982364 -4130478 -4159782 -4170428
32513d170428l7241K8478Q4759K4834j4957O0310Q5371l0608q5237L7526J18251
$$ -4170428 -4207669 -4179191 -4094432 -4069598 -4084555 -4024245 -3938874 -3969482 -4054719 -4017193 -3898942
32502c898942L829r8403j5595N8667n8043j66803l8867J59551J48981j130l6046
$$ -3898942 -3895113 -3993516 -4009111 -3950444 -4008487 -4175290 -4214157 -4054606 -3905625 -3906755 -3942801
32491c942801N3985Q6185J8767m2725n5469m0463J4530R1417J04190M1859O231
$$ -3942801 -3888816 -3802631 -3783864 -3826589 -3882058 -3922521 -3907991 -3816574 -3712384 -3670525 -3664294
32480c664294K9778L1709N432L2188P1128J84r5970J823K20252K06136j03479
$$ -3664294 -3634516 -3602807 -3597375 -3565187 -3494059 -3493875 -3589845 -3588022 -3367770 -3161634 -3265113
32469c265113l04641j24276J62409J79722O695l7916O6250P2766q2938j95381
$$ -3265113 -3569754 -3694030 -3531621 -3351899 -3345204 -3383120 -3316870 -3244104 -3327042 -3522423
32459c522423j29568L629M8933J2097q7M8438Q8675P0706M9012Q0410R3363j671
$$ -3522423 -3651991 -3648362 -3599429 -3587332 -3587419 -3538981 -3450306 -3379600 -3330588 -3250178 -3156815 -3158486
32447c158486j00112k0733J42403Q2022k04226l09995m4667K10995R5621j44607
$$ -3158486 -3258598 -3279331 -3136928 -3054906 -3259132 -3569127 -3613794 -3402799 -3307178 -3451785
32437c451785q8932J44632J41891p2011j14046N9846J18370j9536p4312N7049
$$ -3451785 -3540717 -3396085 -3254194 -3326205 -3440251 -3380405 -3262035 -3281571 -3355883 -3298834
32427c298834J63308J61108J90531K18781L2659k91519l78123j26560J28702J42960
$$ -3298834 -3135526 -2974418 -2783887 -2565106 -2532447 -2823966 -3202089 -3328649 -3199947 -3056987
32417c056987M5271m325m5978r4299m9530N6015N6137l3069k5869P1888P1587
$$ -3056987 -3011716 -3016041 -3062019 -3156318 -3205848 -3149833 -3093696 -3126765 -3152634 -3080746 -3009159
32406c009159j3813J2860J14228M4264j67715k05552q514J22016M8568j3451O0545
$$ -3009159 -3022972 -3010112 -2895884 -2851620 -3019335 -3224887 -3233401 -3111385 -3062817 -3076268 -3015723
32395c015723J10535O2868O7797J43222J03566l8179l3190J17014R7067j50104
$$ -3015723 -2905188 -2842320 -2774523 -2631301 -2527735 -2565914 -2599104 -2482090 -2385023 -2535127
32385b535127k62014o3642J26145L4480j46462j46384m0059q997j4206L1252N5934
$$ -2535127 -2797141 -2860783 -2734638 -2700158 -2846620 -2993004 -3033063 -3042060 -3056266 -3025014 -2969080
32374b969080K4521O2168J88719K05822K8693j40617j28680j4716P9963J44063
$$ -2969080 -2944559 -2882391 -2693672 -2487850 -2459157 -2599774 -2728454 -2743170 -2663207 -2519144
32364b519144J28917l5241j99990j24864R0982R6175j25179k03072k0538R5841
$$ -2519144 -2390227 -2425468 -2625458 -2750322 -2659340 -2563165 -2688344 -2891416 -2911954 -2816113
32354b816113j3888o5275J03104K00677K9508j22371R055J88747J06323r7265
$$ -2816113 -2830001 -2895276 -2792172 -2591495 -2561987 -2684358 -2675303 -2486556 -2380233 -2477498
32344b477498j24750k2692O470R505J10980J79866M6446j43964j40803J2072Q7512
$$ -2477498 -2602248 -2624940 -2618470 -2608965 -2497985 -2318119 -2271673 -2415637 -2556440 -2544368 -2456856
32333b456856L1848m6187q2854m1999J18270K73368J68758j70796l49234j51084
$$ -2456856 -2425008 -2471195 -2554049 -2596048 -2477778 -2204410 -2035652 -2206448 -2555682 -2706766
32323b706766J15831J09082k7426J8911J67087J17530r3364j46656K8668J62962
$$ -2706766 -2590935 -2481853 -2509279 -2490368 -2323281 -2205751 -2299115 -2445771 -2417103 -2254141
32313b254141P7355j00062j73460j04060K6482J11043P4167m5347r5725J2275
$$ -2254141 -2176786 -2276848 -2450308 -2554368 -2527886 -2416843 -2342676 -2388023 -2483748 -2471473
32303b471473J80731K45001J52121k5972j70106j80362o9483J1180l9814j04105
$$ -2471473 -2290742 -2045741 -1893620 -1919592 -2089698 -2270060 -2339543 -2328363 -2368177 -2472282
32293b472282l0135Q7222N5723n5564j4218J54805J94386O2091j9544J0204l2330
$$ -2472282 -2502417 -2415195 -2359472 -2415036 -2429254 -2274449 -2080063 -2017972 -2037516 -2027312 -2059642
32282b059642j65854j63234J2299R6470j3929q5815J0525Q2821R465m0410L3736
$$ -2059642 -2225496 -2388730 -2376431 -2279961 -2293890 -2379705 -2369180 -2286359 -2276894 -2317304 -2283568
32271b283568O8301q106p866J26288J57451o405j08323p114O0062o6294j58658
$$ -2283568 -2215267 -2223373 -2231239 -2104951 -1947500 -1953905 -2062228 -2069342 -2009280 -2075574 -2234232
32260b234232l3794J03776N6314j1661O6024J14553k1596j31474j0067J52224
$$ -2234232 -2268026 -2164250 -2107936 -2119597 -2053573 -1939020 -1960616 -2092090 -2102157 -1949933
32250a949933J14336N130L4126Q2624l8728j93871j55118R83O5587L6439n713
$$ -1949933 -1835597 -1830467 -1796341 -1713717 -1752445 -1946316 -2101434 -2100451 -2034864 -1998425 -2004138
32239b004138r9096k05054j10743J88642L39069J55840n4393j3140Q6429J4122
$$ -2004138 -2103234 -2308288 -2419031 -2230389 -1891320 -1735480 -1789873 -1803013 -1716584 -1702462
32229a702462m6420R0309J70523l8630k46260j29358N5170o2179k46029o9860
$$ -1702462 -1748882 -1658573 -1488050 -1526680 -1772940 -1902298 -1847128 -1909307 -2155336 -2225196
32219b225196K55382J97533j55891k32359M7236J78824k6412j70936j1185J66871
$$ -2225196 -1969814 -1772281 -1928172 -2160531 -2113295 -1934471 -1960883 -2131819 -2143004 -1976133
32209a976133R6319o8558r6089j0396P7983J37464J18728m780q1393K4077J28631
$$ -1976133 -1879814 -1948372 -2044461 -2054857 -1976874 -1839410 -1720682 -1725462 -1806855 -1782778 -1654147
32198a654147j4079k34934j62989J31642K01974n2854k36270j12177P3624P6207
$$ -1654147 -1668226 -1903160 -2066149 -1934507 -1732533 -1785387 -2021657 -2133834 -2060210 -1984003
32188a984003J2412M8279J01073N5375k4351o4230j02138j18915j1120J69162
$$ -1984003 -1971591 -1923312 -1822239 -1766864 -1791215 -1855445 -1957583 -2076498 -2087618 -1918456
32178a918456K12845Q0467l1720k3310j3173o3376o7948Q1J5359l6930o545J19269
$$ -1918456 -1705611 -1625144 -1656864 -1680174 -1693347 -1756723 -1824671 -1824590 -1809231 -1846161 -1852706 -1733437
32166a733437J43112j663j13745n5638L7087J7989m0335l0011m379l1514l8294
$$ -1733437 -1590325 -1591988 -1705733 -1761371 -1724284 -1706295 -1746630 -1776641 -1781020 -1812534 -1850828
32155a850828L7113Q8373m317j65931k06095m9868J88701L22033K53654P1773
$$ -1850828 -1813715 -1725342 -1729659 -1895590 -2101685 -2151553 -1962852 -1640819 -1387165 -1315392
32145a315392l9338k2905o226p0940j10919m4251Q568n0154p5997N5968J50255
$$ -1315392 -1354730 -1377635 -1383861 -1454801 -1565720 -1609971 -1601403 -1651557 -1727554 -1671586 -1521331
32134a521331k0529k71748k38265L8398J73004N4078m0712K6083N6842m6907q5909
$$ -1521331 -1541860 -1813608 -2051873 -2013475 -1840471 -1786393 -1827105 -1801022 -1744180 -1791087 -1876996
32123a876996L9958J24785M1058k2879P2242J42976K4287j10031m8051Q8559P3981
$$ -1876996 -1837038 -1712253 -1671195 -1694074 -1621832 -1478856 -1454569 -1564600 -1612651 -1524092 -1450111
32112a450111k2839J2325J33724J07538p9208j87309j01920J8303J1739p2554
$$ -1450111 -1472950 -1460625 -1326901 -1219363 -1298571 -1485880 -1587800 -1569497 -1557758 -1630312
32102a630312j01364m5266L8940J07852J36009R2752o817o8250j5942Q3931Q2193
$$ -1630312 -1731676 -1776942 -1738002 -1630150 -1494141 -1401389 -1408206 -1476456 -1492398 -1408467 -1326274
32091a326274m6558j43717q2162M2913O0258p725k96Q3442O8756p5859j51091
$$ -1326274 -1372832 -1516549 -1598711 -1555798 -1495540 -1503265 -1503561 -1420119 -1351363 -1427222 -1578313
32080a578313n7885K9223l0025j00221l5495M2446j8711r0193J6627J81514J58198
$$ -1578313 -1636198 -1606975 -1637000 -1737221 -1772716 -1730270 -1748981 -1839174 -1822547 -1641033 -1482835
32069a482835Q857K913J44469J62917k3222j74996j20307K1509P7972L9332l5220
$$ -1482835 -1473978 -1471065 -1326596 -1163679 -1186901 -1361897 -1482204 -1460695 -1382723 -1343391 -1378611
32058a378611j13740j36657n5167M4026L3660l4937p324R7066J15082L7222J7392
$$ -1378611 -1492351 -1629008 -1684175 -1640149 -1606489 -1641426 -1648750 -1551684 -1436602 -1399380 -1381988
32047a381988P3450N0566p3572j20077j8992O9201L4533j9264L927L0817q663
$$ -1381988 -1308538 -1257972 -1331544 -1451621 -1470613 -1401412 -1366879 -1386143 -1382216 -1351399 -1360062
32036a360062m6878k7693r419k0822P113P4382O1277n6738j24445m3866P5798
$$ -1360062 -1406940 -1434633 -1444052 -1464874 -1457761 -1383379 -1322102 -1378840 -1503285 -1547151 -1471353
32025a471353J11614R9123R7540N4872n6787j25372o7101J8374J0586k9516J6437
$$ -1471353 -1359739 -1260616 -1163076 -1108204 -1164991 -1290363 -1357464 -1339090 -1328504 -1358020 -1341583
32014a341583Q8816K6748j47439k01568l425K62781K93408N0013j64452p9473
$$ -1341583 -1252767 -1226019 -1373458 -1575026 -1578451 -1315670 -1022262 -972249 -1136701 -1216174
32004a216174J74131K20916m2730k95403k43971j9121O7537j1538l8418M6215
$$ -1216174 -1042043 -821127 -863857 -1159260 -1403231 -1422352 -1354815 -1366353 -1404771 -1358556
31994a358556P2152l6614j36375j09452j7418M9926R3743J15485P0360k6469p9348
$$ -1358556 -1286404 -1323018 -1459393 -1568845 -1586263 -1536337 -1442594 -1327109 -1256749 -1283218 -1362566
31983a362566m5557J8051N8876P3783N6204P000k2496k861Q273j7238Q746J14873
$$ -1362566 -1408123 -1390072 -1331196 -1257413 -1201209 -1194209 -1216705 -1219566 -1211293 -1228531 -1219785 -1104912
31971a104912J35071m1966k14551j30633Q9907J17576n7832j24332J8266J06362
$$ -1104912 -969841 -1011807 -1226358 -1356991 -1267084 -1149508 -1207340 -1331672 -1313406 -1207044
31961a207044j5966j40356p0837N8653M8977l5317k4276O0858Q3950L1013j3928
$$ -1207044 -1223010 -1363366 -1434203 -1375550 -1326573 -1361890 -1386166 -1325308 -1241358 -1210345 -1224273
31950a224273k7429l2352j4614K7349L6321p668l6503j2606M777k2033l6194J875
$$ -1224273 -1251702 -1284054 -1298668 -1271319 -1234998 -1242666 -1279169 -1291775 -1286998 -1309031 -1345225 -1343350
31938a343350L9411K8257q725n1130j04005j15708j2438J44034J84903P7421j3236
$$ -1343350 -1303939 -1275682 -1284407 -1335537 -1439542 -1555250 -1567688 -1423654 -1238751 -1161330 -1174566
31927a174566K5001R1008N4431l7011n1594J6896M8138l4155j63514j97666p4601
$$ -1174566 -1149565 -1058557 -1004126 -1041137 -1092731 -1075835 -1027697 -1061852 -1225366 -1423032 -1497633
31916a497633R2699J28313K7259l0014L3549M8075j09818k53344j50934Q3793
$$ -1497633 -1404934 -1276621 -1249362 -1279376 -1245827 -1197752 -1307570 -1560914 -1711848 -1628055
31906a628055J59108O5871M1145J22806J03859n5701j37494n5135Q083m6792o9964
$$ -1628055 -1468947 -1403076 -1361931 -1239125 -1135266 -1190967 -1328461 -1383596 -1375513 -1422305 -1492269
31895a492269K1499P7530J6382l315J13967J96905R7738n5750r0713n1642m5722
$$ -1492269 -1470770 -1393240 -1376858 -1380173 -1266206 -1069301 -971563 -1027313 -1118026 -1169668 -1215390
31884a215390l5728K5211M9869p922k5038O5450J15845J6494r0418n0452M1192
$$ -1215390 -1251118 -1225907 -1176038 -1183960 -1208998 -1143548 -1027703 -1011209 -1101627 -1152079 -1110887
31873a110887L3461p472M5248J12042M7956q1560j16647q1921r7316j08888K1491
$$ -1110887 -1077426 -1084898 -1039650 -927608 -879652 -961212 -1077859 -1159780 -1257096 -1365984 -1344493
31862a344493K16395K42738O2347j14218j35719o2171Q504O0914O6793l7332j95990
$$ -1344493 -1128098 -885360 -823013 -937231 -1072950 -1135121 -1126617 -1065703 -998910 -1036242 -1232232
31851a232232k18304k9055J75432J54919m8663j55617k3980J63287J69357M1817
$$ -1232232 -1450536 -1479591 -1304159 -1149240 -1197903 -1353520 -1377500 -1214213 -1044856 -1003039
31841a003039J0310R9877Q5153j16210k58131j31784J03747J79191J14408Q5448
$$ -1003039 -992729 -892852 -807699 -923909 -1182040 -1313824 -1210077 -1030886 -916478 -831030
31831h31030N7874j03942k70286j82403P5960J47585k7672j18382L6256J75671
$$ -831030 -773156 -877098 -1147384 -1329787 -1253827 -1106242 -1133914 -1252296 -1216040 -1040369
31821a040369Q2284q0237r6888l8643m0937l3101O9606J47440Q1524l2194p3562
$$ -1040369 -958085 -1038322 -1135210 -1173853 -1214790 -1247891 -1178285 -1030845 -949321 -981515 -1055077
31810a055077q8769j10838l3336J38360J67380n0184k45690j56282Q3334J88148
$$ -1055077 -1143846 -1254684 -1288020 -1149660 -982280 -1032464 -1278154 -1434436 -1351102 -1162954
31800a162954J42249R5851N3401m0460r0735k4071Q340j02693j49970N8661K80225
$$ -1162954 -1020705 -924854 -871453 -911913 -1002648 -1026719 -1018379 -1121072 -1271042 -1212381 -932156
31789i32156J50754k01971k93816j308K72021J95477q1224k21383j23380O4039
$$ -932156 -781402 -983373 -1277189 -1278497 -1006476 -810999 -892223 -1113606 -1236986 -1172947
31779a172947J52727O0668j16135j58341K7140K49618K64792Q7653q5982j63892
$$ -1172947 -1020220 -959552 -1075687 -1234028 -1206888 -957270 -692478 -604825 -690807 -854699
31769h54699j62025m9474J50343K09654m1944l66333l59581k9790K09197J45374
$$ -854699 -1016724 -1066198 -915855 -706201 -748145 -1114478 -1474059 -1503849 -1294652 -1149278
31759a149278J2271L6793R6690P533j35605j36398k7436Q525n9431q5247K0137
$$ -1149278 -1137007 -1100214 -1003524 -995991 -1131596 -1267994 -1295430 -1286905 -1346336 -1431583 -1411446
31748a411446J71984K22844J16945n7808j49945j02670j6702l902k6503J7458
$$ -1411446 -1239462 -1016618 -899673 -957481 -1107426 -1210096 -1226798 -1230700 -1257203 -1239745
31738a239745R6394Q1060l2509r6784l7904M0401L1951j7398k205Q2581J43561
$$ -1239745 -1143351 -1062291 -1094800 -1191584 -1229488 -1189087 -1157136 -1174534 -1176739 -1094158 -950597
31727i50597J04982j6394j26977j43383q4636m6373n8293l9282N2463J21816Q1691
$$ -950597 -845615 -862009 -988986 -1132369 -1217005 -1263378 -1321671 -1360953 -1308490 -1186674 -1104983
31716a104983k402l2140m1485r2173r9628M4111K33702K48517P1245r0683j05408
$$ -1104983 -1107385 -1139525 -1181010 -1273183 -1372811 -1328700 -1094998 -846481 -775236 -865919 -971327
31705i71327m6469n345L2724P7469O7917j4719r4684j08967o2399L1486J40818
$$ -971327 -1017796 -1023141 -990417 -912948 -845031 -859750 -954434 -1063401 -1125800 -1094314 -953496
31694i53496J58579J6734j41920r5975J18149K06002K7059j91031j73909K7917
$$ -953496 -794917 -778183 -920103 -1016078 -897929 -691927 -664868 -855899 -1029808 -1001891
31684a001891J47003O8712p3151j21111o9674j3489j2963l7698j7697N2975Q3074
$$ -1001891 -854888 -786176 -859327 -980438 -1050112 -1063601 -1076564 -1114262 -1131959 -1078984 -995910
31673i95910J593j13355j10922K4080J40737J26210L7435j6291k0834j7688k669
$$ -995910 -994317 -1107672 -1218594 -1194514 -1053777 -927567 -890132 -906423 -927257 -944945 -947614
31662i47614M4905Q3787N2666k9342p7853n5616j1447R43n473J2833N1877O3175
$$ -947614 -902709 -818922 -766256 -795598 -873451 -929067 -940514 -939571 -945044 -932211 -880334 -817159
31650h17159L5768K1185M0338K1902q6273j87127j41274N155N9723j4249k4348
$$ -817159 -781391 -760206 -719868 -697966 -784239 -971366 -1112640 -1107485 -1047762 -1062011 -1086359
31639a086359J22561K18063O3948j74481j80121L8624J62968M3899j12113r6299
$$ -1086359 -963798 -745735 -681787 -856268 -1036389 -997765 -834797 -790898 -903011 -999310
31629i99310J5485M5575j6871p5492j06121j24261p9626O2895J97540J73379m47
$$ -999310 -983825 -938250 -955121 -1030613 -1136734 -1260995 -1340621 -1277726 -1080186 -906807 -907254
31618i07254j46256j17373N2044J93226J69473J2851r8937l8458J09096J49289
$$ -907254 -1053510 -1170883 -1118839 -925613 -756140 -743289 -842226 -880684 -771588 -622299
31608f22299L6098p9537p8095k3755k8096p7370q8163m8122k500L3853N9537M3441
$$ -622299 -586201 -665738 -743833 -767588 -795684 -873054 -961217 -1009339 -1011839 -977986 -918449 -875008
31596h75008j2433l2589J4692L4938m1167j03646j7657J26749J15829m9999j37158
$$ -875008 -887441 -920030 -905338 -870400 -911567 -1015213 -1032870 -906121 -790292 -840291 -977449
31585i77449l9235O5768J9300o6411k3897P5735N8889l6528k6048R3628J27719
$$ -977449 -1016684 -950916 -931616 -998027 -1021924 -946189 -887300 -923828 -949876 -856248 -728529
31574g28529K801j22011j10632j9603N0094Q8166Q9779J3848q8226p9519L0728
$$ -728529 -725728 -847739 -958371 -977974 -927880 -839714 -749935 -736087 -824313 -903832 -873104
31563h73104N1558p3151j20235O3991K66564J97806o7632k08200j21699K676L1724
$$ -873104 -821546 -894697 -1014932 -950941 -684377 -486571 -554203 -762403 -884102 -881426 -849702
31552h49702K7559L4970o876q8775q9039K5134J31326J40257R1397K6754o4896
$$ -849702 -822143 -787173 -794049 -882824 -971863 -946729 -815403 -675146 -583749 -556995 -621891
31541f21891j42116j15870m346O9035O4772O3187R0953P7373J0677k9647k6755
$$ -621891 -764007 -879877 -884223 -815188 -750416 -687229 -596276 -518903 -508226 -537873 -564628
31530e64628m9632j01991j15548j00991j20246j12488L0770K09732J91471j7045
$$ -564628 -614260 -716251 -831799 -932790 -1053036 -1165524 -1134754 -925022 -733551 -750596
31520g50596j37579l4704J05032J02966K9246o142l9540q6355m0574R5265J20363
$$ -750596 -888175 -922879 -817847 -714881 -685635 -691777 -731317 -817672 -858246 -762981 -642618
31509f42618m5978j84244j04164N9326Q1393j8339q5020r3014r0447l7810R2490
$$ -642618 -688596 -872840 -977004 -917678 -836285 -854624 -939644 -1032658 -1123105 -1160915 -1068425
31498a068425J88854J51348M4360l7537r9651j27445m2258R4721P7100r6005j41318
$$ -1068425 -879571 -728223 -683863 -721400 -821051 -948496 -990754 -896033 -818933 -914938 -1056256
31487a056256M8198J74967J9377j68603q3863J22581J29796p608k5882L9241l1794
$$ -1056256 -1008058 -833091 -813714 -982317 -1066180 -943599 -813803 -821411 -847293 -808052 -839846
31476h39846j64011j00567R1472J04433n1068m4755J82554K84064P0626j90396
$$ -839846 -1003857 -1104424 -1012952 -908519 -959587 -1004342 -821788 -537724 -467098 -657494
31466f57494j98353k5703O5800j6753j59561j98206m3340K09477L04662J26376
$$ -657494 -855847 -881550 -815750 -832503 -992064 -1190270 -1233610 -1024133 -719471 -593095
31456e93095q9564n9773J18827J29626m7243j26618j5574N1047o2877j74862j08874
$$ -593095 -682659 -742432 -623605 -493979 -541222 -667840 -683414 -632367 -695244 -870106 -978980
31445i78980M3134J14527R1571L8475j3296k4310K9983N9638l6397j65249j43889
$$ -978980 -935846 -821319 -729748 -691273 -704569 -728879 -698896 -639258 -675655 -840904 -984793
31434i84793L254P8244K5230l2322m5897o6382m5008R2146J99557P6049j44879
$$ -984793 -981539 -903295 -878065 -910387 -956284 -1022666 -1067674 -975528 -775971 -699922 -844801
31423h44801j41699N6295R7656p9733j34923N7527J64852r696j56162J0057K51046
$$ -844801 -986500 -930205 -832549 -912282 -1047205 -989678 -824826 -834522 -990684 -980627 -729581
31412g29581K12788J603n1722M0736J3385j50574k10723r5305J6475K3093J7680
$$ -729581 -516793 -515190 -566912 -526176 -512791 -663365 -874088 -969393 -952918 -929825 -912145
31401i12145O0078P3445J3261l4702J9833J42026J95616P0685j78749l31176k28837
$$ -912145 -852067 -778622 -765361 -800063 -780230 -638204 -442588 -371903 -550652 -881828 -1110665
31390a110665j513R0640K5230J2176J06496J13057l1783r4495O1707K02722Q4998
$$ -1110665 -1112178 -1021538 -996308 -984132 -877636 -764579 -796362 -890857 -829150 -626428 -541430
31379e41430j44712j86182l9299O6253N8664N0785O4469N918j12939j57365p1527
$$ -541430 -686142 -872324 -911623 -845370 -786706 -735921 -671452 -665534 -778473 -935838 -1007365
31368a007365O2364J39596R4903o6250j87707n8134K61299L82943Q7214l00675
$$ -1007365 -945001 -805405 -710502 -776752 -964459 -1022593 -761294 -378351 -291137 -591812
31358e91812l19143k4046J19798n2306j99011m5679K03536K13647J0494j19009
$$ -591812 -910955 -935001 -815203 -867509 -1066520 -1112199 -908663 -695016 -684522 -803531
31348h03531o0949M0703P1409Q5679J31364J22892o162j40852j21079M477K7903
$$ -803531 -864480 -823777 -752368 -666689 -535325 -412433 -418595 -559447 -680526 -676049 -648146
31337f48146r1133j32579M1733K26960J55083q4614j65894j7296R9747L1199n3454
$$ -648146 -739279 -871858 -830125 -603165 -448082 -532696 -698590 -715886 -616139 -584940 -638394
31326f38394P263R5172M4658p4176j04564o8502q0304j17896p3300N1649J58116
$$ -638394 -631131 -535959 -491301 -565477 -670041 -738543 -818847 -936743 -1010043 -958394 -800278
31315h00278J87421J27580k0088j69712j66641J85J26172O3386o6839p6683J2531
$$ -800278 -612857 -485277 -505365 -675077 -841718 -841533 -715361 -651975 -718814 -795497 -782966
31304g82966O3518N8921N8862L9148l5281p7079j0189N9905Q518p1214j2678J21366
$$ -782966 -719448 -660527 -601665 -562517 -597798 -674877 -685066 -625161 -616643 -687857 -700535 -579169
31292e79169J19858l1950j25834n1337O4048O2947n6037j84073k10162q6645J09050
$$ -579169 -459311 -491261 -617095 -668432 -604384 -541437 -597474 -781547 -991709 -1078354 -969304
31281i69304K11668J60958Q1747O9414K6419j27939k34549j15053J00102J37887
$$ -969304 -757636 -596678 -514931 -445517 -419098 -547037 -781586 -896639 -796537 -658650
31271f58650J078p3773k9935l6692j18581q3692J02725K00792Q2882n5979l9722
$$ -658650 -657572 -731345 -761280 -797972 -916553 -1000245 -897520 -696728 -613846 -669825 -709547
31260g09547P312p0349j42885r406K28946K84406R6736j09338j53977q3074j6550
$$ -709547 -702235 -772584 -915469 -924875 -695929 -411523 -314787 -424125 -578102 -661176 -677726
31249f77726O526j571k6997l1922K4239J08497J29603N3899m6821p8812k1390
$$ -677726 -671200 -672771 -699768 -731690 -707451 -598954 -469351 -415452 -462273 -541085 -562475
31238e62475O1233P4870j8894j40335j49929j4638J25758J21471J356q2589o4236
$$ -562475 -501242 -426372 -445266 -585601 -735530 -750168 -624410 -502939 -501583 -584172 -648408
31227f48408j0205K6272O4469Q4068r5j69011k32858o4609J85693K64132J47585
$$ -648408 -658613 -632341 -567872 -483804 -483899 -652910 -885768 -950377 -764684 -500552 -352967
31216c52967L0551J66o2120k06575k64703j10086J00513J31945Q248n2338K2237
$$ -352967 -322416 -322250 -384370 -590945 -855648 -965734 -865221 -733276 -725028 -777366 -755129
31205g55129Q8413M6492k6557m0182k3869l4553m9186j5907O0623J22916J04202
$$ -755129 -666716 -620224 -646781 -686963 -710832 -745385 -794571 -810478 -749855 -626939 -522737
31194e22737j6960j46806j20987P5635K08633P3277j87609k52258p5152P2755
$$ -522737 -539697 -686503 -807490 -731855 -523222 -449945 -637554 -889812 -964964 -892209
31184h92209L4698l5210J0613P0841K5611k1105O6949J91711J60848j2846j46120
$$ -892209 -857511 -892721 -882108 -811267 -785656 -806761 -739812 -548101 -387253 -400099 -546219
31173e46219j46601p3761R46M8388M7553K1086N0158J47017J84242O2464j25063
$$ -546219 -692820 -766581 -765635 -717247 -669694 -648608 -598450 -451433 -267191 -204727 -329790
31162c29790k08941j53252m1940O2509J30587J15457J4607q1412j04378r7110
$$ -329790 -538731 -691983 -733923 -671414 -540827 -425370 -410763 -492175 -596553 -693663
31152f93663r9105n7397L6506N6255n8739j43160l7157J35344J45149L1529L7466
$$ -693663 -792768 -850165 -813659 -757404 -816143 -959303 -996460 -861116 -715967 -684438 -646972
31141f46972J97152K60665Q3819j43235j71222k9794M7386m9164j76627j36910
$$ -646972 -449820 -189155 -105336 -248571 -419793 -449587 -402201 -451365 -627992 -764902
31131g64902O4444K05642J20553o5830q9034P0756J39072l7144k30166j65969
$$ -764902 -700458 -494816 -374263 -440093 -529127 -458371 -319299 -356443 -586609 -752578
31121g52578N7100J36125L3842j8318N2166M8067j23731k53365j37524J16523
$$ -752578 -695478 -559353 -525511 -543829 -491663 -443596 -567327 -820692 -958216 -841693
31111h41693K45906J56332l3178j64248j50344l51J70800K13334R3774p0876j57287
$$ -841693 -595787 -439455 -472633 -636881 -787225 -787576 -616776 -403442 -309668 -380544 -537831
31100e37831j43301o0530N1635J13384M9491p6311r3977L1686J16600J5909j50073
$$ -537831 -681132 -741662 -690027 -576643 -527152 -603463 -697440 -665754 -549154 -533245 -683318
31089f83318j66002k8465Q1926Q5598P6581J05662P9233n0998j50292p9402Q0350
$$ -683318 -849320 -877785 -795859 -710261 -633680 -528018 -448785 -499783 -650075 -729477 -649127
31078f49127J22054j403j19384p7708P8935J87416J45562j5516j65523j65558
$$ -649127 -527073 -528476 -647860 -725568 -646633 -459217 -313655 -329171 -494694 -660252
31068f60252o252J35353Q0404j00871j64563m9617L0726n6360j32191o099J85934
$$ -660252 -666504 -531151 -450747 -551618 -716181 -765798 -735072 -791432 -923623 -929722 -743788
31057g43788J88866L6442l2397K1573K2062o8744r2132k164O3934N9403Q1034
$$ -743788 -554922 -518480 -550877 -529304 -507242 -575986 -668118 -670282 -606348 -546945 -465911
31046d65911J06550j0398k12382k31104j8260J40982Q3281L052N8631Q7531m8461
$$ -465911 -359361 -369759 -582141 -813245 -831505 -690523 -607242 -604190 -545559 -458028 -506489
31035e06489j61958p5866L2675m3339j31919K4078K69100K44882k6835j81227
$$ -506489 -668447 -744313 -711638 -754977 -886896 -862818 -593718 -348836 -375671 -556898
31025e56898p4450O9443O8450m169m4873o1072m4259M8441J50550J39584M8608
$$ -556898 -631348 -561905 -493455 -497624 -542497 -603569 -647828 -599387 -448837 -309253 -260645
31014b60645K3105P0405N5003o0995j66604j82605j18683J5302J76237K21223
$$ -260645 -237540 -167135 -112132 -173127 -339731 -522336 -641019 -625717 -449480 -228257
31004b28257P0290j20485j45533l8493K9041L6782O0794L6910j25187k69275j60149
$$ -228257 -157967 -278452 -423985 -462478 -433437 -396655 -335861 -298951 -424138 -693413 -853562
30993h53562J11590K20571R2384l1485k1025m975m7498k4323Q7815J16063P54
$$ -853562 -741972 -521401 -429017 -460502 -481527 -486502 -534000 -558323 -470508 -354445 -353691
30982c53691q3538l3646J8206l4014q9925m9677J4761J0542l9157q6825j10046
$$ -353691 -437229 -470875 -452669 -486683 -576608 -626285 -611524 -600982 -640139 -726964 -837010
30971h37010m1212J39675K43661P4090k06936k36124l274J22575l370q7223N8659
$$ -837010 -878222 -738547 -494886 -420796 -627732 -863856 -867130 -744555 -747925 -835148 -776489
30960g76489J81415N0952j22516n5355J32316J53603K9154k3634J0339p481o4256
$$ -776489 -595074 -544122 -666638 -721993 -589677 -436074 -406920 -430554 -420215 -427696 -491952
30949d91952n3689k2589o9904j08740r249J25337J05994j3920m1418J0319k4474
$$ -491952 -545641 -568230 -638134 -746874 -756123 -630786 -524792 -538712 -580130 -569811 -594285
30938e94285j25984j11408K6095R8319N2363L8762J13090J36671M4610k6352K5721
$$ -594285 -720269 -831677 -805582 -707263 -654900 -616138 -503048 -366377 -321767 -348119 -322398
30927c22398J02027P8734j1459p6092j09801j43049j44696p3141L6189J05516
$$ -322398 -220371 -141637 -153096 -229188 -338989 -482038 -626734 -699875 -663686 -558170
30917e58170J00936M9700N673P471L4794J7839o6630j39094j17024l3639J7267
$$ -558170 -457234 -407534 -401861 -394390 -359596 -341757 -408387 -547481 -664505 -698144 -680877
30906f80877J7529K0392M6019P5655J15932J64110J41873j1455j94770k31051
$$ -680877 -663348 -642956 -596937 -521282 -405350 -241240 -99367 -110822 -305592 -536643
30896e36643j07687M566K241k0774M3336J31807J14960J00q3314o3055Q876M8151
$$ -536643 -644330 -639764 -637523 -658297 -614961 -483154 -368194 -368094 -451408 -514463 -505587 -457436
30884d57436J5282p9534j66133j31047N0435K07151J36459q9282j47153R6164
$$ -457436 -442154 -521688 -687821 -818868 -768433 -561282 -424823 -514105 -661258 -565094
30874e65094L31623J96964j88045l47983r9984K21171K65646J04447n556l2199
$$ -565094 -233471 -36507 -224552 -572535 -672519 -451348 -185702 -81255 -86811 -119010
30864a19010r1655j50208r7417j0963n7543j82117j70473m2J31061J19832N4001
$$ -119010 -210665 -360873 -458290 -469253 -526796 -708913 -879386 -879428 -748367 -628535 -574534
30853e74534n367q0009j05907J9522J92831J85952J7205n2544M2435O4816q5049
$$ -574534 -579901 -659910 -765817 -746295 -553464 -367512 -350307 -402851 -360416 -295600 -380649
30842c80649j69111l9996O6744o4127k21701j00413J75117K28909J9684j21936
$$ -380649 -549760 -589756 -523012 -587139 -808840 -909253 -734136 -505227 -485543 -607479
30832f07479j4319J50672J46169P57j28112j62228r9038L6285J47921J04711r0978
$$ -607479 -621798 -471126 -324957 -324200 -452312 -614540 -713578 -677293 -529372 -424661 -515639
30821e15639k51929k03601J1282J85161J80782O3787q509J0072K4222k5756n6089
$$ -515639 -767568 -971169 -959887 -774726 -593944 -530157 -538666 -528594 -504372 -530128 -586217
30810e86217J0960Q2883K7373r2092r5717J8040O5442j7263q1831l5896J9325
$$ -586217 -575257 -492374 -465001 -557093 -652810 -634770 -569328 -586591 -668422 -704318 -684993
30799f84993N973P535P5878J04403K4640n9820o6183o6821r9944o1064O1563P7941
$$ -684993 -679020 -671485 -595607 -491204 -466564 -526384 -592567 -659388 -759332 -820396 -758833 -680892
30787f80892p8347j53562M4917K88205K49106R170r4532k841M6339l1812o4182
$$ -680892 -759239 -912801 -867884 -579679 -330573 -321403 -415935 -418776 -372437 -404249 -468431
30776d68431K7366R6915N2802r540j6478k3021n3848m8568j3410l0689q1214n2173
$$ -468431 -441065 -344150 -291348 -300888 -317366 -340387 -394235 -442803 -456213 -486902 -568116 -620289
30764f20289M8929Q8010M0826K8296Q0010P9428J90k1087P0139J30481M7765q8352
$$ -620289 -571360 -483350 -442524 -414228 -334218 -254790 -254600 -275687 -205548 -75067 -27302 -115654
30752a15654j43746j12907m7931L1740P3937m675j57655k01115o7829P6646P7707
$$ -115654 -259400 -372307 -420238 -388498 -314561 -319236 -476891 -678006 -745835 -669189 -591482
30741e91482N759L311N4322N3738M092r584K4763M9045M6791M0961K0046l8026
$$ -591482 -585723 -582412 -528090 -474352 -470260 -479844 -455081 -406036 -359245 -318284 -298238 -336264
30729c36264j01713j20704q9369k4765N9963J14821P0724m1443q6857j7651M0015
$$ -336264 -437977 -558681 -648050 -672815 -612852 -498031 -427307 -468750 -555607 -573258 -533243
30718e33243j3032p8982k9407O6382N3742m4172p4292k0565o558m0272P432J29056
$$ -533243 -546275 -625257 -654664 -588282 -534540 -578712 -653004 -673569 -680127 -720399 -712967 -583911
30706e83911J31649l5744j41912k5446J23473N8968j11828j02213P4200J29428
$$ -583911 -452262 -488006 -629918 -655364 -531891 -472923 -584751 -686964 -612764 -483336
30696d83336n709o4321R2101K21977R9014j14746j39270j6663N112r9317j20257
$$ -483336 -489045 -553366 -461265 -239288 -140274 -255020 -394290 -410953 -405841 -505158 -625415
30685f25415J8598J52159J40816K4420j00550j66793j07579O4636J70324O0587
$$ -625415 -606817 -454658 -313842 -289422 -389972 -556765 -664344 -599708 -429384 -368797
30675c68797j23827j25433K6108O5474n3788q8716M6876J20079J45j01278j2487
$$ -368797 -492624 -618057 -591949 -526475 -580263 -668979 -622103 -502024 -501879 -603157 -615644
30664f15644R2744K4788p2412m018Q7886l0359k31297j98872M8119J80812P6101
$$ -615644 -522900 -498112 -570524 -574542 -486656 -517015 -748312 -947184 -899065 -718253 -642152
30653f42152m4059j2563O1350M4939m170K0806J05320J64936J36146q515k03021
$$ -642152 -686211 -698774 -637424 -592485 -596655 -575849 -470529 -305593 -169447 -177962 -380983
30642c80983k59225o1535K19051K87018J01499r2957j24552p9856q9174j26587
$$ -380983 -640208 -701743 -482692 -195674 -94175 -187132 -311684 -391540 -480714 -607301
30632f07301j10511m8437J2461O7342J11465J04225L1627o1009j22161j21522
$$ -607301 -717812 -766249 -753788 -686446 -574981 -470756 -439129 -500138 -622299 -743821
30622g43821m2606P1640J06117J5483o7992l848J27276J32597J3583l7339M5825
$$ -743821 -786427 -714787 -608670 -593187 -661179 -665027 -537751 -405154 -391571 -428910 -383085
30611c83085J00673J1188j06869r6366R240N8519k632q5207q2616J2258R3365
$$ -383085 -282412 -271224 -378093 -474459 -465219 -406700 -409332 -494539 -577155 -564897 -471532
30600d71532M6835r6146j59543m4506J19147J50746P0005K4548M0425L0898J554
$$ -471532 -424697 -520843 -680386 -724892 -605745 -454999 -384994 -360446 -320021 -289123 -287569
30589b87569L0048O2175l6180k07082k23420m1772J01773M4701o6295k4071J28711
$$ -287569 -257521 -195346 -231526 -438608 -662028 -703800 -602027 -557326 -623621 -647692 -518981
30578e18981J90114Q3591q2749j69552j25406q580O0775K8311j3315L8240J08528
$$ -518981 -328867 -245276 -328025 -497577 -622983 -631563 -570788 -542477 -555792 -517552 -409024
30567d09024M9162r4730j22997m994N9637l2270j24603o6369O9929J55165J93497
$$ -409024 -359862 -454592 -577589 -582583 -522946 -555216 -679819 -746188 -676259 -521094 -327597
30556c27597K10691J40676k1209j21442o8396P121k4991p3754j7223M9425j4831
$$ -327597 -116906 23770 2561 -118881 -187277 -180156 -205147 -278901 -296124 -246699 -261530
30545b61530j10243m3793J20892J40486q531q6502J8206J13127J6053j62591j97042
$$ -261530 -371773 -415566 -294674 -154188 -162719 -249221 -231015 -117888 -101835 -264426 -461468
30534d61468o9535M3959M5748J8098M5241O1580m0496k07022k43326p0240J40153
$$ -461468 -531003 -487044 -441296 -423198 -377957 -316377 -356873 -563895 -807221 -877461 -737308
30523g37308J75874O2806r80M7118O3677l8976j36541q5220O6416J64729J48404
$$ -737308 -561434 -498628 -499608 -452490 -388813 -427789 -564330 -649550 -583134 -418405 -270001
30512b70001N8326n8688j52183j48817l2476J06908J73367J52999O2364q3180
$$ -270001 -211675 -270363 -422546 -571363 -603839 -496931 -323564 -170565 -108201 -191381
30502a91381j91488j23898R4118K26858J22177p2947j36426q4076p5584j15605
$$ -191381 -382869 -506767 -412649 -185791 -63614 -136561 -272987 -357063 -432647 -548252
30492e48252p2940N5252J24884Q5340L7810M0180L5368l211k2663j2045j5621
$$ -548252 -621192 -565940 -441056 -355716 -317906 -277726 -242358 -245569 -268232 -280277 -295898
30481b95898j1008N4989R6848l4983k61024k86363k1953K25507J61377p7382j37975
$$ -295898 -306906 -251917 -155069 -190052 -451076 -737439 -759392 -533885 -372508 -449890 -587865
30470e87865L0372J40267K1588j47021j29591M5226J71846J49156M6624m0646
$$ -587865 -557493 -417226 -395638 -542659 -672250 -627024 -455178 -306022 -259398 -300044
30460c00044q3984q9678o5619k7313R457M1794O3112N6441K8010J0894P061k1172
$$ -300044 -384028 -473706 -539325 -566638 -557181 -515387 -452275 -395834 -367824 -356930 -349869 -371041
30448c71041o0548k3870J01592J63423L8473j34094r9044J30848K46778P5608
$$ -371041 -431589 -455459 -353867 -190444 -151971 -286065 -385109 -254261 -7483 68125
30438F8125j65903j93826n6460j323o5678o0103P5346J63586Q7820k8647l9394
$$ 68125 -97778 -291604 -348064 -349387 -415065 -475168 -399822 -236236 -148416 -177063 -216457
30427b16457M479k2682j04020j23311n3014K0791K7746j7149n0456j5837Q1473
$$ -216457 -211978 -234660 -338680 -461991 -515005 -494214 -466468 -483617 -534073 -549910 -468437
30416d68437J41605N4822j31437k06326m0761K14429K80273Q7818j35050j42922
$$ -468437 -326832 -272010 -403447 -609773 -650534 -436105 -155832 -68014 -203064 -345986
30406c45986L8268J66921R5748o5479j29310q5115o5004r4839m8295J00965J59613
$$ -345986 -307718 -140797 -45049 -110528 -239838 -324953 -389957 -484796 -533091 -432126 -272513
30395b72513j0753k33212k27933j0515J42727J04102L3748P4222J36278R0626
$$ -272513 -283266 -516478 -744411 -754926 -612199 -508097 -474349 -400127 -263849 -173223
30385a73223j1527m4637j0058j863n1960j09350j15093l8294R2783J64188Q3049
$$ -173223 -184750 -229387 -239445 -241308 -293268 -402618 -517711 -556005 -463222 -299034 -215985
30374b15985o1858q3103K1410M2549r9297j86007l0349J99589K03641q077j39478
$$ -215985 -277843 -360946 -339536 -296987 -396284 -582291 -612640 -413051 -209410 -217487 -356965
30363c56965m7807P4161P836j75553k17690j4949K39338K66448K8244k06717j74734
$$ -356965 -404772 -330611 -322775 -498328 -716018 -730967 -491629 -225181 -196937 -403654 -578388
30352e78388M6377J37639j7852j69346o9726J58657K08617L4541j02623k0442
$$ -578388 -532011 -394372 -412224 -581570 -651296 -492639 -284022 -249481 -352104 -372546
30342c72546J52106J81881L4894j15756j24058l2885P259n6144j12837o3855J5412
$$ -372546 -220440 -38559 -3665 -119421 -243479 -276364 -269105 -325249 -438086 -501941 -486529
30331d86529L07m9403L0529J92346J81423n1281j94631k0575K36801K06605o7921
$$ -486529 -486222 -535625 -505096 -312750 -131327 -182608 -377239 -397814 -161013 45592 -22329
30320b2329k10171o9142J17359J23864J0709o8643q8018p9131l6554Q980j8378
$$ -22329 -232500 -301642 -184283 -60419 -49710 -118353 -206371 -285502 -322056 -313076 -331454
30309c31454r0176o5280Q6231J97028J32183k8423j29922j36054q5753J2059J18237
$$ -331454 -421630 -486910 -400679 -203651 -71468 -99891 -229813 -365867 -451620 -439561 -321324
30298c21324J14889l5104j62568q3634J26777K07813N5599j44801j65494j0598
$$ -321324 -206435 -241539 -404107 -487741 -360964 -153151 -97552 -242353 -407847 -418445
30288d18445J16510O8067q8869j67966q3174O2251J16846O7397K3281L6361L5826
$$ -418445 -301935 -233868 -322737 -490703 -573877 -511626 -394780 -327383 -304102 -267741 -231915
30277b31915k9879q8802n8781J0776J3107m0885l7161N2828J10678M0576q5053
$$ -231915 -261794 -350596 -409377 -398601 -385494 -426379 -463540 -410712 -300034 -259458 -344511
30266c44511j18693k9841O8887P3081M8n6354l5780M0587R7761O8568l9800j29341
$$ -344511 -463204 -493045 -424158 -351077 -351029 -407383 -443163 -402576 -304815 -236247 -276047 -405388
30254d05388j03264O191N5325k6731j29650j06037K3848J06520P0941q69k4092
$$ -405388 -508652 -502461 -447136 -473867 -603517 -709554 -685706 -579186 -508245 -509114 -533206
30243e33206j4764o290K6161R0391J17516O1529j0128j2893K3726J3882m0431
$$ -533206 -547970 -554260 -528099 -437708 -320192 -258663 -268791 -281684 -257958 -244076 -284507
30232b84507o5632m9850m9496o6209l1555N7272R4071K0276n9318j5072R7801
$$ -284507 -350139 -399989 -449485 -515694 -547249 -489977 -395906 -375630 -434948 -450020 -352219
30221c52219R0905q0052k12698j17832J05925J94662Q2359k9046O622P2066J1491
$$ -352219 -261314 -341366 -554064 -671896 -565971 -371309 -288950 -317996 -311374 -239308 -227817
30210b27817j02361j02210j1059J6566l1516l3998J7687J9203r300N8150J73251
$$ -227817 -330178 -432388 -443447 -426881 -458397 -492395 -474708 -455505 -464805 -406655 -233404
30199b33404J29673p0356j55021j1449J14253K4602j01137k9987J17758Q4245
$$ -233404 -103731 -174087 -329108 -340557 -226304 -201702 -302839 -332826 -215068 -130823
30189a30823q6426j48499o8642j2068m60P9856J71351R2528r7806j22178O5229
$$ -130823 -217249 -365748 -434390 -446458 -446918 -367062 -195711 -103183 -200989 -323167 -257938
30178b57938J68859R479j92745j60590L7621J23576M811j48076j52132r986J18357
$$ -257938 -89079 -79600 -272345 -432935 -395314 -271738 -266927 -415003 -567135 -577121 -458764
30167d58764Q7950o0137j19842J4422J67275J15444o2187r1688N7108J16341l6011
$$ -458764 -370814 -430951 -550793 -536371 -369096 -253652 -315839 -407527 -350419 -234078 -270089
30156b70089j66302o3697J22647J29157k7558j28115r4781l3103n447K5649N7467
$$ -270089 -436391 -500088 -377441 -248284 -275842 -403957 -498738 -531841 -537288 -511639 -454172
30145d54172K9990m9261r6898p4458j8889L7588R0432J17604Q8302J3536n7612
$$ -454172 -424182 -473443 -570341 -644799 -663688 -626100 -535668 -418064 -329762 -316226 -373838
30134c73838p6587j5103J01379J68326R4813n5406j19914o5593k9011p6909q7009
$$ -373838 -450425 -465528 -364149 -195823 -101010 -156416 -276330 -341923 -370934 -447843 -534852
30123e34852L0011J46623J06791k4238o7561P30N8533M9242J6118k6632r2414
$$ -534852 -504841 -358218 -251427 -275665 -343226 -342496 -283963 -234721 -218603 -245235 -337649
30112c37649j23551n1032O5558J01512N2682K0619L4039K9000o912j7097k6j0343
$$ -337649 -461200 -512232 -446674 -345162 -292480 -271861 -237822 -208822 -215734 -232831 -232857 -243200
30100b43200l4816o274N2128L6050o7736j45275j13232l974J09556J64133J01087
$$ -243200 -278016 -284290 -232162 -196112 -263848 -409123 -522355 -526329 -416773 -252640 -151553
30089a51553n6123j44560m1473J20327J05735o2713j23680J7426J53489J25010
$$ -151553 -207676 -352236 -393709 -273382 -167647 -230360 -354040 -336614 -183125 -58115
30079e8115M6786M9854M0520r1436k27143k03672q6350k9167k368R6452J81400
$$ -58115 -11329 38525 79045 -12391 -239534 -443206 -529556 -558723 -561091 -464639 -283239
30068b83239J06601k6593P544J60225J46231r0718k60110j63678K7209P1924k364
$$ -283239 -176638 -203231 -195687 -35462 110769 20051 -240059 -403737 -376528 -304604 -306968
30057c06968l6640j5312r101R391R0752J50220P3669q5825j82980j88209j61172
$$ -306968 -343608 -358920 -368021 -358630 -267878 -117658 -43989 -129814 -312794 -501003 -662175
30046f62175q5849Q0681K33766J99078j186j40932r2300K0247K8251n4537r8238
$$ -662175 -748024 -667343 -433577 -234499 -235685 -376617 -468917 -448670 -420419 -474956 -573194
30035e73194m9500L2387P5600O2082K4775J5264M4961N4039o842p0080j7643J28133
$$ -573194 -622694 -590307 -514707 -452625 -427850 -412586 -367625 -313586 -320428 -390508 -408151 -280018
30023b80018J89411O6307j12496j59798p4804q456k9732n5043j4425L5898K3341
$$ -280018 -90607 -24300 -136796 -296594 -371398 -379854 -409586 -464629 -479054 -443156 -419815
30012d19815r458K4471R6299Q0996n0945j62936j31752j6968M1391L4534O4173
$$ -419815 -429273 -404802 -308503 -227507 -278452 -441388 -573140 -590108 -548717 -514183 -450010
30001d50010J34678J29728K9595j7929O7926J50306Q7644l9865q1259p3179j39738
$$ -450010 -315332 -185604 -156009 -173938 -106012 44294 131938 92073 10814 -62365 -202103
29990b02103k18207j32503Q1832J81304P8274l7128j0434O4865N2365j3549m9640
$$ -202103 -420310 -552813 -470981 -289677 -211403 -248531 -258965 -194100 -141735 -155284 -204924
29979b04924p8578j13383n3051J30936K44598J11793j32245k00620n5168O3988
$$ -204924 -283502 -396885 -449936 -319000 -74402 37391 -94854 -295474 -350642 -286654
29969b86654L88j28927j48948o5237M6M664J5633P5382J20430O2781p3170j48764
$$ -286654 -286266 -415193 -564141 -629378 -629332 -624668 -609035 -533653 -413223 -350442 -423612 -572376
29957e72376p9046M4416P1075l001n0251j2990L9176N3811N3939L9651q811j5775
$$ -572376 -651422 -607006 -535931 -538932 -589183 -602173 -562997 -509186 -455247 -415596 -424407 -440182
29945d40182J04732K19171Q1051k49690l80297j34644J64559J88778Q0190J16260
$$ -440182 -335450 -116279 -35228 -284918 -665215 -799859 -635300 -446522 -366332 -250072
29935b50072J74816k4937l21533k67217J41728L93755K10001r0413j37897j8333
$$ -250072 -75256 -100193 -421726 -688943 -547215 -153460 56541 -33872 -171769 -190102
29925a90102Q313l8506J4095J35552J52886M2171p2344j18654j00679k0193P0902
$$ -190102 -181789 -220295 -206200 -70648 82238 124409 52065 -66589 -167268 -187461 -116559
29914a16559M7846j07685k14527j27756M1281R3499K2518l7105m2180m4055l8279
$$ -116559 -68713 -176398 -390925 -518681 -477400 -383901 -361383 -398488 -440668 -484723 -523002
29903e23002Q839L9514j8862r9488p8663K7081J00685J16483J26115R4833n1977
$$ -523002 -514163 -474649 -493511 -592999 -671662 -644581 -543896 -427413 -301298 -206465 -258442
29892b58442k23887k13326L265J91504J65599K0214m2499M868L1969k3340q1012
$$ -258442 -482329 -695655 -692390 -500886 -335287 -315073 -357572 -352704 -320735 -344075 -425087
29881d25087n8169K4639R8505J29982J09485J7030j26258j99999q5828J38098
$$ -425087 -483256 -458617 -360112 -230130 -120645 -103615 -229873 -429872 -515700 -377602
29871c77602K15016K3304k13702j87366P0402K21513R9357p6873o5048M5956L3570
$$ -377602 -162586 -139282 -352984 -540350 -469948 -248435 -149078 -225951 -290999 -245043 -211473
29860b11473p7951q4606L8165J07587M9958l561K7728N0744J621l6742k0718n2454
$$ -211473 -289424 -374030 -335865 -228278 -178320 -181881 -154153 -103409 -101788 -138530 -159248 -211702
29848b11702j61808j65720N7025K88152K16538r3620k46300n6603J97459J78713
$$ -211702 -373510 -539230 -482205 -194053 22485 -71135 -317435 -374038 -176579 2134
29838B134n7292j96696j23371j4433j3821l6473L8185J50462J59157N8469k8881
$$ 2134 -55158 -251854 -375225 -389658 -403479 -439952 -401767 -251305 -92148 -33679 -62560
29827f2560l0772R245K6358K232n4122j11919j09564k1904O2593K3139j14986
$$ -62560 -93332 -84087 -57729 -55497 -109619 -221538 -331102 -353006 -290413 -267274 -382260
29816c82260j77494o3602J11244J66494Q8489J9504M3879Q8270N4366l5715q6539
$$ -382260 -559754 -623356 -512112 -345618 -257129 -237625 -193746 -105476 -51110 -86825 -173364
29805a73364p3856o3029q6787q3945j126J01686J16963L6283m2526m9349r494
$$ -173364 -247220 -310249 -397036 -480981 -482107 -380421 -263458 -227175 -269701 -319050 -328544
29794c28544K4684L0577k751n7798m6031R4377K30252J29219j86374l59897j44330
$$ -328544 -303860 -273283 -276034 -333832 -379863 -285486 -55234 73985 -112389 -472286 -616616
29783f16616K18412K91886L2526j84036j09895Q0587J14914l478q4594m4670M4869
$$ -616616 -398204 -106318 -73792 -257828 -367723 -287136 -172222 -175700 -260294 -304964 -260095
29772b60095J00934R5361L9686j5343k2225j7353p1971j40601r2626N8435J19595
$$ -260095 -159161 -63800 -24114 -39457 -61682 -79035 -151006 -291607 -384233 -325798 -206203
29761b06203K984j16100n8468Q3099R3439m3254j49803j21611j8726O9916J05409
$$ -206203 -203219 -319319 -377787 -294688 -201249 -244503 -394306 -515917 -534643 -464727 -359318
$$ [...]
##END NTUPLES=NMR SPECTRUM
##END=
