##TITLE=31Pdec_LY-2Dix-40.24
 CD3CN, 24 sc
 4.03.2021
##JCAMPDX= 6.0         $$ Bruker NMR JCAMP-DX V2.0
##DATA TYPE= NMR SPECTRUM
##DATA CLASS= NTUPLES
##ORIGIN= UXNMR, Bruker Analytische Messtechnik GmbH
##OWNER= root
$$ XWIN-NMR		Version 3.5
$$ Thu Mar  4 11:39:38 2021 Russian Standard Time (UT+4h)  she@DPX200
##.OBSERVE FREQUENCY= 81.013821
##.OBSERVE NUCLEUS= ^31P
##.ACQUISITION MODE= SIMULTANEOUS
##.ACQUISITION SCHEME= undefined
##.AVERAGES= 24
##.DIGITISER RES= 16
##SPECTROMETER/DATA SYSTEM= spect
##.PULSE SEQUENCE= zgpg30
##.SOLVENT NAME= CDCl3
##.SHIFT REFERENCE= (INTERNAL, CDCl3, 0, 248.564)
##AUDIT TRAIL= $$ (NUMBER, WHEN, WHO, WHERE, WHAT)
$$ ##TITLE= Audit trail, XWIN-NMR		Version 3.5
$$ ##JCAMPDX= 5.01
$$ ##ORIGIN= Bruker BioSpin GmbH
$$ ##OWNER= she
$$ F:/spectra/data/she/nmr/P31/1/pdata/1/auditp.txt
$$ ##AUDIT TRAIL=  $$ (NUMBER, WHEN, WHO, WHERE, WHAT)
(   1,<2021-03-04 11:38:12.21 +0400>,<she>,<DPX200>,
      <created by zg, POWCHK disabled, PULCHK disabled
       configuration hash MD5:
       00 E9 B6 7A A2 85 ED C7 34 08 36 98 17 FE 4E 26
       data hash MD5: 32K
       13 B4 5A 44 BB 5F 3C 91 4C 52 BC 2F 41 AD 77 1D>)
(   2,<2021-03-04 11:38:15.65 +0400>,<she>,<DPX200>,
      <Start of raw data processing
       efp BC_mod = 2 LB = 1 FT_mod = 6 PKNL = 1 PHC0 = -2962.15 PHC1 = 33.40086 SI = 64K 
       data hash MD5: 64K
       13 A3 CF 0B 71 B2 13 3B 73 2B 86 65 0F 1E 2C 7B>)
(   3,<2021-03-04 11:38:58.31 +0400>,<she>,<DPX200>,
      <pk PHC0 = -25.87545 PHC1 = 36.20002 
       data hash MD5: 64K
       AD 6D 6B FA 03 99 2F 7F FC 88 32 A2 CE 98 40 E3>)
(   4,<2021-03-04 11:39:01.76 +0400>,<she>,<DPX200>,
      <abs ABSG = 5 
       data hash MD5: 64K
       0E 5D 31 18 94 E4 56 06 27 C3 DA 69 FC B9 A6 94>)
$$ ##END=
$$ 
$$ hash MD5
$$ 07 F5 BC 91 68 FD 89 E7 23 AC D3 BF 86 DF AF 9C
##$RELAX= 
##$RELAX= 
##$RELAX= 
##$RELAX= 
##$RELAX= 
##$RELAX= 
##$RELAX= 
##$RELAX= 
$$ Bruker specific parameters
$$ --------------------------
##$DU= <F:/spectra>
##$EXPNO= 1
##$NAME= <P31>
##$PROCNO= 1
##$TYPE= <nmr>
##$USER= <she>
##$AMP= (0..31)
100 100 100 100 100 100 100 100 100 100 100 100 100 100 100 100 100 100 
100 100 100 100 100 100 100 100 100 100 100 100 100 100 
##$AQSEQ= 0
##$AQ_mod= 1
##$AUNM= <au_zg>
##$AUTOPOS= <>
##$BF1= 81.014009
##$BF2= 200.13
##$BF3= 200.13
##$BF4= 200.13
##$BF5= 200.13
##$BF6= 200.13
##$BF7= 200.13
##$BF8= 200.13
##$BYTORDA= 1
##$CFDGTYP= 0
##$CFRGTYP= 5
##$CHEMSTR= <none>
##$CNST= (0..31)
1 1 145 1 1 1 1 1 1 1 1 1 1 1 1 1 1 1 1 1 1 1 1 1 1 1 1 1 1 1 1 1 
##$CPDPRG= <waltz16>
##$CPDPRG1= <>
##$CPDPRG2= <waltz16>
##$CPDPRG3= <>
##$CPDPRG4= <mlev>
##$CPDPRG5= <mlev>
##$CPDPRG6= <mlev>
##$CPDPRG7= <mlev>
##$CPDPRG8= <mlev>
##$CPDPRGB= <>
##$CPDPRGT= <>
##$D= (0..31)
0 1 0 0 0 0 0 0 0 0 0 0.03 2e-05 3e-06 0 0 0 0 0 0 0 0 0 0 0 0 0 0 0 0 
0 0 
##$DATE= 1614843491
##$DBL= (0..7)
120 120 120 11 120 120 24 19 
##$DBP= (0..7)
150 150 150 150 150 150 150 150 
##$DBP07= 0
##$DBPNAM0= <>
##$DBPNAM1= <>
$$ [...]
##$SUBNAM3= <"">
##$SUBNAM4= <"">
##$SUBNAM5= <"">
##$SUBNAM6= <"">
##$SUBNAM7= <"">
##$SUBNAM8= <"">
##$SUBNAM9= <"">
##$SW= 501.771253377433
##$SWIBOX= (0..15)
0 1 3 0 0 0 0 0 0 0 0 0 0 0 0 0 
##$SW_h= 40650.406504065
##$TD= 32768
##$TD0= 1
##$TE= 0
##$TE2= 300
##$TE3= 300
##$TEG= 300
##$TL= (0..7)
0 120 53 12 22 120 120 120 
##$TP= (0..7)
150 150 150 150 150 150 150 150 
##$TP07= 0
##$TPNAME0= <>
##$TPNAME1= <>
##$TPNAME2= <>
##$TPNAME3= <>
##$TPNAME4= <>
##$TPNAME5= <>
##$TPNAME6= <>
##$TPNAME7= <>
##$TPOAL= (0..7)
0.5 0.5 0.5 0.5 0.5 0.5 0.5 0.5 
##$TPOFFS= (0..7)
0 0 0 0 0 0 0 0 
##$TUNHIN= 0
##$TUNHOUT= 0
##$TUNXOUT= 0
##$USERA1= <user>
##$USERA2= <user>
##$USERA3= <user>
##$USERA4= <user>
##$USERA5= <user>
##$V9= 5
##$VALIST= <valist>
##$VCLIST= <CCCCCCCCCCCCCCC>
##$VD= 0
##$VDLIST= <DDDDDDDDDDDDDDD>
##$VPLIST= <PPPPPPPPPPPPPPP>
##$VTLIST= <TTTTTTTTTTTTTTT>
##$WBST= 1024
##$WBSW= 4
##$XGAIN= (0..3)
0 0 0 0 
##$XL= 0
##$YL= 0
##$YMAX_a= 6527
##$YMIN_a= -70201
##$ZGOPTNS= <>
##$ZL1= 120
##$ZL2= 120
##$ZL3= 120
##$ZL4= 120
##$ABSF1= 248.5645
##$ABSF2= -253.2056
##$ABSG= 5
##$ABSL= 3
##$ALPHA= 0
##$AQORDER= 0
##$ASSFAC= 0
##$ASSFACI= 0
##$ASSFACX= 0
##$ASSWID= 0
##$AUNMP= <proc_1d>
##$AZFE= 0.1
##$AZFW= 0.5
##$BCFW= 0
##$BC_mod= 2
##$BYTORDP= 0
##$COROFFS= 0
##$CY= -3
##$DATMOD= 1
##$DC= 0
##$DFILT= <>
##$DTYPP= 0
##$F1P= 0
##$F2P= 0
##$FCOR= 1
##$FTSIZE= 65536
##$FT_mod= 6
##$GAMMA= 0
##$GB= 0
##$INTBC= 1
##$INTSCL= 5.30512e-09
##$ISEN= 30
##$LB= 1
##$LEV0= 0
##$LPBIN= 0
##$MAXI= 10000
##$MC2= 0
##$MEAN= 0
##$ME_mod= 0
##$MI= 50
##$NCOEF= 0
##$NC_proc= -1
##$NLEV= 6
##$NOISF1= 182.463
##$NOISF2= 159.3651
##$NSP= 0
##$NTH_PI= 0
##$NZP= 0
##$OFFSET= 248.5645
##$PC= 4
##$PHC0= -2988.025
##$PHC1= 69.60088
##$PH_mod= 1
##$PKNL= yes
##$PPARMOD= 0
##$PSCAL= 0
##$PSIGN= 0
##$REVERSE= no
##$SF= 81.014009
##$SI= 65536
##$SIGF1= 159.3651
##$SIGF2= -187.1042
##$SINO= 113.3802
##$SIOLD= 16384
##$SREGLST= <1H.CDCl3>
##$SSB= 0
##$STSI= 65536
##$STSR= 0
##$SW_p= 40650.406504065
##$SYMM= 0
##$S_DEV= 0
##$TDeff= 32768
##$TDoff= 0
##$TI= <>
##$TILT= no
##$TM1= 0
##$TM2= 0
##$TOPLEV= 0
##$USERP1= <user>
##$USERP2= <user>
##$USERP3= <user>
##$USERP4= <user>
##$USERP5= <user>
##$WDW= 1
##$XDIM= 65536
##$YMAX_p= 273903931
##$YMIN_p= -3941117
$$ End of Bruker specific parameters
$$ ---------------------------------
##NTUPLES= NMR SPECTRUM
##VAR_NAME=  FREQUENCY,     SPECTRUM/REAL,   SPECTRUM/IMAG
##SYMBOL=    X,             R,               I
##VAR_TYPE=  INDEPENDENT,   DEPENDENT,       DEPENDENT
##VAR_FORM=  AFFN,          ASDF,            ASDF
##VAR_DIM=   65536,         65536,           65536
##UNITS=     HZ,            ARBITRARY UNITS, ARBITRARY UNITS
##FACTOR=    0.620285442955139, 1,           1
##FIRST=     20137.2065510759, 0,            0
##LAST=      -20513.1999529892, 0,           0
##MIN=       -20513.1999529892, -3941117,    0
##MAX=       20137.2065510759, 273903931,    0
$$ Real data points
##PAGE= N=1
##DATA TABLE= (X++(R..R)), XYDATA
$$ [...]
36168i7871K5956L824k281L1743M5044J1089j4668M773K8803K2003J8966N0413
36156A27794O6647P133q8563j16166m6724L7888O3437N3390O0414O0962n400j05826
36144A14986j18846p989R3102N0751p1396r7687J230P1048J5365o7419n8778m025
36132g9658q855m8576k3283N0614N7091k1958p0500k2847M2511M0595O023J6450
36120f2393O7024R1653O1854M306m9041p9683p3109l0482J9739M3858K9001j4377
36108H350n4781m9916R027O4691M9554k0696n8196j8731M3224N4629J2534l2406
36096G283m2122j6137J7519J8582k5867o7804m4808K9398P0482L5835k3430m6405
36084h7474l8652k9242j1817K1581L9389K1276O840L1491N2314R764o4502q0977
$$ plain form
36168 -97871 -71915 -68091 -70372 -38629 6415 17504 2836 7609 36412 58415 77381 127794
36156 127794 194441 201574 113011 -3155 -49879 -11991 51446 104836 165250 226212 220812 114986
36144 114986 -3860 -11849 81253 132004 60608 -37079 -35849 35199 50564 -16855 -75633 -79658
36132 -79658 -88513 -137089 -160372 -109758 -52667 -74625 -145125 -167972 -125461 -84866 -78843 -62393
36120 -62393 4631 96284 158138 162444 113403 33720 -39389 -69871 -50132 -6274 22727 8350
36108 8350 -46431 -96347 -87320 -22629 26925 6229 -51967 -70698 -27474 27155 39689 7283
36096 7283 -34839 -50976 -33457 -14875 -40742 -108546 -153354 -123956 -53474 -17639 -41069 -87474
36084 -87474 -126126 -155368 -167185 -145604 -106215 -84939 -78099 -46608 5706 15470 -49032 -130009
36072a30009k2458L7053M4751K4669R633o798k3892q977L9725O3146K3940k7198
36060B3585k4213J1035L531n5331r1780n6234J4327N6865N6309L6156J4585k329
36048a3494j0362j2863j5830o212L2355O9563M1975n1260j14128o7323L8877Q7155
36036b1547M5421j1713k2577m590P226J6122L0785L1416K342l5554m8307k2374
36024c3350K8155O0699K6069o2974j08401m1667N9354O2636j9690m7736J7244
36013e9661M6654l4138j05983m4144P5627R5490J3548m1934j9896J5519K1559
36002c7359J6970L095l4004n6307j9073L5916L9583J6156K6995L6912j8734p2711
35990f2561r399J06115Q5778p2777j50430m3561P7578N6216p945L8579J25747
$$ plain form
36072 -130009 -152467 -115414 -70663 -45994 -36361 -43159 -67051 -76028 -36303 26843 50783 23585
36060 23585 -628 10407 13938 -41393 -133173 -189407 -175080 -118215 -61906 -25750 -11165 -13494
36048 -13494 -23856 -36719 -52549 -58761 -26406 43157 85132 33872 -80256 -147579 -108702 -21547
36036 -21547 23874 12161 -10416 -15006 -7780 8342 39127 70543 72885 37331 -10976 -33350
36024 -33350 -5195 55504 81573 18599 -89802 -131469 -72115 -9479 -29169 -76905 -59661
36013 -59661 -13007 -47145 -153128 -197272 -121645 -26155 -12607 -54541 -74437 -58918 -37359
36002 -37359 -20389 -17294 -51298 -107605 -126678 -90762 -51179 -35023 -8028 28884 10150 -62561
35990 -62561 -71960 34155 119933 47156 -103274 -146835 -69257 -13041 -20986 17593 143340
35979A43340Q5010n7264j20797n6162L569l0619q9174p9164q417N9251Q4124N9736
35967f567O049l2867l0768j3891j4514j6288O672L1990K7312R907Q022L305k3531
35954d5169l4779K769M3735L2728J759R809L1184P201l1860j4477L1692J7448
35942E2040m1489l3871N9251J21365P8273m608m7269o1964p9008p2257k8033J279
35930e6291j4831k0483L0432Q3748O9006J4650l410J6874J8038j0707k4013o687
35918I6326K208k2777n3391m8206n200L2852J8110m5620q7186m2871M9585Q3648
35906b2522K7339l0277j2629L3329K3200k6403l3905N356J3225l4233n8460r42
35894a16922P7645P5121j2535q3904n8454L0030Q0984M8918q683j3134L0935M8681
$$ plain form
35979 143340 228350 171086 50289 -5873 -2304 -32923 -122097 -201261 -209678 -150427 -66303 -6567
35967 -6567 -518 -33385 -64153 -78044 -92558 -108846 -102174 -70184 -42872 -32965 -24943 -21638 -45169
35954 -45169 -79948 -77179 -33444 -716 1043 10852 42036 49237 17377 2900 34592 52040
35942 52040 10551 -23320 35931 157296 235569 230961 183692 121728 42720 -29537 -57570 -56291
35930 -56291 -71122 -91605 -61173 22575 91581 106231 102821 119695 137733 127026 103013 96326
35918 96326 98534 75757 22366 -25840 -31040 1812 19922 -25698 -112884 -155755 -106170 -22522
35906 -22522 4817 -25460 -38089 -4760 18440 -7963 -41868 -36512 -23287 -57520 -115980 -116922
35894 -116922 -39277 35844 23309 -60595 -119049 -89019 -8035 40883 32200 19066 50001 98682
35882I8682P060l7755k7370J2935K2236M213J6252O6863Q8493L0495o7597j21902
35870I2605r4242j6296M9946N6416Q28n9797n0893L1899R5430N1424o3037j20931
35858b6648o9575L635O882j9098K0709R9748Q8684l6550j27427o9357M7573O7957
35846a3467L167j2858M1390M6355m0029r7168l8690M3870L1189l9523n7572k3838
35834a57174j9399m0594q837O9781R4466L7678k304L9883R2390O4390j4597n0766
35822A04917k6579n345k2198m3396l1419N522L8697N3463M3466j48o7944j11355
35810f2319p4809L3186J19763R6081j0537p5166k8253N3473N1556l4676r4389
35799b6090n4936M0488J06690J07654O0203j976m6706o0034n7094n2387l0485
$$ plain form
35882 98682 105742 67987 40617 53552 75788 80001 96253 163116 251609 282104 214507 92605
35870 92605 -1637 -17933 32013 88429 89257 29460 -21433 10466 105896 157320 94283 -26648
35858 -26648 -96223 -92588 -85706 -104804 -84095 15653 104337 67787 -59640 -128997 -81424 -13467
35846 -13467 -10300 -23158 18232 64587 24558 -72610 -111300 -67430 -36241 -75764 -133336 -157174
35834 -157174 -176573 -217167 -226004 -156223 -61757 -24079 -26383 13500 105890 170280 155683 104917
35822 104917 78338 72993 50795 7399 -24020 -18498 20199 73662 117128 116980 49036 -62319
35810 -62319 -137128 -103942 15821 111902 101365 26199 -2054 51419 102975 68299 -26090
35799 -26090 -81026 -40538 66152 173806 234009 232033 185327 125293 68199 15812 -14673
35788a4673J4430L2762j9661q7102o6251L8500J04605O4492l948q104K5607J7449
35776I8106l4798o6675m2098K4914R8965J22962M8381p7362j24361n0465K1835
35765A9404j2363p0926k4162P5508P2513k4052m5092N4962J12818J8027j08986
35754F7651j01990J5911R6362P5111Q927l3125k0983M2719J00405O3012p0001
35743B43999j69620j33255k4286K7444O132p192J5918L0491K1508K0378K6598
35732E8115Q678k0878j9085M956P176j613K2446N1775J3265p1834q8801k986P5755
35719C6969N3801j6961l6560l440J4488j699j1786O650L4806M6349K0731m9850
35707I3498j27692j37652n2822N6531J02319P9177M4306K7166R641k1318m8160
$$ plain form
35788 -14673 -243 32519 12858 -74244 -140495 -101995 2610 67102 63154 55050 80657 98106
35776 98106 63308 -3367 -45465 -20551 78414 201376 249757 172395 48034 -2431 19404
35765 19404 7041 -63885 -88047 -12539 59974 35922 -9170 45792 158610 176637 67651
35754 67651 -34339 -18428 77934 153045 161972 128847 107864 150583 250988 314000 243999
35743 243999 74379 -58876 -83162 -55718 -49586 -56778 -40860 -10369 11139 31517 58115
35732 58115 66793 45915 26830 31786 38962 37349 59795 111570 124835 53001 -35800 -38786 36969
35719 36969 90770 73809 37249 33809 48297 46598 34812 41462 76268 122617 143348 93498
35707 93498 -34194 -171846 -224668 -168137 -65818 13359 57665 84831 94472 73154 24994
35696B4994m5561k975O1402R3729M5254n4897j08825o7398L797J9573r524j5735
35684e6166J2591L0278K4242K5301L7861K9906l508k9206l2971l0824k2777N420
35672i853L4064K7182L71Q27J5610j5969q0959q0996J2654Q6531M1192n7725p8392
35659a05463j5742K4894Q194J1156P3628J18864P3150j5920m7060n108L1378L200
35647A55171o2087r5577o4616J245M4529L6822N948j061J9127K3130j1180m3872
35635G579k5273L1518O2652L1608l1239o6999m7790J459K8041K687m5616n8046
35623a09419j8430K4357K3622l982j5544j1188j8781k8953n631M1603N8062K7520
35611c6764l827m879k197j8615k7227l701K6584L3740K8031J9998r925n4310n1418
$$ plain form
35696 24994 -20567 -23542 37860 131589 176843 121946 13121 -54277 -50480 -30907 -40431 -56166
35684 -56166 -43575 -13297 10945 36246 74107 104013 100505 71299 38328 7504 -15273 -9853
35672 -9853 24211 51393 51764 52591 68201 52232 -28727 -109723 -97069 -10538 30654 -27071 -105463
35659 -105463 -121205 -96311 -88117 -76961 -3333 115531 188681 172761 125701 120593 151971 155171
35647 155171 93084 -2493 -67109 -65864 -21335 15487 21435 20374 39501 62631 51451 7579
35635 7579 -17694 13824 76476 108084 76845 9846 -37944 -36485 -8444 -5757 -51373 -109419
35623 -109419 -127849 -103492 -79870 -83852 -99396 -110584 -129365 -158318 -163949 -122346 -64284 -36764
35611 -36764 -40591 -45470 -47667 -66282 -93509 -97210 -70626 -36886 -8855 11143 1218 -53092 -104510
35598a04510J9906P4594L1715n6518p8827l0215J692r865q778J8155J6960j5793
35586a41484j0444M8910Q7941P0730N0856M7972j718j03006j37466m1529O5217
35575f4021N2511j7682m939P0552P1063j7783o7150k6194P720k4497m2289K1885
35563d0824R5332P8180q246p3701r1205r0465p0601j1099N2836N0831j9484p1529
35551a99975l5783M9245Q3700L3375k6583j6893K8558J3006n8284n8137O6226
35540a21545J73601J12092m6467r9657j2645M5603j5914p0447K735J10437R5330
35529A73123j2586n3123O473L2449n2033j44437j15230J1354R8338P1226j1099
35518D455m9390j9137K4687L3891K2190K3908L1944J5644j7336k7511q996M051
$$ plain form
35598 -104510 -84604 -10010 21705 -34813 -113640 -143855 -142163 -152028 -160806 -142651 -125691 -141484
35586 -141484 -151928 -103018 -15077 55653 106509 154481 152763 49757 -87709 -129238 -64021
35575 -64021 -11510 -29192 -34131 36421 107484 89701 22551 -3643 4077 -20420 -62709 -40824
35563 -40824 54508 132688 124442 50741 -40464 -130929 -201530 -212629 -159793 -108962 -128446 -199975
35551 -199975 -235758 -186513 -102813 -69438 -96021 -112914 -84356 -71350 -129634 -187771 -121545
35540 -121545 52056 164148 117681 18024 5379 50982 35068 -35379 -32644 77793 173123
35529 173123 160537 107414 113887 146336 94303 -50134 -165364 -154010 -55672 15554 4455
35518 4455 -44935 -64072 -39385 -5494 16696 40604 72548 88192 70856 43345 34349 38400
35506C8400l96J8M442j6779n3211m9110M227M0744K2458n49J7541L5622Q90n1567
35492g270n0487o7L3238J9107j4498l5313k9021Q834N6290O8185L7129J4041K7555
35479A27723L2746j0657o4989p9009o7754o1464l6608K2918N7565J8332l3837
35468i5034j5660M3004N9358M0709M2520L1544n9437j65100j39906J4286J28913
35457a14803J06374L2471J1887L1576M2739M8327M2815j6987j09380j25312k5847
35446g6140P6189P0138p783o0440o8410n7467j6400N3766Q2748K7572l3426p452
35434a7105O2166O1724j1794m9925k923N5922N0895K250k6823k0960j1442j4790
35422G7195r589K1753M6254O056r1463j44603o9888P6243J54642J15093L7655
$$ plain form
35506 38400 38004 38022 42464 25685 -27526 -76636 -72409 -31665 -9207 -9756 7785 43407 44297 -7270
35492 -7270 -57757 -57824 -24586 -5479 -19977 -55290 -84311 -75477 -19187 48998 86127 100168 127723
35479 127723 160469 149812 84823 5814 -61940 -123404 -160012 -137094 -79529 -61197 -95034
35468 -95034 -110694 -67690 -8332 32377 74897 106441 47004 -118096 -258002 -243716 -114803
35457 -114803 -8429 24042 35929 67505 110244 158571 201386 184399 75019 -50293 -76140
35446 -76140 49 70187 62404 1964 -66446 -123913 -140313 -86547 -3799 23773 -9653 -17105
35434 -17105 45061 106785 94991 45066 42143 98065 148960 151210 124387 103427 91985 77195
35422 77195 67606 89359 135613 141669 50206 -94397 -164285 -88042 66600 181693 219348
35411B19348L949J0530K1667K3460O701k4832j9288O1749J46876J32353N8463
35400F40976O7224J65297J98647J13880N6901J19167J76969J18496M8534Q8047
35390A794138J27409l398k31112l34107k68426j77706j30933p6625k9587p1414
35380E98239j57324j39798j5728M8764j7354q8590o1623k60R274p201j700K731
35368A69430j4608j6370J0667J7640j2590l2382k5542k9642l4410J8938J02325
35357A53456R9077j2494j05870r4611m2202j9491R735P5277J02494L4067n4039
35346A45399o5078k4954j3795l0400k3547L368J1386K680K300L822q243k2377
35334a9439k7400k9636j9998J5434M2562J8524j3516K3476Q8255N8265n8198j04815
$$ plain form
35411 219348 223297 233827 255494 278954 285655 260823 241535 303284 450160 582513 640976
35400 640976 708200 873497 1072144 1186024 1242925 1362092 1539061 1657557 1706091 1794138
35390 1794138 1921547 1918149 1687037 1352930 1084504 906798 775865 699240 669653 598239
35380 598239 440915 301117 285389 334153 316799 228209 166586 166326 175600 168399 166699 169430
35368 169430 154822 138452 149119 166759 154169 121787 96245 66603 32193 51131 153456
35357 153456 252533 240039 134169 39558 -2644 -22135 -12400 62877 165371 199438 145399
35346 145399 80321 55367 41572 11172 -12375 -9007 2379 5059 7359 11181 2938 -19439
35334 -19439 -46839 -76475 -96473 -81039 -38477 -19953 -33469 -9993 78262 136527 78329 -26486
35322b6486k1382O1823M6795J3075M1104O1409P403l9724n259K5106l4433r1404
35310C8027l4006N3603K9240n6183n2708K1625K3689n3364p5046k718O0319N6660
35298I138L2305Q645l6021o0545j970P7705N1233o2057j08257l4142N2614P4736
35286C384P1630O8642K6530l8345m3043M798n279q6989j05292O75R6217N3759
35274D6687n3953p9594j6998L2209L3954L8888O1942N6571O248l9497l5759k225
35262D8473P213k2082m2637j0682L7734K6554l3807l7165N4027J22353N9493o2888
35250A46586j00908n0520j5286j4512J6918O4016L9066m2822o3469r75L1597j4479
35238d788m1511K0864J00532J07228N1157k0717r1424j25078p0289L1691N7986
$$ plain form
35322 -26486 -47868 13955 60750 73825 114929 176338 183741 144017 138758 163864 129431 38027
35310 38027 4021 57624 86864 30681 -22027 -402 23287 -30077 -105123 -107841 -47522 9138
35298 9138 41443 50088 14067 -46478 -48448 29257 80490 18433 -89824 -123966 -71352 3384
35286 3384 75014 143656 170186 131841 88798 93596 88317 1328 -103964 -103289 -7072 46687
35274 46687 -7266 -86860 -103858 -71649 -37695 1193 63135 119706 125954 86457 50698 48473
35262 48473 55686 33604 -9033 -19715 18019 44573 10766 -26399 27628 149981 209474 146586
35250 146586 45678 -4842 -20128 -34640 -17722 46294 85360 42538 -20931 -21906 9691 -4788
35238 -4788 -46299 -25435 75097 182325 233482 212765 121341 -3737 -74026 -42335 15651
35227A5651k1391r3581p6738k1619J2041M5869Q3103N6634l7152q0180m870Q8996
35215c3237Q6583K0723j5085j4408j7071j3625Q380N275m2287o8470k4804L7651
35203g0375O1403O4689O2262J5640o0244o6172J3372M4676m4274j26644p8910
35192a84577K0752M6655L7777P7727R5302k862j07577n2877Q4931Q4477n7910
35181D1818j18183p201J02160O3882m0008o8010j5861L9312N4429J2273q0769
35170a6158j40093o9963P4482J25953M7185j3145L6426Q9510L4513n9790p3830
35159C5090l4524m1914p8897m2266P0546J37361P8641m3404j08538o4408L8731
35148e3582J02153O8632j9863o7228l6532J4262K4009O162P21k988l9011q6564
$$ plain form
35227 15651 -5740 -99321 -176059 -197678 -185637 -139768 -56665 -31 -37183 -117363 -122233 -33237
35215 -33237 53346 74069 58984 44576 27505 13880 22260 27535 -14752 -83222 -108026 -70375
35203 -70375 -8972 55717 117979 133619 73375 7203 20575 65251 20977 -105667 -184577
35192 -184577 -163825 -117170 -79393 -1666 93636 90774 -16803 -69680 15251 99728 41818
35181 41818 -76365 -83566 18594 82476 42468 -25542 -41403 -2091 52338 64611 -16158
35170 -16158 -156251 -226214 -151732 -25779 21406 8261 44687 134197 168710 108920 35090
35159 35090 566 -41348 -120245 -162511 -91965 45396 124037 80633 -27905 -92313 -53582
35148 -53582 48571 117203 97340 30112 -6420 7842 31851 38013 38734 35746 -3265 -89829
35136h9829q1617j0599N4544L9853l2264o0949O591R4951Q8467j0315p6388l7472
35124a15027K5695J3918l1890q127O5666O9248j7733p2417j7835O5608P5700L2262
35112H5068P269n741n4386j08825q4556K2948J09561Q7574j1544q2706o8368j2615
35100a16321K038m0040o4386n353R2024J15585L4458n1442m0163L9603P4392K0167
35088F0562m8365m7699O417L2409k608m5649l7712R303M1199L9226K7967J8936
35076E3986j706k4915j4175K8628M5058L732m3602l5359Q111K0501r223l1583
35064e47k1296q213j7993k9710j1114L1287N6286L5443j1212l3556j1485J8988
35052c122K0813J1870K1131J6359m8039j21943r7774K5000J16833R5484K2588
$$ plain form
35136 -89829 -171446 -182045 -127501 -87648 -119912 -180861 -174270 -79319 9148 -1167 -77555 -115027
35124 -115027 -89332 -75414 -107304 -115431 -49765 19483 1750 -70667 -88502 -22894 52806 85068
35112 85068 92337 86596 32210 -76615 -161171 -138223 -28662 58912 47368 -35338 -103706 -116321
35100 -116321 -114283 -154323 -218709 -224062 -132038 -16453 18005 -33437 -73600 -33997 40395 60562
35088 60562 12197 -35502 -29085 3324 716 -44933 -82645 -73342 -32143 7083 35050 53986
35076 53986 52280 27365 13190 41818 86876 90608 47006 11647 19758 40259 31036 -547
35064 -547 -21843 -30056 -48049 -77759 -88873 -57586 -1300 34143 22931 -10625 -22110 -3122
35052 -3122 17691 29561 50692 67051 19012 -102931 -200705 -175705 -58872 36612 59200
35041E9200k3307n5174r0166p3052J4828P5570L5889k5891j1452L5248L0115J5290
35029a2902O4701J10920M9947m9547m2875L3760K1565p1838p8804K4781O8433
35018A18141j3238p1582j6532L3559j2293m9508J1667O5435Q106n8401j1163N6438
35006F0629l924j15280r1353M2183Q5888j325m8004L1057J03839N5458l3730m1515
34994D3923R355K7264P289j705r024m9169q4476m8924L0880N6341k13n9187n6527
34981a34173k3738j0841j933L3335N9118K4863l0871j9065N9261J03934O5794
34970A25684J1084k572j5186o3287q5123k3696N1832M2834j6881k1271K6615L0981
34958F1014j9520l6988j537J222o1161j04731o8981l067L5084N8276Q1173P5551
$$ plain form
35041 59200 35893 -19281 -109447 -182499 -167671 -92101 -56212 -82103 -93555 -58307 -28192 -12902
35029 -12902 51799 162719 212666 163119 120244 154004 175569 103731 24927 49708 118141
35018 118141 104903 33321 16789 50348 38055 -11453 214 65649 73755 15354 4191 60629
35006 60629 56705 -58575 -149928 -107745 -21857 -23182 -71186 -40129 63710 119168 85438 43923
34994 43923 53278 80542 87831 86126 77102 27933 -56543 -105467 -74587 -18246 -18459 -77646 -134173
34981 -134173 -157911 -168752 -170685 -137350 -78232 -53369 -84240 -103305 -44044 59890 125684
34970 125684 136768 134196 119010 55723 -29400 -53096 -1264 41570 24689 3418 30033 61014
34958 61014 41494 4506 2969 4191 -56970 -161701 -230682 -233749 -198665 -140389 -59216 16335
34946A6335M3746L7335N5055K4539o3461j10162n9618Q945R719k4561j8525L1839
34934d8814Q8072J25988J06685p342j44787j52571j2832R0189K4104r3463q2154
34923a06925K7005O6447K445m5046j6757J6484l621m5746o3563m3697J8233R8626
34911i6115J20695M2086n5454o1792K738L0465J999m140L1147L0452l8897r9977
34899i6793q1621j3276L2018K4987j4687m7246l3514K6610P6974P1846M2852M3999
34887C2149N6837K5169l5444n0602p748K0562j2261o2919o5527j1678N1707P1363
34875A1608L5071q594j575L4383J4170p2129j16948n3864L0789L7341J2806M6563
34863c0379Q9039L6193o0501n4533M2758O2556m8537j41698j02352m037M4353
$$ plain form
34946 16335 60081 97416 152471 177010 113549 3387 -56231 -47286 -37567 -62128 -80653 -48814
34934 -48814 39258 165246 271931 264589 119802 -32769 -45601 44588 68692 -24771 -106925
34923 -106925 -79920 -13473 -11028 -56074 -72831 -56347 -59968 -105714 -169277 -212974 -194741 -96115
34911 -96115 24580 66666 11212 -50580 -47842 -17377 -15378 -19518 11629 42081 3184 -96793
34899 -96793 -178414 -191690 -159672 -134685 -149372 -196618 -230132 -203522 -126548 -54702 -11850 32149
34887 32149 88986 114155 78711 28109 20361 40923 28662 -34257 -99784 -111462 -59755 11608
34875 11608 46679 38085 36510 70893 85063 12934 -104014 -157878 -127089 -89748 -76942 -30379
34863 -30379 58660 94853 34352 -20181 22577 85133 36596 -105102 -207454 -211491 -167138
34852a67138N1685N9109L8719k1906m7844O014N9295K7804m1181n3579j5168N993
34840i8197J620Q201J9702R960J769K5375M4714J0883m3624m9702j3280L645p023
34827h5957M088M6325P1745N8328L5928K0659q256n0376o3370k4361L3126O4372
34815A02251N9603L0137j4521n7085p2156n7509m1546l9915k8485J4336N6247
34804d8643L8984l8915r9007o5457M1442J19027R1993r307q5474o7726K3966J04508
34792E391R7728O253q2130p8368P024P2950N0769j7046m6990k4355J418K951L38
34779d067R087J4967O986k900j912O618J1383K297k1058l7981k3271J0959K1160
34766g732j369j3188M841R487k1872l2654K0429P3362M2101l8413o1973j1147
$$ plain form
34852 -167138 -115453 -56344 -17625 -39531 -87375 -81361 -22066 5738 -35443 -89022 -104190 -98197
34840 -98197 -96577 -88376 -68674 -58714 -56945 -31570 13144 24027 -19597 -69299 -82579 -78934 -85957
34827 -85957 -81869 -35544 36201 94529 130457 151116 142860 92484 29114 4753 37879 102251
34815 102251 161854 191991 177470 120385 48229 -9280 -50826 -90741 -119226 -104890 -48643
34804 -48643 -9659 -48574 -147581 -213038 -171596 -52569 39424 30117 -55357 -123083 -99117 5391
34792 5391 103119 109372 27242 -51126 -44102 28848 79617 62571 15581 -8774 -7356 -4405 -4067
34779 -4067 5020 19987 26973 24073 22161 28779 40162 42459 21401 -16580 -39851 -28892 -7732
34766 -7732 -9101 -22289 -17448 -7961 -29833 -62487 -42058 31304 73405 34992 -26981 -38128
34754c8128L3784L1052J7388J5384M558j0483j507R934j9684n5541k4608M1105
34742C254L0973n6583r3810k9138L2888J6269q781K4811N5961K4312o438K5072
34730A8790M8639n261n7053j6836L2159k9577j21023p0898Q2058J26889J7669
34719B5556n7348R826Q3991L3275n4821m0763L1005K2231o6691j09190m9321M3166
34707a29084Q8366O4994j0446q4322p5154L1521J27164J04624O618m0817j0179
34696G3285J7527K015j4655j3846k9489n5076l3055L4680O8535L4041j6663n1615
34684A5684r2719j10633k5366J24187J60270K0104j10695n7730P5326P6084m0147
34673C4365p7309R886O2961K777n7104l0136R217j0743l4612j2315k574m1969
$$ plain form
34754 -38128 -4344 26708 44096 59480 64038 53555 52048 61982 42298 -13243 -37851 3254
34742 3254 34227 -22356 -116166 -145304 -112416 -96147 -104928 -80117 -24156 156 -6282 18790
34730 18790 67429 62168 5115 -11721 20438 -9139 -130162 -201060 -119002 7887 25556
34719 25556 -31792 -21966 62025 95300 40479 -284 30721 52952 -13739 -122929 -172250 -129084
34707 -129084 -40718 24276 13830 -70492 -145646 -114125 13039 117663 124281 83464 73285
34696 73285 90812 92827 78172 64326 34837 -20239 -53294 -18614 49921 83962 67299 15684
34684 15684 -77035 -187668 -213034 -88847 71423 91527 -19168 -76898 -1572 74512 34365
34673 34365 -42944 -33058 29903 32680 -24424 -54560 -45343 -56086 -90698 -103013 -105587 -147556
34661a47556m8679L2271J10611R2548K8965N856l349m9615p8152k8768K6242k570
34649f2196m9447j832Q6170P1578k7553n3464K7755P5651J5745m7658j8967L8290
34637E4072K1060n2897q8712m8456K3659O4188M0906k1149n1578j3377M0806M4931
34625A3453K2926L6588O1648K2334o5118j02284o6224l8337n8171o5739k0759
34614b59683L0082M3786M0661L6710J0794k6190k3997J0735P626m1400m9318K7678
34602a92516J14581J29249Q0768J2856n6641r4065m9900M1126N9322l1515j08287
34591i5022n8812N6876J01312M5980k4535m1585n370N0839Q1763M9060k8839p9855
34579E1812o6295k5045M121K5925L7016M916n7087p2097r809N5172M7096j4110
$$ plain form
34661 -147556 -196235 -163964 -53353 39195 68160 74016 70667 21052 -57100 -85868 -59626 -62196
34649 -62196 -111643 -113475 -27305 44273 16720 -36744 -8989 66662 82407 34749 15782 54072
34637 54072 75132 22235 -66477 -114933 -91274 -27086 13820 -7329 -58907 -72284 -31478 13453
34625 13453 36379 72967 134615 156949 91831 -10453 -76677 -115014 -173185 -238924 -259683
34614 -259683 -229601 -185815 -145154 -108444 -97650 -123840 -147837 -137102 -129476 -170876 -220194 -192516
34602 -192516 -77935 51314 132082 144938 88297 -5768 -55668 -14542 44780 13265 -95022
34591 -95022 -153834 -96958 4354 50334 25799 -15786 -21156 29683 111446 160506 131667 51812
34579 51812 -14483 -39528 -35407 -9482 27534 32450 -24637 -96734 -106543 -51371 -4275 -18385
34567a8385o3814p0802k6068O4491J33813R2071l5965j06664m9955L2308K7177
34556b1793l4756o7388o7545o5872l3634M8545J05698O7492r164k4691J2451K5676
34544f4981P742R511L1966L1856O019j4024j9608j0991K4802O2454L6142m4595
34532E6293o7809R522O8681J4293o1240l7182K0031k3290j15363q9144N3917J35688
34520c5603P7153p217j6820N579l75m265L3549Q0422Q7057M7411k3850j00763
34508A42278j26915o6936K2867N4279K5658l6o164j5002p402L4343M1326m9245
34496D9051j47778j11662K7731J01668O0608J7054K4673Q929m5130l5188N8099
34485H055J00194K3860n2618l4497q774o2498j00433r027J18982J07171l1369
$$ plain form
34567 -18385 -82199 -153001 -179069 -114578 19235 111306 75341 -31323 -81278 -48970 -21793
34556 -21793 -56549 -123937 -191482 -257354 -290988 -242443 -136745 -69253 -78417 -103108 -90657 -64981
34544 -64981 -57239 -47728 -15762 16094 22113 8089 -11519 -22510 2292 64746 100888 56293
34532 56293 -11516 -1994 66687 80980 19740 -17442 2589 -20701 -136064 -225208 -171291 -35603
34520 -35603 41550 34333 17513 23092 22717 18452 52001 132423 219480 266891 243041 142278
34508 142278 15363 -51573 -28706 25573 51231 51195 45031 30029 22627 56970 98296 49051
34496 49051 -98727 -210389 -182658 -80990 -20382 -3328 21345 30274 -14856 -50044 8055
34485 8055 108249 132109 79491 44994 36220 -26278 -126711 -135738 -16756 90415 59046
34474E9046j18212o8796K8458P5472O8356L5360j1744m7940m4037j7990j1763
34463e3790k0627q431J8415K0921L732J1272M5994N5738J5625l0418k9977J0941
34451C9395M0270K1978k5269m9147k5661Q089L332k9203l7860j5031o695k7106
34439a02908k9092J2848N2566M4916J1826q668k3972m5268l9177J2525M9671Q225
34427e6508o9464q0219o057O4429O6433L5116K6714L0264N845l1256k5699K6515
34415a3887N6423J2706o1489p8470j8538M7992N4769J5459j1677j373K3225K9291
34403E4431M842l0699l3953J5344O8217N5807m274k2390J5551R935q1825j39590
34391h8604n0804R8507J37064N3164k0889k7757k6604l4777j946M7091J7168p4736
$$ plain form
34474 59046 -59166 -127962 -99504 -24032 44324 79684 67940 20000 -24037 -42027 -53790
34463 -53790 -74417 -82848 -64433 -43512 -39780 -28508 17486 73224 88849 58431 28454 39395
34451 39395 79665 101643 76374 27227 1566 9655 12987 -16216 -54076 -69107 -75802 -102908
34439 -102908 -132000 -119152 -66586 -21670 -9844 -18512 -42484 -87752 -126929 -114404 -64733 -56508
34427 -56508 -125972 -206191 -212248 -147819 -81386 -46270 -19556 10708 16553 -14703 -40402 -13887
34415 -13887 42536 55242 -6247 -84717 -103255 -55263 -494 14965 3288 1915 25140 54431
34403 54431 59273 28574 -5379 9965 78182 133989 129715 107325 122876 132811 50986 -88604
34391 -88604 -139408 -40901 96163 149327 128438 100681 74077 39300 37354 84445 101613 26877
34379B6877q8597J3925R3317M8655m0870o8636m9323k8445J3317O7143M7767n1483
34367a6353r2271k078Q5665M2999l6962o035P8226N8222m4591p1830o03M0575
34355C4964J0278P40L5927K0655o9801j23547p1083J5170N4051N9013N8726L5987
34343F1080l774j2337J0646J1109q046J3588N8848L5846m5909n6454L4335P8812
34331A77744j0713j02019n0491O8393Q9615J5474k9662k6346n9342j26782j27981
34320a82110m1605L8443N9143O2803O7897L0382m2726o5743p370N3897N2812J9370
34308D5193k953k1262l1012O335O8704O2213k8766q7370m1504J4330k1265q1484
34296a18841n1191K6621K6943l2893k4567N8988Q8559K7046j1108K8327M5602
$$ plain form
34379 26877 -61720 -47795 45522 94177 53307 -15329 -64652 -93097 -79780 -12637 35130 -16353
34367 -16353 -108624 -110702 -25037 17962 -19000 -25035 53191 111413 66822 -5008 -5611 34964
34355 34964 45242 45982 81909 102564 32763 -90784 -161867 -146697 -92646 -33633 25093 61080
34343 61080 57306 44969 55615 66724 58678 72266 131114 166960 121051 64597 98932 177744
34331 177744 167031 65012 14521 82914 172529 188003 158341 131995 72653 -54129 -182110
34320 -182110 -223715 -185272 -126129 -63326 4571 34953 -7773 -73516 -80886 -26989 25823 45193
34308 45193 42240 20978 -10034 -3699 65005 127218 98452 11082 -30422 -16092 -37357 -118841
34296 -118841 -170032 -143411 -116468 -149361 -173928 -114940 -26381 665 -10443 17884 63486
34285F3486k0665p1479k1579M6085K4216l7605l2825J5414J5213j6929M543N9933
34273B7808M5139m4409r2123l4309N9453R5110N0069m1927j14638r0843K5310
34262a15360J00647K9946q6214o2127Q6687J49678M0830p1914l4515O4640N7120
34251A59418m4708r6413m9973J0914K2382K762j7227k6110p480L3574M0507j8983
34239H663p2899k9682P2616R8258P29j12666j28038n9468M557K8256M2805O3254
34227h3615N6826O151m1938l0243K2988M1891M790j8918K0561O3231K7696n2237
34215A7183o9864n832N3743N9337N1695N3879K1288n4725r5035m9313J9448L6202
34203C8006K5313M5751P8216N9077j4937q6256j09465p5177k537M9414J8138o7038
$$ plain form
34285 63486 42821 -28658 -50237 -4152 20064 -17541 -50366 -34952 -19739 -36668 -32125 27808
34273 27808 72947 28538 -63585 -97894 -38441 56669 106738 64811 -49827 -140670 -115360
34262 -115360 -14713 15233 -70981 -133108 -46421 103257 144087 72173 37658 102298 159418
34251 159418 114710 18297 -31676 -20762 1620 4382 -12845 -38955 -46435 -12861 27646 8663
34239 8663 -64236 -93918 -21302 76956 77685 -34981 -163019 -222487 -217930 -189674 -146869 -83615
34227 -83615 -26789 -20638 -62576 -92819 -69831 -27940 -23150 -42068 -21507 41724 69420 17183
34215 17183 -52681 -58513 -4770 54567 106262 160141 181429 126704 31669 -17644 1804 38006
34203 38006 63319 109070 187286 246363 231426 145170 35705 -39472 -42009 7405 25543 -41495
34191d1495q9369K2R9514R5958J6932l5041l5581l2386l6112j6968J7815L1256
34179b5455K3608K0738J6626j0513m8739p0537o8416l5044L7040R8486O8848k6611
34167a9969m8283N1194J27346O1264m3915l4541L4114K286j05215j14600j642
34156i1961O8088J5848m1254q827M2328K6418j9625l0271j6746l816K9041P7836
34144D7059Q5366L7173q054k3068m3726o5296k8953M7455N6320k7512r2264o7789
34132h3289k2587j2409K0598J02489J27439K6510r0964j01423n8618p1299r3551
34121b57104j3949J16646J36297K5615o4269m0866K6229N0487L9828K6835K734
34110D8483l2150l9297p216J9269P503j7695j8906Q046M4210O4715M7871N141
$$ plain form
34191 -41495 -130864 -130842 -31328 64630 81562 46521 10940 -21446 -57558 -74526 -56711 -25455
34179 -25455 -1847 18891 35517 25004 -23735 -94272 -162688 -197732 -160692 -62206 6642 -19969
34167 -19969 -68252 -17058 110288 171552 127637 93096 127210 129496 24281 -90319 -91961
34156 -91961 -23873 -8025 -49279 -58106 -15778 10640 -8985 -39256 -56002 -59818 -30777 47059
34144 47059 132425 169598 161544 138476 94750 29454 501 47956 104276 76764 -15500 -83289
34132 -83289 -105876 -118285 -97687 4802 132241 158751 67787 -33636 -92254 -163553 -257104
34121 -257104 -271053 -154407 -18110 7505 -56764 -97630 -71401 -20914 18914 45749 48483
34110 48483 16333 -22964 -30180 -10911 -3408 -21103 -40009 -31963 12247 76962 124833 129974
34098A29974j4034R145K0567k0227n0982N784R3573P6664m9636j26626n5401N6175
34086G4976M8197o7023j32777o3991N9401J15029P5606p37n8579p8398n4085O241
34074g6140N7818M9579l516k4140J8202M9028l750q6395q7707q063M4286K7711
34062d3087J7901N0675M2535n5325j36214q0803N8335J31290R3603K0546l3882
34051F5574p1770p7863l3252J5749J5650J0222O6120J20756N3196r6472j43961
34040g6051k9545R0771Q2504R521j0627J0575L824j6818m668J3031n722k5666
34028D1129j0870j4889p2385q1874M7873J93271J44386p2883j96317q9866P2853
34017c9572P4545m7423r8478k1515N8392M8331M925J5245O1018N6290k5047j10227
$$ plain form
34098 129974 115940 125085 145652 125425 74443 80227 173800 250464 200828 74202 18801 74976
34086 74976 123173 56150 -76627 -140618 -81217 33812 109418 108681 50102 -28296 -82381 -76140
34074 -76140 -18322 31257 27741 3601 21803 70831 67081 -19314 -107021 -115084 -70798 -43087
34062 -43087 -25186 25489 68024 12699 -123515 -204318 -145983 -14693 78910 99456 65574
34051 65574 -6196 -84059 -117311 -101562 -85912 -75690 -9570 111186 164382 67910 -76051
34040 -76051 -105596 -14825 67679 77200 66573 77148 80972 64154 59486 72517 66795 41129
34028 41129 30259 15370 -57015 -138889 -91016 102255 246641 173758 -22559 -112425 -39572
34017 -39572 34973 -12450 -110928 -132443 -74051 -25720 -20795 -5550 55468 111758 86711 -23516
34005b3516j13486l5206M1369N2594K8440L6384P2863O8265L497m8050k8097K0505
33993G5562K9033R895J6052L3335M585n1754m6123L9746J03817O0943m0447r2893
33981A41751o6185q323M4205Q2011P4203j0663j27099j67525q4243M8449J20578
33970D7159J00244L7866q622j9725o022J1986J7340O620j3428l8241o0036n5049
33958B0092q523M2203L2333l9403q6790m3037M2957P0165K1594k7041k6315p450
33946i215l337J0075N0652O8878J5000o6805q3395k2248L3017K4729q000r135
33934B16L469j9933o4568o2506M555P1262P2461J9967k5189k6359N461L7602M0657
33921E7095N704m0696n4644k8619o663k0942l8988j3998L3878M2645Q491n006
$$ plain form
34005 -23516 -137002 -172208 -130839 -78245 -49805 -13421 59442 127707 131204 83154 55057 75562
33993 75562 104595 114490 130542 163877 168462 116708 70585 110331 214148 275091 234644 141751
33981 141751 75566 67243 111448 193459 267662 256999 129900 -37625 -121868 -73419 47159
33970 47159 147403 185269 176647 156922 150900 162886 180226 186846 173418 135177 75141 20092
33958 20092 11569 53772 86105 46702 -40088 -83125 -40168 29997 51591 24550 -1765 -9215
33946 -9215 -12552 -2477 48175 117053 132053 65248 -18147 -40395 -7378 17351 9351 216
33934 216 3685 -16248 -80816 -143322 -138767 -67505 4956 24923 -266 -26625 -21164 16438 57095
33921 57095 62799 22103 -32541 -61160 -67823 -88765 -127753 -141751 -107873 -65228 -56737 -61743
33909f1743K7146M3094p871p3377o4505J5386P3257N2368j922j5091K0049M2820
33897D9611J351q5949j41274j01694J1492J09223J28452Q7597L6915o168l7853
33886E1703k9007L0669P6748L7053n3071q5957l8338j309k8351n2264r273M4764
33874e6633K6361l5317m8740o862J9240R498J2437L7608L2939j4500m6110k6465
33862i6544Q901K7906M7305P2419O8997L4579K1150L9064J7685p4680j47411j07704
33850h8333l871M5976K3801P142K3967K5259j932p134J8118J2184m0945o2643
33838d8411l029O6212N4795r563k9787J0644L2775r841o7140p5648m5891l0108
33826a54992l6774k0950M3281J13105J17646L9235o3362j14234q7532j3594N6102
$$ plain form
33909 -61743 -34597 8497 626 -72751 -137256 -121870 -48613 3755 1833 -13258 6791 49611
33897 49611 50962 -34987 -176261 -277955 -266463 -157240 -28788 58809 95724 89556 51703
33886 51703 22696 53365 130113 167166 114095 28138 -10200 -11509 -39860 -92124 -101397 -56633
33874 -56633 -30272 -65589 -114329 -121191 -101951 -92453 -80016 -42408 -9469 -23969 -70079 -96544
33862 -96544 -87643 -59737 -12432 59987 128984 163563 184713 223777 241462 166782 19371 -88333
33850 -88333 -92204 -46228 -22427 -15285 8682 33941 32009 24875 42993 55177 14232 -48411
33838 -48411 -51440 14772 69567 60004 30217 40861 73636 63795 -3345 -78993 -124884 -154992
33826 -154992 -191766 -212716 -169435 -56330 61316 100551 37189 -77045 -164577 -178171 -122069
33815a22069P5598K7297m8273o9171k291P9562Q2073J7578j7189J0134K3772k9017
33803B8004q6022o5886P561M6415K1445k5438n7782o2686k0608O3466J16517P1751
33791C6737j8013l3468L4676O4586n590p2046k7442N9469M1570p3463j20005j5269
33779a28258J16341J15613p52q1945m7539L6080P0259L6015k1444n7272m8756
33768a1658J294N1340M5756j6179o5957n2312j0620n190l1614l2419N668L5227
33756h6664L2845L5295O6788Q5486M4150l0381o3573k6311L1959M1233j5853q6730
33744B8244r9770m0888K5616L3125j418p206L0466M8958J1623l2986l1122k356
33732c7714J2634K5973N7352O4187L579o6598m8123M1834P7823Q342o6499m3297
$$ plain form
33815 -122069 -46471 -19174 -67447 -136618 -138909 -59347 22726 40304 23115 33249 57021 28004
33803 28004 -58018 -123904 -116343 -69928 -48483 -73921 -131703 -194389 -214997 -151531 -35014 36737
33791 36737 18724 -14744 19932 84518 78928 6882 -20560 38909 80479 7016 -112989 -128258
33779 -128258 -11917 103696 102944 20999 -26540 9540 79799 115814 94370 37098 -11658
33768 -11658 -10364 40976 86732 70553 4596 -47716 -58336 -63526 -95140 -127559 -121891 -86664
33756 -86664 -53819 -18524 48264 133750 177900 147519 83946 57635 89594 130827 114974 28244
33744 28244 -71526 -112414 -86798 -53673 -55091 -62297 -31831 17127 28750 -4236 -35358 -37714
33732 -37714 -25080 893 58245 122432 126011 59413 11290 53124 130947 139289 72790 29493
33720B9493M2371Q4272N2811K149k7623m1129m2591k8508j7964l3142n3795m2691
33708g6347j0919l005j9029j2832K4605M5074K6401R351J7312O822m7079p7868
33696a17514j9545O9683P1771j6556p3912l1490L7776M4933J0234M23J2284j089
33684a3002l2290l0937P180L5409L2275J9564R776o492k2914k0151m409M195J3246
33671h550L6865M6110K995o3056q0262l6423J1141K7805L1129K6092n908m1367
33659e3429k7410J7867J3684m1294m1580N2366J21597N9236n6228p2467J3033
33648a4625O6723K7784k1596j08O3776R2000M9338m6513j43542j68172q3040M6010
33636a31965R8376M1071k8468j3012N8337P9514J3171o6327p4400j6509L5188
$$ plain form
33720 29493 71864 156136 208947 211096 183473 142344 99753 71245 53281 20139 -33656 -76347
33708 -76347 -87266 -90271 -109300 -122132 -97527 -52453 -26052 -16701 611 7433 -39646 -117514
33696 -117514 -137059 -67376 4395 -12161 -86073 -117563 -79787 -34854 -24620 -24197 -11913 -13002
33684 -13002 -45292 -76229 -69049 -33640 -1365 18199 27975 21483 -1431 -21582 -25991 -21796 -8550
33671 -8550 28315 74425 77420 14364 -65898 -102321 -91180 -63375 -32246 -6154 -12062 -53429
33659 -53429 -80839 -62972 -49288 -90582 -132162 -79796 41801 101037 44809 -27658 -14625
33648 -14625 52098 79882 58286 58178 121954 213954 263292 216779 73237 -94935 -177975 -131965
33636 -131965 -33589 7482 -20986 -33998 24339 103853 117024 50697 -23703 -40212 -5024
33625e024L9824K3584J6910J824m4148q3779n6626K6771Q4615O7638J2305k3397
33613F0497k6733j3667N695K0605J9645J5555K9701M3625J8150l2171m7178j4248
33601G9476J7861K8048M0803M2934j1318q4897p1151K8045P0792m013o4467L15
33589G2428R1287O4395l4866o6346k9735k4778m7776j5840N1029N8346J9048K4791
33577A61983N7267J6245p4425q4980r803K0701k0973j6287O1774Q1941k474n2491
33565A38478J3904P3970K0934m7250j0743N6500K6172n2592m4756L3245N0803
33554B58665j2724n2321k4414K758j2633k5890r67L3199M2852L6109L6181N4352
33542C35167Q6568J04423P3267J0159j6609J8768N7775N0391K8449L5540N0264
$$ plain form
33625 -5024 34800 58384 75294 77118 32970 -50809 -107435 -80664 3951 71589 83894 60497
33613 60497 33764 20097 25792 46397 66042 81597 111298 154923 173073 140902 93724 79476
33601 79476 97337 125385 166188 209122 197804 112907 41756 69801 140593 136580 72113 72428
33589 72428 163715 228110 193244 126898 97163 72385 24609 8769 59798 118144 137192 161983
33577 161983 219250 235495 161070 76090 66287 86988 66015 49728 111502 193443 190969 138478
33565 138478 152382 226352 247286 200036 189293 245793 271965 219373 174617 207862 258665
33554 258665 245941 193620 169206 171964 159331 133441 132474 165673 208525 244634 280815 335167
33542 335167 421735 526158 599425 609584 592975 611743 669518 719909 748358 783898 834162
33531H34162M1918L7778O5184R0217Q7680J04935J72222K19411J83565J37712
33521A974784J95246L30829M20396M30649M40270M82011M91188M23324L08549
33512E497246J67591j9659k29588l76025m19365m16240m22238m21535l94589l75560
33502B590038l81264l51331k38930j15467r2244j52398j57897m7887N7495J6580
33492A126695j27606j95535j13337k204P020n0146n6503K149M2608L1909J3981
33481F79031M313k6558o1654m3624J2942K6678j3571l3231j6069l1174p8712n8732
33469C59639M0143P8197r620p8918j107J15337R5346k3029o8324j4858J9033L427
33457E15266K0150O9468N9653M907L3551J52411J91905O5671p8386o8934N7114
$$ plain form
33531 834162 876080 913858 979042 1069259 1156939 1261874 1434096 1653507 1837072 1974784
33521 1974784 2170030 2500859 2921255 3351904 3792174 4274185 4765373 5188697 5497246
33512 5497246 5664837 5645178 5415590 5039565 4620200 4203960 3781722 3360187 2965598 2590038
33502 2590038 2208774 1857443 1618513 1503046 1410802 1258404 1100507 1052620 1110115 1126695
33492 1126695 999089 803554 690217 688013 695033 644887 588384 590533 633141 665050 679031
33481 679031 683344 656786 595132 551508 564450 591128 577557 544326 528257 497083 418371 359639
33469 359639 399782 477979 468359 389441 388334 503671 599017 575988 507664 492806 511839 515266
33457 515266 535416 604884 664537 669444 702995 855406 1047311 1112982 1034596 965662 1022776
33446A022776J43641J33109Q1815L4199l838j1641K5771O7602O5561M3523O4419
33435A666937J33995J94200K00831J62281J13383Q8846J07337J47430J57422J21695
33425C094357R2610J15943J50859J20935L2861k3745p542J0856m2613j27549j47318
33414C269654r7800p4026j22034j72073j59135j26805j38541j55403j06475l6576
33404B080786n5518j49497j80503r8989k1472m0961q9515p5005m0173p2190j40011
33393A116952j48156r6347o0937n3286j9550L5013L9848j7649o4201n2189j5828
33382F63670J579M305P014l53k5915n1153m8987j0863L8090M4988j5801q4395
33370E22179p2421J15J0348p8035j34154n4616O1596N6657m6553r6226n0797m783
$$ plain form
33446 1022776 1166417 1299526 1381341 1415540 1411702 1400061 1425832 1493434 1558995 1602518 1666937
33435 1666937 1800932 1995132 2195963 2358244 2471627 2560473 2667810 2815240 2972662 3094357
33425 3094357 3186967 3302910 3453769 3574704 3607565 3583820 3576278 3587134 3544521 3416972 3269654
33414 3269654 3171854 3097828 2975794 2803721 2644586 2517781 2379240 2223837 2117362 2080786
33404 2080786 2025268 1875771 1695268 1596279 1574807 1533846 1444331 1369326 1329153 1256963 1116952
33393 1116952 968796 872449 811512 758226 738676 773689 813537 795888 731687 679498 663670
33382 663670 665249 669554 676568 676215 650300 599147 550160 539297 577387 622375 606574 522179
33370 522179 449758 449873 460221 382186 248032 193416 255012 311669 265116 168890 118093 113310
33358A13310J308K8250Q4363Q5532J0701m1445q814L7692J8294l3543m3210j2794
33346B39644K604j5750m1595m9723l2818jK2427J6185p44l206l027k0042l0379
33333H3575j616M0383M4200J3410j1092k4620m3884m9759k4568j0163l8557m7450
33321g0141K6126J10719R0088m260l7828P286J9473l4665o0780j9834Q654j0904
33309B3934q745L4966L6282k4393m1462K8506P6591L1010j9739j90J2323m8529
33297A00554q2855Q946J27773J16532M605o1343n3033m8851m7969J4037R4351
33286A72747P6271k5992p0635j6582J6645m0456r1293l8951N9083R2021N8735
33275A91593L4718L8884K7939q893l5415m0307n0570o4528l6494M0367Q7066L0648
$$ plain form
33358 113310 114618 142868 227231 312763 323464 282019 273205 310897 329191 295648 252438 239644
33346 239644 242248 226498 184903 135180 102362 102361 124788 140973 140229 137023 133996 113954 83575
33333 83575 81959 122342 166542 179952 168860 144240 100356 50597 26029 15866 -22691 -70141
33321 -70141 -44015 66704 156792 152532 114704 121990 141463 106798 46018 26184 34838 23934
33309 23934 15189 50155 86437 62044 20582 49088 125679 156689 136950 136760 149083 100554
33297 100554 17699 26645 154418 270950 275555 214212 161179 112328 64359 78396 172747
33286 172747 249018 223026 152391 135809 152454 111998 20705 -18246 40837 132858 191593
33275 191593 226311 265195 293134 284241 248826 208519 157949 93421 56927 97294 184360 215008
33263B15008p9875j16050l2161Q2868J35005J27552R1301O815j14444j57267m5557
33252A13195R5415P9014o2502j14704p950Q6155L9105m9417n1433j6131l6068
33241G4679o0007o327N4614J1758p8494p8054M3K7892q871o372M9489N7075o126
33228C1299l8112L901L5760J1739O477O2916R3958K5456o9641p7572q083L9077
33216A17175K0070j9975k6762R659N6131N6155j5653r5947q5125J2858P1885J2229
33204A12700q2426q4780j256N6577L9081J125j0360j6207l5531l6408O108N6741
33192E364O6287L7361Q712q04k96J491J872l605q093R008M1174L6431l1364r1331
33178G2207m6174Q0078J44613P1299m2647o7001j7602l745m2837m6603J2319M4586
$$ plain form
33263 215008 135133 19083 -13078 69790 204795 332347 423648 430463 316019 158752 113195
33252 113195 208610 287624 225122 110418 102468 188623 227728 178311 126878 110747 74679
33241 74679 14672 8345 62959 74717 -3777 -81831 -81788 -53896 -62767 -69139 -19650 37425 31299
33228 31299 -6813 -2912 32848 44587 51064 113980 207938 233394 163753 86181 78098 117175
33216 117175 137245 117270 90508 100167 156298 212453 196800 100853 15728 28586 100471 112700
33204 112700 30274 -54506 -55762 815 39896 41021 30661 14454 -21077 -57485 -51377 5364
33192 5364 71651 109012 117724 116920 116624 118115 119987 116382 108289 117297 158471 194902 163538 72207
33178 72207 26033 106111 250724 322023 279376 212375 194773 191028 148191 101588 113907 158493
33166A58493m522n3953r928Q3826J06724L3046m3517m7708r975n45l0015m7263
33154A34663j4331M4094O9362L7914j0254j9885J3049M0335K2069k9998o6527
33143B20491m5009K7321Q1515M6867m9659q5340M409J15229R7781l2945j14423
33132B66237o2583L0721N4840K4625R907J4743L968j7548k7665l6606m8890l0375
33120A81374K1135L3479l2708r3576n4643L5004N3254j905j8004L6298N8202r699
33108B08211p3229l5139M8096N7583l080k6976J8607N0462J7619j7455N304L6696
33096B86699O723m4018k4848M2737M0563n8409j32664q8337P006L6725o3k0686
33084E1428O087M6486P3781O6429j3546j40951j80652m6106J34108J54491K1630
$$ plain form
33166 158493 153971 100018 90090 173916 280640 313686 270169 222461 212486 211941 181926 134663
33154 134663 120332 164426 233788 271702 261448 241563 254612 294947 317016 287018 220491
33143 220491 175482 202803 284318 331185 281526 196186 200595 315824 413605 380660 266237
33132 266237 203654 234375 289215 313840 323747 338490 342458 324910 297245 260639 211749 181374
33120 181374 202509 235988 203280 109704 55061 90065 143319 141414 123410 159708 217910 208211
33108 208211 134982 99843 147939 205522 202442 175466 194073 244535 262154 244699 250003 286699
33096 286699 293422 249404 224556 267293 307856 249447 116783 28446 35452 72177 72114 51428
33084 51428 57515 104001 177782 244211 230665 89714 -90938 -137044 -2936 151555 173185
33073A73185n7739R165P7728J8880p5208n4347M8891Q4541J6535n1601n0300j9739
33061A19991j2286j7741q403O705L562j2481r298K8013O6625N8361J1685k914
33049B31819M6000Q5471L6863n5557q1687k9804Q728p482k5596j6963j8755k9976
33037A43061R271Q8241R8691L503q1567n3518L2812P0406N5447M2905L2729L448
33025D45429j1201J7168L4359j0638n7371j9279O7160R3855N5787N5763J32105
33014H03137J89284J33895M798p9330o7313k9447o1996j56774j98366j13585J3949
33003D38252M1595l9126r4944m4400L7387M5286j1231m9125l5187o156r35j7875
32991B63541k1148K2418Q7742R1238L33q5983n2673N7426R6433L1120k0070J2799
$$ plain form
33073 173185 115446 124611 202339 221219 146011 91664 140555 225096 241631 190030 139730 119991
33061 119991 107705 89964 81561 88266 91828 79347 70049 98062 164687 223048 234733 231819
33049 231819 277819 363290 400153 344596 262909 233105 241833 234351 208755 191792 173037 143061
33037 143061 152332 240573 339264 342767 261200 207682 240494 310900 366347 409252 441981 445429
33025 445429 434228 451396 485755 475117 417746 398467 465627 559482 615269 671032 803137
33014 803137 992421 1126316 1131114 1051784 984471 955024 893028 736254 537888 424303 438252
33003 438252 479847 440721 345777 301377 338764 384050 372819 323694 288507 282351 281416 263541
32991 263541 242393 264811 352553 443791 444124 358141 305468 362894 459327 490447 470377 483176
32979D83176M9481N498p6886j03905n1142L2123O9714N180j15554j36593J3445
32968A74537J63959J09106o5593q5945Q5357J88415Q1077o2407p2750l6324p0789
32957D08643r5762j8054O1352K7699l5267r708M1375J6940k0554J7178N6159R152
32945D59153l6506J4320O0977j0514r0941l2571P1030M9528k6714K4081J50489
32934F32332J52820M3862J5559P6828L7498j29655k08937r0110N7919N6539m1606
32923F03049q2305k9300L8616N0390L18n6683n3816l01J9389j5027r842P2780
32911E37268J14791L1999o3996m5884J4502q618n7608r271P3949M1894o8051q6455
32899D74520O055P2466N8541L2629K0504o404j4677L8627Q4659M4803j3437N682
$$ plain form
32979 483176 532657 538155 461269 357364 306222 338345 408059 413239 297685 161092 174537
32968 174537 338496 447602 382009 296064 381421 569836 650913 588506 515756 479432 408643
32957 408643 312881 294827 356179 383878 348611 338903 380278 397218 376664 393842 450001 459153
32945 459153 422647 436967 497944 487430 396489 363918 434948 484476 457762 481843 632332
32934 632332 785152 829014 844573 921401 958899 829244 620307 530197 588116 644655 603049
32923 603049 520744 491444 530060 580450 580768 524085 470269 469968 489357 474330 464488 537268
32911 537268 652059 684058 620062 574178 588680 580062 522454 513183 587132 629026 560975 474520
32899 474520 480575 553041 611582 644211 664715 658311 643634 682261 766920 811723 798286 803968
32887H03968M2881M243m2729J60N2540N808m1797M2319J41342O7687q3411p4972
32875I18039O2778R6825L157k8692L2592L0775m3276k8564P7961R5739n236m9096
32863A163002L3393J22749J64880K28191K92126K54291J53075J11788Q1268p1369
32853B533394k53236k48611j03004n9691j32526j09598K1295M2766o8795q5523
32843A536471M8157J17968M0856p118N3346P9084J8925P020O3880M4514m8956
32832A954147m4680N7867P4486j945M520P9300M1112m8213N3183K65448K40714
32821B675939j5203r3033J37198L19029K36713J27910J81970K32397J67010J66241
32811D136171L06537L77026L04625L22286N17825O51033N89620M83612L78052
$$ plain form
32887 803968 846849 851092 808363 808523 861063 866871 825074 867393 1008735 1076422 993011 918039
32875 918039 980817 1077642 1080799 1052107 1084699 1115474 1072198 1043634 1121595 1217334 1212098 1163002
32863 1163002 1196395 1319144 1484024 1712215 2004341 2258632 2411707 2523495 2604763 2533394
32853 2533394 2280158 2031547 1928543 1868852 1736326 1626728 1648023 1690789 1621994 1536471
32843 1536471 1584628 1702596 1743452 1736334 1789680 1868764 1887689 1894709 1958589 2003103 1954147
32832 1954147 1909467 1967334 2041820 2039875 2044395 2123695 2164807 2116594 2169777 2435225 2675939
32821 2675939 2660736 2567703 2704901 3023930 3260643 3388553 3570523 3802920 3969930 4136171
32811 4136171 4442708 4819734 5124359 5446645 5964470 6615503 7205123 7688735 8066787
32802H066787J41272j13763q1990J56251K06324R6788K61781O78784Q09649N77759
32792A0799642N48462Q88990J068082R15975R98867J514211J848173J763739J952559
32783B2298700K759682L474606L653972L978038M884869N623346N836793O783729
32775E9293735R455077J2717912J5341386J8923516K6126508L5698135M1294671
32768B18850940L6215865J8837126n939555k9064515m1946061m1653375l2879630
32761A22420795k3548473j7857932j4499456j1121144p953950o242136n578893
32754C5618811m711752l632885l105710k977338k519588j847472j608948j691411
32746A3523707j467947r93802q35270r71029q94634o04177n35800o69381n84358
$$ plain form
32802 8066787 8208059 8094296 8012306 8168557 8374881 8471669 8733450 9412234 10221883 10799642
32792 10799642 11348104 12237094 13305176 14221151 15220018 16734229 18582402 20346141 22298700
32783 22298700 25058382 28532988 32186960 36164998 41049867 46673213 52510006 59293735
32775 59293735 68748812 81466724 96808110 115731626 141858134 177556269 218850940
32768 218850940 255066805 273903931 267964376 238899861 196953800 155300425 122420795
32761 122420795 98872322 81014390 66514934 55393790 47439840 41197704 35618811
32754 35618811 30907059 27274174 24168464 21191126 18671538 16824066 15215118 13523707
32746 13523707 12055760 11061958 10226688 9255659 8361025 7756848 7221048 6551667 5967309
32737E967309k92219k02066l42446l58977k12785j94927l12119k94424j50027
32728C607319j25509j94104j38142l7012j26421k89308k36398p1369j14726k81300
32718A993030k16448L4328Q7107r2526j51886n050M4503j11692k08262j04734
32708A268370L818k0306o0891l8237l6614o9558m1137J9969p555p1810k3548P0413
32696I92914K1724j07371q5002N9329O2398j04112j70750k5728J18550R1597j1543
32685H42006n6133n2528m3000k5683l1757q6302j02251o370Q5090L3743o3509
32674D93306l5838M1671j7312j45515j20473L2996Q1507q289m4030K0293K9605
32663C27921m4165n2911K2547L8356j1544K2884J29818J18925k5903r2715r208
$$ plain form
32737 5967309 5675090 5473024 5130578 4771601 4558816 4363889 4051770 3757346 3607319
32728 3607319 3481810 3287706 3149564 3112552 2986131 2696823 2460425 2389056 2274330 1993030
32718 1993030 1776582 1810910 1898017 1805491 1653605 1648555 1693058 1581366 1373104 1268370
32708 1268370 1272188 1251882 1190991 1152754 1116140 1046582 1005445 1025414 1017859 946049 922501 992914
32696 992914 1014638 907267 822265 881594 943992 839880 669130 643402 761952 853549 842006
32685 842006 785873 733345 690345 664662 632905 546603 444352 437982 523072 556815 493306
32674 493306 457468 499139 481827 336312 215839 248835 330342 322053 278023 298316 327921
32663 327921 283756 230845 253392 291748 280204 303088 432906 551831 525928 433213 424005
32652D24005M2701l3516q9723k1655N2277K2710l3732k7571l493r332J745M8684
32640C73100O1439R729m7537p3712p7883l4514O3647J06065L119j21010q7091
32629A75352L8413M7035n1971n7589N4151R0785m802o5022j4223J3689m9672q4509
32617I1637k4888K4541M831L941N5634O2014J761m420P6648J08902K4066o2716
32605C61951o1963m1042o2368p4701m4709k4556k4431J3613O9490M9023l2342
32594A27965n4703n070J2838r322J8774O9690K2719p8950o1281O0847Q2077k9144
32582A56440p0634J7028L8269q1969j39051j9774Q3931K4901l3181P0270J79175
32571B25405Q5435j06497j53156m9942K3516J3028M413J9194J0305k915K7475
$$ plain form
32652 424005 466706 433190 343467 321812 374089 396799 363067 335496 332003 322671 324416 373100
32640 373100 434539 444268 396731 323019 245136 210622 274269 380334 383453 262443 175352
32629 175352 213765 260800 208829 151240 205391 296176 291374 226352 212129 225818 176146 91637
32617 91637 66749 91290 96121 100062 155696 217710 219471 215051 291699 400601 424667 361951
32605 361951 299988 258946 196578 121877 77168 52612 28181 41794 111284 160307 127965
32594 127965 73262 68192 81030 71708 90482 160172 182891 103941 42660 103507 185584 156440
32582 156440 85806 102834 141103 59134 -79917 -99691 -15760 9141 -24040 46230 225405
32571 225405 310840 204343 51187 1245 24761 37789 42202 61396 71701 68786 96261
32560I6261O3098M3489j195j6939k2053l6100j5777L9733L7011n5026j20763p4895
32548f3156N888L3113M6828Q9697Q7570r472j00230q3916j6761J0528K4130O5568
32536H9787P0906n808p0833l7396K0310K498l9430p938O2923Q0571N0036K0823
32524B36449k5832j01233j17859j4567J11662J31417O1168k029l6395o8271p7345
32513I7165m4767j4166q361J8698O3608L4800p1826j07763l647Q9207L4536o5001
32501B2483m9432L5796M9496M115K579K5851j0283o4075l4506M1512M8526k759
32489F9303j1371K1052J1183l1821k5321K2899K9500j0698l0114j8209j2913q99
32477A2591M4877P4035L1564l0377l4459o762l273P729N7518O9910o131o2705
$$ plain form
32560 96261 159359 202848 201653 184714 162661 126561 110784 150517 187528 132502 11739 -63156
32548 -63156 -57268 -24155 22673 112370 199940 190468 90238 6322 -10439 89 24219 89787
32536 89787 160693 154885 84052 46656 66966 69464 30034 22096 85019 165590 215626 236449
32524 236449 210617 109384 -8475 -23042 88620 220037 281205 279176 242781 174510 97165
32513 97165 52398 38232 29871 48569 112177 146977 75151 -32612 -36259 52948 87484 22483
32501 22483 -26949 8847 58343 62458 65037 90888 80605 16530 -17976 23536 72062 69303
32489 69303 57932 78984 90167 58346 33025 55924 85424 74726 44612 26403 13490 12591
32477 12591 57468 131503 163067 132690 98231 91469 88196 95925 153443 223353 217222 154517
32465A54517l642O1523o845j16706q9807K2147K8797n3186l1008J06038J50911
32454B22739L0658p9142n2642K0293L9316L5524K8494l8030j28679j00295M5397
32443B3633J05186j0355j14968m7841O3321K7705q7902q5771K8534P3014j927
32432b7371n4216k166N7947L1939k6264k1492L2276M9050L050m6468m3187K502
32420d4400L8764L4149L989j7397j9814k3335m1034m9676j4223N7357J03370P4157
32408A01907P12l7598j9301m200k5477k8048K2592M5565l0601j08788m4931J00188
32396b7980J23082M497m6680N6612J23713J4906j06476n5460M3135k6686j70788
32385f8125j20727J00899J87689L3206j13511n5642P3733P3552k1571o2778l2818
$$ plain form
32465 154517 150875 212398 205553 88847 -960 21187 49984 -3202 -34210 71828 222739
32454 222739 253397 174255 121613 141906 181222 216746 245240 207210 78531 -21764 23633
32443 23633 128819 118464 3496 -44345 18976 46681 -41221 -126992 -98458 -25444 -27371
32432 -27371 -81587 -83753 -25806 6133 -20131 -41623 -9347 39703 42753 -3715 -46902 -44400
32420 -44400 -5636 28513 32502 15105 -4709 -28044 -69078 -118754 -132977 -75620 27750 101907
32408 101907 102619 65021 45720 41520 16043 -12005 10587 56152 25551 -83237 -128168 -27980
32396 -27980 95102 99599 52919 109531 233244 248150 141674 86214 129349 102663 -68125
32385 -68125 -188852 -87953 99736 132942 19431 -36211 37522 111074 89503 26725 -6093
32374f093k184K7154P5001Q2208M165p4633n2998K7324N7611L3460K3662K2810
32362B17487k6819r4455q0747J5645P2436J6291p2455p3486J8276R9519Q6154
32351A77846n728r2009j05937n2379Q644K5166j233k8263k1237J3970M0091K9199
32339a1870m724k1883p463J1831J1315L607J0582K5358L0261L0447L7446L8647
32327A53554J7016j6427m1643n9472o9849n0065J962L3984M919m1557l3172K0033
32315h0717M4449K4882K4586O8154Q5780J8776p6528r0178k722Q3173O2329m9767
32303A12217j33181r9474R513P6659M8814j4606l2156L889L9385L0510j7035n5901
32291c1366l5885L5636P7380K6650n9916o9244L951M7485M817m7210l5451L250
$$ plain form
32374 -6093 -8277 18877 93878 176086 180251 105618 52620 79944 137555 171015 194677 217487
32362 217487 190668 96213 15466 31111 103547 119838 47383 -26103 -7827 91692 177846
32351 177846 172118 80109 -25828 -78207 -69563 -44397 -45630 -73893 -95130 -81160 -41069 -11870
32339 -11870 -16594 -38477 -45940 -34109 -22794 -19187 -8605 16753 47014 77461 114907 153554
32327 153554 170570 154143 112500 53028 -16821 -66886 -64924 -30940 -26021 -67578 -100750 -80717
32315 -80717 -36268 -11386 13200 81354 167134 185910 109382 19204 16482 99655 161984 112217
32303 112217 -20964 -120438 -110925 -34266 14548 -58 -32214 -28325 11060 41570 24535 -31366
32291 -31366 -67251 -31615 45765 72415 12499 -56745 -52794 -5309 -492 -47702 -83153 -79903
32279g9903J5648K5628N3744M5629k1825n8323L316P4876M3168m2879n4999N263
32267I343L0376k024j7856o039l2606r1147q5444J1817J05586J16596P3352L7672
32255A49626K2497P779k5039p9557j16623o9968M9673J21547P1099q140Q48M7235
32243A70977J2013o7199n3675M0797O5345j2910o0990j6684K1538q150k9022P658
32231F9698K5313k2163n0535L146O2019L8138l4981q2688r2145o1945L1479J39730
32219B5066J39959J5706q0634m0519M6006N0507k070k2528k3109n3773o8318o196
32207a9903O2382K6719p5134j04567l2216L8325M3915K8141K8798J7746j9923
32196e717l8752k155N8099P9060L2761m9838r9809o8654J4280O6821N1119O167
$$ plain form
32279 -79903 -64255 -38627 15117 60746 38921 -19402 -16086 58790 101958 59079 4080 9343
32267 9343 39719 37695 19839 13800 -18806 -109953 -195397 -183580 -77994 38602 111954 149626
32255 149626 172123 179902 154863 75306 -41317 -111285 -61612 59935 131034 122894 123742 170977
32243 170977 182990 115791 62116 102913 168258 155348 94358 77674 99212 91062 62040 69698
32231 69698 95011 72848 22313 25459 87478 125616 90635 7947 -84198 -146143 -114664 25066
32219 25066 165025 180731 100097 59578 105584 156091 154021 131493 108384 54611 -13707 -19903
32207 -19903 42479 69198 -5936 -110503 -142719 -104394 -60479 -32338 -3540 14206 -5717
32196 -5717 -44469 -46624 11475 90535 123296 73458 -26351 -95005 -80725 -13904 37215 43382
32184D3382k7799n3000n7914j088R7024J28370L7924p7942r5172k5506K9178L1495
32172B8952K2068K0218J1108O277K3832K8552j8177o8778m6435K0608K6823m2240
32160A2808p6914j1317P1847O3250j6038n4191j1543L1106p181r3297j19739l9578
32148b50787P4783J16669O2503j7329m6334j1975L9046M4905j9099j00246j01186
32137b09050K823J05159Q9466j1096n8996q488M3687K0676k6956k2428K0408M5341
32125i454M7325N0124M4895J5095j8445k9980k8696k5799p418K0827J5297l4453
32113C9318o8322l8715J7142L6050J3726j4657l0410k2731K4016Q4986Q8681J1278
32101A40362o8821o6567o68M4404L1259n021j6535J0721M7232M1617j5095n4148
$$ plain form
32184 43382 15583 -37417 -95331 -96419 605 128975 166899 88957 -6215 -31721 -2543 28952
32172 28952 51020 71238 82346 88623 112455 141007 122830 54052 7617 28225 55048 12808
32160 12808 -64106 -75423 -3576 59674 43636 -10555 -22098 9008 1827 -91470 -211209 -250787
32148 -250787 -176004 -59335 3168 -14161 -60495 -72470 -33424 11481 -7618 -107864 -209050
32137 -209050 -206227 -101068 -11602 -22698 -81694 -90182 -46495 -25819 -52775 -75203 -54795 -9454
32125 -9454 37871 87995 132890 147985 129540 99560 70864 45065 37647 58474 73771 39318
32113 39318 -29004 -67719 -50577 -14527 -801 -15458 -45868 -68599 -44583 40403 129084 140362
32101 140362 71541 4974 4306 48710 79969 74948 58413 69134 116366 157983 142888 88740
32089H8740j9167K6675j4864r4863o4954O6721J02788l8331j61871q0563R2030
32078i7659J15891j3997q9182j9602O4199M4649k6921m8847j0032L5543M4977
32067i81P709m3922m5049J8876O5900K9606k5188J699P5984P8117l265o1662n0011
32054D7813l0199l4140j2688M3938O0827K976n9164n8539j6822K0816M9191O0582
32042G4591K5344l9266o0920j8198K1650J2868l015R522R101l1954m8567J4871
32030c3973Q5726N4580m6505p2428K2297J08689O7685l7548n8135J8255N2082
32019A60725l0331j15498p1763M2414N6793n6878j43636r2058K6883R4153R5453
32008c3743O9217J4131n6061o1243K9704J08922P1828j8541l4416J2478J3513
$$ plain form
32089 88740 69573 96248 81384 -13479 -78433 -11712 91076 52745 -109126 -189689 -97659
32078 -97659 18232 4235 -84947 -104549 -40350 4299 -22622 -71469 -81501 -45958 -981
32067 -981 6728 -37194 -82243 -63367 2533 32139 6951 8650 84634 162751 159486 97824 47813
32054 47813 17614 -16526 -29214 14724 75551 78527 19363 -39176 -55998 -35182 14009 74591
32042 74591 99935 60669 -251 -18449 3201 16069 13054 22576 31677 -277 -48844 -33973
32030 -33973 51753 106333 59828 -12600 9697 118386 186071 148523 90388 108643 160725
32019 160725 130394 14896 -56867 -14453 42340 -14538 -158174 -250232 -223349 -129196 -33743
32008 -33743 35474 49605 -6456 -67699 -37995 70927 142755 124214 89798 102276 115789
31997A15789l6652m4312m315j5873r2992j15741j9490R6928J14208M3883k2039
31986A9394l3837n864K2981J5699k5683m0360J4269P4760M3902n5416r9859m5834
31974a15848J9857L1061K9458N7637P0607J7574o5299j03129o9207J1234Q8280
31963b7775R9631K4046o2264n9120J6264N1066J0839j9565K960M737n7710r6299
31951a13190k9969O8440P0659k0820q6298n6328J9845N9951L9819J351J870M7351
31939B681P2945K3715n2162n3784K5845Q1983M5119l5241p9643o9370j9759M8489
31927i182P7399Q244j04232j15717Q894J22201R5718n204m3854j8172k1269n7504
31915f2678l6272O4034J44944J20465J9482o8566r5861p9612n4492k6953J8409
$$ plain form
31997 115789 79137 34825 30510 14637 -78355 -194096 -213586 -116658 -2450 41433 19394
31986 19394 -14443 -20307 2674 18373 -7310 -47670 -33401 41359 85261 29845 -70014 -115848
31974 -115848 -95991 -64930 -35472 22165 92772 110346 45047 -58082 -127289 -116055 -27775
31963 -27775 71856 95902 33638 -25482 -9218 41848 52687 33122 36082 40819 -16891 -113190
31951 -113190 -143159 -74719 -4060 -24880 -111178 -167506 -147661 -87710 -47891 -46540 -44670 2681
31939 2681 75626 99341 47179 -6605 19240 101223 146342 111101 31458 -37912 -57671 -9182
31927 -9182 68217 76461 -27771 -143488 -134594 -12393 83325 78121 34267 16095 -5174 -62678
31915 -62678 -98950 -34916 110028 230493 249975 181409 85548 5936 -48556 -75509 -57100
31904e7100P0483P9178K4139l4180l0435M991J63k8612p745M4324L0861m5654
31892E0413o4904R819O0301J1911m2841j2361L9966K4403j5573k775K1348j3849
31880F5858n4130n464R0278J08631K7404o7338j15546j08932l8292O5268R6474
31869F4211J0566p0362k3187P0531M7144o5052q4049L0249J13104N3893n3933
31858I3115p5637j1630M8341M6555j2324p4998o5377L0024J08967P0032l9393
31847A17675r1714o5154l8868l0878J1778P0784O2762k75j2503M0675N5141j837
31835A17586l3649M657K4839k9628q4114p2195l7003j8010K5764R6121R8201J739
31823I4308p0854k7360M5956L8598o01K5585P1091K7367p2881r7234k5299L1107
$$ plain form
31904 -57100 13383 92561 116700 82520 52085 57076 57239 28627 20882 65206 96067 50413
31892 50413 -14491 -4672 55629 67540 24699 12338 52304 76707 61134 58359 79707 65858
31880 65858 11728 6264 96542 205173 232577 165239 49693 -59239 -97531 -32263 64211
31869 64211 74777 4415 -18772 51759 98903 33851 -50198 -19949 93155 147048 93115
31858 93115 17478 5848 54189 100744 88420 13422 -51955 -21931 87036 157068 117675
31847 117675 25961 -39193 -78061 -108939 -97161 -26377 36385 36110 23607 64282 119423 117586
31835 117586 83937 88594 113433 83805 -309 -72504 -109507 -127517 -101753 -5632 92569 94308
31823 94308 23454 -3906 42050 80648 80047 105632 176723 204090 131209 33975 8676 39783
31811C9783Q608l8614n3756m7236l7293j4160J7759L2591K8809K6769K3394L866
31799i480j1184J1578N4792O5459L0824r377k4429k3808k7059l6437m1289l1084
31787e1494q690N795L176R573M4252O5812K4765l6043k2112N8665Q6075P961p7000
31774A10735p4979k9714k1767l3612j0876K4567K4793J0198J5522R079l4461n1233
31762f1748J2265Q4401P1608J1857j733J3669j4663n2525j5998M7462J6032q0992
31750B9635q4158L0873R7611K1156p7894o3985J7669M6941J3286j3095j0963r633
31738b557j6612k0797k4593k0838J3086O0224O3722J5877k1320j7530j6441l8622
31726b6401l2403K3710N8387J6931m4077m6112m915J8445K0683L1093L5885P729
$$ plain form
31811 39783 48391 9777 -43979 -91215 -128508 -142668 -124909 -92318 -63509 -36740 -13346 -9480
31799 -9480 -20664 -9086 45706 111165 141989 132612 108183 84375 57316 20879 -20410 -51494
31787 -51494 -60184 -54389 -51213 -41640 2612 68424 93189 57146 35034 93699 179774 187735 110735
31774 110735 35756 6042 -15725 -49337 -60213 -35646 -10853 -655 14867 23946 -10515 -61748
31762 -61748 -49483 34918 106526 118383 116650 130319 115656 63131 47133 94595 110627 29635
31750 29635 -54523 -23650 73961 95117 17223 -46762 -29093 17848 31134 18039 7076 -2557
31738 -2557 -19169 -39966 -64559 -85397 -72311 -12087 51635 67512 46192 28662 12221 -26401
31726 -26401 -58804 -35094 23293 40224 -3853 -49965 -54880 -36435 -15752 15341 51226 58955
31714E8955k9231l5250k0451j3980p830J2308K5890K2357L3922O6046N8863j2627
31702A58972o8151l7471J9317P737m2857l5009K5129M2143j168k2628R236K9232
31690H4482J528k2845r747j883l1483n9917n0402k5795j0183J5999N6524O2472
31678H750Q421m9142m3910J0644M9428L8698n576m6235m1872K3242R7443R8157
31666A48048K1947l6955j7610K1307L308m1361l6084M113j175m9987m7215L8141
31654F477J04414N8368m7311q7404l4441J9029J25n0250m6592K1421P9693O9338
31642I2867J6343j4156o714l505k7591m2026r696L9070M1639p631m9996m5254
31630a6650j4849R478K9567M4993K2445m8439j02555o7842K5518P2612L6464o064
$$ plain form
31714 58955 29724 -5526 -25977 -39957 -47787 -35479 -9589 12768 46690 112736 171599 158972
31702 158972 90821 53350 72667 80404 37547 2538 27667 69810 68642 46014 55250 84482
31690 84482 86010 63165 53418 51535 20052 -39865 -90267 -116062 -126245 -110246 -53722 8750
31678 8750 17171 -31971 -75881 -65237 -15809 22889 17313 -28922 -70794 -47552 49891 148048
31666 148048 169995 133040 115430 136737 140045 98684 62600 66713 65538 15551 -31664 6477
31654 6477 110891 169259 121948 34544 103 19132 19257 -30993 -77585 -56164 23529 92867
31642 92867 109210 95054 88340 84835 57244 15218 5522 44592 86231 78600 28604 -16650
31630 -16650 -31499 -22021 7546 52539 74984 26545 -76010 -143852 -118334 -45722 -9258 -15322
31618a5322J3417N3428L4068l9080q7967p4899l6371r089J5713N0134P1054N0876
31606B5962N85l9684m1533j0883K0957K7744J6358J5393K8993K6049o482l0637
31594C2822j0121L3751N8005N7940M3977k219q2245j28969q6732j5732j3401n1045
31582a63969j5914Q2782J02113R87p0979o837Q0948M4166n8758o2489L9385R8545
31570F9980M9556j8954l0695j3626m393J0501K2569j7107r6681j18338l0676Q4505
31558i3359J13194M7208k5298l2476J4476M7189J3638o3312j05956p4770j4699
31547a74165J8678L5531O6099Q7879O7962L4025K2967L826n4417q7181k5376N8388
31535E4216L8482n0506n3112M9498J00493K7340l9947O587P3952L1381p7663j19866
$$ plain form
31618 -15322 -1905 51523 85591 46511 -41456 -116355 -152726 -161815 -146102 -95968 -24914 25962
31606 25962 26547 -13137 -54670 -65553 -44596 -16852 -494 14899 43892 69941 63459 32822
31594 32822 22701 56452 114457 172397 216374 214155 131910 2941 -83791 -99523 -112924 -163969
31582 -163969 -179883 -97101 5012 5999 -64980 -71817 9131 53297 -5461 -67950 -28565 69980
31570 69980 119536 100582 69887 56261 51868 62369 84938 67831 -28850 -147188 -177864 -93359
31558 -93359 19835 67043 41745 9269 23745 70934 84572 21260 -84696 -159466 -174165
31547 -174165 -155487 -119956 -53857 34022 101984 136009 158976 162802 108385 21204 -4172 54216
31535 54216 92698 42192 -10920 38578 139071 166411 126464 133051 207003 238384 160721 40855
31523D0855p5018k4094j003K1391M0665K7197q459k9694k8547j1340K5052N5077
31511C2082K7281m2412n9284N626M9545m086p6697o3867l468O007k0758O99O0495
31498h8837P0839J5022m4097p7122r2923o2548L6893J26232R9984j3557q7590
31487a17704p8320m8815k6311K6938R6377J06741N4978K8062N9012P8805M1390
31476B21153j2664m7057p6010q9030m1259M1453N9048j0344n9633j4112N4885
31465B6430M9260q395k8719N160L3258J6615k4975n1391l8025M860K8829l308
31453I599n5036n1001J4343N9702K7696m2097p3279l8135L4424R2690R3931M2854
31441A15691l992j1579j8860o1992q8354l6285L8582L3403k8864k9917M6469R1430
$$ plain form
31523 40855 -34163 -58257 -59260 -37869 2796 29993 21534 -8160 -36707 -48047 -22995 32082
31511 32082 59363 16951 -42333 -36707 12838 8752 -67945 -131812 -135280 -129273 -150031 -149332 -88837
31498 -88837 -17998 -2976 -47073 -124195 -217118 -279666 -242773 -116541 -16557 -30114 -117704
31487 -117704 -196024 -244839 -271150 -244212 -147835 -41094 13884 41946 100958 179763 221153
31476 221153 208489 161432 85422 -3608 -44867 -3414 55634 45290 -14343 -28455 26430
31465 26430 75690 67295 38576 43736 76994 93609 68634 17243 -20782 -15922 12907 9599
31453 9599 -45437 -96438 -82095 -22393 5303 -36794 -110073 -148208 -113784 -21094 72837 115691
31441 115691 111699 100120 81260 19268 -69086 -105371 -66789 -33386 -62250 -92167 -45698 45732
31429D5732N6473J2389k430l5936q3607n8740L6637P3412O680l6755K2522P4941
31417A11318K1356m4741n992O5825L7749n3888q0456m1349k6568k9736J6694P1496
31405D1708L7422m6972n1789K1875M3677j9016n1594N666O7987N9930J7568j0102
31393A16360l7192o9164o4234j4347K7483L5138L6207L1063j3478o7317m6898
31382f6379M0952P8345J1932n9035l8028K4164K7091j4423n697O6336J05021L9734
31370B10013p6528j29185p4786J2217L1614j8466m6235j373N3147M2519q730l1979
31358c7772k5096k5346k1299J0741K5514k4662p7848m1679M3944O3547K5662M2683
31346d1611J09604Q7643m9840j40973q4501O480O655k2475K8339J08354R7435
$$ plain form
31429 45732 102205 114594 112164 76228 -7379 -66119 -29482 43930 50610 13855 36377 111318
31417 111318 132674 87933 81941 147766 185515 131627 51171 9822 -16746 -46482 -29788 41708
31405 41708 79130 32158 -19631 2244 45921 26905 -24689 -19023 48964 108894 126462 116360
31393 116360 79168 10004 -54230 -68577 -41094 -5956 30251 61314 47836 -19481 -66379
31382 -66379 -25427 52918 64850 5815 -32213 -8049 19042 4619 -1078 65258 170279 210013
31370 210013 133485 4300 -70486 -58269 -26655 -45121 -91356 -92729 -39582 2937 -5793 -37772
31358 -37772 -62868 -88214 -109513 -98772 -73258 -97920 -175768 -217447 -173503 -109956 -84294 -41611
31346 -41611 67993 155636 105796 -35177 -119678 -113198 -106543 -129018 -100679 7675 105110
31335A05110J4158k6641o375p31k0735j746N7605P4698J4242n9308p7064l8782
31323C4431J6231M8784L1074k6749o7429m9062N07L0606L4601K6722J699k6132
31311E5283j998P6689J07065J5259j07825j17085k1859M0158J5250j7254j0236
31300C3447j8065o3772p1935l112N4342J4930o0960n1328M6227J10690O2273m2990
31288I747r3264m9873K1873L4884j9692o6224m5785L610O802k9646k3701N2689
31276a98580J21252J04376K5837l6087m9054l4395j2059J0906K0045R336L278
31265c5145K2304L9653J5790l2390m3720P73M6082L5928j4612m5675l3837j4780
31253e9629k4310m5391l3881J6238O2062O9895N4726M3019K4185k2902o9489n5721
$$ plain form
31335 105110 119268 92627 86252 85521 64786 63040 120645 195343 209585 150277 73213 34431
31323 34431 50662 99446 130520 103771 36342 -12720 -12213 18393 52994 79716 81415 55283
31311 55283 53285 129974 237039 252298 144473 27388 5529 45687 60937 43683 33447
31300 33447 15382 -48390 -120325 -123437 -69095 -54165 -115125 -166453 -120226 -9536 52737 9747
31288 9747 -83517 -133390 -111517 -76633 -96325 -162549 -208334 -204724 -197922 -227568 -251269 -198580
31276 -198580 -77328 27048 52885 16798 -32256 -66651 -78710 -67804 -47759 -38423 -35145
31265 -35145 -12841 26812 42602 10212 -33508 -32735 13347 49275 34663 -11012 -44849 -59629
31253 -59629 -83939 -129330 -163211 -146973 -84911 -15016 39710 82729 106914 84012 14523 -41198
31241d1198J8694P1625L9710l2854n3232q597K2093r098m4107n406Q1749J13300
31229A52679M6111m5127o9903l2539m283j8863m4692m6730k6833j406K0088K7067
31217d4431J1687j2370k2006j4922L14L1509P6224Q3306P887r5508j15108l5782
31205a29200L4062K3893l413K3093N4832J4332n8792o4901l038M1346L9146L2922
31193D282K7330j2470n4177j9380O9401R2121J9853l0043J1447M5332k3865j09458
31181B0373o7901O7585J24198L7572p1854q2465j6407L6373M7022M1941K6929
31170A63366j4933o8814q6246m5846J4914M4617L7371K3243Q140l3616q9761q7716
31158a35281L042Q9857O4714k8929m6926L4204P7064P039o2742j9790O0351M5916
$$ plain form
31241 -41198 -22504 49121 88831 55977 2745 -5852 16241 7143 -36964 -42370 39379 152679
31229 152679 198790 153663 83760 51221 46938 28075 -16617 -63347 -90180 -91586 -71498 -44431
31217 -44431 -32744 -45114 -67120 -82042 -81728 -50219 26005 109311 117198 21690 -93418 -129200
31205 -129200 -95138 -71245 -74658 -51565 3267 17599 -41193 -106094 -109132 -67786 -28640 4282
31193 4282 31612 19142 -35035 -54415 14986 107107 126960 96917 108364 153696 129831 20373
31181 20373 -47528 20057 144255 181827 109973 27508 11101 47474 94496 136437 163366
31170 163366 148433 79619 -6627 -52473 -37559 7058 44429 67672 75812 42196 -47565 -135281
31158 -135281 -132239 -42382 22332 -6597 -53523 -19319 57745 64784 2042 -17748 42603 88519
31146H8519k9723l7555J9923K7042k6774l0232L8500O3405l149n4273j8428J9455
31134E6710k0310o8151l6551K2772K1244n524K0821N7733J3150p2289p4506O588
31122g8313M6763N581j8391L2754Q2872N8568p3k6799k7321k7296j0878K2691
31110F0158K0633l5291p3851m1009N580q656m6279k1841M6980O1784L230l9384
31098f7946j1719K8831J5624k6457l5139j0234J775p782j593L3885O2391N2132
31086C3768J7529j1011k7882l7308k5106J4998M3560J6861l4643l2471K6538M4707
31074B9540l1879j13185q7078J2936O2192L3467J3820M2163N9284M0363M4989
31063A06612Q5182P1597k9445j00662m1536O1105N3608n6921j24321p7089J1721
$$ plain form
31146 88519 58796 21241 41164 68206 41432 11200 49700 113105 109956 55683 37255 56710
31134 56710 36400 -31751 -68302 -45530 -24286 -29810 -8989 48744 61894 -10395 -84901 -78313
31122 -78313 -31550 -25969 -44360 -11606 71266 129834 129761 102962 75641 48345 37467 60158
31110 60158 80791 45500 -28351 -69360 -63780 -72436 -118715 -140556 -93576 -31792 -28562 -67946
31098 -67946 -79665 -50834 -35210 -61667 -96806 -107040 -105265 -113047 -114640 -80755 -18364 33768
31086 33768 51297 40286 12404 -24904 -50010 -35012 8548 25409 -9234 -41705 -15167 29540
31074 29540 -2339 -115524 -202602 -189666 -127474 -94007 -80187 -38024 21260 61623 106612
31063 106612 191794 263391 233946 133284 91748 152853 206461 149540 25219 -51870 -40149
31052d0149N3650L5434j5419o2056n7874M733N5407L0632k6663l4287j346R174
31040d8764R210N0403Q7928L0137p8962r1458M967N0612k5629q1557L494J22845
31028C3226J08297j2515p6938l2418K9374M3266L4300K2472j1539n4689n6078
31017B6758j4061Q583k1204n7964m6077P217M8923M3734M404l0632m1350l9917
31005a11586l4088l104N4869Q1538K9286m7309n3379N833M5083M7494O5161P2260
30993A52058j6457j45838j31224M6341J53380M5347r7725n8009P5070P9781k1409
30982H1315l7753K9325O534j02735j01940L9841J11680J7012p1857k3482M6820
30971e240K0873r981M9845Q9009j4475j49198j35607j2864M8496K6089K9591P1509
$$ plain form
31052 -40149 13501 48935 33516 -28540 -86414 -81681 -26274 4358 -22305 -56592 -57938 -48764
31040 -48764 -39554 10849 98777 128914 49952 -41506 -36539 14073 -11556 -93113 -89619 33226
31028 33226 141523 129008 52070 19652 49026 92292 126592 149064 137525 82836 26758
31017 26758 12697 21280 76 -57888 -103965 -96748 -47825 -4091 313 -30319 -71669 -111586
31005 -111586 -145674 -148778 -93909 -12371 16915 -30394 -83773 -77940 -32857 14637 79798 152058
30993 152058 135601 -10237 -141461 -95120 58260 103607 5882 -52127 22943 102724 81315
30982 81315 43562 72887 79421 -23314 -125254 -85413 26267 43279 -28578 -52060 -5240
30971 -5240 15633 5652 55497 144506 130031 -19167 -154774 -167638 -119142 -93053 -63462 8047
30959H047N9937j1142m9572l1738k1295l0693j2217K1454J1370j9080P760O8421
30947A252N7776k3766n0042K9888J06691P9723l432l9032j0506K0489L888o0619
30935A12310j26978j26963m3188M3755M6562m631j5734J2839n98m9706k8756P4506
30923a06582J23023M0106n9097m5982K5718K5198m1219n9704k109M8020M4294
30912h334K7450K3120O98m4918o4610l9679j7984k8892k7832K8486J00112J08308
30900E5925L7330m9570q3403m8455K1912P8760Q7121M6459p634l2951k1603o704
30888G7187j9727m6466m3157L9L6040K1312k0607k9025R726M6601L9581l86m1854
30875B9264p0850p8976n2364K58L7908L3244M578j9594l8125n3119m2944K178
$$ plain form
30959 8047 67984 56842 7270 -24468 -45763 -76456 -88673 -67219 -55849 -74929 -67169 1252
30947 1252 59028 35262 -14780 15108 121799 201522 198090 159058 148552 169041 172929 112310
30935 112310 -14668 -141631 -184819 -141064 -94502 -99133 -114867 -102028 -102626 -152332 -181088 -106582
30923 -106582 16441 56547 -2550 -48532 -22814 2384 -38835 -98539 -100648 -52628 -8334
30912 -8334 19116 42236 42934 -1984 -66594 -106273 -124257 -153149 -180981 -152495 -52383 55925
30900 55925 93255 43685 -39718 -88173 -66261 12499 99620 146079 138445 105494 83891 77187
30888 77187 57460 10994 -32163 -32124 3916 25228 4621 -24404 -14678 31923 71504 71118 29264
30875 29264 -41586 -120562 -172926 -172668 -134760 -101516 -96938 -116532 -154657 -207776 -250720 -248542
30863b48542M6391N4234M5797N5471N8217L833q1011j01612k7764N1173M5857
30852i7956j3589l4740L75K7994J6170N362K0871K0259k7015o5164k4208O4614
30840a07027J01121N6986O681L730N930l4380p5980n2741J4950N0738L8970L1059
30828D0037M4890M0214L711j8865j520J6707m02k6663j9552J5473M1821M0935
30816A76786J7569j4677l3428k3234k887l671k0091k7157l6140o4547o2737K7273
30804f6941J34028J09393m0340j22430l6855O3577J6795q8686p2261L4763N8649
30793a0308j2082k7444L9407N0029l2849p2214j0926K6212k4171l5375O8139J41206
30781I9624N2169q2326q1053J7888N0599j266l0428j5549j6571j7742L3027P3850
$$ plain form
30863 -248542 -202151 -147917 -102120 -46649 11568 15401 -65610 -167222 -194986 -143813 -97956
30852 -97956 -111545 -146285 -145910 -117916 -101746 -96384 -75513 -55254 -82269 -147433 -171641 -107027
30840 -107027 -5906 51080 57761 61491 67421 33041 -42939 -95680 -80730 -29992 8978 40037
30828 40037 84927 125141 128852 109987 108467 125174 124772 98109 78557 94030 135851 176786
30816 176786 194355 179678 146250 123016 120129 116458 96367 69210 33070 -31477 -94214 -66941
30804 -66941 67087 176480 136140 13710 -23145 40432 57227 -31459 -103720 -68957 -10308
30793 -10308 -22390 -49834 -10427 39602 6753 -65461 -76387 -50175 -74346 -109721 -41582 99624
30781 99624 151793 69467 -11586 6302 56901 55635 25207 9658 -6913 -24655 8372 82222
30769H2222Q417r9281j00518m989M5947K6601L8281Q1962M7441n0296n9041L6335
30757E3081O3250l7386r5691r356P5202K6395m2541P891Q1983K3015r6073q9064
30745c9294L4584J03293O0873j431m2658r6452j27896o4629M0255N8332p992l9976
30733a22991r997J338j6519M057M0335o84q1031n6338O6959J11222J8887n0892
30721i5654L142O7422M0336P311M7507N9459m4645j37281p0217O0561O1745m1136
30709d1450o1921K8455P3733J1438l8542K606M9913J8097m2941n0082j0511K6087
30697c5118M9153N9801L5979j8893n2477l6324j0787j6918l2220j6765J6153K1260
30685c7156p060k3274Q735O3471P6163K4599k7639o947N6048N1964m6662j26829
$$ plain form
30769 82222 90639 -8642 -109160 -114149 -68202 -41601 -3320 78642 126083 75787 16746 53081
30757 53081 116331 78945 -16746 -26102 49100 75495 32954 40845 122828 145843 49770 -39294
30745 -39294 -4710 98583 159456 158025 115367 18915 -108981 -173610 -133355 -75023 -83015 -122991
30733 -122991 -132988 -131650 -148169 -144112 -103777 -104461 -185492 -241830 -174871 -63649 -44762 -95654
30721 -95654 -92512 -25090 15246 22557 70064 129523 84878 -52403 -122620 -62059 -314 -41450
30709 -41450 -103371 -74916 -1183 10255 -28287 -25681 24232 42329 -612 -50694 -61205 -35118
30697 -35118 14035 73836 109815 90922 38445 2121 -8666 -25584 -57804 -74569 -58416 -37156
30685 -37156 -44216 -67490 -58755 4716 80879 105478 77839 70892 126940 178904 132242 5413
30673E413q8836J4507O6364M8110K1323M255k2780k8295K9682R1877N5927n2115
30661A45432r4457l0103K3922j5898p0494l3136O4865J10133O3474j9657p9358
30650F4723r2570n7701Q53L3363J5746j6522j6042J5958M0506L0238q210l8330
30638b7988j7662M7984Q0092J2004j00802j25182k3554Q9455R7260J9984m3855
30627G736n4136m5877m6440l8596J080O3083J05153Q6851J8473l5975l6248k4501
30615F03n3348q4442m4154L7816N8830J5608J1475N9623L4462j00444j71701m2106
30603b77778J44689J46068k2415j10650l375J30620J08226j7221p3764k2906K9480
30592C0974J6930j4054j0729K116j9927n7579n3542l43M6009M3396J2422q649
$$ plain form
30673 5413 -83423 -68916 -2552 45558 66881 71136 48356 20061 49743 141620 197547 145432
30661 145432 50975 20872 44794 28896 -41598 -74734 -9869 100264 163738 144081 64723
30650 64723 -27847 -85548 -84695 -51332 -35586 -52108 -68150 -52192 -11686 18552 10342 -27988
30638 -27988 -45650 2334 82426 94430 -6372 -131554 -155108 -65653 31607 51591 7736
30627 7736 -46400 -92277 -138717 -177313 -176233 -113150 -7997 78854 97327 61352 25104 603
30615 603 -52745 -137187 -181341 -143525 -84695 -69087 -57612 2011 36473 -63971 -235672 -277778
30603 -277778 -133089 12979 -9436 -120086 -123461 7159 115385 98164 24400 1494 30974
30592 30974 47904 33850 23121 25237 5310 -52269 -105811 -106154 -60145 -16749 -4327 -12976
30580a2976j5965j6135O592M9164N5958m270o1624l5413K4319J721q4908r1251
30568a84788J4763Q0033Q197p7299l3044P0681P3451j1837l8946K0467N3013K0180
30556e129J5672P6699J02361K2853q2306j10710p6788m6156j7722L9024Q9358
30545G156P0025l864m7174k0537J8493l632p5866j09499m5809O4773J18644Q7272
30533E9982M2244L9283M0141n920o2562n9301l878L5619L3951J7533n107l9344
30521I2641n0750n070M9637L4735k8655m0067K2190O5674K9271l4621n8987n2206
30509B3792m3336j9613K5347M7214J4031l4727m3650j6779N915J1442J1798P238
30497a1328r957k9433k6420J0827N8920O2870j0034j00472r1720L4982J35102
$$ plain form
30580 -12976 -28941 -45076 -38484 10680 66638 62368 744 -34669 -10350 -8629 -93537 -184788
30568 -184788 -170025 -89992 -81795 -159094 -192138 -121457 -48006 -59843 -98789 -78322 -25309 -5129
30556 -5129 10543 87242 189603 212456 130150 19440 -57348 -103504 -121226 -82202 7156
30545 7156 77181 73317 26143 5606 24099 20467 -55399 -164898 -210707 -145934 -27290 59982
30533 59982 102226 141509 181650 175730 113168 53867 49989 85608 119559 137092 131985 92641
30521 92641 41891 36821 86458 121193 92538 52471 74661 140335 169606 134985 75998 23792
30509 23792 -19544 -39157 -13810 33404 47435 12708 -30942 -47721 -41806 -30364 -18566 -11328
30497 -11328 -21285 -50718 -77138 -66311 -7391 55479 45445 -55027 -146747 -111765 23337
30486B3337P4917p3297j19753j7503R0486Q6914J4641l1993l1287n608K8716L6990
30474G6560j5956q4069p1004J9114O4618O422o2161m5237K0642N3066M9084M3815
30462E4894K7938j1681m0120l5681l3804m7388k4559M6067P7216J3228o3922m9789
30450h7601L2249Q4229P1301K2821l6195p2502l4935N8470R7270K7110n8353o1736
30438D2128k6033l1256m5211m735M1972J7841l0339j0951M2108L2749j5888n615
30426F770M9651M6603k1267o2211n4878n7112n8785M496Q9347P0365m9533j19012
30414a55566o3002K5357N4844M9244M6682K9967Q420L4507Q7873P3430j5096o2473
30402A14187j5732L4898J9191o691R999J6306l1724p2891n1199j3767j0415k739
$$ plain form
30486 23337 98254 24957 -94796 -112299 -21813 65101 79742 47749 16462 10854 39570 76560
30474 76560 60604 -23465 -94469 -75355 -10737 -4315 -66476 -111713 -91071 -38005 11079 54894
30462 54894 82832 71151 31031 -4650 -38454 -85842 -110401 -64334 12882 26110 -37812 -87601
30450 -87601 -55352 28877 100178 122999 86804 14302 -20633 37837 135107 162217 103864 42128
30438 42128 16095 -15161 -60372 -65107 -23135 -5294 -35633 -46584 -4476 28273 12385 6770
30426 6770 56421 103024 81757 19546 -35332 -92444 -151229 -146733 -57386 12979 -36554 -155566
30414 -155566 -218568 -193211 -138367 -89123 -42441 -12474 -4054 30453 118326 191756 176660 114187
30402 114187 98455 133353 152544 145853 155852 172158 140434 67543 16344 2577 -7838 -10577
30390a0577L6578M2379k4307p8283m0042K7814K6921j7278k0155J0714J1163j0756
30378d5829k700K0531Q885j6275K000M3460M0350k048j5915J2175K9090J2503
30366H6227l735R46R454Q148l145k7373m9086k8459L2863O4719K7793j4326J090
30353A05116J9469m0616j27013j11321O196P9234K6251n4995l4976O8929J27940
30342F4214P3540k7789o7623k6795J0845k1010p0906m1460N3519R1242K2955m4620
30330A6112j3340N3626L8284m4593q1115l6447J7062K8580J7087N78k2489k4725
30318e1380K2994P6785O1132j5828p3039p6268n8642l1260K5939Q3737P8046J5757
30306E7973l0297l7360m0898k8403M5409J21185O5038j07842j90768o3850J15922
$$ plain form
30390 -10577 26001 68380 44073 -34210 -74252 -46438 -19517 -36795 -56950 -46236 -35073 -45829
30378 -45829 -48529 -27998 -19113 -35388 -33388 10072 50422 48374 32459 44634 73724 86227
30366 86227 82492 83438 92892 101040 97895 70522 21436 -7023 25840 90559 118352 104026 105116
30353 105116 124585 83969 -43044 -154365 -148169 -68935 -42684 -97679 -132655 -63726 64214
30342 64214 137754 109965 42342 15547 26392 5382 -65524 -106984 -53465 37777 60732 16112
30330 16112 2772 56398 94682 50089 -31026 -67473 -50411 -21831 -4744 -4166 -26655 -51380
30318 -51380 -28386 48399 109531 93703 20664 -55604 -114246 -145506 -119567 -35830 42216 57973
30306 57973 27676 -9684 -50582 -78985 -33576 87609 152647 44805 -145963 -209813 -93891
30295i3891J30325L180o5943q950M2327p184p1873l6776N9973Q6157N589p6949
30283c4015n9488L0483Q3825N3975M723P886M3063L9334j7520p7868j08741j11505
30271a45848o8036M1154J49421J35765m009j10196o3443M0877K9994q7216j33230
30260b14767k7853R7376R6434N111m1996j0132K3208J3192m573p656k5048n5486
30248a52190m0138L1885P0917J3730o2040m6883K4073K4971m8342o2100L3746
30237b12371J14251Q0017J3557K4081N1061k5611j53263j59685j8211J08400J05783
30226g1991L8332L700k683j6326j7437Q153J7629o461q641L5332N5531P776l2469
30213A0445P883O4105L5898l7814l8710L0970M8432k9342r7563o9286M51J1190
$$ plain form
30295 -93891 36434 39614 -26329 -35279 7048 -136 -72009 -108785 -48812 37345 42934 -34015
30283 -34015 -93503 -63020 20805 74780 79503 87389 130452 169786 152266 74398 -34343 -145848
30271 -145848 -213884 -172730 -23309 112456 108447 -1749 -65192 -24315 5679 -81537 -214767
30260 -214767 -242620 -145244 -48810 -43699 -85695 -95827 -72619 -59427 -64000 -71656 -96704 -152190
30248 -152190 -192328 -160443 -89526 -75796 -137836 -184719 -160646 -135675 -184017 -246117 -212371
30237 -212371 -98120 -18103 -4546 19535 70596 44985 -108278 -267963 -286174 -177774 -71991
30226 -71991 -33659 -29959 -32642 -48968 -66405 -58252 -40623 -47084 -55725 -20393 35138 42914 10445
30213 10445 18328 82433 118331 80517 41807 72777 121209 91867 -5696 -74982 -74531 -63341
30201f3341l9924p2869l7541L7271Q5390O6973P449k2874P098L7353m921q7023
30189h6959j00178j4966P0605O9060J4864j2317q843j9731l7092j2863M3034O0940
30177c4446J6968k9184k3968R535K1712J0879P444J4135O033k1118l9783k9301
30165i1094k233J2425J038j9336j4461K7390O7454N2399j0546m6405p204N7215
30153B6642O5310J7403j2639Q813L2367Q702m2945p5268p5025n3130j1348M5210
30141f5908Q9650R9344Q0252M4502p764o2432q2880n8041k6669k1083j9899O494
30129b4434L6923L0318j0026m5555n3348l1898J3167M9976K6934n0013q7705j8973
30117a64634Q8949J15070M8012j4482j4174Q835O893j1107k0920j6998O392M3693
$$ plain form
30201 -63341 -103265 -176134 -213675 -176404 -91014 -24041 -16592 -39466 -32368 4985 64 -86959
30189 -86959 -187137 -202103 -131498 -62438 -47574 -59891 -68734 -88465 -125557 -138420 -95386 -34446
30177 -34446 -17478 -46662 -70630 -61095 -39383 -28504 -21060 -6925 -892 -22010 -61793 -91094
30165 -91094 -93327 -80902 -79864 -99200 -113661 -86271 -18817 33582 23036 -23369 -30573 26642
30153 26642 91952 109355 96716 105529 137896 146598 103653 28385 -46640 -99770 -111118 -65908
30141 -65908 23742 123086 203338 247840 240076 177644 94764 36723 10054 -11029 -30928 -24434
30129 -24434 12489 42807 32781 -12774 -66122 -98020 -84853 -34877 -7943 -57956 -145661 -164634
30117 -164634 -75685 39385 87397 72915 58741 67576 74469 63362 42442 25444 31836 75529
30105G5529M7064j9203r4556q0631Q113N0886N67m8825k0174K5763J547n8191
30093a12111n1895L2535J02860Q5401J477o8776o1937J2334O9796L6044n6156
30082a0428j00358n7281L466K0840J9056K9267K3477j2583k2551K8377P4794M8034
30070D4110j0142j8884J3488K7396K6177M6876N9352J0622n7037n3702L939J0731
30058A02926m9166p1559j0156L8323j2224r8487j01647j3107P2572Q9816N6775
30047D066J8521o138k2322l7438m5064k4683K7573P0426N4750m616l7377j3725
30035a6027J4908j279l3425k4647J6565L0754K176j9155J630L1940K6648k186
30023B7902j1038k91j1872m7453m4833K9345J05868Q9663p571p5838n1803P812
$$ plain form
30105 75529 122593 103390 8834 -71797 -63684 -12798 -12231 -61056 -81230 -55467 -53920 -112111
30093 -112111 -164006 -131471 -28611 56790 58267 -10509 -72446 -60112 9684 45728 -10428
30082 -10428 -110786 -168067 -164601 -143761 -124705 -95438 -71961 -84544 -107095 -78718 -3924 44110
30070 44110 33968 15084 28572 55968 82145 129021 188373 198995 141958 88256 92195 102926
30058 102926 53760 -17799 -27955 10368 -1856 -100343 -201990 -215097 -142525 -52709 4066
30047 4066 22587 16449 -5873 -43311 -88375 -113058 -85485 -15059 39691 35075 -2302 -16027
30035 -16027 -1119 -2398 -35823 -60470 -43905 -13151 -10975 -30130 -28500 3440 30088 27902
30023 27902 16864 16573 4701 -42752 -87585 -58240 47628 137291 129720 53882 2079 9891
30011I891J9731j5750l6701j2304K9154M5586K4906n214l483K7461K0672o5145
29999C8804j43625p9437J04548K03971Q9054j06810j59100m7597M8780K3357l3591
29988f1646n536P5540R2589J4112p0629o9373N816N9284K9997l0523k7845L6584
29976D8370O0393l672o5524l1248N2268P1599J1791m9462p1357o9990m1591K0624
29964f7799N4403m429r0334p1841M5351J11013N0899l7522n1841j8747j997M217
29952g8627J6759M892l1671k5372L7183N7117j7396p4910m996J07312R8614j6226
29940G2679o7078N192O7668J3735p7915p5044J5585P7074N2632J299p201J2409
29928I1035n122p4515j26917r0247J5220R4083Q9871M1441Q335j1904m8304p6728
$$ plain form
30011 9891 29622 13872 -22829 -35133 -5979 39607 64513 59299 55816 83277 103949 38804
29999 38804 -104821 -184258 -79710 124261 213315 106505 -52595 -100192 -51412 -28055 -61646
29988 -61646 -67182 8358 100947 115059 44430 -24943 -19127 40157 70154 39631 11786 48370
29976 48370 108763 105091 39567 8319 60587 132186 143977 94515 23158 -46832 -88423 -67799
29964 -67799 -13396 -17825 -108159 -180000 -134649 -23636 27263 -10259 -62100 -80847 -82844 -78627
29952 -78627 -61868 -56976 -88647 -114019 -76836 -19719 -37115 -112025 -117021 -9709 88905 72679
29940 72679 5601 10793 78461 92196 14281 -60763 -45178 31896 84528 85827 78626 91035
29928 91035 85913 11398 -115519 -205766 -190546 -96463 -6592 34849 43184 31280 -17024 -93752
29916i3752m2658M2818R3751N5131k6128o2878l2224J1622J6111r207j8800L423
29904f2791K8296K8471J3324K855o468k1189j8591K2978P1587O7247K227o6914
29892F1032r1881p4643l5655P933K4444j2898o7904o0312K6988J11796J17645
29881F545O4340J5005j4925m3105n7433l1526J7626M3418L2819J2483j458k1004
29869B2785n3461p8704o5998q339N6377P0065K3907j4769J0591N2938K8415l6832
29857F975l3417L9345L8915r2423j89594p9519J49192K41550J09199p6420j28276
29846a4473n0388L3940N2003K1380j1363j4295J3545L7070K1029j8714l2175p329
29834C0230J3963j218l4761m6032j4827M1796P1423K5111p0759j12512m3195N3207
$$ plain form
29916 -93752 -136410 -93592 159 55290 29162 -33716 -65940 -54318 -38207 -47414 -66214 -62791
29904 -62791 -34495 -6024 7300 10155 3687 -17502 -36093 -13115 58472 125719 127946 61032
29892 61032 -30849 -105492 -141147 -133214 -108770 -121668 -189572 -249884 -222896 -111100 6545
29881 6545 70885 85890 70965 27860 -29573 -61099 -43473 -55 32764 45247 43789 22785
29869 22785 -30676 -109380 -175378 -183717 -127340 -57275 -33368 -48137 -37546 15392 43807 6975
29857 6975 -26442 12903 51818 -40605 -230199 -309718 -160526 81024 190223 113803 -14473
29846 -14473 -64861 -30921 21082 42462 31099 16804 30349 67419 88448 69734 37559 30230
29834 30230 44193 42975 8214 -37818 -52645 -10849 60574 85685 14926 -97586 -140781 -87574
29822h7574N5061k4832o4616k2264J4230j0695k4732M0433J17525R7482l191o7222
29810A9605m2571P607J8638N761J0514K8563K9018J0848J518J1491J9016J988
29798A21996l1186m8428k6591K4363O5299N7007m538p5708r7437n2051J6981N2466
29786B173M0857P859k4425m4377l1307K1207O4737L7841l8827p1263k0760M1743
29774a4542M7676K6186K8468K5462l2229r9634q3978J1708Q5745P6423J9989l0429
29762F0845o0368o0893k1815K5210K9975M169N032K9446J2952m4541n3225J9188
29750e4025P2189J8658p3193p6362R961P1456M9366L595K539L1179L4417l57l4680
29737E4743l0218Q179L4818J2741l4918m5429n09M3870L6820K293j1551j2991
$$ plain form
29822 -87574 -32513 -57345 -121961 -144225 -129995 -140690 -165422 -124989 -7464 90018 86827 19605
29810 19605 -22966 -15359 3279 9040 19554 48117 77135 87983 89501 100992 120008 121996
29798 121996 90810 42382 15791 40154 105453 162460 157922 82214 -15223 -67274 -50293 2173
29786 2173 43030 50889 26464 -17913 -49220 -28013 36724 74565 35738 -35525 -56285 -14542
29774 -14542 33134 59320 87788 113250 81021 -18613 -102591 -90883 -5138 71285 91274 60845
29762 60845 477 -60416 -82231 -57021 -27046 -22877 -17845 11601 24553 -19988 -73213 -54025
29750 -54025 18164 36822 -36371 -112733 -102772 -31316 18050 21645 24184 55363 89780 89423 54743
29737 54743 24525 32704 67522 80263 45345 -84 -593 43277 80097 82390 70839 57848
29725E7848l4950n1389p228P1860Q8477J6901m6465k4590K4495Q989m0697k3612
29713C9639N0677N8909l6274j07099m9635M9997M2663o0361j16945p2212r978
29702b10619J1762L4335P5203P0906Q114j7328L6719N7223m0514j33252n4123
29691a61574J30545J92257O9622n8610n4152N306j88m0495k6776J7861Q338m5186
29679C6948n3315M424N2151L9135N454P866L8246M4840O522m0343m8383k1219
29667G2326j0380l9375n9396j9263M4444M9945m107l3079p93K4434j1339n1894
29655c8477k1245M8848O5531J8876q162K6453N8884J8372o2796q7014k1130N8620
29643E6760O4455O190l2520j1624K2986K2672L707MK560n760m470J7014J5121
$$ plain form
29725 57848 22898 -28491 -35719 36141 124618 141519 95054 70464 94959 103948 63251 39639
29713 39639 90316 149225 112951 5852 -43783 6214 48877 -11484 -128429 -200641 -210619
29702 -210619 -198857 -164522 -89319 -18413 -10299 -27627 9092 66315 25801 -107451 -161574
29691 -161574 -31029 161228 230850 172240 118088 123394 123206 82711 55935 73796 82134 36948
29679 36948 -16367 -11943 40208 79343 84797 92663 130909 175749 182271 141928 93545 72326
29667 72326 61946 22571 -36825 -56088 -11644 38301 34194 1115 322 24756 13417 -38477
29655 -38477 -59722 -10874 54657 73533 65371 91824 150708 169080 106284 19270 -1860 56760
29643 56760 121215 127405 94885 83261 106247 128919 132626 132630 135190 129430 124960 141974 157095
29630A57095l3900o6000k3053L4084J4775m1336k6254M0353L3531n5733r0602
29619e7040j6471M8050J4132m0735k8225L351j4974l6165L984N8484N9674M2289
29607C6354N7329N5984j5421r0254p9908j9707Q184J6062M5426M9417j3931n8877
29595i342n143N0446k0374j34136j06722M2514J19841O5699P075O980l534k7616
29583a4312J9185R3050L5804j25766j53921J8425J40157L2371j20667q0599N9277
29572i6996N8575n5532n2252J00484J86198Q8817n8253j09760q6688n7509j6705
29561i9621M0487N8044J4903j9167P981M7944L6841o102k2788o687K870j6799
29549C7906n0970o7150m0229J8299N6016L5009j4935l3914r964K1173L6291L6610
$$ plain form
29630 157095 123195 57195 34142 68226 83001 41665 15411 55764 89295 33562 -57040
29619 -57040 -73511 -25461 -11329 -52064 -80289 -76938 -91912 -128077 -124093 -65609 -5935 36354
29607 36354 93683 149667 134246 43992 -35916 -55623 -47439 -31377 14049 63466 49535 -9342
29595 -9342 -14485 35961 15587 -118549 -225271 -182757 -62916 2783 9858 16838 13304 -14312
29583 -14312 4873 97923 133727 7961 -145960 -127535 12622 44993 -75674 -156273 -96996
29572 -96996 -38421 -93953 -146205 -45721 140477 229294 171041 61281 -25407 -82916 -99621
29561 -99621 -59134 -1090 13813 -5354 2627 50571 87412 81310 58522 51835 54705 37906
29549 37906 -13064 -80214 -120443 -102144 -46128 -11119 -26054 -59968 -69932 -48759 -12468 24142
29537B4142J9533p339o787L2164M6910j4159q6941o7419K1973N3012j4191p5518
29525g4620n2667l468o669l7992l4281J04K7901N2624Q1614P5914J5646l7957
29513F149k5756J4265J8374J1128M8551R1274N3112m3922q7978n2357k6186m9346
29501d2692m7439J7747N8097M246o1793k7482O8671R6034L0783k6262j7338N406
29489E7978m955j5441Q217L5022L0706J9411L0102L4532l621n5473o1125j6784
29477E8569K1735J2583l2058p0884p0785l0699J1192J2699j3534q448M3135P5201
29465H706L5643k6340l1349M722l285o8384j01497m0519O2258J13357Q5753K2104
29453F1169k6214l2753l109K6405K4497R111J8227L4628J832o8465q3303p232
$$ plain form
29537 24142 43675 36336 29549 61713 108623 94464 7523 -59896 -37923 15089 898 -74620
29525 -74620 -127287 -130755 -137424 -175416 -209697 -209593 -181692 -129068 -47454 28460 44106 6149
29513 6149 -19607 -5342 13032 24160 72711 163985 217097 173175 85197 32840 6654 -42692
29501 -42692 -90131 -72384 -14287 -10041 -71834 -99316 -30645 65389 96172 69910 52572 57978
29489 57978 53023 37582 45799 80821 111527 130938 161040 195572 191951 136478 75353 58569
29477 58569 80304 92887 60829 -10055 -80840 -111539 -100347 -87648 -101182 -109630 -66495 8706
29465 8706 44349 18009 -13340 -8618 -11903 -80287 -181784 -222303 -160045 -46688 39065 61169
29453 61169 34955 2202 -907 25498 49995 59106 77333 111961 113793 45328 -37975 -45207
29441d5207O3702L8778k3826r025O5327P3100j3793p3427k2666N8750O0729M942
29429A77384j8018n715k5351p0410n7622K2856O5908M488q4961r5093l8154l422
29417a28110q964Q556O6084R1733L6767m3575o6834l2884o645j9705l9860l1165
29405a74602k720J1012m016k6439k4938M961L4854M0897L5439M0757M4184J6857
29393c754k6121l2969N331L3369J3253k0644k3073p166o832j0733J0571M0498
29381b8270L8277P505j2367j0761r078q603J0966M3125N3400K8696j0595m3540
29369E8755n8783m5298j1611M938r163j0491K7133M3061k4286j09466q4168M9193
29357a70186J39843R4966r07k6032J1265K1348j7538m7150l4195q186N80L237
$$ plain form
29441 -45207 18495 57273 33447 24422 89749 162849 149056 75629 52963 111713 172442 177384
29429 177384 159366 153651 128300 57890 268 23124 89032 93520 8559 -86534 -124688 -128110
29417 -128110 -137074 -128518 -62434 29299 66066 22491 -44343 -77227 -83872 -103577 -143437 -174602
29405 -174602 -177322 -166310 -170326 -196765 -221703 -216742 -181888 -140991 -105552 -64795 -20611 -3754
29393 -3754 -29875 -62844 -57513 -24144 -10891 -31535 -54608 -61774 -68606 -79339 -68768 -28270
29381 -28270 10007 17512 5145 -5616 -14694 -23297 -12331 30794 84194 112890 102295 58755
29369 58755 -28 -45326 -56937 -51999 -61162 -71653 -44520 -1459 -25745 -135211 -219379 -170186
29357 -170186 -30343 64623 63716 37684 48949 70297 52759 5609 -28586 -36772 -36192 -32955
29345c2955K3646N8286P3305L6820l7424q4954n7395Q727K9174j9412p2972o9639
$$ plain form
29345 -32955 -9309 48977 122282 159102 121678 36724 -20671 -11944 17230 -2182 -75154 -144793
$$ [...]
##END NTUPLES=NMR SPECTRUM
##END=
