##TITLE=31Pdec_LY-2Dix 60.4
 CD3CN, 24 sc
 5.03.2021
##JCAMPDX= 6.0         $$ Bruker NMR JCAMP-DX V2.0
##DATA TYPE= NMR SPECTRUM
##DATA CLASS= NTUPLES
##ORIGIN= UXNMR, Bruker Analytische Messtechnik GmbH
##OWNER= root
$$ XWIN-NMR		Version 3.5
$$ Fri Mar  5 12:38:28 2021 Russian Standard Time (UT+4h)  she@DPX200
##.OBSERVE FREQUENCY= 81.013821
##.OBSERVE NUCLEUS= ^31P
##.ACQUISITION MODE= SIMULTANEOUS
##.ACQUISITION SCHEME= undefined
##.AVERAGES= 24
##.DIGITISER RES= 16
##SPECTROMETER/DATA SYSTEM= spect
##.PULSE SEQUENCE= zgpg30
##.SOLVENT NAME= CDCl3
##.SHIFT REFERENCE= (INTERNAL, CDCl3, 0, 248.564)
##AUDIT TRAIL= $$ (NUMBER, WHEN, WHO, WHERE, WHAT)
$$ ##TITLE= Audit trail, XWIN-NMR		Version 3.5
$$ ##JCAMPDX= 5.01
$$ ##ORIGIN= Bruker BioSpin GmbH
$$ ##OWNER= she
$$ F:/spectra/data/she/nmr/P31/1/pdata/1/auditp.txt
$$ ##AUDIT TRAIL=  $$ (NUMBER, WHEN, WHO, WHERE, WHAT)
(   1,<2021-03-05 12:36:42.40 +0400>,<she>,<DPX200>,
      <created by zg, POWCHK disabled, PULCHK disabled
       configuration hash MD5:
       00 E9 B6 7A A2 85 ED C7 34 08 36 98 17 FE 4E 26
       data hash MD5: 32K
       B7 56 BF 94 C6 18 60 15 30 B7 08 80 F2 59 58 53>)
(   2,<2021-03-05 12:36:45.26 +0400>,<she>,<DPX200>,
      <Start of raw data processing
       efp BC_mod = 2 LB = 1 FT_mod = 6 PKNL = 1 PHC0 = -3003.416 PHC1 = -625.399 SI = 64K 
       data hash MD5: 64K
       17 15 71 D2 66 9B 3E BF EF CA B5 A0 67 9B 79 67>)
(   3,<2021-03-05 12:37:38.07 +0400>,<she>,<DPX200>,
      <pk PHC0 = -237.5079 PHC1 = 465.5996 
       data hash MD5: 64K
       71 36 D3 E8 C9 2C FA 92 9A 43 06 4F D1 B6 97 BC>)
(   4,<2021-03-05 12:37:41.25 +0400>,<she>,<DPX200>,
      <abs ABSG = 5 
       data hash MD5: 64K
       E9 0E 38 78 D9 58 35 B9 4A 91 5F 5F 92 87 89 6C>)
$$ ##END=
$$ 
$$ hash MD5
$$ 74 7A 4E 1F AB C0 48 F1 D5 A2 87 F9 36 BC 9C 3A
##$RELAX= 
##$RELAX= 
##$RELAX= 
##$RELAX= 
##$RELAX= 
##$RELAX= 
##$RELAX= 
##$RELAX= 
$$ Bruker specific parameters
$$ --------------------------
##$DU= <F:/spectra>
##$EXPNO= 1
##$NAME= <P31>
##$PROCNO= 1
##$TYPE= <nmr>
##$USER= <she>
##$AMP= (0..31)
100 100 100 100 100 100 100 100 100 100 100 100 100 100 100 100 100 100 
100 100 100 100 100 100 100 100 100 100 100 100 100 100 
##$AQSEQ= 0
##$AQ_mod= 1
##$AUNM= <au_zg>
##$AUTOPOS= <>
##$BF1= 81.014009
##$BF2= 200.13
##$BF3= 200.13
##$BF4= 200.13
##$BF5= 200.13
##$BF6= 200.13
##$BF7= 200.13
##$BF8= 200.13
##$BYTORDA= 1
##$CFDGTYP= 0
##$CFRGTYP= 5
##$CHEMSTR= <none>
##$CNST= (0..31)
1 1 145 1 1 1 1 1 1 1 1 1 1 1 1 1 1 1 1 1 1 1 1 1 1 1 1 1 1 1 1 1 
##$CPDPRG= <waltz16>
##$CPDPRG1= <>
##$CPDPRG2= <waltz16>
##$CPDPRG3= <>
##$CPDPRG4= <mlev>
##$CPDPRG5= <mlev>
##$CPDPRG6= <mlev>
##$CPDPRG7= <mlev>
##$CPDPRG8= <mlev>
##$CPDPRGB= <>
##$CPDPRGT= <>
##$D= (0..31)
0 1 0 0 0 0 0 0 0 0 0 0.03 2e-05 3e-06 0 0 0 0 0 0 0 0 0 0 0 0 0 0 0 0 
0 0 
##$DATE= 1614933401
##$DBL= (0..7)
120 120 120 11 120 120 24 19 
##$DBP= (0..7)
150 150 150 150 150 150 150 150 
##$DBP07= 0
##$DBPNAM0= <>
##$DBPNAM1= <>
$$ [...]
##$SUBNAM3= <"">
##$SUBNAM4= <"">
##$SUBNAM5= <"">
##$SUBNAM6= <"">
##$SUBNAM7= <"">
##$SUBNAM8= <"">
##$SUBNAM9= <"">
##$SW= 501.771253377433
##$SWIBOX= (0..15)
0 1 3 0 0 0 0 0 0 0 0 0 0 0 0 0 
##$SW_h= 40650.406504065
##$TD= 32768
##$TD0= 1
##$TE= 0
##$TE2= 300
##$TE3= 300
##$TEG= 300
##$TL= (0..7)
0 120 53 12 22 120 120 120 
##$TP= (0..7)
150 150 150 150 150 150 150 150 
##$TP07= 0
##$TPNAME0= <>
##$TPNAME1= <>
##$TPNAME2= <>
##$TPNAME3= <>
##$TPNAME4= <>
##$TPNAME5= <>
##$TPNAME6= <>
##$TPNAME7= <>
##$TPOAL= (0..7)
0.5 0.5 0.5 0.5 0.5 0.5 0.5 0.5 
##$TPOFFS= (0..7)
0 0 0 0 0 0 0 0 
##$TUNHIN= 0
##$TUNHOUT= 0
##$TUNXOUT= 0
##$USERA1= <user>
##$USERA2= <user>
##$USERA3= <user>
##$USERA4= <user>
##$USERA5= <user>
##$V9= 5
##$VALIST= <valist>
##$VCLIST= <CCCCCCCCCCCCCCC>
##$VD= 0
##$VDLIST= <DDDDDDDDDDDDDDD>
##$VPLIST= <PPPPPPPPPPPPPPP>
##$VTLIST= <TTTTTTTTTTTTTTT>
##$WBST= 1024
##$WBSW= 4
##$XGAIN= (0..3)
0 0 0 0 
##$XL= 0
##$YL= 0
##$YMAX_a= 2077
##$YMIN_a= -28977
##$ZGOPTNS= <>
##$ZL1= 120
##$ZL2= 120
##$ZL3= 120
##$ZL4= 120
##$ABSF1= 248.5645
##$ABSF2= -253.2056
##$ABSG= 5
##$ABSL= 3
##$ALPHA= 0
##$AQORDER= 0
##$ASSFAC= 0
##$ASSFACI= 0
##$ASSFACX= 0
##$ASSWID= 0
##$AUNMP= <proc_1d>
##$AZFE= 0.1
##$AZFW= 0.5
##$BCFW= 0
##$BC_mod= 2
##$BYTORDP= 0
##$COROFFS= 0
##$CY= -3
##$DATMOD= 1
##$DC= 0
##$DFILT= <>
##$DTYPP= 0
##$F1P= 0
##$F2P= 0
##$FCOR= 1
##$FTSIZE= 65536
##$FT_mod= 6
##$GAMMA= 0
##$GB= 0
##$INTBC= 1
##$INTSCL= 5.30512e-09
##$ISEN= 30
##$LB= 1
##$LEV0= 0
##$LPBIN= 0
##$MAXI= 10000
##$MC2= 0
##$MEAN= 0
##$ME_mod= 0
##$MI= 50
##$NCOEF= 0
##$NC_proc= -3
##$NLEV= 6
##$NOISF1= 182.463
##$NOISF2= 159.3651
##$NSP= 0
##$NTH_PI= 0
##$NZP= 0
##$OFFSET= 248.5645
##$PC= 4
##$PHC0= -3240.924
##$PHC1= -159.7994
##$PH_mod= 1
##$PKNL= yes
##$PPARMOD= 0
##$PSCAL= 0
##$PSIGN= 0
##$REVERSE= no
##$SF= 81.014009
##$SI= 65536
##$SIGF1= 159.3651
##$SIGF2= -187.1042
##$SINO= 113.3802
##$SIOLD= 16384
##$SREGLST= <1H.CDCl3>
##$SSB= 0
##$STSI= 65536
##$STSR= 0
##$SW_p= 40650.406504065
##$SYMM= 0
##$S_DEV= 0
##$TDeff= 32768
##$TDoff= 0
##$TI= <>
##$TILT= no
##$TM1= 0
##$TM2= 0
##$TOPLEV= 0
##$USERP1= <user>
##$USERP2= <user>
##$USERP3= <user>
##$USERP4= <user>
##$USERP5= <user>
##$WDW= 1
##$XDIM= 65536
##$YMAX_p= 337598546
##$YMIN_p= -1258973
$$ End of Bruker specific parameters
$$ ---------------------------------
##NTUPLES= NMR SPECTRUM
##VAR_NAME=  FREQUENCY,     SPECTRUM/REAL,   SPECTRUM/IMAG
##SYMBOL=    X,             R,               I
##VAR_TYPE=  INDEPENDENT,   DEPENDENT,       DEPENDENT
##VAR_FORM=  AFFN,          ASDF,            ASDF
##VAR_DIM=   65536,         65536,           65536
##UNITS=     HZ,            ARBITRARY UNITS, ARBITRARY UNITS
##FACTOR=    0.620285442955139, 1,           1
##FIRST=     20137.2065510759, 0,            0
##LAST=      -20513.1999529892, 0,           0
##MIN=       -20513.1999529892, -1258973,    0
##MAX=       20137.2065510759, 337598546,    0
$$ Real data points
##PAGE= N=1
##DATA TABLE= (X++(R..R)), XYDATA
$$ [...]
38512 -75350 37628 14430 -118271 -177207 -91322 -13894 -97512 -258805 -280527 -103709 96961
38501 96961 133523 9144 -127988 -168524 -128129 -79258 -53541 -31181 -2655 605 -42795
38490 -42795 -92037 -89360 -49522 -45702 -93070 -110639 -38994 60068 85999 50260 68975 199137
38478 199137 340083 329598 121641 -149409 -287213 -222557 -78039 -27583 -109204 -218985
38468 -218985 -268845 -264563 -217393 -90765 99570 229719 214392 144780 168974 281419 351997
38457 351997 334349 310762 331632 345624 315872 282475 265670 217352 125261 68124 99683
38446 99683 155753 144862 71714 13028 21083 91329 168808 161286 26675 -123412 -114222 46980
38434 46980 142056 45471 -75767 -3373 201865 293217 196699 72586 32255 6311 -57548
38423 -57548 -61989 65692 210306 215963 110913 50660 79216 76433 -51492 -229773 -300321
38412 -300321 -192344 30020 254756 406926 449367 356767 147312 -70605 -159110 -97720
38402 -97720 -16199 -32660 -112793 -153552 -145051 -148351 -155771 -104563 -24004 -31798 -154308 -273020
38390 -273020 -292759 -247408 -190764 -110067 -21444 -22322 -139876 -233549 -173808 -30900 48320
38379 48320 70098 138145 225125 191030 28146 -95094 -74741 2189 28637 27610 49371
38368 49371 48862 -24002 -106268 -111218 -69883 -66679 -78638 -1765 173579 326415 361650 312965
38356 312965 257925 201655 93243 -79229 -252911 -341444 -306867 -190619 -79041 -28072
38346 -28072 -21031 -5203 44711 111336 157297 138627 26766 -138229 -241227 -201826 -85265
38335 -85265 -37391 -102447 -178076 -171975 -118787 -90059 -69747 -7474 60707 56206 207 -6484
38323 -6484 45786 45398 -59212 -161484 -151637 -74026 -36393 -39089 -7567 57864 89538 81620
38311 81620 84161 78344 -7389 -144456 -206526 -161797 -126357 -168615 -199790 -145328 -89063 -123284
38299 -123284 -172455 -121844 -33541 -52396 -146207 -140562 -15702 30672 -123071 -333593 -393279
38288 -393279 -296163 -193653 -167056 -154738 -68951 96741 260293 308909 196571 15293
38278 15293 -77098 -30355 52681 71594 50843 54863 64618 26791 -28568 -17514 71482 161311
38266 161311 188764 161451 120176 95047 90773 80252 32341 -29917 -42767 -3202 11444 -22001
38254 -22001 -2301 140909 296829 304172 185561 111020 147283 192484 168815 127877 122872
38243 122872 116747 83564 77312 116173 104014 -33690 -212282 -280144 -191871 -17481 149673
38232 149673 217148 114442 -98918 -219633 -126610 32078 20817 -155310 -271755 -224834
38222 -224834 -159262 -205669 -274331 -223228 -96102 -49672 -119204 -190642 -168214 -58646 83952
38211 83952 195756 206414 101273 -30738 -94184 -108931 -145473 -175795 -114576 8535 70701
38200 70701 66814 130999 287879 355004 208615 -2280 -63564 -603 12000 -39396 -13409
38189 -13409 94872 109327 -33481 -165960 -160236 -121873 -175062 -221408 -100179 118902 210723
38178 210723 120473 19956 34431 87310 60385 -33227 -105375 -124380 -122973 -136942 -182320
38167 -182320 -245635 -273177 -221364 -126292 -60015 -19660 51732 129349 109116 -14180 -91077
38156 -91077 -14398 128048 184904 135061 48716 -59699 -207298 -325441 -313836 -200762 -118533
38145 -118533 -114063 -107502 -56510 -32014 -78967 -112670 -33508 123556 225806 186586 26027
38134 26027 -161000 -251282 -164914 45751 216423 236718 162583 113998 107671 65764 -39303
38123 -39303 -137552 -162508 -128327 -90021 -80577 -103108 -139700 -152947 -119405 -74367 -81622 -143301
38111 -143301 -184248 -151114 -85591 -61924 -81738 -77238 -9007 81439 123009 90638 19161 -38672
38099 -38672 -53328 -28287 12575 43078 52776 59256 95500 165021 210028 154783 -1752 -164193
38087 -164193 -240297 -237114 -218236 -192832 -115973 4403 87241 100331 123570 222017 314575
38076 314575 264752 79437 -85871 -131085 -121843 -155437 -208169 -194754 -119446 -68158 -69600
38065 -69600 -62803 -14605 21739 4685 -15654 21322 80731 85705 45183 39090 80894 88832
38053 88832 20143 -53826 -60351 -39261 -67170 -123678 -132155 -103654 -122351 -181231 -157982 -7394
38041 -7394 132420 115078 -14883 -107235 -130464 -174087 -248658 -242360 -119050 -18614 -69298
38030 -69298 -203121 -273187 -282961 -355497 -493942 -526331 -342268 -74639 45118 -37303 -153054
38019 -153054 -127636 26945 156990 157710 76224 28419 53315 88015 77805 51057 50259 42998
38007 42998 -25369 -118442 -141788 -91991 -71532 -123249 -154507 -91690 -12434 -22131 -73789 -42553
37995 -42553 58691 84514 -17972 -129636 -142855 -97313 -68474 -33794 55180 148206 152386
37984 152386 70503 -13981 -67009 -129431 -218883 -285914 -279676 -202184 -89363 16679 70973
37973 70973 41776 -61577 -189432 -277580 -277990 -204508 -155679 -227379 -371793 -419947 -298803
37962 -298803 -140841 -95609 -124123 -105651 -67050 -124889 -228696 -172904 84390 296477 222088
37951 222088 -82792 -366881 -472129 -415911 -274572 -110518 21881 96003 129253 135061
37941 135061 97116 24043 -35813 -74013 -133931 -193752 -140349 60902 269610 341011 299007
37930 299007 231663 119968 -81344 -277249 -324141 -244725 -181415 -165701 -109613 -10309 26853
37919 26853 -16614 -39192 -14310 -36838 -124444 -154121 -69899 20866 47181 93359 202685
37908 202685 238428 101695 -58733 -46289 79121 101837 -12810 -97517 -72367 -36844 -48078
37897 -48078 -11366 129720 255374 230779 99347 8511 12601 49346 68375 84080 108723
37886 108723 115079 88974 69371 98758 148856 134147 18268 -117793 -159009 -107387 -88368
37875 -88368 -173687 -260785 -201664 -17645 105170 39748 -140254 -266402 -259082 -169100 -85237
37864 -85237 -49400 -44346 -27248 24765 89930 130354 147502 184932 259579 313534 270413 144045
37852 144045 56914 112045 248227 273282 82221 -192118 -315758 -233848 -128657 -172513
37842 -172513 -315506 -385779 -323205 -211622 -122908 -47356 23792 58026 52407 55968 83316
37831 83316 81541 27313 -13617 16971 69966 56718 -19212 -73930 -72026 -65716 -92860 -105223
37819 -105223 -41459 68250 126497 93401 39342 51087 114794 130332 38895 -97713 -159959
37808 -159959 -96073 24827 72135 -34386 -247856 -421952 -441533 -337216 -245446 -249711 -301162
37797 -301162 -310385 -264528 -215147 -194005 -190971 -185435 -153937 -76735 18998 61121 29738 4589
37785 4589 45506 80526 17905 -71042 -23158 158968 272982 193027 42784 4571 72356
37774 72356 115351 101268 105988 135505 93943 -48338 -182462 -211494 -177373 -167339 -167557 -104752
37762 -104752 687 30207 -63919 -169502 -150415 -21453 82348 86199 42927 17412 -594
37751 -594 -22202 13468 146755 285414 295964 190127 108190 110502 104162 14484 -86990 -99058
37739 -99058 -41853 1344 22004 60330 91755 60686 10951 59790 221581 362425 373010
37728 373010 302166 261013 260186 218040 100873 -19099 -53466 66 64767 76019 48807
37717 48807 52549 123839 217947 259819 230405 174801 129832 86825 46197 66512 203032 399332
37705 399332 498077 403344 211923 128645 235787 392942 404667 249461 76379 -5012
37695 -5012 -32572 -65564 -60868 36279 151686 156590 61239 10144 70114 140460 116499 33404
37683 33404 -23038 -56013 -113008 -168651 -161379 -111123 -94902 -124507 -151461 -179776 -255345 -334538
37671 -334538 -294495 -124300 10826 -23743 -151782 -204842 -148328 -81810 -63265 -54033 -27287
37660 -27287 -20378 -61423 -125268 -179102 -206228 -182429 -103578 -38417 -64451 -137283 -124472 -5490
37648 -5490 68309 -17598 -164447 -190611 -77151 28659 29403 -14927 -9377 35945 32679 -62878
37636 -62878 -191756 -248442 -187238 -76083 -28940 -75471 -131523 -122670 -89815 -118766 -200543
37625 -200543 -234246 -158789 -13760 130410 233400 263795 190743 41039 -81283 -86519 821
37614 821 69895 49353 -24327 -73816 -87209 -116075 -167404 -161530 -52187 62515 49808 -53024
37602 -53024 -74141 24271 62468 -83043 -262665 -258492 -104856 -22386 -86736 -159108 -135653
37591 -135653 -69806 -21912 23773 42403 -44817 -191041 -212679 -63221 56560 -381 -81358
37580 -81358 28481 253701 332704 198486 29354 -50873 -96372 -144611 -114611 25994 161160
37569 161160 185628 138315 96832 56574 1891 -10995 53967 122056 114196 75580 91192 131162
37557 131162 99955 5476 -45282 -14921 14029 -26550 -105494 -168317 -205173 -204508 -129192 -244
37545 -244 72134 23803 -49906 -11369 116834 173512 88797 -15730 -2920 95225 149112 128507
37533 128507 125843 199041 292327 334769 331630 311625 252891 132693 12894 -4467 93671
37522 93671 208870 249068 215985 156069 79810 -22980 -120553 -155755 -129695 -115834 -161422
37511 -161422 -208306 -154255 15893 199734 283514 246145 146333 42741 -41271 -93938 -97740
37500 -97740 -45761 37959 97067 65533 -80365 -272179 -378667 -325715 -180990 -85515 -102829
37489 -102829 -165306 -166176 -71676 59876 139952 124888 51397 -1494 205 11701 -17248 -68586
37477 -68586 -99160 -122802 -177948 -230712 -197584 -72903 52393 121793 174491 235172 234153
37466 234153 114450 -42800 -89774 12686 158748 224290 177736 76993 3156 -6797 11979
37455 11979 5671 -6662 56818 208752 332069 312612 185287 75336 30426 -4203 -62275
37444 -62275 -100137 -74166 -2935 65569 97668 80166 34926 27123 100795 203583 236752 183843
37432 183843 120416 85747 27133 -94057 -219485 -274213 -268471 -250307 -204814 -89444 45121
37421 45121 63402 -93760 -316285 -439185 -421217 -365365 -370150 -405615 -359502 -186553 21059
37410 21059 123291 77295 -25329 -65618 -21334 32708 36290 19165 45085 110229 143992
37399 143992 107162 38077 -12621 -39745 -48926 -24136 20998 18641 -54566 -108203 -62969 1691
37387 1691 -47715 -171547 -194462 -86531 -29185 -130472 -248100 -217240 -101181 -50011 -34331
37376 -34331 69401 200030 158517 -63699 -231544 -203406 -121859 -161392 -251832 -206070 -21373
37365 -21373 112840 75510 -56791 -147077 -152670 -107785 -35526 55298 116826 78343 -57537
37354 -57537 -177145 -172208 -87621 -80728 -205703 -318613 -266875 -105421 -18510 -65238 -129276
37343 -129276 -116937 -70737 -51900 -32978 27417 97734 133977 154987 190634 219051 218227 214701
37331 214701 213558 150309 1308 -115682 -62741 116659 222012 131027 -71737 -220419
37321 -220419 -252356 -231726 -234680 -260731 -262296 -239219 -266503 -392728 -530200 -518180 -318288
37310 -318288 -78687 38529 27608 -19365 -65841 -127934 -166323 -105155 37263 142104 141555
37299 141555 94219 78838 88659 73718 25008 -34423 -96721 -157260 -187487 -166192 -117049 -76812
37287 -76812 -43622 8999 81918 144959 168808 137547 49686 -61436 -128624 -114628 -64565
37276 -64565 -49817 -65186 -37073 55695 132261 121392 73047 91704 176444 201938 78992
37265 78992 -119642 -229914 -165211 11877 160066 173496 51276 -108679 -193958 -180461
37255 -180461 -138742 -126497 -119405 -88430 -88465 -180254 -290605 -268729 -104750 22658 -21817 -149736
37243 -149736 -190062 -127263 -75030 -65747 -22331 57915 55025 -71875 -170961 -100108 47723
37232 47723 61670 -83459 -187864 -105564 68167 145260 82352 -10329 -34646 8100 65269
37221 65269 88631 50542 -29734 -75402 -23393 90308 164382 150402 87356 22686 -34419
37210 -34419 -68138 -36990 59351 145590 150200 87378 22772 -11305 -29047 -48654 -78224 -124001
37198 -124001 -173219 -180491 -105151 39691 189683 271460 244677 136211 37717 22935 55645
37187 55645 36586 -42161 -69961 11168 95456 54875 -75849 -155599 -132051 -72884 -31751
37176 -31751 861 21758 7957 -2398 64070 177870 199662 61582 -130129 -227417 -202778
37165 -202778 -128969 -70806 -60313 -113659 -195428 -211659 -116513 4631 33580 -22153 -49311
37154 -49311 1876 56194 38020 -28195 -89637 -164453 -285180 -380586 -325132 -127894 28553
37143 28553 5251 -109312 -122482 7990 158170 248500 324982 412516 442122 394169 376730
37132 376730 456582 524906 455936 308384 230058 232033 207335 127217 65257 49559 35868
37121 35868 17056 27634 53724 65493 108417 216476 272063 134940 -102891 -193868 -83243
37110 -83243 26950 3250 -45877 420 77305 73528 -4946 -113637 -243432 -317988 -203422
37099 -203422 59347 219436 150941 32422 37751 60229 -46505 -157589 -80052 86975
37089 86975 97130 -39719 -106282 -60953 -50877 -77744 3178 130979 49286 -233898 -344025
37078 -344025 -74569 273312 317130 120305 20369 102750 155631 73531 319 47256 119168
37067 119168 102439 40679 18923 7349 -59986 -136285 -119304 -23926 22291 -29877 -63968
37056 -63968 43626 240843 353741 301838 181076 122115 138060 149192 104400 26850 -33125
37045 -33125 -48774 -35583 -40463 -88999 -134997 -105641 -7066 75037 97066 103123 121014 108687
37033 108687 57758 45310 97863 103661 -26995 -198379 -257006 -215815 -206724 -256665 -265903 -190142
37021 -190142 -94097 -21694 51867 128142 165740 161982 148779 114135 35960 -29491 -20237 -1722
37009 -1722 -77581 -189922 -184182 -70662 -28511 -123969 -221387 -222436 -195761 -200869 -183103 -134081
36997 -134081 -156083 -251009 -243650 -62239 92176 36246 -101605 -85704 64343 149086 132018
36986 132018 156256 256810 295602 196723 46635 -68721 -153962 -198625 -143064 -1712 110260
36975 110260 123134 80109 31528 -25309 -74180 -68616 -31520 -49915 -126129 -153151 -93959 -59603
36963 -59603 -123853 -177821 -90634 69950 121569 32312 -45069 -7974 66049 72080 41702 61631
36951 61631 105819 71324 -38684 -94484 -36835 14946 -68580 -227727 -292177 -222150 -149265
36940 -149265 -171812 -228066 -216069 -139927 -71141 -39358 -35264 -65535 -126125 -158926 -113949 -35458
36928 -35458 -15703 -71014 -128194 -137893 -142955 -206903 -304918 -325830 -202123 -24860 23594 -112836
36916 -112836 -267018 -245638 -81095 27596 5334 -21553 33778 72322 -5504 -120991 -157774
36905 -157774 -159475 -224336 -291549 -221631 -53497 7188 -125553 -295398 -307924 -145806 54203
36894 54203 149664 95937 -18769 -32125 120898 298975 304287 133230 -25256 -40253 29446
36883 29446 71734 65846 42114 3071 -44206 -47352 29710 137957 179099 96135 -74124 -214592
36871 -214592 -220259 -123167 -83211 -186343 -310620 -298224 -199024 -188198 -275279 -286467 -152137
36860 -152137 -13639 16570 12515 58416 89472 37346 -9450 60663 192175 246993 197647
36849 197647 111084 21287 -56151 -62377 17573 73870 8633 -113117 -178522 -212158 -289894
36838 -289894 -342248 -237125 -25320 96387 72793 54321 145561 266005 313584 308358 302021
36827 302021 276933 212842 148490 109694 68709 26290 34381 85231 83557 -8572 -100306 -112351
36815 -112351 -89239 -97873 -114927 -106912 -131947 -250121 -391643 -423063 -315403 -164448 -70719
36804 -70719 -63000 -106529 -130415 -84272 -10212 -3509 -64014 -71093 35559 149915 159455 107544
36792 107544 82848 50498 -51575 -129810 -43546 134559 171876 10960 -140935 -117371 -10907
36781 -10907 15673 -11035 49885 200381 278455 180289 -1791 -92972 -30335 90929 147240
36770 147240 127870 118038 150113 137441 2575 -186147 -289029 -275559 -240452 -255447 -300784
36759 -300784 -340807 -368816 -365453 -303004 -205692 -127209 -71467 -22754 -31318 -145348 -272052
36748 -272052 -261051 -136616 -75763 -123806 -125913 -11014 63458 -27256 -158937 -162992 -85384
36737 -85384 -59974 -62859 5053 101716 121642 101742 134952 155199 39859 -128611 -148136
36726 -148136 -15781 84782 96708 124119 149640 22074 -209038 -259356 -46195 128903
36716 128903 24175 -172759 -160767 4902 53528 -37524 -49376 66458 110078 -3864
36706 -3864 -95022 -20349 110356 148073 137045 175501 196766 81940 -96104 -142263 -29595
36695 -29595 66862 49296 29799 104532 156616 35241 -165656 -196380 -2087 196214 209498
36684 209498 106974 58164 96939 158818 230289 313754 335411 253295 192083 290117 453124
36673 453124 459107 298349 191411 235080 258831 128386 -19010 2901 131348 163945 67742
36662 67742 -6607 26388 92676 108370 85067 61753 32046 -22481 -80073 -87453 -7589 133470
36650 133470 245558 257239 202196 165763 148184 74918 -43584 -91619 -43394 -39155 -162560
36639 -162560 -268068 -179191 27205 104474 -32260 -217387 -273312 -194268 -73083 27081
36629 27081 79779 67217 7514 -31739 11301 130143 243017 249004 127885 -4359 -818
36618 -818 127050 203664 121692 -11962 -41044 23015 62011 52228 64464 104032 94640 15834
36606 15834 -66202 -108514 -125487 -112745 -43935 44180 59953 -26261 -142533 -201795 -172079
36595 -172079 -74469 25832 48515 -15036 -72655 -53375 -9608 -19999 -56355 -51405 -28744
36584 -28744 -32922 1415 141732 267395 190827 -33895 -135213 96 174626 179597 60501
36573 60501 -27970 -72384 -155670 -263122 -286552 -185499 -36445 60887 59956 -20260 -105198
36562 -105198 -116349 -51861 16466 46946 76869 142719 210365 222279 172126 106219 84597
36551 84597 142864 244890 281376 180482 15814 -64988 -12964 91490 160016 159456 77652
36540 77652 -61592 -158480 -127638 -22400 46525 90698 191890 292396 234403 32415 -99428
36529 -99428 -52751 42669 71322 103562 191769 202284 30095 -177397 -208091 -84666 10330
36518 10330 16322 11917 18504 -18951 -80944 -73123 22850 126924 182548 194676 166094 96759
36506 96759 26516 -6409 -20333 -38404 -40459 -30548 -60590 -105495 -37726 153126 252775 107562
36494 107562 -106112 -117414 27167 49612 -103746 -182028 -41381 136963 142828 27180
36484 27180 -39067 -24496 -10547 -29303 -61749 -106423 -135498 -64543 122560 285716 275406
36473 275406 123719 -4765 -18227 30737 53324 23891 -26318 -58131 -58018 -44576 -38655 -29621
36461 -29621 -309 21470 -10468 -76231 -92465 -19077 90140 160396 162785 93659 -43254
36450 -43254 -201804 -301767 -310805 -272516 -231829 -190640 -156124 -154364 -157919 -84697 67583 162276
36438 162276 85750 -83643 -162728 -90267 26037 75650 61599 37797 18195 -10115 -41945
36427 -41945 -67744 -94970 -117284 -96758 -22060 42218 21648 -60326 -99976 -46474 43413 105402
36415 105402 152641 210384 234179 181324 120095 154251 247996 249285 112235 -24337 -33420
36404 -33420 37816 78169 81510 103701 133027 122221 93586 92156 75271 -26148 -161141 -203292
36392 -203292 -139229 -88143 -117366 -154259 -115786 -27676 29503 20057 -35427 -87691 -78150 7368
36380 7368 92519 85224 6464 -31256 16211 73231 76493 70307 125642 231915 314118 309602
36368 309602 203596 43122 -67358 -50838 38755 68768 12588 4282 156837 388078 495377
36357 495377 378605 140125 -30229 -44673 11121 859 -76827 -83410 48370 184159 159266
36346 159266 9843 -93750 -93829 -70720 -50050 29230 139711 153503 63589 33494 139005
36335 139005 233288 182331 74137 52285 78830 26683 -95820 -181173 -208219 -227669 -217426
36324 -217426 -114079 39762 123028 96816 22859 -49531 -104636 -109473 -60507 -39473 -100343
36313 -100343 -148728 -69112 79013 147825 136072 154240 187630 113016 -36437 -57884 99444
36302 99444 218211 133021 -28217 -73717 -51037 -125866 -271242 -301084 -178599 -82519 -134614
36291 -134614 -227055 -193688 -41177 79585 74064 -8305 -73449 -102240 -142417 -208811 -240025
36280 -240025 -179659 -71979 -22921 -62589 -103683 -66055 5180 -3836 -123794 -258892 -298604
36269 -298604 -236185 -158594 -135024 -140967 -106181 -21029 47900 60838 68538 123012 169990 112287
36257 112287 -35527 -146028 -141049 -69489 -5846 36245 54226 19946 -40533 -17151 139384
36246 139384 297113 268187 35833 -222885 -327137 -239883 -50114 113657 162182 113820
36236 113820 85522 154042 237914 192288 12361 -149722 -182720 -134547 -98752 -78603 -30965
36225 -30965 27021 42677 23777 26463 54507 40569 -56791 -181990 -230621 -154438 -12334
36214 -12334 80521 65977 7515 14902 98587 145800 68576 -76601 -167821 -171356 -146198 -128661
36202 -128661 -103368 -80205 -97792 -128195 -79501 53210 128935 36644 -131302 -182459 -73945
36191 -73945 42358 25553 -99520 -222609 -299464 -361387 -418536 -422585 -327334 -151137 30165
36180 30165 143092 171703 158063 146818 140615 124562 113077 130934 154982 130275 59744 24114
36168 24114 78219 170125 207628 173386 122172 83763 29680 -58350 -138958 -155037 -99745 -16673
36156 -16673 51518 97281 135557 168529 171143 122058 50338 29498 102672 223951 301964 303330
36144 303330 286361 319413 387104 405924 334595 239898 221775 278774 293366 178535 -41
36133 -41 -101942 -88035 -41805 -14646 50718 192180 312270 286784 146762 49048 72945
36122 72945 140895 154400 118700 93733 92675 84317 53326 8179 -43502 -86973 -90963 -43772
36110 -43772 19417 58380 78241 102765 115157 72147 -21971 -98389 -100344 -51083 -19252 -24720
36098 -24720 -7878 90991 237249 319523 270437 139112 21225 -50507 -104145 -144377 -139482
36087 -139482 -96937 -83953 -141614 -226543 -270198 -256529 -213270 -172041 -170725 -242371 -350011
36076 -350011 -381220 -277003 -131211 -82250 -127480 -135975 -43758 62410 83004 36539 1886
36065 1886 5182 31945 94253 201799 294358 287302 182877 67503 -6121 -68026 -148693 -214844
36053 -214844 -219668 -163860 -71925 38541 119548 88164 -58634 -166535 -74444 154736 271517
36042 271517 151626 -39947 -77617 29932 99419 63902 38444 94409 138177 82162 775
36031 775 12910 103506 171386 181632 154583 66718 -96768 -224132 -168807 29385 159467
36020 159467 114568 20404 30920 121245 171603 151986 111282 56726 -30771 -97208 -52805
36009 -52805 88245 196157 169394 32043 -112728 -174300 -128775 -37135 -2477 -60085 -125184
35998 -125184 -99938 -4623 63024 69441 61293 59676 39320 13978 36016 89770 89306 18147
35986 18147 -32381 -16091 -18745 -114408 -228896 -251930 -217262 -246997 -350158 -407063 -360250
35975 -360250 -301037 -323844 -387368 -385602 -298246 -198236 -135325 -81994 -3514 69510 71931 -10505
35963 -10505 -117651 -177452 -167824 -112146 -45180 -2683 -10237 -45250 -40581 23142 59523 -14714
35951 -14714 -133754 -148500 -45113 23484 -32028 -104183 -74833 -15953 -67073 -193316 -232247
35940 -232247 -149530 -76957 -88380 -103865 -58517 -10605 -9350 4078 65870 85333 -3154 -86013
35928 -86013 -21295 122266 146524 19748 -82938 -51788 15796 5928 -36489 -28716 -21362 -106969
35916 -106969 -231987 -250359 -135566 -2035 73734 114908 121137 37577 -104656 -163646 -87878
35905 -87878 -14641 -56581 -105709 2021 212337 318576 258516 161121 106546 34042 -77805
35894 -77805 -131403 -88829 -61618 -119593 -159498 -85459 14607 14592 -44422 -50323 -17073 -8595
35882 -8595 43262 231885 438741 437144 233947 78626 93875 125895 43923 -36495 24919
35871 24919 129961 90491 -72553 -173337 -148039 -115292 -158926 -207990 -165013 -42823 68017
35860 68017 100951 58602 3696 8900 72225 95825 4560 -130743 -161907 -58038 42759
35849 42759 2665 -150855 -265635 -236494 -102381 11556 21033 -48820 -109029 -107726 -70235
35838 -70235 -40015 -14528 29435 67244 33100 -87711 -203816 -194648 -54586 65241 1778
35827 1778 -223225 -396147 -340072 -115511 65488 99178 76741 103928 134687 51968 -139027
35816 -139027 -281179 -236983 -49910 90596 53187 -77555 -93093 66589 204844 114494
35806 114494 -128183 -249301 -137429 43640 128883 161733 240076 310342 260906 121146
35796 121146 14903 -27845 -74724 -143891 -181686 -166943 -126702 -66780 12928 59556 26996
35785 26996 -30106 -25770 20622 25496 -9643 -10502 29763 50683 52284 89798 145621 144324 96052
35772 96052 77753 63777 -58461 -270331 -392462 -338673 -237758 -216492 -214002 -122013 21485
35761 21485 102869 96422 45186 -29052 -93938 -82504 -4481 24791 -23629 1180 187796 358742
35749 358742 303261 110605 42332 137074 196709 145785 126387 187056 151381 -79761 -322561
35738 -322561 -373102 -301323 -297275 -355803 -320476 -168363 -48254 -51371 -112788 -149865 -157892 -148143
35726 -148143 -113979 -89951 -139709 -246560 -303173 -250280 -152292 -96359 -82068 -53204 15612
35715 15612 104951 178430 189760 105432 -42450 -160743 -185079 -136435 -68742 -2395 62989
35704 62989 115470 149467 181461 210498 200136 138585 76864 60220 61330 38521 21437 62371
35692 62371 123599 100791 -33262 -182405 -243633 -208603 -130818 -55961 -16100 -34700 -90756
35681 -90756 -114433 -59877 41744 129233 180393 205805 209349 193892 179719 178173 167553 130950
35669 130950 96659 103309 144510 186234 216425 230964 192460 67576 -93973 -180986 -143938
35658 -143938 -52529 -6237 -23177 -45629 -29372 5463 6551 -45664 -106558 -105998 -33145 28586
35646 28586 -12923 -136886 -220086 -189144 -114949 -113109 -186988 -233136 -193398 -132590 -140547 -208288
35634 -208288 -246472 -205642 -134973 -118129 -174199 -230486 -190567 -37073 131159 186416 109389
35623 109389 11350 -5088 27867 5759 -84890 -141115 -89256 16931 76305 58220 -2646
35612 -2646 -76950 -150899 -203287 -229473 -261906 -314885 -337193 -276780 -166091 -80151 -34672 1430
35600 1430 13456 -47707 -158816 -220912 -191054 -144752 -172847 -271971 -364881 -379059 -285349 -113452
35588 -113452 48505 120849 116823 112153 129503 123035 80770 48534 28211 -44127 -169259 -233854
35576 -233854 -159396 -17613 79353 124257 163669 178723 126073 47064 25911 68255 117550
35565 117550 161277 219322 251023 185517 44468 -65569 -94925 -99596 -135861 -183687 -190123
35554 -190123 -122484 28310 228015 376317 378575 257275 126626 45095 -31938 -131984
35544 -131984 -183213 -109794 43200 145712 129190 53315 26889 89477 180987 216770 171421
35533 171421 74727 -48664 -183212 -270552 -230915 -73715 78889 131918 123144 128935 129476
35522 129476 58913 -52588 -94326 -28292 63061 95238 79882 85683 143047 199519 159262
35511 159262 -7436 -184848 -205760 -57085 91176 117047 103889 173918 271596 256662 139482
35500 139482 60088 71963 106372 124717 141703 113588 -19821 -178232 -206370 -116612 -81046
35489 -81046 -144329 -144399 3934 141626 103455 -38129 -111869 -102899 -109102 -131639 -79201 52678
35477 52678 155138 165900 145765 168534 209706 189920 101863 45376 104389 210759 210967 93437
35465 93437 35720 135744 220482 91263 -133363 -153186 63221 220761 127629 -68850
35455 -68850 -160921 -154844 -137719 -85751 27349 99604 48465 -44791 -85029 -117041 -181860 -175505
35443 -175505 -32207 92199 25891 -141416 -197116 -128398 -86493 -101313 -66352 24149 49916
35432 49916 -17954 -70171 -49028 -17486 -20666 -28182 -28705 -44523 -45225 19539 99285 89497 4260
35419 4260 -29258 42047 137927 178562 161451 106178 40874 40379 155946 305776 352516 288674
35407 288674 232520 251485 310791 381306 460606 491339 404940 263978 226765 342361 494199
35396 494199 565516 553804 513336 494265 546607 681927 833111 948182 1094613 1353911
35386 1353911 1655304 1861498 1983948 2141533 2326120 2400428 2334581 2249673 2197590 2088569
35376 2088569 1884531 1682922 1549114 1432059 1302741 1210614 1145094 1011534 813355 691354
35366 691354 705690 737453 682233 584278 505890 429247 366648 394983 488970 494526 369845
35355 369845 276128 314512 355766 271143 157584 167672 264649 319655 326546 349425 365514
35344 365514 323435 262364 229203 180456 100732 93366 204055 291317 244809 194003 298795
35333 298795 459231 459909 299770 140471 16944 -138817 -248864 -152573 86009 207601
35323 207601 131285 54263 121732 223253 203089 83282 -19736 -54799 -31749 21406 40083
35312 40083 -26558 -112575 -96533 19058 115211 142032 145334 113662 -8711 -131962 -59423
35301 -59423 212169 433137 435914 336117 288716 247209 125109 15404 43064 127309 108199
35290 108199 25180 48724 177837 225251 109357 -36183 -83594 -71089 -76905 -78562 -33288
35279 -33288 3091 -50926 -157124 -182262 -65187 103944 186113 142727 65528 68044 163340
35268 163340 259997 272715 211356 148557 126442 126726 121839 119150 142485 186276 204521 154399
35256 154399 54355 -16274 -650 59057 68399 13373 -3084 103922 265598 319377 200823
35245 200823 20010 -70551 -36989 40101 90299 110628 103398 30143 -126560 -294265 -364347
35234 -364347 -310143 -205405 -125201 -75352 -27308 27356 80671 130094 175292 220528 286000
35223 286000 375667 430222 372569 219536 83949 36505 34153 21092 16238 37225 20889
35212 20889 -86337 -216791 -259062 -203037 -109422 19038 213923 412395 486058 411215 295338
35201 295338 213109 127375 6872 -87729 -96637 -56531 -36249 -36544 -18905 7607 -5709 -64686
35189 -64686 -106035 -66705 32627 91305 41826 -46597 -37645 79062 152942 92667 19989 86463
35177 86463 224373 249163 159636 130419 202144 202684 47345 -91197 -43567 87576 81696
35166 81696 -81588 -220544 -208610 -90656 27286 84664 74537 33157 11653 7862 -30653
35155 -30653 -91525 -67862 80521 225205 233008 151629 110440 113939 84607 49800 101579 190378
35143 190378 156006 -7314 -105939 -35490 57283 8308 -112817 -128807 -32968 20335 -40112
35132 -40112 -121935 -133930 -98366 -67727 -37406 8023 42471 47206 47399 46809 -4692 -104865
35120 -104865 -128556 22915 237139 293347 157941 32697 59602 126556 67261 -77653
35110 -77653 -146250 -105834 -45170 19581 133310 220564 132871 -90557 -214610 -131571 -8200
35099 -8200 -19707 -113764 -155730 -142609 -125693 -63138 80762 199246 179834 94285 87158 151398
35087 151398 182643 183639 229850 285161 244305 129316 59039 44212 -3742 -77362 -79182 -18176
35075 -18176 -3766 -37109 -8520 82357 114779 80368 99536 158389 81177 -143903 -268584
35064 -268584 -157872 -22154 -89621 -253400 -266292 -121742 -259 39699 68941 73819 -10389
35053 -10389 -99432 -43234 98736 102104 -75907 -214399 -154450 -14319 13646 -69170 -113974
35042 -113974 -43845 74158 130142 77843 -40895 -150498 -224431 -288532 -324563 -249406 -64092
35031 -64092 65885 10355 -108334 -60069 161413 327078 291085 139634 -1 -106952
35021 -106952 -164752 -102038 60124 157606 100269 11693 30867 95510 65225 -39386 -83564
35010 -83564 -41884 -8828 -10324 36239 157917 256701 250942 190922 175334 210674 212786 129155
34998 129155 15146 -25635 36561 122209 142107 98542 48197 3418 -54365 -88187 -37099
34987 -37099 63039 104555 76849 86702 164553 183617 53211 -126924 -206941 -177642 -111836
34976 -111836 -17694 114023 196423 131109 -35872 -171737 -230648 -251302 -235277 -165786 -105187
34965 -105187 -128243 -187455 -186281 -151867 -177741 -224870 -162444 -3812 89100 61079 34433
34954 34433 79275 102613 42463 -4604 46687 122189 121085 69590 32685 -10564 -89451 -143423
34942 -143423 -117293 -65764 -56530 -58467 -32578 -38592 -127300 -210338 -171284 -43089 52634 85376
34930 85376 107976 124210 99216 63384 74519 102090 67231 -28789 -123645 -198177 -245072 -192324
34918 -192324 -9372 153012 106765 -94377 -194297 -73838 113392 180680 125761 54104
34908 54104 27332 54287 113555 130143 47022 -39943 38314 253866 354563 199766 -35817
34897 -35817 -117170 -56356 -7270 11436 85938 187603 205893 166847 201608 290816 252169
34886 252169 32931 -176083 -202235 -104158 -23296 26438 85011 85619 -54090 -236137 -256390
34875 -256390 -82100 90253 93056 -13569 -62107 -7404 50132 29681 -28755 -39236 9538
34864 9538 51884 57442 96822 242088 415716 430723 231834 10311 -24774 71323 70550 -80017
34852 -80017 -190344 -148784 -105118 -204598 -318516 -243627 -52292 5560 -95022 -119439 24401
34841 24401 115600 -28318 -250769 -287703 -146535 -48333 -80313 -115712 -55791 35315 62132
34830 62132 23380 -31872 -70023 -62704 4936 87747 108849 49456 -47299 -155578 -273895
34819 -273895 -356998 -332051 -202312 -57573 37744 94986 128100 116255 67888 38773 45172
34808 45172 33020 -21796 -57790 -32818 -17828 -103781 -250239 -307367 -183958 62355 298428
34797 298428 429905 442553 379660 300813 241152 194542 142110 93676 80351 99329 90539
34786 90539 -2000 -148225 -244506 -224020 -127570 -42966 -8303 -12490 -48869 -100839 -109030 -46887
34774 -46887 -6547 -86591 -196277 -129906 120378 300635 239343 82846 41945 70113 5372
34763 5372 -96773 -46169 117422 137020 -48380 -175202 -43497 190896 257834 138008
34753 138008 21836 11921 29882 -21670 -125341 -176312 -95403 67199 142702 22783 -183355
34742 -183355 -273233 -222354 -188159 -232670 -224500 -82364 67641 89837 35213 8758 -14851
34731 -14851 -88389 -129515 -41193 89902 98266 -5271 -53277 26586 133862 165052 126315
34720 126315 66263 6554 -42220 -72037 -90449 -91635 -40464 61788 140138 136514 89869 66274
34708 66274 68987 79152 109067 141212 100586 -22857 -111526 -77984 3755 26675 8026 1195
34696 1195 -32624 -115711 -132491 -60 138687 101601 -29024 -20257 139083 225907 139186
34685 139186 26762 20021 61447 59619 30502 15805 11014 21740 54187 35034 -99615 -231555
34673 -231555 -170938 35595 118472 -36852 -232579 -257040 -141888 -26719 43318 71161
34663 71161 26920 -67178 -109166 -69352 -33613 -30040 15867 85747 40011 -113753 -154193 9187
34651 9187 156473 101920 -14045 -2098 33112 -83978 -221225 -130131 96834 129033 -77656
34640 -77656 -222858 -160971 -107338 -233922 -364181 -254127 36410 248958 267709 180941
34630 180941 86316 -7751 -115155 -216531 -271585 -240778 -116171 42516 136315 115132 16141
34619 16141 -80966 -109057 -56725 -7400 -88626 -305468 -474993 -427987 -227613 -65693 4224
34608 4224 63423 92311 -40515 -310664 -475277 -388574 -211793 -174372 -259421 -279352 -169605
34597 -169605 -45110 -9890 -51926 -111565 -143390 -118987 -55106 -21989 -48096 -51923 41399
34586 41399 155258 150527 41139 -14538 44767 90525 15721 -88486 -82201 -19053 -84497
34575 -84497 -299905 -440150 -316657 -41726 98817 -3730 -173058 -198430 -80499 34636
34565 34636 81363 126057 216406 290759 272975 183491 101906 63101 49042 59473 121577 218019
34553 218019 264149 201280 88644 52829 139896 255203 268920 155739 9198 -59313 -10307
34542 -10307 111694 220160 252630 224257 201668 202780 162569 42881 -73950 -81906 -7990
34531 -7990 28732 -1625 -16548 18974 44064 44014 95839 204959 236807 113371 -42760 -81944
34519 -81944 -40139 -40131 -73253 -45951 15736 -10350 -128976 -203203 -155574 -51294 35312 101705
34507 101705 140122 110450 29390 -25185 -34199 -54779 -89096 -58245 42612 84893 -16627
34496 -16627 -162984 -201336 -132434 -92110 -154634 -239294 -224002 -107572 -29250 -113988 -307175
34485 -307175 -414633 -335696 -188975 -139389 -172046 -150129 -46764 25205 3632 -47526 -68279
34474 -68279 -73614 -68569 -21592 41781 39518 -35402 -96400 -101193 -86823 -52085 45468 147478
34462 147478 121629 -17126 -92986 -47924 -36565 -140388 -200263 -91792 32148 -15440 -130834
34451 -130834 -82436 112091 228796 194263 141877 131083 62671 -93193 -202723 -166950 -47468
34440 -47468 61602 142601 188967 167597 95376 36466 -7866 -88833 -175744 -175779 -114998 -139059
34428 -139059 -278067 -371055 -307445 -191187 -153263 -138356 -25917 132382 164346 33000
34418 33000 -104839 -103429 15868 134400 181263 173970 160755 159360 149273 115920 88784 110009
34406 110009 167776 199324 169835 111475 74162 77474 122463 205655 300209 358610 351770 281758
34394 281758 163251 34304 -31207 8701 85893 89203 16336 -27581 3548 35278 12976
34383 12976 -7654 24766 56147 29135 -3828 23313 56722 11912 -57381 -24624 94409
34372 94409 141723 51439 -54582 -55908 2039 10744 -27237 -26546 29590 65098 28090 -40167
34360 -40167 -60380 148 93993 121377 20635 -134149 -170288 -15198 178842 197775 36836
34349 36836 -100062 -83956 -20068 -66021 -206047 -307375 -317006 -278104 -205043 -84415 16118
34338 16118 -13909 -155227 -246464 -185238 -42296 60025 84357 58546 25036 51800 182271
34327 182271 326223 325882 193416 136701 250665 339022 195993 -67369 -174366 -72275
34317 -72275 42236 42357 -2180 -15725 -25629 -42707 -9759 77235 139249 143718 130261 90819
34305 90819 -17100 -115568 -52683 137612 212057 47568 -179548 -254065 -195587 -140663 -108805
34294 -108805 -50246 -2410 -21442 -46593 -784 49814 4797 -68934 -24111 121335 204336
34283 204336 160159 74672 7051 -62577 -105481 -51552 39321 -5554 -211437 -371932 -318699
34272 -318699 -138741 -12478 43227 126996 230038 229554 93188 -52910 -92291 -52083 -26693
34261 -26693 -49402 -94345 -142068 -173746 -143633 -39542 49652 20513 -84550 -104705 15331
34250 15331 135932 130006 71579 95182 156762 110065 -19438 -43395 82906 166098 63662
34239 63662 -113846 -198409 -199690 -207570 -203013 -133308 -66213 -87021 -118138 -25934 141156 202459
34227 202459 106969 -23726 -94480 -108776 -56202 87553 233996 235299 103029 12025 46283
34216 46283 104227 105276 114273 178689 211394 152727 105990 170496 250420 188925 26569 -35023
34204 -35023 85655 238399 236898 80976 -55996 -30560 104438 152187 10501 -174470
34194 -174470 -167803 52536 262604 285689 195768 161376 203393 220121 173524 117854 74226
34183 74226 -282 -110823 -185586 -166270 -82826 -13052 6538 16317 81360 196314 261830
34172 261830 201085 82350 44585 99636 117630 41862 -10365 58395 153214 133775 40890
34161 40890 19250 66717 35721 -115873 -243664 -232549 -151840 -117335 -111132 -47525 45964
34150 45964 37150 -116417 -270697 -238872 -548 269747 376935 280935 98674 -27431
34140 -27431 -31571 68121 197653 264613 234274 183017 213237 301086 310774 195070 86865
34129 86865 120357 244411 310730 283058 242563 226488 193215 142233 141602 211629 288973 339301
34117 339301 403252 483740 489000 366133 216892 185357 270217 342746 334977 310338 327220
34106 327220 327569 233385 102235 86465 226119 366327 331380 126339 -96173 -224022 -255938
34095 -255938 -212662 -90022 81117 225665 312190 371183 400258 349430 241190 190740 235419
34084 235419 256596 167315 66956 81841 149936 124356 21770 -13942 37400 47784 -26472
34073 -26472 -69465 -3488 94896 130493 106721 55258 -24816 -104519 -121647 -88382 -80655 -81315
34061 -81315 17409 197269 269892 148395 -332 -6364 52156 13553 -82376 -75500 31808
34050 31808 83632 25088 -48414 -82816 -117312 -135979 -50729 127843 258421 256144 182781
34039 182781 118109 75138 70039 123509 152368 32663 -159129 -156601 120499 375056 297673
34028 297673 -5475 -161419 -30246 172537 233124 183888 140762 104734 38061 -8878 19157
34017 19157 61933 30788 -43787 -70040 -60252 -111901 -228039 -278185 -177129 -12649 63758
34006 63758 17471 -56575 -64139 8230 125214 246024 322815 312683 229286 152956 149552 193393
33994 193393 208874 178533 159739 185918 206627 160793 67389 -5923 -36275 -50472 -55175 -32499
33982 -32499 -5335 -28902 -92781 -107785 -37701 25799 -8107 -79629 -53628 76984 168408
33971 168408 123274 18191 -10002 64621 155864 184148 131990 14023 -133093 -231534 -201119
33960 -201119 -50353 104448 147311 83008 21473 35794 65460 -2036 -161682 -264855 -200997
33949 -200997 -53719 -634 -81533 -162593 -141204 -78906 -75226 -103125 -65357 39545 112778
33938 112778 98597 39228 -10187 -34974 -22074 47092 140698 184739 154881 99078 50290
33927 50290 -8741 -66654 -59984 15141 55011 -3949 -65075 -11355 90770 73955 -56381
33916 -56381 -97807 48015 202278 146152 -79153 -249913 -270336 -242551 -242978 -204913 -78439
33905 -78439 38510 31911 -56693 -98404 -59883 -14262 -7290 -17150 -29174 -50189 -53376 -4102
33893 -4102 58235 60904 26819 56296 158042 214160 162405 99361 123108 171497 123265 -6256
33881 -6256 -85236 -48619 42612 113812 158360 201837 249989 280967 257848 171999 100572 157650
33869 157650 327269 417255 277778 11502 -149243 -133424 -68298 -52791 -48628 -8789 36966
33858 36966 67077 107903 141716 101122 7357 -16609 62797 119877 74883 28605 75492 118058
33846 118058 27898 -112421 -119403 -2587 52438 -15753 -56825 42742 191393 236170 143179
33835 143179 -25390 -192790 -263212 -158775 55109 188298 159102 103548 148608 193060
33825 193060 72994 -135173 -180192 1243 181321 152386 -22657 -155095 -185075 -173886
33815 -173886 -145965 -80931 -11918 289 -27908 -32991 -20519 -41676 -69705 -23880 80340
33804 80340 136422 124042 142855 223684 253355 171746 104401 177234 315277 372461 366242 406940
33792 406940 455433 353724 93180 -137810 -207895 -177825 -135986 -65654 46142 117767 96990
33781 96990 59115 74792 84752 21384 -43061 -9838 56474 10054 -134240 -199711 -103343 25355
33769 25355 30425 -68707 -130149 -81922 10451 48925 19859 -8665 15783 64369 73028 30770
33757 30770 -17822 -46850 -68351 -74470 -29580 60585 142519 199180 255289 270512 145220 -96987
33745 -96987 -257031 -209470 -100373 -144245 -301514 -343421 -204079 -66950 -79963 -170840 -204487
33734 -204487 -160687 -73056 64343 222334 283893 188358 50183 17567 71114 78592 9040
33723 9040 -30211 35110 145113 200241 181153 137904 103657 58772 -23861 -117097 -147880 -89225
33711 -89225 -19836 -35465 -107492 -108003 7490 131981 162608 130211 107780 87571 51317 76081
33699 76081 226699 389111 371484 171929 -3641 -13701 73485 146374 205311 266479 256079
33688 256079 134895 26315 63681 169796 152376 -5275 -120008 -91432 -37533 -80049
33678 -80049 -145184 -97948 24493 57878 -46753 -155644 -137447 -20212 66866 50134 -17666
33667 -17666 -15380 120394 305119 366762 238353 59446 21677 137230 242642 221870 125594
33656 125594 52451 17819 -5288 -658 58563 141931 196507 219416 240413 259180 250209 210959
33644 210959 168506 156836 201666 284594 312590 200921 19325 -42565 77808 207329 177570
33633 177570 71805 84418 212953 281068 234934 200804 225808 186638 41976 -33116 90952
33622 90952 271042 305654 246573 284468 406953 414086 262705 152442 210453 305101 283955
33611 283955 218928 259677 370935 400038 339829 336035 441814 539186 542412 528887 589850
33600 589850 663773 622107 459647 304132 265347 350408 507880 682310 826868 919793
33590 919793 976727 1015231 1018705 971120 908795 891169 929123 980912 1004762 978684 894802 784898
33578 784898 727824 774364 883322 981822 1051642 1093683 1068092 976871 952489 1111094 1334446
33567 1334446 1376753 1216814 1116226 1252058 1475468 1561328 1536154 1583190 1733156 1849117
33557 1849117 1871797 1893431 1984422 2094734 2152192 2152759 2133322 2130734 2170843 2242122 2303816 2368026
33545 2368026 2511174 2736589 2917736 2985937 3076556 3336584 3670289 3866558 3926471 4046032
33535 4046032 4283162 4474292 4528729 4591612 4823624 5190851 5572985 5936162 6296269 6632211
33525 6632211 6939341 7278997 7694580 8157190 8644626 9178856 9744222 10280580 10797369
33516 10797369 11364757 11946071 12386492 12626904 12765642 12831454 12680293 12238561 11672680
33507 11672680 11162798 10666183 10081625 9500660 9077637 8753433 8340632 7828400 7379721
33498 7379721 7046723 6701495 6266125 5827446 5481734 5206184 4924477 4597435 4234043
33489 4234043 3898604 3688156 3606706 3501045 3238857 2906308 2691179 2615518 2551594 2471321
33479 2471321 2476131 2560245 2549290 2349347 2093929 1950636 1905357 1829722 1671933 1503855
33469 1503855 1441426 1555142 1785285 1931520 1829774 1562748 1380825 1386743 1432832 1378938
33459 1378938 1299091 1330984 1443980 1488736 1406213 1267500 1148513 1068559 1028526 1021324 1010474
33448 1010474 960057 882809 822987 806352 829894 873773 904278 897780 874738 870757 870609 827072
33436 827072 750381 707715 717476 721149 686860 661618 681993 706602 683017 618791 545981 478628
33424 478628 443549 485149 593451 685953 700775 653389 579539 497809 452958 498647 591659
33413 591659 605294 512363 455003 550046 715697 787459 727418 614678 499494 386997 315700
33402 315700 325614 370431 374725 364812 431799 566653 646807 612977 558209 586115 650595 612249
33390 612249 435957 264206 258721 395928 482155 395285 244841 221389 341367 455551
33380 455551 484211 494548 526681 508106 413338 358902 431402 541921 568895 538124 533561
33369 533561 529915 459093 360518 313439 289865 230882 200836 289034 411399 407248 308067 301641
33357 301641 422643 492405 410588 301558 289800 315261 285534 256675 321469 423245 424883
33346 424883 309059 192706 168151 215627 260690 263518 258816 321792 465738 585915 574416
33335 574416 480736 456246 532178 579073 521567 453021 463428 486743 426068 319734 257583
33324 257583 220856 144462 74018 109539 221283 266839 194226 102538 81981 102801 96076
33313 96076 56250 22058 17779 46302 92680 113546 69616 -10958 -42008 27880 158156 256392
33301 256392 250080 131140 -26854 -103511 -38457 90340 143674 81715 -5459 -34468 -26111
33290 -26111 -33647 -40618 5396 94068 159073 172808 166576 151408 92427 -2643 -35840 68771
33278 68771 239173 328226 310577 314051 422531 538975 517703 367302 226837 177600 183144
33267 183144 202152 245209 298791 301513 246678 222112 285971 372692 390476 352091 326533 302053
33255 302053 196653 9474 -118613 -38621 235098 512806 596265 463986 284865 231852
33245 231852 296575 324670 219818 51194 -45521 -4957 145823 324930 422557 368675 225789
33234 225789 148255 197115 264288 238194 163501 153253 218670 293819 366548 452870 479801
33223 479801 350537 137370 58598 203679 396759 413385 250968 96975 83800 171451
33213 171451 254945 293692 306464 302315 276155 258340 308733 433146 543182 547043 462947
33202 462947 387169 358628 326814 262072 212324 214471 230405 224047 227429 267000 297362 284739
33190 284739 288560 371688 488021 551329 560419 561419 547379 502139 477199 498513 465399 296709
33178 296709 116672 107756 217774 230601 120457 88573 202580 260006 125278 -32473
33168 -32473 -3047 154650 252112 262661 270896 262149 187642 148188 275531 476533 528096
33157 528096 416627 357635 454188 552242 499253 357571 269400 263055 293574 348230 403817
33146 403817 380253 248425 115183 105660 216531 362420 500164 618856 672944 636761
33136 636761 587307 620258 699451 697703 587644 484643 477649 518628 526623 513389 534076 575669
33124 575669 580428 547611 524316 503801 421335 270425 145824 130849 201234 285505 363049
33113 363049 440106 478882 439525 375069 394054 518018 650166 700984 675005 614870 537395
33102 537395 463321 440403 483040 538442 560502 571078 602375 629252 617099 596930 629153
33091 629153 713841 786008 783202 689864 550633 463939 503005 606575 624866 529882 485114
33080 485114 611458 777121 761822 570285 418161 429799 522846 600050 671615 735153 710973
33069 710973 595440 535738 632174 778259 823961 800250 833960 912716 908389 812164 773502
33058 773502 875680 1017216 1074367 1063778 1065408 1075415 1034710 952254 899569 898306 901919 896899
33046 896899 942531 1075049 1230816 1317864 1332498 1348583 1403510 1456159 1468520 1468628 1496051
33035 1496051 1532103 1539981 1546335 1614697 1740270 1839264 1862333 1858317 1890286 1941508 1958130 1947031
33023 1947031 1961469 2001924 2007017 1962326 1952879 2060599 2248498 2400959 2461040 2474715 2507449
33012 2507449 2577501 2678529 2798679 2885566 2862101 2739186 2658413 2739864 2922374 3050142
33002 3050142 3094735 3169432 3313686 3403418 3341404 3219855 3194098 3276086 3360304 3396755 3427655
32991 3427655 3487117 3566318 3655294 3732858 3749608 3711450 3730219 3874411 4018686 3994072 3860147
32980 3860147 3842019 3980602 4049288 3896545 3683571 3648191 3774511 3854704 3783808 3633267
32970 3633267 3490508 3379873 3315362 3294377 3249293 3124138 2989478 2964419 3028879 3033730 2909132
32959 2909132 2748245 2659933 2645139 2651883 2651008 2613437 2504775 2354617 2252064 2224018 2196688
32948 2196688 2124502 2064071 2052830 2013639 1885520 1772434 1826551 2013843 2127592 2041116
32938 2041116 1838705 1679689 1628571 1642012 1638045 1556015 1428309 1403000 1594185 1889276
32928 1889276 2026070 1907572 1712257 1625579 1612156 1569269 1549471 1640271 1735583 1668314 1523015
32917 1523015 1554658 1779035 1909070 1780288 1588824 1566576 1645044 1639360 1585561 1646227 1783935
32906 1783935 1786004 1588444 1357367 1245914 1259300 1368016 1561655 1749529 1782578 1644697
32896 1644697 1491375 1441419 1451773 1449460 1457338 1513667 1575177 1584301 1557242 1542408 1559064 1617903
32884 1617903 1721710 1811835 1812876 1770817 1831051 2020274 2175886 2177948 2124291 2154969 2218225
32873 2218225 2174244 2057344 2044348 2172067 2267629 2208691 2109671 2163400 2389204 2634556
32863 2634556 2782565 2867726 2990350 3189626 3428874 3658223 3841095 3933347 3897320 3761611
32853 3761611 3621091 3533259 3446137 3285070 3089998 2993125 3052133 3173594 3232887 3220147
32843 3220147 3222431 3283586 3330905 3265269 3114085 3047988 3194335 3457414 3614184 3599404 3577821
32832 3577821 3679124 3801063 3801640 3769263 3912874 4234466 4510611 4606514 4629248 4730827
32822 4730827 4917205 5116249 5310098 5524908 5766835 6017749 6247206 6431563 6622144
32813 6622144 6955331 7498846 8132573 8697744 9211726 9798366 10466585 11118976 11710222
32804 11710222 12206282 12469804 12436250 12348944 12535802 12977162 13390265 13714757 14166894 14816007
32794 14816007 15520046 16347238 17616562 19370377 21243540 23064491 25165289 27848958
32786 27848958 30978060 34402329 38381693 43214086 48820048 55099133 62343378 70880931
32778 70880931 80706144 91988854 105598060 122540953 143257071 168187851 198561473
32771 198561473 235110207 275176936 311507386 334683715 337598546 318993239 284184990
32764 284184990 242526337 202745422 169216137 141934720 119420136 100936300 86216919
32757 86216919 74479921 64693738 56382315 49498346 43777907 38774589 34335175 30553552
32749 30553552 27371063 24601175 22214778 20247579 18543891 16911171 15412600 14209335
32741 14209335 13223977 12240499 11234876 10346980 9620716 9001250 8480412 8031092 7521125
32732 7521125 6896157 6310162 5884323 5507866 5076713 4721223 4558841 4437201 4195103
32723 4195103 3959135 3870684 3738718 3337113 2868906 2717806 2847766 2869211 2646360 2427897
32713 2427897 2381501 2389796 2346100 2300232 2249514 2095637 1873853 1750608 1743513 1700543 1588048
32702 1588048 1536362 1567221 1539880 1409103 1286431 1212277 1115164 1017847 1020589 1056888 946154
32691 946154 726686 647517 775750 904268 912861 913541 951029 883578 694303 607401 723143
32680 723143 825233 742618 628583 660688 722100 642252 534501 598821 747584 732010 545242
32669 545242 412083 426577 465121 448730 447513 493812 498989 419415 348523 371205 438968 458974
32657 458974 427312 406212 415797 413654 376215 353352 409023 517130 567419 504836 412914 402164
32645 402164 465525 528316 594350 720592 863175 886871 752631 578728 482669 466708 489011
32634 489011 538092 591635 595631 531426 434321 329503 228098 181621 231815 303738 272503
32623 272503 150937 80672 113235 136911 60115 -63971 -140596 -138538 -54523 99244 232628
32612 232628 230570 104915 -29747 -137361 -254929 -306349 -150387 128170 224226 31615
32602 31615 -171868 -116855 93262 204141 199523 223523 260803 172903 -14181 -119291 -89542
32591 -89542 -54168 -87757 -112594 -61448 26252 102728 171988 227317 245577 257490 312570 368848
32579 368848 334176 226560 171990 218702 269319 235183 151642 88372 38963 -30728 -91835
32568 -91835 -89463 -38866 -14140 -43137 -66816 -20986 76862 155537 186307 200401 206718 161212
32556 161212 59878 -7944 22700 78105 51513 -23556 -35813 -1962 -46191 -164231 -186676
32545 -186676 -38666 124447 132540 21527 -56225 -29204 76150 206169 276959 208648 53155
32534 53155 -22014 37548 92957 59299 69972 239216 414173 376388 188060 102898 181500
32523 181500 230108 121701 -41850 -130485 -159995 -192361 -208828 -170755 -110518 -84473 -93723
32512 -93723 -101739 -87788 -53736 -12491 16234 23211 19367 14850 18610 68401 195240 331736
32500 331736 348495 235648 143712 166020 196754 115287 -8080 -39927 -12209 -40735 -93885
32489 -93885 -50669 50732 40358 -105044 -214146 -178719 -72861 21872 126010 238042
32479 238042 272600 203686 128258 111509 99699 57509 54606 126766 178067 127030 45466 41981
32467 41981 93710 108728 92998 138039 266677 381781 369363 210311 3511 -106749 -64548
32456 -64548 29074 35410 -40769 -77157 -38123 -22236 -68873 -66667 51066 147121 50315 -197104
32444 -197104 -397834 -452015 -418859 -362254 -277066 -172730 -106542 -101029 -111278 -96461 -55085
32433 -55085 20070 147051 297944 404723 437553 413509 322269 130547 -112402 -268318
32423 -268318 -268410 -202207 -178069 -168000 -88345 21858 35186 -58772 -114306 -32588 106195 170768
32411 170768 145131 96526 59984 40391 59075 100118 69980 -78555 -232598 -255110 -193302
32400 -193302 -202079 -282621 -275961 -134773 -9866 1022 6596 113521 228368 218818 146431
32389 146431 162854 253649 264528 145568 4899 -71349 -107182 -138408 -153759 -152937 -156939 -139102
32377 -139102 -36230 146927 311179 355341 251613 48382 -147635 -226296 -178984 -113718
32367 -113718 -103255 -81821 19049 112345 68757 -69906 -150098 -146199 -165083 -217232 -176205
32356 -176205 -10501 119222 74774 -81426 -199553 -219034 -163041 -69469 -3824 -40082 -152174
32345 -152174 -213377 -165907 -89170 -34936 77563 295356 476413 447425 249324 81531
32335 81531 42191 63183 77495 97355 109722 41486 -104757 -187143 -88826 109611 209424
32324 209424 126347 -28034 -97291 -47746 36256 70038 34979 -44319 -133614 -197958 -216777
32313 -216777 -198077 -155023 -80693 18612 88314 84917 54170 71994 119541 118488 86035 117581
32301 117581 191366 159650 7892 -59979 72384 214362 143239 -42070 -73450 75667
32291 75667 187286 156452 85049 24932 -100605 -275541 -343701 -255775 -139710 -57577 69942
32280 69942 215358 190683 -17415 -123347 45656 248401 189006 -20807 -57154 96571
32270 96571 162302 46718 -32171 63636 177914 146540 53364 47081 84257 37312 -49260
32259 -49260 -2550 198410 340703 226553 -74065 -287213 -240688 -53097 20582 -95533
32249 -95533 -219138 -170004 -9897 70361 32707 16897 93263 148294 78985 -28160 -27149
32238 -27149 53539 45367 -105414 -252748 -264716 -211252 -245128 -362767 -407982 -305590 -165411
32227 -165411 -109712 -104473 -45881 62339 127130 123132 116875 137376 129872 65094 5653 13874
32215 13874 49392 13238 -122128 -258937 -260902 -104153 67318 83689 -45817 -144914 -114545
32204 -114545 -55715 -75243 -96232 -74 147588 193733 147470 127489 111429 -22329 -215164
32193 -215164 -258085 -141526 -98980 -208014 -226510 12930 296630 334623 173090 58961
32183 58961 46025 4849 -68792 -34694 118437 217693 154133 12170 -75463 -65965 9438
32172 9438 78896 51032 -86352 -207071 -195724 -120287 -130576 -224609 -264263 -200631 -126115
32161 -126115 -102055 -85424 -42389 2585 48954 123511 189469 183112 150831 203296 310231
32150 310231 304033 146617 34170 134578 343471 424765 314957 162373 100551 98340 44958
32139 44958 -95053 -247557 -318160 -282333 -183525 -69636 30073 74799 30233 -53494 -56747
32128 -56747 56982 169898 164943 83644 35184 18231 -36984 -97991 -60099 58464 109241
32117 109241 33527 -47538 -14248 96303 176992 196681 193311 192384 189511 161951 64484 -126169
32105 -126169 -336185 -431531 -361832 -206992 -59812 65257 179953 258933 274817 238721
32095 238721 171042 84587 15756 4119 17397 -27132 -135497 -213005 -209240 -200750 -265085 -348982
32083 -348982 -347610 -264519 -198890 -192839 -181096 -108766 -32724 -59759 -202111 -336700 -329487 -184132
32071 -184132 -33847 9465 -50039 -149875 -243217 -280824 -212248 -81338 -35636 -137474 -246078
32060 -246078 -219918 -156802 -246716 -429972 -435268 -188280 51546 58480 -61071 -80713 4739
32049 4739 33798 -37391 -102442 -109244 -121988 -181551 -237307 -228622 -141057 10228 168165 229405
32037 229405 151058 44925 61496 186246 257749 194311 91715 66776 107333 130434 104955
32026 104955 47082 -45461 -173351 -277960 -283158 -200491 -133166 -152488 -212159 -218151 -153178
32015 -153178 -82961 -50736 -30756 -5915 -20353 -93730 -136921 -48359 122125 210752 157348
32004 157348 80684 90662 127774 76661 -36222 -76916 -9164 54800 28878 -21485 14512
31993 14512 123300 177618 101778 -36540 -115421 -95950 -35567 11088 51111 103887 143491
31982 143491 129194 66175 -3819 -51908 -61799 -5998 116579 228454 230186 126533 38163
31971 38163 59141 145832 176775 91249 -57438 -163171 -161316 -78085 2020 22834 -1509
31960 -1509 -41676 -109568 -214913 -303921 -313409 -267481 -243557 -252406 -234199 -169913 -107711 -74094
31948 -74094 -50069 -42081 -77650 -122195 -112876 -87429 -143294 -240643 -212897 -44023 44920 -85652
31936 -85652 -253880 -217036 -45301 -10485 -168221 -294265 -241586 -132700 -129579 -195744 -190660
31925 -190660 -77334 64509 153165 158071 100964 54197 73279 98741 11352 -175029 -279686
31914 -279686 -182785 10326 122670 137392 162955 232496 274222 255898 221877 178764 74588
31903 74588 -70924 -137181 -76416 -18107 -95816 -231583 -219496 -14813 183582 179423 11984
31892 11984 -123306 -115893 -14573 93570 169458 189898 137400 57764 39014 81777 73350
31881 73350 -37643 -120826 -28872 165250 231200 81869 -118869 -182823 -111857 -24867 18103
31870 18103 22295 -27139 -133930 -213310 -166407 -27364 64163 40968 -32942 -84408 -109387
31859 -109387 -109362 -57440 26822 67100 54299 87235 213123 317211 274658 143217 85382
31848 85382 144759 225982 266809 289516 284647 194680 51635 -5093 81423 180157 130878 -66787
31836 -66787 -281083 -387991 -330322 -127673 99343 196305 146861 102755 164294 223445 135791
31825 135791 -37484 -107591 -29741 61195 73971 64148 92331 119885 97651 51056 20865
31814 20865 2936 -3204 38791 131068 193286 139866 -20184 -185385 -244486 -166627 -47006
31803 -47006 -35531 -158129 -245402 -131534 108269 242284 186677 72406 -139 -86148 -211514
31792 -211514 -256629 -157636 -66280 -137603 -275269 -281648 -177934 -154117 -234311 -229857 -59887
31781 -59887 102511 94191 -11789 -65441 -73520 -121794 -175315 -131420 -14301 51653 38437
31770 38437 26399 29423 -23690 -112703 -105318 26276 132478 118824 89834 135603 135987 -36505
31758 -36505 -244406 -250832 -89106 -11308 -84815 -112343 5843 109037 79517 44451 112480
31747 112480 146102 11830 -138950 -95511 49260 40632 -121911 -197523 -97844 11777 15726
31736 15726 -8821 1498 -15120 -77417 -90969 -32495 -20641 -113526 -200839 -185878 -120935 -75341
31724 -75341 -20772 59298 91751 45487 7350 29776 35573 -25305 -59979 10661 103916 107440
31712 107440 48578 7194 -37244 -140123 -258433 -308312 -286526 -232831 -153109 -76978 -93540
31701 -93540 -218642 -323180 -307610 -245888 -236660 -227980 -134338 -12832 46573 101393 235493
31690 235493 346620 269939 56245 -92764 -130116 -177436 -252053 -229240 -106438 -60224 -160493
31679 -160493 -244015 -182618 -91261 -132993 -261737 -307175 -218286 -88905 -9753 -8637 -79210
31668 -79210 -163916 -157315 -27513 102997 92960 -31441 -122385 -120775 -109306 -142673 -139508 -15622
31656 -15622 145322 161457 -7232 -184790 -196386 -87807 -36470 -82021 -76862 70042 234588
31645 234588 251549 148285 82244 103432 117357 70139 34057 77797 155922 176185 108734
31634 108734 -8311 -115349 -155067 -105311 -17793 24491 12920 24320 97061 152107 90037
31623 90037 -64911 -173737 -132800 21412 162012 200160 151848 93045 74475 91441 118268
31612 118268 138922 137128 87006 -18931 -137908 -193865 -141949 -24362 48657 3025 -110731
31601 -110731 -172662 -143516 -94861 -67876 -4743 107605 142158 16875 -119905 -74913 79894
31590 79894 106205 -12167 -38059 123521 270913 248053 176231 187076 173320 21179 -121187
31579 -121187 -69868 58143 19565 -148850 -194755 -71447 25 -98129 -213217 -186065 -66780
31568 -66780 13842 25852 17002 26166 72481 142181 169477 113144 37226 24921 51309 48229
31556 48229 37640 67375 76538 -15902 -141632 -174944 -145409 -170437 -219379 -156846 676
31545 676 92981 79471 73081 101618 64093 -46669 -107561 -95962 -130069 -220896 -210856 -37165
31533 -37165 157893 262758 333496 408742 402381 289646 203934 234548 302352 326872 330629
31522 330629 300286 164116 7 16436 198613 238757 -6754 -254563 -212572 -16491
31512 -16491 25017 -84685 -115654 -36524 -19513 -90365 -88822 29721 120145 93274 19042
31501 19042 -30016 -52354 -33277 40146 89134 35502 -35738 17187 139129 118718 -107438
31490 -107438 -364652 -476605 -439713 -342742 -257234 -232572 -274224 -306580 -258293 -173202 -133326
31479 -133326 -116579 -65864 -44108 -143081 -274183 -257310 -115935 -62338 -152691 -183260 -16404
31468 -16404 196249 245388 153969 84478 76460 39813 -54904 -131703 -144285 -145608 -202703 -298811
31456 -298811 -342766 -270508 -138499 -84397 -151029 -194754 -64639 153779 210259 25004 -192338
31445 -192338 -223040 -107018 -30395 -54215 -88828 -74781 -44597 -18139 34315 102896 116031
31434 116031 50074 -16399 -9497 37930 52668 46396 94929 203107 275115 245861 171296 137588
31422 137588 135764 96923 18792 -23207 16796 106624 189785 221307 164058 33948 -58497
31411 -58497 -12483 110614 148672 67934 3133 32872 59696 -11000 -109958 -127022 -77968
31400 -77968 -32231 19045 94037 119563 47050 -15711 48805 156974 136299 3343 -60434
31389 -60434 673 39822 -50952 -189389 -244565 -197237 -108075 -35594 -26515 -88421 -141010 -91437
31377 -91437 19666 50024 -45854 -159257 -191572 -157589 -91190 22984 162675 231186 189582
31366 189582 131926 144232 169715 108552 -9156 -52185 34802 166169 223578 170771 56942
31355 56942 -52075 -128131 -174886 -182564 -119893 6724 121228 152512 113859 53289 -37550
31344 -37550 -177988 -286047 -231265 -26014 140928 118411 -32680 -135692 -108737 -12478
31334 -12478 73622 142792 216712 264233 220504 97402 19365 79031 182032 146290 -29052
31323 -29052 -136533 -70018 2493 -80213 -172135 -32163 250661 327628 93832 -156748 -161301
31312 -161301 -23326 19711 -47498 -79025 -35013 11018 41132 84162 95488 18866 -64502
31301 -64502 -16219 133760 197786 93647 -36703 -23673 117319 234838 231818 135815 18572
31290 18572 -80271 -144771 -150821 -83418 18190 70234 29684 -45531 -59328 5223 76580 104598
31278 104598 120740 162151 192262 152842 67260 27553 70931 120387 85782 1183 2932 147807
31266 147807 307807 314807 183109 91471 138106 227571 241400 194717 140597 45372 -110266
31255 -110266 -210942 -152663 -34987 -24026 -77727 -18753 140575 186097 49549 -70640
31245 -70640 -25341 67073 50288 -10551 32561 152029 204579 158601 95725 49553 -4716
31234 -4716 -46342 -37394 -24461 -81687 -171011 -177969 -78401 36649 100731 141073 198774 257520
31222 257520 270987 218341 129470 73971 96894 148921 136268 64374 48939 134555 199000
31211 199000 122836 -30887 -112757 -96350 -75913 -103214 -144448 -168978 -171781 -133471 -60790
31200 -60790 -34600 -105446 -173665 -105168 48459 92275 -31448 -147750 -87510 95938 221771
31189 221771 207037 118533 55986 59668 109549 157169 158332 102119 12929 -72328 -119336 -108744
31177 -108744 -63408 -43941 -76372 -101554 -46493 64862 127013 77983 -40393 -146244 -192010
31166 -192010 -173892 -118229 -68901 -48779 -27959 35462 126646 185829 184696 147815 100601 42554
31154 42554 -23725 -80341 -119692 -149160 -167863 -168642 -157365 -137958 -92178 -16896 33986 2534
31142 2534 -80434 -116796 -68031 -5478 -11453 -77013 -128010 -118536 -66717 -18105 89 -1217
31130 -1217 16878 81055 164412 196763 130611 -5258 -125204 -159672 -106584 -12746 83593
31119 83593 173107 239818 243513 170482 75288 22693 -32 -58499 -164744 -258460 -297690 -295780
31107 -295780 -251976 -128439 58843 197878 195482 95359 27724 66640 172807 248280 220856
31096 220856 106884 7406 2000 43299 18139 -86470 -166665 -163286 -132839 -125710 -111398 -74263
31084 -74263 -59458 -60995 -128 106304 111520 -17221 -89421 18243 131149 46406 -115271
31073 -115271 -94331 70744 97798 -80362 -228954 -215819 -193932 -282911 -347915 -248723 -87666
31062 -87666 -39117 -100197 -168342 -219952 -259317 -223489 -93584 14072 15437 4793 83240
31051 83240 157743 87889 -62120 -113973 -57813 -46939 -134632 -201322 -149858 -16060 127706
31040 127706 240182 272574 196364 85728 49553 72156 49133 -11918 21820 183612 320363
31029 320363 302749 194868 127740 112158 76679 4423 -75248 -165519 -263915 -296178 -204384
31018 -204384 -72681 -46006 -127710 -176032 -119686 -53255 -61380 -65893 39754 178627 164198
31007 164198 -19633 -164920 -124324 -19053 -50568 -196256 -248686 -128242 14007 41048
30997 41048 21320 82602 188626 188252 34428 -160469 -270667 -270937 -213150 -157023 -119724 -57507
30985 -57507 69106 184859 139437 -73473 -240925 -197189 -71068 -96380 -246759 -281844
30975 -281844 -140295 -34663 -100949 -199914 -178574 -103172 -76202 -27177 112186 195356 64124
30964 64124 -156704 -221514 -137627 -113735 -189937 -206221 -132041 -126485 -217999 -214839 -39240 113267
30952 113267 86439 -3819 -9414 3921 -54906 -74973 60830 219466 213570 123519 152328
30941 152328 258742 233037 88871 65905 224422 333020 231338 46581 -49177 -70110
30931 -70110 -89439 -80614 -14889 49185 95697 212160 396672 467196 315688 108792 60245
30920 60245 121545 95065 -27961 -59776 73721 216035 212096 106991 48760 89397 149222
30909 149222 132540 30399 -81734 -130921 -120813 -103244 -95027 -75858 -59691 -87356 -136507
30898 -136507 -130859 -66543 -31474 -60363 -76153 -28284 21062 16459 6570 45296 101238 143434
30886 143434 202748 263995 229203 95646 31227 137462 272042 263504 169506 140006 154148
30875 154148 111963 75392 160494 262535 168201 -80881 -213208 -129607 -14405 -6703 -25326
30864 -25326 6627 17649 -24076 -6680 112989 193457 141998 81763 137486 218024 177682
30853 177682 63006 30801 115755 228478 303845 318526 238960 81360 -42031 -51147 -8331
30842 -8331 -2574 -7945 31724 66629 23378 -48250 -52544 -17729 -43455 -113774 -110951 -10210
30830 -10210 75677 67951 27629 50749 134359 193216 175911 129915 142616 215500 231829 107232
30818 107232 -55206 -66300 86955 209182 166856 52800 7932 19239 7333 -7372 32740
30807 32740 80770 46491 -63554 -187925 -319278 -445242 -463457 -310585 -112833 -43961
30797 -43961 -82021 -77558 -21348 -48045 -181200 -278634 -266756 -240970 -267486 -255109 -123470
30786 -123470 32039 59961 -40568 -133967 -128476 -69118 -66739 -168797 -291113 -290722 -145438
30775 -145438 -26474 -112196 -351798 -514338 -464848 -281549 -99585 28169 85053 47301
30765 47301 -38747 -48743 57566 147852 86120 -67116 -119301 16424 227102 336257 277670
30754 277670 132296 30164 27796 78485 118196 146535 187870 211613 165556 75002 28159
30743 28159 62346 142113 244490 367013 443523 371334 167803 -3013 -19299 67702 143216
30732 143216 175108 184378 164261 118609 106972 157174 192604 139010 47760 14053 24208 -1943
30720 -1943 -53085 -39359 42648 83506 22681 -72619 -128239 -161417 -197257 -172428 -15735 212669
30708 212669 355308 336957 243942 201396 222974 225101 159041 66388 -648 -51228 -111755
30697 -111755 -159151 -157190 -129367 -124810 -125604 -69461 29862 73008 16572 -56298 -54551 1106
30685 1106 34049 25273 3947 -23489 -57858 -57434 15592 115868 153050 101860 18425 -38145
30673 -38145 -45291 755 77641 126317 113135 91131 133177 215984 244967 189299 111758 60552
30661 60552 18904 -17678 -2596 80253 167386 199552 199344 214454 231701 204808 134516 63234
30649 63234 5775 -65140 -166249 -270758 -332807 -330284 -283721 -235619 -206770 -183781 -159759
30638 -159759 -153266 -150162 -73420 108476 272321 254264 81857 -31371 36244 165883 193298
30627 193298 124467 53500 -13725 -105850 -144940 -39023 124074 159033 57880 3325 78612
30616 78612 144102 76813 -28298 -15084 88553 118452 13086 -114190 -131030 -35675 54978
30605 54978 34462 -70858 -114968 -8696 140240 150111 15047 -90700 -66891 8168 67658
30594 67658 166902 306545 332276 171484 13088 52312 181426 163978 22514 -11792 108298
30583 108298 188407 142994 119271 192765 201501 21330 -202956 -263812 -173108 -82785 -48764
30572 -48764 -24688 8375 46366 115961 203289 210387 96533 -22253 -28896 28819 45300 30429
30560 30429 37722 16608 -98517 -226124 -239081 -172952 -154938 -172118 -108404 10068 22936
30549 22936 -89265 -149575 -68568 8550 -57740 -171497 -145903 24835 173162 187034 118389
30538 118389 76659 94724 116290 86912 38872 56202 136974 153655 26738 -121313 -111552
30527 -111552 20988 58633 -83630 -238356 -235790 -118464 -18250 41324 100626 129713 75399
30516 75399 -21131 -74449 -77756 -73239 -48638 27132 102485 91679 10440 -36877 33 74082
30504 74082 133373 173777 199435 204868 198134 180840 115719 -22412 -180165 -279770 -321023 -353491
30492 -353491 -370873 -327185 -243781 -190877 -158916 -65791 83243 163808 110299 12928 -30308
30481 -30308 -49477 -98780 -118322 -30462 88525 81120 -61768 -180655 -172816 -114228 -116121 -168293
30469 -168293 -190744 -160128 -108717 -51148 13996 63442 76052 78014 104436 135532 125705 80758
30457 80758 54101 77239 137599 203993 224571 131604 -77085 -279316 -337498 -266176 -203027
30446 -203027 -206493 -188316 -84525 14640 -15428 -157015 -278901 -294977 -215717 -81712 66395
30435 66395 167883 172898 101643 23598 -19864 -35321 -39976 -50702 -90609 -157529 -203438 -191637
30423 -191637 -151971 -130098 -111292 -57360 4759 5353 -64039 -135438 -151362 -109794 -33583 37963
30411 37963 34483 -88809 -262361 -333633 -216531 20841 221164 264152 151062 11001
30401 11001 1126 146027 297369 303185 175961 26120 -109521 -259256 -378573 -367211 -229592
30390 -229592 -85542 -861 66850 129576 113346 -8262 -146694 -220844 -237428 -204842 -96231
30379 -96231 40755 77047 -8436 -68087 -18038 9574 -112841 -264545 -239878 -75746 -14080
30368 -14080 -162135 -376116 -491697 -500139 -456472 -362250 -212891 -62740 27285 50543 27736
30357 27736 -22440 -59434 -30255 60916 136052 125276 38929 -50965 -75891 -26335 25742 -18668
30345 -18668 -163750 -277569 -231555 -59308 88952 127564 92747 35875 -43352 -143143 -223551
30334 -223551 -255215 -247776 -213304 -152492 -80791 -13131 69355 168706 202294 85711 -109269
30323 -109269 -192706 -91742 56091 100719 69805 78851 136600 152592 96023 32642 5134
30312 5134 -27725 -105733 -186821 -194170 -117906 -37396 -39452 -123837 -203859 -211433 -180098 -185996 -222791
30299 -222791 -203062 -95101 20250 69000 83129 115365 127992 65754 -10457 10716 103543
30288 103543 119013 12638 -78029 -50528 -2488 -63492 -163243 -129566 28363 117272 55459
30277 55459 -7545 60814 165186 141140 9155 -79339 -77633 -66509 -77036 -52161 16378
30266 16378 65397 91099 152837 218590 171696 29714 -19310 96650 180263 52591 -150871
30255 -150871 -177602 -53852 -36338 -192538 -288097 -155982 48965 95361 8627 -9349 103153
30244 103153 209076 202388 136899 97594 67618 -5110 -78720 -45625 112804 265697 264282
30233 264282 108711 -59566 -127638 -122408 -133991 -186019 -237767 -277755 -336069 -404515 -419204
30222 -419204 -350463 -259219 -229775 -276059 -340688 -365706 -343472 -311237 -308860 -336257 -354993 -339149
30210 -339149 -304376 -264682 -191760 -65994 53227 76118 4986 -56706 -33656 45303 123264
30199 123264 195183 260513 259826 146834 3051 -14738 129791 278963 258183 86871 -54162
30188 -54162 -50291 32862 80099 81288 88307 89316 37522 -21579 20389 158652 248591 205939
30176 205939 127565 139528 215058 233941 154236 31320 -79900 -150226 -151596 -99594 -79623
30165 -79623 -143314 -222212 -229928 -192664 -176692 -151054 -53644 56522 63804 -14437 -55718 -34546
30153 -34546 -37068 -78052 -75779 -28211 -38940 -125510 -169629 -112871 -39268 -4452 43468 96814
30141 96814 32089 -160749 -272410 -157639 22318 24354 -120108 -171839 -40286 122311
30131 122311 159923 74533 -51280 -147956 -162843 -91725 -22703 -51414 -145627 -181365 -113094
30120 -113094 -22865 -77 -51163 -129298 -184135 -182885 -137678 -99489 -80607 -22182 104952
30109 104952 221321 235950 167865 85092 -14999 -153960 -257444 -231691 -130787 -105027
30099 -105027 -177428 -202316 -71513 146143 298109 293134 140750 -64866 -188956 -168214
30089 -168214 -86343 -65017 -100440 -104424 -76825 -101215 -171824 -173021 -61712 61380 99375
30078 99375 57555 -31045 -140732 -183048 -64605 122786 140408 -71635 -272879 -256206 -140907
30067 -140907 -153963 -255883 -221550 -28352 93486 15772 -114906 -136675 -108037 -155060 -226312
30056 -226312 -169197 10425 124408 43773 -149630 -277468 -244764 -76468 140013 288673
30046 288673 266694 83151 -103838 -133673 -30580 34206 -21848 -90125 -46277 70689 137620
30035 137620 126246 93038 45891 -44699 -120307 -63509 122846 286185 314698 254745 199007
30024 199007 165376 143476 157167 201696 202198 118924 27076 12337 49176 61411 38562 4532
30012 4532 -61540 -161774 -188449 -29460 245295 422711 385966 222668 86211 42208 66866
30001 66866 104314 95648 29031 -13332 63303 212179 263525 143241 -18370 -68463 -40099
29990 -40099 -74805 -190268 -257635 -212508 -158421 -199660 -266953 -212327 -39104 75869 11327
29979 11327 -138283 -193621 -123183 -57576 -89186 -157012 -163058 -120169 -113844 -162839 -197364 -162002
29967 -162002 -70373 38318 126212 137350 36797 -100302 -124322 3911 138024 138939 74829
29956 74829 105432 206917 179881 -39996 -251354 -263343 -156596 -122060 -152582 -92558 59410
29945 59410 122781 28445 -72617 -60727 -12477 -14102 2368 90799 124327 -12595 -187148
29934 -187148 -184201 -28836 73491 62617 55669 76726 8091 -154203 -236753 -158840 -56347
29923 -56347 -41725 -35757 49255 143174 168603 188944 253209 245845 67952 -155127 -233713 -184690
29911 -184690 -156473 -166900 -117974 -18887 13452 -36815 -61025 -11924 55838 131366 259738
29900 259738 392294 397702 261981 122852 64021 28613 -18734 -14754 39130 5212 -174007
29889 -174007 -321994 -243918 -9262 139340 112132 46306 56028 64416 -49844 -240054 -325880
29878 -325880 -216370 -21284 78052 22227 -95342 -159817 -142551 -82101 -23093 -1862 -39379
29867 -39379 -105723 -129720 -82191 -12339 28295 42676 33511 -29166 -121630 -132889 -12881 120434
29855 120434 134844 73339 53940 49078 -55481 -214066 -240079 -94730 40525 42719 18774
29844 18774 105137 251712 324395 304746 264267 225833 167259 103322 65123 40742 9867
29833 9867 -9245 -6601 -19135 -67398 -109882 -106837 -68455 -5532 89182 177261 187280 129206
29821 129206 90587 85425 42917 -8350 76605 297051 416541 286337 89156 72756 191737
29810 191737 237404 194309 200960 241135 172345 37413 43763 198978 261451 136640 40104
29799 40104 128973 228688 124014 -80689 -129767 -16110 32320 -91257 -254532 -321157 -309268
29788 -309268 -277211 -208830 -84967 34420 76078 43507 -16355 -93203 -200972 -304936 -322004
29777 -322004 -214034 -48011 70997 112669 121229 106264 16151 -129912 -171788 8524 269787
29766 269787 326812 107365 -145336 -188480 -68708 4852 -32637 -67496 -27983 16361 -12017
29755 -12017 -85395 -128288 -106299 -23158 101596 212472 232532 145205 27198 -36210 -37234
29744 -37234 -16081 12712 51585 66683 16513 -62766 -73703 7560 75924 37264 -42157 -14101
29732 -14101 135697 249459 202028 50723 -74808 -147128 -216578 -275069 -261042 -179707 -103512
29721 -103512 -47290 46495 173066 227749 159253 65105 55232 93553 69765 -21144 -81513
29710 -81513 -79741 -102966 -206718 -300638 -256368 -89591 43932 38778 -39365 -61471 -16902
29699 -16902 -14227 -104158 -185275 -133994 28891 170294 211977 192384 177908 192904 241848
29688 241848 320987 382107 349364 205405 14823 -155365 -282028 -335502 -261072 -65925
29678 -65925 128485 186888 95978 -35330 -86935 -14833 130865 236980 211424 76824 -45626
29667 -45626 -72912 -42619 -30698 -42312 -36746 -11935 5565 22678 56449 67290 -810 -105743
29655 -105743 -111036 55331 286846 386407 265929 44176 -59362 61668 289306 404246
29645 404246 326828 197945 195194 316617 407849 376755 295795 272935 296395 267913 155636
29634 155636 39872 -5298 -13446 -59741 -131631 -143851 -81113 -31497 -36896 -8868 117356
29623 117356 230698 183853 35684 -15451 65036 100782 4617 -71536 9317 144160 170153
29612 170153 123035 131864 168763 113663 -4155 -52829 -50994 -142815 -317996 -392353 -310812
29601 -310812 -237315 -259243 -229419 -38898 150771 129253 -52500 -184258 -200982 -188317 -163779
29590 -163779 -68814 50229 65421 -11811 -23970 72031 112885 -20939 -207758 -246631 -117279
29579 -117279 32080 88833 60281 -5286 -76509 -122546 -118348 -80031 -49337 -39213 -28917
29568 -28917 -8060 10149 18103 24417 31707 27039 1492 -31107 -39211 -2402 54073 65065 -3814
29555 -3814 -94964 -109707 -26516 76604 125852 119961 78813 1456 -78665 -75290 34608 133357
29543 133357 93802 -47950 -143456 -126442 -57102 4467 52865 68333 16544 -59083 -57375
29532 -57375 34448 116890 128309 105540 64126 -42219 -181398 -212283 -95086 7757 -28359
29521 -28359 -80620 21058 189873 187640 -14735 -196171 -205362 -125308 -86297 -93280 -98917 -98512
29509 -98512 -82780 -20112 50871 28308 -89549 -163626 -111709 -38960 -80516 -202053 -257726
29498 -257726 -188963 -72350 -742 8144 -7189 -19018 -52401 -148781 -268597 -283718 -141100
29487 -141100 22981 51654 1422 43337 158435 145075 -44631 -208577 -214764 -186574 -241706
29476 -241706 -271081 -158448 -23743 -25777 -79008 -13788 99764 59837 -100082 -130757 47200
29465 47200 228772 238829 149269 112660 144426 151145 68192 -85061 -218458 -234761 -145141
29454 -145141 -81055 -110419 -122870 -18362 95392 73019 367 56285 168700 90969 -179255
29443 -179255 -349981 -262150 -92012 -31012 -24308 36480 94909 74525 53708 119556 194899
29432 194899 172282 91502 38861 -1591 -55229 -49926 44015 93026 -15911 -178925 -225092
29421 -225092 -163735 -123877 -144554 -184781 -241748 -291713 -219865 209 156535 45010 -210909
29410 -210909 -317548 -229609 -158816 -193614 -192050 -89521 -38330 -137061 -246614 -210478 -84191
29399 -84191 -7181 13036 45314 71630 26200 -65662 -113232 -89459 -39956 5621 52021 94538
29387 94538 124398 160879 228006 311470 365155 343052 226052 63585 -20305 55748 198871
29376 198871 229022 124408 57312 123917 175506 40188 -197184 -303799 -230233 -149085 -165824
29365 -165824 -176169 -69888 78802 127364 67437 1012 -17944 -11470 5051 26666 11857
29354 11857 -59010 -99342 -13177 124575 125619 -36434 -152803 -64412 111769 166377 98476
29343 98476 62226 77435 2557 -189201 -307938 -208491 -6592 78984 -153 -119323 -175781
29332 -175781 -165364 -107648 -14581 71145 97293 65807 9940 -78380 -217466 -333282 -283768
29321 -283768 -33930 249162 338731 180672 -49153 -126707 -3259 164521 198125 79526
29311 79526 -65834 -129257 -108457 -53898 704 32658 12583 -67444 -171449 -244478 -247023
29300 -247023 -177914 -95428 -86554 -156829 -186210 -82759 55551 61306 -37043 -41115 97316
29289 97316 177178 61444 -97766 -98887 -748 3117 -87225 -99149 7778 78848 19912
29278 19912 -73364 -90438 -60140 -66573 -120068 -172018 -185086 -151282 -95349 -68954 -86513 -83369
29266 -83369 -5684 92698 133609 151291 224051 304206 271219 152374 121561 237839 342026
29255 342026 285505 131998 46078 83185 176300 251356 275438 247047 196953 150410 64584
29244 64584 -117824 -328074 -391579 -245327 -39014 48361 9414 -37592 -10795 85769 191449
29233 191449 203987 58887 -137909 -169623 5300 150116 65061 -115101 -124291 24091
29223 24091 69374 -71299 -172163 -67883 83092 61234 -61476 -43613 136821 241901
29213 241901 127244 -61377 -115129 -36818 18145 -24808 -109742 -179679 -227595 -232106 -162175
29202 -162175 -62850 -33129 -86329 -122907 -78704 -7588 31704 70969 139793 171557 106158
29191 106158 15189 6111 51548 41113 -26554 -38395 48459 142476 154717 91672 -3516 -94541
29179 -94541 -119281 -29269 103824 129678 10893 -126584 -176262 -177032 -200615 -222421 -185699
29168 -185699 -106659 -30231 44660 111262 100419 -18448 -136599 -118785 6527 72638 -10064
29157 -10064 -150520 -203640 -134284 -29882 8698 -36784 -98284 -98753 -31058 42776 59739 3645
29145 3645 -99648 -196548 -225271 -169703 -90120 -51375 -34856 11247 54334 13749 -79751 -84540
29133 -84540 47711 186720 213685 187626 225024 305582 319330 246756 162618 90217 -18342
29122 -18342 -152525 -211810 -144522 -40056 -31380 -141475 -261631 -269394 -152419 -15326 39403
29111 39403 25515 35424 97007 136368 108909 87261 148169 229577 200846 62301 -25047 58528
29099 58528 227919 286490 154629 -52093 -178296 -204222 -212614 -215353 -120720 87335 245344
29088 245344 196257 20184 -53326 56363 206165 253796 208593 125655 4710 -126428
29078 -126428 -158572 -40182 116625 167801 108643 30436 -24976 -77820 -132912 -176048 -211047
29067 -211047 -236981 -227927 -180288 -128128 -79555 -10848 50896 43435 3081 48863 171642 194801
29055 194801 46248 -91722 -48577 67150 48049 -89637 -175339 -184683 -236264 -330592 -323932
29044 -323932 -166904 27447 164135 238112 227924 106977 -27369 -28577 68269 80247 -24871
29033 -24871 -65296 60133 216619 264038 252692 269485 260604 158143 49276 54408 126297
29022 126297 126151 40596 -19343 630 44612 56491 37643 3487 -28782 -13889 80941 202399
29010 202399 239377 141239 -23257 -131248 -118679 -39273 -13910 -97025 -198297 -180159 -29647
28999 -29647 126194 179786 144925 83005 11319 -71830 -140490 -173264 -181889 -165732 -92519 28951
28987 28951 111768 86276 -3496 -53103 -24319 23530 10606 -83857 -199828 -239377 -159785
28976 -159785 -31693 34230 19588 -133 10895 -504 -58087 -80953 -5423 80439 28049
28965 28049 -157421 -288221 -213301 -8288 112555 61214 -17223 49845 201467 200343 -31218
28954 -31218 -264960 -252905 -56313 58747 -7194 -100746 -92790 -48632 -64797 -103997 -93723
28943 -93723 -66662 -90166 -139786 -149080 -125126 -116644 -110461 -52757 45379 97929 41220 -94964
28931 -94964 -208969 -212953 -121205 -44507 -55629 -89076 -48727 22776 5521 -82301 -90653 12942
28919 12942 71326 -15741 -137527 -163352 -130224 -112301 -51783 113308 267800 253714 113413
28908 113413 17281 1939 -32969 -96585 -73142 63980 175798 145607 16077 -105074 -166656
28897 -166656 -160141 -85434 15551 60957 8655 -107133 -226587 -302453 -297141 -208142 -94315
28886 -94315 -18894 20173 47853 40236 -22039 -71199 -33242 37606 31489 -26535 -5098 105164
28874 105164 153594 71198 -4298 60996 186411 200240 94878 27494 95514 224675 289082
28863 289082 263613 229039 262269 344726 379755 304557 172484 94352 106074 140135 128441
28852 128441 76054 18562 -33340 -76172 -92053 -83166 -88728 -128963 -161211 -128161 -32001 66024
28840 66024 107070 80379 21874 -22941 -43444 -66011 -103048 -129756 -139034 -172254 -236646 -243118
28828 -243118 -124173 20335 25979 -89287 -131627 -22931 75570 20143 -88268 -78055 9376
28817 9376 -2661 -123585 -172504 -61669 82932 132342 123308 135806 140491 80586 5060 -7563
28805 -7563 6235 -40938 -112688 -76933 83518 214877 190952 70458 -3172 16228 66695
28794 66695 96280 110840 123030 123877 109787 93431 83909 84158 99375 119307 107092 39141 -57913
28781 -57913 -139514 -186635 -180645 -76821 129412 337735 426574 390102 310679 214265 66728
28770 66728 -86047 -120754 -30696 25808 -37780 -86376 14596 144473 86860 -115473 -188831
28759 -188831 -31144 129825 74483 -90120 -102162 77601 240667 241901 157736 110654 93113
28748 93113 48053 12055 58361 150515 177129 123253 87137 103805 75794 -51228 -152780
28737 -152780 -80108 117447 253760 250777 185868 119227 35745 -31999 -2273 80086 45592
28726 45592 -127158 -213608 -56398 179051 241313 157471 143298 235294 260063 144943 11331
28715 11331 -64728 -147537 -235530 -187286 36765 248836 279930 194253 127771 69552 -34113
28704 -34113 -95944 -10971 122301 117840 4681 5360 198451 390969 382310 203843 21675
28693 21675 -77806 -116536 -126829 -121722 -121199 -135331 -142286 -124256 -94262 -54981 23091 136667
28681 136667 207924 171227 74687 26580 49347 56594 -13341 -105512 -122932 -47552 52911
28670 52911 107548 90121 9434 -97214 -170355 -179214 -168070 -202874 -265797 -260779 -148500 -22146
28658 -22146 -8343 -128975 -294122 -390780 -346209 -164448 37571 85674 -69794 -258253
28648 -258253 -271032 -123891 -31864 -117310 -258156 -268043 -128814 21598 63793 -8198 -120517
28637 -120517 -187175 -169452 -107996 -78306 -105150 -158108 -222019 -294324 -310614 -187171 18990
28626 18990 113504 12074 -120265 -84318 90139 223446 247921 232865 199572 95209 -49734
28615 -49734 -116753 -89620 -88920 -159496 -179148 -67743 53058 31596 -86966 -143217 -104851
28604 -104851 -86125 -160607 -283467 -388076 -443621 -417139 -290181 -129736 -42618 -35107 -12034
28593 -12034 54016 53515 -98292 -309213 -400460 -308625 -131138 374 31719 -7391 -49417
28582 -49417 -46148 -17209 -27363 -85927 -106562 -22664 93201 110526 32019 1259 87113 158391
28570 158391 54392 -176859 -311638 -214443 16551 184161 197453 107330 5792 -43382
28560 -43382 -11491 78353 143910 117863 34895 -15123 -22463 -62903 -144980 -158317 -49859 43147
28548 43147 -39173 -231799 -309942 -191495 -30142 12395 -55009 -144114 -214834 -240387 -174859
28537 -174859 -45500 36827 48405 108666 261706 348725 249853 110146 120891 193996 107470
28526 107470 -96867 -150913 11686 161258 157589 140520 227446 289153 190647 35492 -16373
28515 -16373 -173 -31093 -87557 -93500 -83514 -101754 -61944 98488 240528 205503 74200
28504 74200 31132 62667 22294 -79556 -107800 -81693 -150697 -291685 -301080 -134151 3195
28493 3195 -15079 -44587 69505 234075 256853 121521 -26149 -85323 -80073 -78517 -107884
28482 -107884 -131493 -95682 -26892 -35927 -149051 -209004 -82700 99864 103575 -57714 -152029
28471 -152029 -102409 -65940 -102369 -51060 151252 299435 232627 89869 63287 94879 33028
28460 33028 -75468 -84883 -19820 -9614 -39229 5598 100718 113694 47886 49304 161874 254487
28448 254487 221733 116400 47152 47796 75677 73186 26559 -2196 54600 139826 109829 -38912
28436 -38912 -116839 -20101 86611 24476 -101698 -70582 94676 176290 115354 58071 59235
28425 59235 -118 -155205 -255616 -207807 -124613 -128616 -161224 -96725 65840 216120 254854
28414 254854 148295 -50191 -193077 -153144 13835 117106 70949 -21158 -49706 -38385
28404 -38385 -49673 -76029 -96200 -136123 -203464 -251858 -269609 -308695 -363988 -325862 -135887
28393 -135887 92207 192167 127245 -11618 -125719 -163157 -116482 -34763 6471 -3571 1910
28382 1910 55122 97618 81159 50496 66475 111052 130675 116314 77400 -9500 -152785 -279478
28370 -279478 -285090 -146248 47411 166637 147038 48996 3500 57919 106563 43496 -62273
28359 -62273 -63863 21505 32458 -62469 -100869 -4928 65476 -35222 -191213 -196608 -64289
28348 -64289 15005 -40117 -124067 -126828 -51328 38135 67424 -24932 -203595 -304603 -209891
28337 -209891 -27221 36560 -38646 -80097 -5967 57185 887 -72481 6925 231764 428986
28326 428986 472961 395544 303598 264554 276320 293357 262782 162106 21053 -95311 -130388
28315 -130388 -74769 22560 83497 60603 -24369 -108762 -153301 -166065 -166549 -148724 -95675 -23831
28303 -23831 11965 -19814 -67578 -36786 92794 229714 285158 281195 287596 295182 246069 169447
28291 169447 167723 248663 291966 233094 166074 185883 231716 192299 86732 16162 -13258
28280 -13258 -84067 -199996 -254507 -186630 -66347 6184 7144 -32789 -82715 -107657 -72712 4109
28268 4109 45461 3196 -74548 -101840 -62851 -25603 -50300 -113707 -141886 -106068 -56194 -46231
28256 -46231 -58695 -44995 -19496 -46587 -128049 -176477 -134069 -54799 -21670 -35527 -42147 -27594
28244 -27594 -23828 -44235 -70034 -87028 -92352 -77756 -39961 6919 51393 94199 124645 122734
28232 122734 93561 52587 -20868 -140193 -225335 -178812 -71482 -97843 -271947 -339994 -137183
28221 -137183 125616 136085 -71991 -192566 -111330 -20314 -56340 -106287 -64911 -36183 -122621
28210 -122621 -209795 -149676 -19248 5191 -61257 -58265 27308 32451 -99869 -208499 -162641
28199 -162641 -66210 -92380 -215689 -256490 -156061 -58294 -88564 -175371 -171094 -67176 18506
28188 18506 28354 18315 24219 -2249 -84247 -156028 -172869 -188005 -238544 -245616 -135362 12843
28176 12843 63459 21168 2355 46733 94165 126641 183475 233933 189570 71930 20785
28165 20785 87945 160491 148430 114087 136857 175550 164670 142255 172741 226361 242835 241700
28153 241700 259680 245417 138404 4047 -36696 14972 50306 29289 17114 42801 52026
28142 52026 34783 78210 221722 349521 318526 145630 -18034 -76461 -71251 -77676 -100423
28131 -100423 -103788 -83849 -60844 -37535 -16950 -33264 -106412 -186385 -208823 -188899 -178994 -149607
28119 -149607 -30129 118461 118272 -68177 -231656 -178006 15425 133263 112568 52938 24455
28108 24455 33180 104577 216371 212665 -3013 -235905 -203728 43943 177613 81359 2085
28097 2085 123270 284041 275805 161353 103900 89992 33671 -16931 9367 35311 -18450
28086 -18450 -51182 45994 168659 169538 122019 170450 231817 121551 -98550 -184028 -85654
28075 -85654 11774 17326 26545 71610 51733 -36142 -50222 38359 69832 -35490 -140500 -116135
28063 -116135 -15192 68331 134105 179573 144599 48213 15974 79140 113267 65944 58067
28052 58067 143551 165491 12798 -154009 -129340 18485 66636 -13719 -47198 44265 135116
28041 135116 110748 28441 10426 71048 102243 -989 -213145 -374979 -353706 -206690 -112278
28030 -112278 -127854 -125031 -5796 140279 174236 99374 25719 29092 122928 277275 390489
28019 390489 350047 206559 164755 297872 407026 301604 84764 -16237 11196 7351
28009 7351 -55310 -43647 78034 179646 180898 153919 170509 197422 184986 134172 44528 -89989
27997 -89989 -210154 -223776 -125781 7264 132646 245661 297525 247766 179914 207783 273666
27986 273666 215671 45507 -40198 27512 71826 -43608 -198435 -211869 -97189 23063
27976 23063 121218 220862 253199 138359 -40698 -109601 -31313 68786 93129 63440 26190
27965 26190 -10509 -24086 33461 150847 234388 214960 133314 81577 89262 104948 86344 77593
27953 77593 165960 353435 509665 501755 352872 206388 138750 95277 29617 882 64831
27942 64831 150512 137810 13243 -134885 -242631 -308667 -332315 -304005 -254645 -232810 -222206
27931 -222206 -154494 -25561 65575 31560 -91287 -183840 -172765 -84624 14183 92713 158173
27920 158173 206653 204357 129454 12171 -89007 -139547 -135629 -78735 14513 85401 70350
27909 70350 -18954 -92285 -75411 18264 110452 116380 -7962 -215046 -361672 -331809 -180242
27898 -180242 -71908 -54901 -1833 162107 292139 210937 -12135 -126769 -31752 114537
27888 114537 143584 92862 92978 149812 161569 103937 69709 113919 166150 147287 97416 109534
27876 109534 175983 195096 131936 76532 99559 132068 67532 -68270 -147290 -124083 -93863
27865 -93863 -149482 -259675 -322363 -284940 -184654 -108857 -123761 -199685 -214710 -94179 66466
27854 66466 105383 17065 -40745 17613 94031 86313 46922 64855 102515 80329 45110 110195
27842 110195 268090 398063 441801 445324 432562 365519 250956 173014 175649 194669 150918
27831 150918 53630 -22432 -20732 52488 127178 110503 -22557 -177767 -230789 -167340 -81993
27820 -81993 -42132 -17834 46026 152548 264519 336468 317208 178474 -26612 -175238 -182875
27809 -182875 -86773 -7257 -34129 -147255 -234931 -200927 -65557 59691 102185 83379 30615
27798 30615 -78340 -220286 -267034 -135981 53486 104215 -3616 -113907 -137689 -142744 -179795
27787 -179795 -179508 -95675 -22075 -66056 -189827 -271740 -265419 -213776 -154222 -94676 -55036 -57259
27775 -57259 -82559 -88332 -60460 -20051 4158 -8580 -53109 -78682 -25439 98085 210748
27764 210748 248314 217435 154972 93600 81753 161793 289552 342124 255654 104930 3921
27753 3921 -20873 -15759 -13707 -15471 -17379 -14996 -9693 -28828 -88540 -129811 -75996 25092 27191
27740 27191 -96569 -186014 -130063 -42955 -72737 -145512 -83667 82045 127626 -30226 -209002
27729 -209002 -225880 -125078 -50444 -21655 42054 151627 223753 202739 115673 10762 -89169
27718 -89169 -163926 -181423 -132122 -56349 -15855 -36472 -84039 -101645 -67030 -832 75132 153511
27706 153511 209113 202656 148715 126629 170300 199144 136372 51137 74786 193112 248370
27695 248370 166647 54609 18001 9825 -48843 -105020 -64053 22295 13744 -85686 -109067 20053
27683 20053 153434 123380 -16739 -73237 15010 107863 71514 -52049 -125733 -93828 -19112
27672 -19112 15238 -15146 -72098 -81667 16978 195989 321762 274762 96633 -39201 -26663
27661 -26663 57180 73086 5155 -40895 -3151 51696 31744 -48703 -90412 -42372 36076 57743
27649 57743 14993 -31192 -54031 -96025 -173857 -198213 -62119 191899 368132 320591 111864
27638 111864 -75996 -147257 -147165 -141649 -132773 -107651 -86431 -70289 -3668 136707 249488 199673
27626 199673 11322 -120478 -60335 89330 114170 -43389 -226532 -272749 -196628 -133753
27616 -133753 -164429 -241248 -262378 -180660 -53125 7449 -45593 -122282 -92771 47827 178041
27605 178041 218007 206214 183075 117665 22245 17350 157853 287149 220985 20587 -86649
27594 -86649 -31899 32873 8012 -9356 79128 192805 189048 54238 -111917 -219938 -225903
27583 -225903 -126281 6503 52238 -25135 -131146 -171462 -154848 -123092 -73326 -15658 -17919
27572 -17919 -110941 -217431 -246162 -193675 -97228 32303 167075 236757 217003 166144 119562
27561 119562 47825 -23704 12328 161584 256550 189632 81112 69501 74990 -38032 -181363
27550 -181363 -158506 5045 84128 -12156 -146739 -196371 -180534 -131904 -37455 55455 58089
27539 58089 8393 46521 176378 225220 102652 -64040 -127137 -103190 -83465 -94860 -129072
27528 -129072 -189635 -235966 -190670 -65084 29694 43306 37577 39745 -9071 -103132 -127037 -39196
27516 -39196 50749 70622 92565 155621 154214 32084 -79647 -74900 -66484 -180646 -295460
27505 -295460 -206876 35877 191111 169286 95103 54916 9563 -34165 11710 130517 174463
27494 174463 96154 37910 102767 183869 128354 -43334 -190693 -236790 -195168 -92899 17204
27483 17204 27164 -110391 -257852 -216404 8662 188257 164433 50496 41121 115549 85931
27472 85931 -85505 -205972 -151836 -76972 -178838 -375060 -404607 -202749 23791 100014
27462 100014 69862 40811 27534 29927 100242 223928 270458 176080 52913 4623 -33613
27451 -33613 -135085 -196513 -94723 70905 97551 -14184 -78151 -27761 17 -92783 -218884
27440 -218884 -252254 -178368 -48988 89834 177048 155064 59137 -2398 8802 29007 26661
27429 26661 57401 137272 165767 50631 -155607 -308118 -319816 -222934 -120993 -102902 -166182
27418 -166182 -215373 -173654 -81407 -27018 -6143 62027 189466 290550 304963 253853 166279
27407 166279 51677 -41898 -50995 430 30633 50050 150113 306903 349712 206559 39184
27396 39184 18257 84084 73146 -8534 -7699 120216 246529 275310 272647 336952 438482 461426
27384 461426 361991 222528 149562 149348 127466 21951 -86689 -52684 136023 301446 269080
27373 269080 71703 -107187 -165596 -175684 -238401 -329823 -348390 -271649 -186906 -154442 -111793
27362 -111793 22454 186758 217232 68141 -107807 -161139 -138524 -173780 -254693 -238748 -83534
27351 -83534 81519 136904 104130 57773 19010 -11401 -12938 1560 -25959 -103128 -153968 -125034
27339 -125034 -43745 65049 214133 349361 331241 119030 -121762 -203708 -134235 -46751
27329 -46751 3096 47691 78711 51216 -8860 -26290 4858 27046 24568 21638 -64 -71526
27317 -71526 -144059 -144577 -111306 -149921 -255113 -307632 -264620 -214921 -204969 -148292 13597 173447
27305 173447 186584 69584 -30922 -35849 -12043 -54996 -155928 -208235 -130276 30437 132909
27294 132909 97538 -4388 -56436 -54899 -83563 -151053 -160872 -66287 47216 87459 81074 105437
27282 105437 157665 169405 117128 47201 7470 8000 37561 74844 91962 77971 44900 -9575
27270 -9575 -109913 -237477 -299210 -225738 -83908 -21010 -85974 -166865 -138034 -23813 37375
27259 37375 -22446 -111397 -96286 31484 156639 189805 157264 132555 139262 154480 159063 140976
27247 140976 89142 27696 13962 56383 87515 74230 81395 138021 125456 -53741 -251516
27236 -251516 -214355 46275 227973 144078 -38101 -74063 21350 72528 38380 13270 12778
27225 12778 -41953 -151156 -221428 -222520 -209565 -186768 -94660 53332 162276 205864 246806
27214 246806 279373 205110 28053 -73167 28636 219388 291084 199346 63092 -30826
27204 -30826 -100120 -168228 -204353 -176330 -95531 2561 83955 130703 161088 209602 254418 212111
27192 212111 62274 -70582 -47220 95432 178671 111721 -5130 -33662 31480 96096 101696
27181 101696 55000 -35790 -165847 -274545 -261488 -102072 95210 190833 154283 67538 10498
27170 10498 -6809 -5073 8385 24572 26671 27697 64054 120338 125382 75622 85241 219894
27158 219894 346914 287903 90302 -14842 60396 148134 99185 878 5857 82839 92558
27147 92558 21354 -23468 935 45749 93635 156876 174490 71120 -81814 -126092 -57566
27136 -57566 -40721 -137885 -196807 -96551 52283 83240 27960 36158 115558 121953 -6594
27125 -6594 -156355 -205077 -165545 -114680 -67539 8592 98537 129832 66366 -28411 -52052 17741
27113 17741 95946 98735 43370 -3084 -39214 -112388 -193782 -173516 -19307 147515 194553
27102 194553 129341 47102 -6374 -46212 -78062 -95862 -107614 -93187 8472 185791 292626
27091 292626 218598 74595 62273 175443 199341 37482 -133410 -123600 -854 35047 -45173
27080 -45173 -83373 10536 139447 181549 150511 131024 134740 101834 14193 -67619 -86052 -55222
27068 -55222 -27678 -22951 -16129 14753 55160 68796 32474 -39927 -93990 -64925 60566 211366
27056 211366 290165 272146 217491 179951 144734 81183 17081 15451 91066 185671 225107 186928
27044 186928 123317 122394 218356 332823 349606 262753 189021 199393 212153 119757 -44691
27033 -44691 -161301 -196021 -209264 -219927 -186888 -127555 -121998 -161367 -116040 73673 272585
27022 272585 306971 181495 48533 958 -13371 -81455 -205168 -302662 -288657 -153578 8672
27011 8672 67033 -17179 -140673 -173590 -108510 -50982 -71504 -120660 -105557 -9417 92843
27000 92843 117847 46533 -77303 -194105 -266170 -286612 -271067 -240345 -199629 -136680 -51136
$$ [...]
##END NTUPLES=NMR SPECTRUM
##END=
