##TITLE=31Pdec_LY-20ix.24.R.t
 CD3CN, 24 sc
 2.03.2021
##JCAMPDX= 6.0         $$ Bruker NMR JCAMP-DX V2.0
##DATA TYPE= NMR SPECTRUM
##DATA CLASS= NTUPLES
##ORIGIN= UXNMR, Bruker Analytische Messtechnik GmbH
##OWNER= root
$$ XWIN-NMR		Version 3.5
$$ Wed Mar  3 10:50:22 2021 Russian Standard Time (UT+4h)  she@DPX200
##.OBSERVE FREQUENCY= 81.013821
##.OBSERVE NUCLEUS= ^31P
##.ACQUISITION MODE= SIMULTANEOUS
##.ACQUISITION SCHEME= undefined
##.AVERAGES= 24
##.DIGITISER RES= 16
##SPECTROMETER/DATA SYSTEM= spect
##.PULSE SEQUENCE= zgpg30
##.SOLVENT NAME= CDCl3
##.SHIFT REFERENCE= (INTERNAL, CDCl3, 0, 248.564)
##AUDIT TRAIL= $$ (NUMBER, WHEN, WHO, WHERE, WHAT)
$$ ##TITLE= Audit trail, XWIN-NMR		Version 3.5
$$ ##JCAMPDX= 5.01
$$ ##ORIGIN= Bruker BioSpin GmbH
$$ ##OWNER= she
$$ F:/spectra/data/she/nmr/P31/1/pdata/1/auditp.txt
$$ ##AUDIT TRAIL=  $$ (NUMBER, WHEN, WHO, WHERE, WHAT)
(   1,<2021-03-03 10:48:53.90 +0400>,<she>,<DPX200>,
      <created by zg, POWCHK disabled, PULCHK disabled
       configuration hash MD5:
       00 E9 B6 7A A2 85 ED C7 34 08 36 98 17 FE 4E 26
       data hash MD5: 32K
       01 19 4C A8 85 D5 29 DD B6 3D 88 F8 3A 66 F3 AB>)
(   2,<2021-03-03 10:49:09.82 +0400>,<she>,<DPX200>,
      <Start of raw data processing
       efp BC_mod = 2 LB = 1 FT_mod = 6 PKNL = 1 PHC0 = -2938.131 PHC1 = 6.602692 SI = 64K 
       data hash MD5: 64K
       2C 3B 31 FE 70 46 7F F6 D2 52 8C 5E AB 1E 26 0C>)
(   3,<2021-03-03 10:49:43.37 +0400>,<she>,<DPX200>,
      <pk PHC0 = 78.42307 PHC1 = -198 
       data hash MD5: 64K
       ED 5F 19 F6 E7 4F DE B4 4D 5A 42 11 96 5D 67 C3>)
(   4,<2021-03-03 10:49:56.18 +0400>,<she>,<DPX200>,
      <abs ABSG = 5 
       data hash MD5: 64K
       C7 4D 94 B9 9E 4A 8B AC 65 9C 78 EF 09 1C 06 98>)
$$ ##END=
$$ 
$$ hash MD5
$$ 52 D1 AD 1F 59 29 7A F8 D7 45 C0 F5 39 50 8E 93
##$RELAX= 
##$RELAX= 
##$RELAX= 
##$RELAX= 
##$RELAX= 
##$RELAX= 
##$RELAX= 
##$RELAX= 
$$ Bruker specific parameters
$$ --------------------------
##$DU= <F:/spectra>
##$EXPNO= 1
##$NAME= <P31>
##$PROCNO= 1
##$TYPE= <nmr>
##$USER= <she>
##$AMP= (0..31)
100 100 100 100 100 100 100 100 100 100 100 100 100 100 100 100 100 100 
100 100 100 100 100 100 100 100 100 100 100 100 100 100 
##$AQSEQ= 0
##$AQ_mod= 1
##$AUNM= <au_zg>
##$AUTOPOS= <>
##$BF1= 81.014009
##$BF2= 200.13
##$BF3= 200.13
##$BF4= 200.13
##$BF5= 200.13
##$BF6= 200.13
##$BF7= 200.13
##$BF8= 200.13
##$BYTORDA= 1
##$CFDGTYP= 0
##$CFRGTYP= 5
##$CHEMSTR= <none>
##$CNST= (0..31)
1 1 145 1 1 1 1 1 1 1 1 1 1 1 1 1 1 1 1 1 1 1 1 1 1 1 1 1 1 1 1 1 
##$CPDPRG= <waltz16>
##$CPDPRG1= <>
##$CPDPRG2= <waltz16>
##$CPDPRG3= <>
##$CPDPRG4= <mlev>
##$CPDPRG5= <mlev>
##$CPDPRG6= <mlev>
##$CPDPRG7= <mlev>
##$CPDPRG8= <mlev>
##$CPDPRGB= <>
##$CPDPRGT= <>
##$D= (0..31)
0 1 0 0 0 0 0 0 0 0 0 0.03 2e-05 3e-06 0 0 0 0 0 0 0 0 0 0 0 0 0 0 0 0 
0 0 
##$DATE= 1614754133
##$DBL= (0..7)
120 120 120 11 120 120 24 19 
##$DBP= (0..7)
150 150 150 150 150 150 150 150 
##$DBP07= 0
##$DBPNAM0= <>
##$DBPNAM1= <>
$$ [...]
##$SUBNAM3= <"">
##$SUBNAM4= <"">
##$SUBNAM5= <"">
##$SUBNAM6= <"">
##$SUBNAM7= <"">
##$SUBNAM8= <"">
##$SUBNAM9= <"">
##$SW= 501.771253377433
##$SWIBOX= (0..15)
0 1 3 0 0 0 0 0 0 0 0 0 0 0 0 0 
##$SW_h= 40650.406504065
##$TD= 32768
##$TD0= 1
##$TE= 0
##$TE2= 300
##$TE3= 300
##$TEG= 300
##$TL= (0..7)
0 120 53 12 22 120 120 120 
##$TP= (0..7)
150 150 150 150 150 150 150 150 
##$TP07= 0
##$TPNAME0= <>
##$TPNAME1= <>
##$TPNAME2= <>
##$TPNAME3= <>
##$TPNAME4= <>
##$TPNAME5= <>
##$TPNAME6= <>
##$TPNAME7= <>
##$TPOAL= (0..7)
0.5 0.5 0.5 0.5 0.5 0.5 0.5 0.5 
##$TPOFFS= (0..7)
0 0 0 0 0 0 0 0 
##$TUNHIN= 0
##$TUNHOUT= 0
##$TUNXOUT= 0
##$USERA1= <user>
##$USERA2= <user>
##$USERA3= <user>
##$USERA4= <user>
##$USERA5= <user>
##$V9= 5
##$VALIST= <valist>
##$VCLIST= <CCCCCCCCCCCCCCC>
##$VD= 0
##$VDLIST= <DDDDDDDDDDDDDDD>
##$VPLIST= <PPPPPPPPPPPPPPP>
##$VTLIST= <TTTTTTTTTTTTTTT>
##$WBST= 1024
##$WBSW= 4
##$XGAIN= (0..3)
0 0 0 0 
##$XL= 0
##$YL= 0
##$YMAX_a= 4628
##$YMIN_a= -26477
##$ZGOPTNS= <>
##$ZL1= 120
##$ZL2= 120
##$ZL3= 120
##$ZL4= 120
##$ABSF1= 248.5645
##$ABSF2= -253.2056
##$ABSG= 5
##$ABSL= 3
##$ALPHA= 0
##$AQORDER= 0
##$ASSFAC= 0
##$ASSFACI= 0
##$ASSFACX= 0
##$ASSWID= 0
##$AUNMP= <proc_1d>
##$AZFE= 0.1
##$AZFW= 0.5
##$BCFW= 0
##$BC_mod= 2
##$BYTORDP= 0
##$COROFFS= 0
##$CY= -3
##$DATMOD= 1
##$DC= 0
##$DFILT= <>
##$DTYPP= 0
##$F1P= 0
##$F2P= 0
##$FCOR= 1
##$FTSIZE= 65536
##$FT_mod= 6
##$GAMMA= 0
##$GB= 0
##$INTBC= 1
##$INTSCL= 5.30512e-09
##$ISEN= 30
##$LB= 1
##$LEV0= 0
##$LPBIN= 0
##$MAXI= 10000
##$MC2= 0
##$MEAN= 0
##$ME_mod= 0
##$MI= 50
##$NCOEF= 0
##$NC_proc= -2
##$NLEV= 6
##$NOISF1= 182.463
##$NOISF2= 159.3651
##$NSP= 0
##$NTH_PI= 0
##$NZP= 0
##$OFFSET= 248.5645
##$PC= 4
##$PHC0= -2859.708
##$PHC1= -191.3973
##$PH_mod= 1
##$PKNL= yes
##$PPARMOD= 0
##$PSCAL= 0
##$PSIGN= 0
##$REVERSE= no
##$SF= 81.014009
##$SI= 65536
##$SIGF1= 159.3651
##$SIGF2= -187.1042
##$SINO= 113.3802
##$SIOLD= 16384
##$SREGLST= <1H.CDCl3>
##$SSB= 0
##$STSI= 65536
##$STSR= 0
##$SW_p= 40650.406504065
##$SYMM= 0
##$S_DEV= 0
##$TDeff= 32768
##$TDoff= 0
##$TI= <>
##$TILT= no
##$TM1= 0
##$TM2= 0
##$TOPLEV= 0
##$USERP1= <user>
##$USERP2= <user>
##$USERP3= <user>
##$USERP4= <user>
##$USERP5= <user>
##$WDW= 1
##$XDIM= 65536
##$YMAX_p= 311065436
##$YMIN_p= -941045
$$ End of Bruker specific parameters
$$ ---------------------------------
##NTUPLES= NMR SPECTRUM
##VAR_NAME=  FREQUENCY,     SPECTRUM/REAL,   SPECTRUM/IMAG
##SYMBOL=    X,             R,               I
##VAR_TYPE=  INDEPENDENT,   DEPENDENT,       DEPENDENT
##VAR_FORM=  AFFN,          ASDF,            ASDF
##VAR_DIM=   65536,         65536,           65536
##UNITS=     HZ,            ARBITRARY UNITS, ARBITRARY UNITS
##FACTOR=    0.620285442955139, 1,           1
##FIRST=     20137.2065510759, 0,            0
##LAST=      -20513.1999529892, 0,           0
##MIN=       -20513.1999529892, -941045,     0
##MAX=       20137.2065510759, 311065436,    0
$$ Real data points
##PAGE= N=1
##DATA TABLE= (X++(R..R)), XYDATA
$$ [...]
35969B85705q1060j41184p6612J6041L9599k0383r5551q2615N0928J78318J23276
35958A96462q7199k01314p7581Q7934L7207j51692j73202L6903K00822J14144
35948a7516p5369j16347N411J17409J20034N0384k9595q2917q6805n8602m0175
35937b14088q037J05784K46210K24146j7111k52778k45847o4975M3599K5633M6839
35926a10625J71599K43867J49448K734m2666k8037r1128k19686k60394j51355
35916c36243l227P5231J09883J57832J73995Q9483l3481o0857J826j31j22287
35905E2024k03957j01433P7369J16905j401j02362q5459j5645M4609J08843J45343
35894C4836O8451q2701j27416K23J27055Q3794n6970j08275k4886R4806J67848
$$ plain form
35969 285705 204645 63461 -13151 2890 42489 22106 -73445 -156060 -105132 73186 196462
35958 196462 109263 -92051 -169632 -81698 -44491 -196183 -369385 -332482 -131660 -17516
35948 -17516 -92885 -209232 -203821 -86412 33622 84006 54411 -28506 -115311 -173913 -214088
35937 -214088 -222125 -116341 129869 354015 336904 84126 -161721 -226696 -183097 -157464 -110625
35926 -110625 60974 304841 454289 457023 414357 386320 295192 75506 -184888 -336243
35916 -336243 -339470 -264239 -154356 3476 177471 266954 233473 172616 174442 174311 52024
35905 52024 -151933 -253366 -175997 -59092 -60493 -162855 -248314 -263959 -219350 -110507 34836
35894 34836 103287 20586 -106830 -106607 20448 104242 47272 -61003 -85889 8917 176765
35883A76765J58537L9904j35030j98109n7453J27193J21554n8047j63752o6241
35873e4679Q1682Q6180k4116p7585j9973K7158l8708j49015j60864n2932N9471
35862c23381R6381R5379Q7647J9604j04602j32456J8114J55590N7817j50273j44987
35851c25167Q3068J94257M2736r9565j6451J02337K9863q8516j7583J21522O3989
35840I0490j08053r1396J08286J77524J8767j07183k1946J19192J18874Q495q7848
35829B25202j43201j73404j60297j07288m0511O1537J92973K09728M195k33485
35819a64551j87680J26462L42959K38817p041j29030j03154n1055k9832l4950
35809I45m6783n29J28298J90267L0239k02378j91915N2903J69354m544j90957
$$ plain form
35883 176765 335302 375206 240176 42067 -15386 111807 233361 175314 11562 -54679
35873 -54679 27003 113183 89067 11482 -8491 18667 -20041 -169056 -329920 -382852 -323381
35862 -323381 -227000 -131621 -43974 -24370 -128972 -261428 -243314 -87724 -29907 -180180 -325167
35851 -325167 -242099 -47842 -5106 -104671 -121122 -18785 11078 -77438 -95021 26501 90490
35840 90490 -17563 -108959 -673 176851 195618 88435 66489 185681 304555 313050 225202
35829 225202 82001 -91403 -251700 -358988 -399499 -337962 -144989 64739 68934 -164551
35819 -164551 -352231 -225769 117190 356007 348966 219936 116782 65727 35895 945
35809 945 -45838 -46367 81931 272198 302437 100059 -91856 -38953 130401 125857 -65100
35798f5100j42470n827K055l9360K0216Q9520M4268O655J07332J82678L7561j72610
35786F4918j65504R978Q6160K7546J2556N1387j0481j44803j50992j6942N5153
35775a81024K389k6529J7732M156r3301j15244j838R7018Q4597O0155J08238J53332
35763A09681J16776L9238k7463q6014j04365l5386M1458q656j30451j18486M9874
35752a53794J50012N3167r1585j15144n4434j0934J4793K9331k1351j05319p7492
35741c82750P7964J68545Q8723m387L4870R3181J7922r8137p8865L0544N9114
35730F724N511l13M3933L0038k6508J59J05867J38957M1863o9631r6608p0191
35718A09801m5173k1997r097l6560p0032k3716R8214J68909R5056o1434j54171
$$ plain form
35798 -65100 -207570 -213397 -211342 -250702 -230486 -140966 -96698 -90043 17289 199967 237528 64918
35786 64918 -100586 -90608 -4448 23098 35654 87041 76560 -68243 -219235 -236177 -181024
35775 -181024 -178635 -205164 -187432 -183276 -276577 -391821 -393659 -296641 -212044 -151889 -43651 109681
35763 109681 226457 265695 238232 152218 47853 12467 53925 45269 -85182 -203668 -153794
35752 -153794 -3782 49385 -42200 -157344 -211778 -222712 -207919 -178588 -199939 -305258 -382750
35741 -382750 -304786 -136241 -47518 -51905 -17035 76146 94068 -4069 -82934 -52390 6724
35730 6724 12235 11922 55855 85893 59385 59544 165411 304368 346231 276600 179992 109801
35718 109801 64628 42631 33534 -3026 -73058 -96774 1440 170349 265405 203971 49800
35707D9800j02205M0068J27221N4187j16226j95531r0331P7840J43745J10991
35697I9559Q4017O5909j6758j26119j30601k0714O0357L8497N573L9296P3938
35686A72954L2414l9239o7203p7968j25438j66519j16916J4621J35537J77044
35676f0713J27433J0418r8133r2402L0882J11340P810j83801k18854k0095K10938
35665a75177K42594Q0566p8339r4665q122O1343N4447K22m6183o0152n6785o5928
35653a46179r7074j18164p5342M3911J61510J57016M616j55086j42569M4470K03921
35642a18970J63578p614r2413j188J32138J36513K554j41429j86796j23122j979
35631b38728J11832J59622J11665o306j17728j38971m3772R0102J23698L371j46105
$$ plain form
35707 49800 -52405 -12337 114884 169071 52845 -142686 -233017 -155177 -11432 99559
35697 99559 183576 249485 232727 106608 -23993 -44707 15650 54147 59720 99016 172954
35686 172954 205368 166129 98926 20958 -104480 -270999 -387915 -373294 -237757 -60713
35676 -60713 66720 77138 -20995 -113397 -82515 28825 36635 -147166 -366020 -386115 -175177
35665 -175177 67417 147983 69644 -25021 -33143 28200 82647 82869 36686 -23466 -80251 -146179
35653 -146179 -243253 -361417 -436759 -392848 -231338 -74322 -69706 -224792 -367361 -322891 -118970
35642 -118970 44608 36994 -55419 -56607 75531 212044 214598 73169 -113627 -236749 -238728
35631 -238728 -126896 32726 144391 138085 20357 -118614 -162386 -72284 51414 54785 -91320
35620i1320j51356j6968P8163M0064r623N7804J61641J39553N552q4289p7515
35609E1706o1550o9029l1316M8853N6633m3805j32080j14330m1117K4379J02029
35598b09627J72235J22473n6355j67087n7273J42213J95334Q3449k2782l6232
35588A66348j4012L120K7159K4794m3537j01804m2571P6552R0379j6748q2697
35577H6983j8831P3526P8128J0296n8285r4829q1028m478Q7571J18705Q1528J8441
35565B97727o9457j76582k01984o9962R0751Q5926m0311o6180L7002N8553p2669
35554a27186j46996k9725J13803J17515Q7327J59606K09856O8969j33480j34871
35544A84818M3554J29469J5854j14117r3667J3490N3380k3138j52440k34537j93622
$$ plain form
35620 -91320 -242676 -259644 -181481 -141417 -151040 -93236 68405 207958 213510 129221 51706
35609 51706 -9844 -78873 -110189 -61336 -4703 -48508 -180588 -294918 -336035 -311656 -209627
35598 -209627 -37392 85081 28726 -138361 -195634 -53421 141913 225362 202580 166348
35588 166348 152336 155456 182615 207409 163872 62068 19497 96049 186428 169680 86983
35577 86983 68152 141678 219806 230102 171817 76988 -4040 -8518 79053 197758 279286 297727
35565 297727 228270 51688 -150296 -220258 -129507 -43581 -83892 -150072 -113070 -54517 -127186
35554 -127186 -274182 -303907 -190104 -72589 14738 174344 384200 453169 319689 184818
35544 184818 228372 357841 373695 259578 165911 179401 232781 209643 57203 -177334 -370956
35533c70956m6339R0634J24960Q6914M5822L447m7903n5528m708P524p6670j46629
35521c89432q5586L4636P7977O4188Q6400J05968L7087m3230J246J06738R1709
35510H7701l5021r1349l0240J8825J6282N9058J36786J08926k1208p3433n749
35499A70578L878j08900j52199j5541J06494K2329j40719j49681k6286L7644K699
35488b49704j0005M2943R0794J07200J23847J13816K2439r9898j36333p2773j4646
35477h2320l2856q1105o8564L9974J80517K20289Q7148j06493j58883l7442P2088
35466C2353L4440n4077m9767J3512K3242n605J0102M0341m155q6790q4355R973
35454a20786P6212N6772K2318L9683Q2635Q8365K8687p1388j37000j02753j2326
$$ plain form
35533 -370956 -417295 -326661 -201701 -114787 -68965 -65518 -113421 -168949 -173657 -166133 -242803 -389432
35521 -389432 -475018 -440382 -362405 -298217 -211817 -105849 -68762 -111992 -110746 -4008 87701
35510 87701 52680 -38669 -68909 -50084 -33802 25256 162042 270968 249760 176327 170578
35499 170578 174456 65556 -86643 -102184 4310 26639 -114080 -263761 -290047 -252403 -249704
35488 -249704 -259709 -216766 -125972 -18772 105075 218891 241330 141432 5099 -67674 -82320
35477 -82320 -115176 -196281 -264845 -224871 -44354 175935 263083 156590 -2293 -39735 32353
35466 32353 66793 12716 -37051 -23539 -297 -5902 4200 44541 40386 -46404 -130759 -120786
35454 -120786 -44574 12198 34516 74199 156834 245199 273886 202498 65498 -37255 -49581
35443d9581J3295m2216m9651M7862J15548M6991m4394k0248L8888n682p4683j0139
35431c4010J08277P9553m5197l0274J13144J12640r3607k25148j21101P910k7213
35420a55026p0838N4753J82972Q0081j15377r2342J08322J44284p3174k32258
35410a68603j01665J42583K08389P9169n3051r1570r2735r6182n8921M4478J58265
35399b9843K07163J80327J37338J35535J55549J27380N3521N3845K12936M14881
35389A648632M37411K19539o8453k50118l26465l71916l58973k16592j6857M7511
35379G43719q8751k45482k09432r103J22899N6897p1984o5335O0993J14886J4801
35368D24108r9718q3239J3024M2397k1182p9839p2653k6721K1925M8956Q727j01978
$$ plain form
35443 -49581 -36286 -78502 -128153 -80291 35257 82248 37854 17606 56494 50812 -23871 -34010
35431 -34010 74267 153820 108623 78349 191493 304133 210526 -14622 -135723 -127813 -155026
35420 -155026 -225864 -171111 11861 91942 -23435 -115777 -7455 136829 63655 -168603
35410 -168603 -270268 -127685 80704 159873 106822 15252 -77483 -173665 -232586 -188108 -29843
35399 -29843 177320 357647 494985 630520 786069 913449 966970 1020815 1233751 1648632
35389 1648632 2086043 2305582 2237129 1987011 1660546 1288630 929657 713065 696208 743719
35379 743719 654968 409486 200054 190951 313850 370747 298763 233428 294421 409307 424108
35368 424108 324390 241151 254175 296572 275390 195551 122898 96177 118102 167058 175785 73807
35356G3807j68835q4707O1320Q1572j3313j3609J33997J95688J8348j80638j17514
35345a3884J12743J75612R982j04494q254J11516N5404q8558j40279j15382j21485
35334a27079j19567q829J39293J49049J1104j01159q2180j845M3659M3448J5340
35323c8766l3449o0831j5033O7684Q7215K2703m0792m5845k9204l2723l6089p741
35311a62871M4906R2098R7135L3293n5792o6205P834J0284j39890k44496p8776
35300d62480K14191K67490L1595j50458q2668J7187m7319j00916M5507J90043
35290g7828O0897j72203j32746J28971J89347o1635k32421m7691K33410K30891
35280A18992j2598j61235p9859N9063Q2475J5486k4202O422M1823o742j33754
$$ plain form
35356 73807 -95028 -179735 -118415 -36843 -50156 -63765 70232 265920 284268 103630 -13884
35345 -13884 98859 274471 284453 179959 171705 283221 338625 250067 109788 -5594 -127079
35334 -127079 -246646 -255475 -116182 32867 43971 -57188 -139368 -141213 -97554 -54106 -38766
35323 -38766 -72215 -133046 -148079 -80395 6820 29523 -11269 -57114 -86318 -119041 -155130 -162871
35311 -162871 -117965 -25867 71268 104561 48769 -17436 -9602 682 -139208 -383704 -462480
35300 -462480 -248289 19201 50796 -99662 -182330 -165143 -212462 -313378 -267871 -77828
35290 -77828 -16931 -189134 -321880 -192909 -3562 -65197 -297618 -345309 -111899 118992
35280 118992 106394 -54841 -134700 -75637 6838 22324 -1878 4544 46367 39625 -94129
35269i4129k16250j55608j4894P3837J01147J41919J56357K7366j79515k16500
35259c76270o849K03215J80410J9984l5184N2837J30587J16083N4939k6001j35371
35248A78380k09418j52075P259J20161R6904j2570j09437j32881o9482L7187R1262
35237a54710L4845o7159r1798l952J06683J25300K3233j09171j36118k7135Q1027
35226b18955N6418k1963K2769J52227J28488r2140k27321q3082J31618J27946
35216b3995k3193n6893L0095K2282r2533r8414M6447J20012J6832q4388m0464
35205a84212L5793Q327n7344m8155P341M1617P2629J04131O8643j6905j9211O8573
35193H1227N5409j24929k35038q4215J36440J25644o7872j42504j2781J11434
$$ plain form
35269 -94129 -310379 -465987 -480881 -407044 -305897 -163978 -7621 19745 -159770 -376270
35259 -376270 -383119 -179904 506 20490 -14694 38143 168730 284813 339752 313751 178380
35248 178380 -31038 -183113 -175854 -55693 41211 28641 -80796 -213677 -283159 -245972 -154710
35237 -154710 -119865 -187024 -278822 -282774 -176091 -50791 -27558 -136729 -272847 -299982 -218955
35226 -218955 -162537 -184500 -161731 -9504 118984 26844 -200477 -283559 -151941 -23995
35216 -23995 -47188 -104081 -73986 -51704 -144237 -242651 -196204 -76192 -59360 -143748 -184212
35205 -184212 -148419 -140092 -197436 -245591 -238250 -196633 -124004 -19873 48770 31865 12654 81227
35193 81227 136636 11707 -223331 -307546 -171106 -45462 -113334 -255838 -268619 -157185
35183a57185Q7299N695k5733k8031l1427p567K8920J7509j5374J9816R8054R7200
35171H9176J5938j3473L1478J2862j04300j50441l1988Q2562K1559j03525p0990
35160b21142R5291J59774L1642j11636q5935O3120J47185P2986o6329j07377K538
35149a9883J39292J33716k6654j74657j61351j4023J35590K02147J68632M1831
35139D24640j21633k04296j46377m1472k2057q1325j01718l0218P4499J46459
35129a03498J60492R5392l7892j37917j01247K1855P6093K0776k3355K1466P1099
35118F3264L0133n4938q1799m3893k845K5186O4322J03538J04036N2432m1512
35107B17924j51823k01702j04554R3267K01994J19719j0625k513R1301O7454r1160
$$ plain form
35183 -157185 -69886 -64191 -89924 -117955 -149382 -156949 -128029 -110520 -125894 -106078 -8024 89176
35171 89176 105114 91641 123119 135981 31681 -118760 -150748 -68186 -46627 -150152 -221142
35160 -221142 -125851 33923 65565 -46071 -132006 -68886 78299 151285 84956 -22421 -19883
35149 -19883 119409 253125 226471 51814 -109537 -123560 12030 214177 382809 424640
35139 424640 303007 98711 -47666 -89138 -111195 -192520 -294238 -324456 -249957 -103498
35129 -103498 56994 152386 114494 -23423 -124670 -102815 -26722 -5946 -29301 -7835 63264
35118 63264 93397 38459 -43340 -87233 -90078 -64892 -570 102968 207004 259436 217924
35107 217924 66101 -135601 -240155 -146888 55106 174825 164200 161687 252988 320442 229282
35096B29282j68790m6134J08815Q1401r0810j90538j18558J1470N4543K298n0602
35085a77623m1958o481j6828p7621j01381j5851J26668K03210J76362J22527R4625
35074B85649M9344m4715j16255q7105J863M5614J6505k9337n5172o9408o7299
35063g0316l0153K1851M6312M2174L3310P022n4052r6892n0615M9078R1952O0865
35051E0536N4269J10522J30954M0685q4820j39357j34686j27831q9258K4617J29321
35040c5048R6473l7466r4136K26J21175J29331L0558q5160j52840j31971p615
35029a66473J40112J65210L2705j15513j45572r3590n7120k3854O5280J55421
35019d3394J31483M735r1221q2176j1457O7623J27562J06298l9025k02063k02537
$$ plain form
35096 229282 60492 14358 123173 204574 113764 -76774 -195332 -183862 -129319 -127021 -177623
35085 -177623 -219581 -226062 -242890 -320511 -421892 -437743 -311075 -107865 68497 191024 285649
35074 285649 334993 290278 174023 86918 88781 134395 150900 121563 66391 -3017 -70316
35063 -70316 -100469 -78618 -32306 9868 43178 50200 -3852 -100744 -151359 -102281 -10329 50536
35051 50536 104805 215327 346281 386966 302146 162789 28103 -99728 -188986 -164369 -35048
35040 -35048 61425 23959 -70177 -69951 51224 180555 211113 125953 -26887 -158858 -166473
35029 -166473 -26361 138849 171554 56041 -89531 -183121 -240241 -264095 -198815 -43394
35019 -43394 88089 92824 1603 -80573 -92030 -24407 103155 209453 170428 -31635 -234172
35008b34172l2114J15337J08184K9308K810J9003K2907L4847O7283M6320n4772
34997A24941j15969m4961N2386L1250n6675o2213O282K4175r257J1354O4734J9276
34985D5323j04556j22994O158R5960L7769k4200M1900J17496M1671j01002j14314
34974h0789j2146J6624p6692j34199n4061O3177Q5399K7731j2364m488P401l750
34962a78157j4104P057N0354O3377J80j10695j66589r5227M9353J33327Q9305
34951a71819j1644m2596L7278J33585J22555J1421m7457M9134J88986J70785j4176
34940D26052j56906j22852k6757k5489o7624R0J55270K06470O8189j24281k04265
34929A27897j56672o8629J971M6438N9083L5027j0531n5331q7528r8184p6961
$$ plain form
35008 -234172 -266286 -150949 -42765 -13457 -10647 8356 31263 66110 133393 179713 124941
34997 124941 8972 -35989 16397 47647 -9028 -71241 -64959 -40784 -50041 -38687 26047 45323
34985 45323 -59233 -182227 -176069 -80109 -42340 -66540 -24640 92856 134527 33525 -80789
34974 -80789 -92935 -76311 -153003 -287202 -341263 -278086 -192687 -164956 -177320 -181808 -174407 -178157
34962 -178157 -192261 -185204 -134850 -71473 -71293 -181988 -348577 -443804 -394451 -261124 -171819
34951 -171819 -183463 -226059 -188781 -55196 67359 78780 31323 80457 269443 440228 426052
34940 426052 269146 146294 119537 94048 26424 26514 181784 388254 456443 332162 127897
34929 127897 -28775 -97404 -95433 -48995 10088 45115 34584 -20747 -108275 -206459 -283420
34918b83420k5344L5873P1509M9270j7389m5750L4006J53414J48780j5458j59802
34907e4311j19663K3797P5018J9584J2444Q8270Q7596o4534j86428q0632J61653
34896c7206K54177Q2776j56988k13439p3358N8412L0109q3275j00668K0940J32792
34885h5728R1650n5507j30856l4834J51014K54158J74909k0801j58223j34057
34875E1725l4788j1660n4704j9293J03870J27763k6729j57443q3877M8864Q784
34864d7488j16756o2294J36299J62171n1584j75170N15K24977J80541m4599j40639
34853F5973n5932n905r0324j70189j19076J1117J04408J19894Q9596O4297O5624
34842G9483M7089n1714j74168j66468L691J64149J69015Q6956M0541k329j12134
$$ plain form
34918 -283420 -308764 -272891 -201382 -152112 -169501 -215251 -181245 -27831 120949 105491 -54311
34907 -54311 -173974 -150177 -75159 -55575 -43131 45139 132735 68201 -118227 -198859 -37206
34896 -37206 216971 299747 142759 -70680 -144038 -85626 -55517 -138792 -239460 -218520 -85728
34885 -85728 5922 -49585 -180441 -215275 -64261 189897 364806 344005 185782 51725
34875 51725 16937 5277 -49427 -68720 35150 162913 136184 -21259 -105136 -56272 -47488
34864 -47488 -164244 -226538 -90239 71932 20348 -154822 -154307 70670 251211 206612 65973
34853 65973 10041 4136 -86188 -256377 -375453 -364336 -259928 -140034 -50438 13859 79483
34842 79483 126572 74858 -99310 -265778 -262087 -97938 71077 158033 198574 196245 84111
34831H4111j98371j29618L1759J17507J06958R0541N3830o9900j86579j38997
34821b38759M131K5116p3390o3166J04022J89341O6434o4118j6058Q7423N6991
34810G7967m4399n1823M941r976q0004r1494m8444k0416L0000J48915K07717O2943
34798A85927j54198j67652L3866J73645J01082k4774l8803j4985p5129j47498
34788a28519r2307N2829J27909R1163N1684P6769R2818Q580j34791j86928n9773
34777a00566J45599K23837R7751q7485j54885j10766o9567l4900P5122K03604
34767A87744J63512o8801k54303j94750J0825J35101J20182O5645K5391j8706
34757A71840m1693M569P5333O6133l9463j44355j47336k1459J64875K51236J06361
$$ plain form
34831 84111 -114260 -243878 -212119 -94612 12346 102887 156717 86817 -99762 -238759
34821 -238759 -234628 -209512 -282902 -346068 -242046 -52705 13729 -50389 -66447 20976 77967
34810 77967 33568 -18255 -13314 -23290 -103294 -194788 -243232 -263648 -233648 -84733 122984 185927
34798 185927 31729 -135923 -102057 71588 172670 147896 109093 94108 18979 -128519
34788 -128519 -220826 -167997 -40088 51075 102759 179528 272346 280926 146135 -40793 -100566
34777 -100566 45033 268870 366621 279136 124251 13485 -56082 -90982 -15860 187744
34767 187744 351256 282455 28152 -166598 -155773 -20672 99510 165155 190546 171840
34757 171840 130147 134716 210049 276182 236719 92364 -54972 -76431 88444 339680 446041
34746D46041j68482k76804r1647J44260J45019k6784j12032p3380p3862j12941
34736b00612k6713J42720J37713o7421j56437L1869K12922Q5359k11107l25160
34726c76867j79633L3253J75357K15894J04192j30271k56568j00694J53817J95560
34716a65960M0269l6101L9471P0776j4856m9767L5261P6486n848m5230O6839J67700
34704A79040R3415m7579o3113K7456Q0439P7706R5195J15034N2626p9596j79596
34693C51027j87892j10764K5024J45020J36505n425j19589p9951K3564K8448n2986
34682A52981p4390O841Q3447P4489J4909l6627p0696r1154q7476o0672k5696J2800
34670a01244N1130P0508O1783L8915O828l8453o1144p418R5759J43954R3056P623
$$ plain form
34746 446041 277559 755 -90892 53368 198387 171603 59571 -13809 -87671 -200612
34736 -200612 -227325 -84605 53108 -14313 -170750 -138881 74041 159400 -51707 -376867
34726 -376867 -556500 -523247 -347890 -131996 -27804 -158075 -414643 -515337 -361520 -165960
34716 -165960 -125691 -161792 -122321 -51545 -66401 -116168 -80907 -4421 -10269 -55499 11340 179040
34704 179040 272455 224876 161763 189219 269658 347364 442559 557593 610219 530623 351027
34693 351027 163135 52371 77395 222415 358920 353495 233906 153955 177519 205967 152981
34682 152981 78591 85432 168879 243368 258277 221650 150954 59800 -27676 -88348 -114044 -101244
34670 -101244 -50114 20394 82177 121092 127920 89467 28323 20905 116664 260618 353674 361297
34658C61297n9514j24232j63991r3310P1216J58654O8334p3804j01998l5129J4289
34647B1812L1603M7553J1129j08315j89095j13536K6964P2502N4585J02332J66009
34636A23543Q4404j06617j91073j03577K493L8730Q4583J58205J34485j7894j37326
34625F9956j11866k9148J1106L9496P0522J9966j02830j24989P444P5062q3308
34614a58589k58376j45037J82094L46799J92037m1984r3671k467L6112l5251j14291
34603i2624j18684o8987k2005N26J6797N4531J16157J64176J50867O7205m6247
34592B21712j32940j53256r5811J6300J22649J50195P2046m6106q7481j5815N1148
34581A02641k5254j89544k17802j9025K01626J97976J2949j02831m7618M1633
$$ plain form
34658 361297 301783 177551 13560 -79750 -8534 150120 218454 144650 42652 7523 21812
34647 21812 53415 100968 112097 3782 -185313 -298849 -271885 -199383 -144798 -42466 123543
34636 123543 207947 101330 -89743 -193320 -190827 -152097 -67514 90691 225176 207282 69956
34625 69956 -41910 -71058 -59952 -20456 50066 70032 -32798 -157787 -150343 -75281 -158589
34614 -158589 -416965 -562002 -379908 -33109 158928 116944 23273 20806 56918 21667 -92624
34603 -92624 -211308 -280295 -302300 -301774 -284977 -230446 -114289 49887 200754 267959 221712
34592 221712 88772 -64484 -160295 -143995 -21346 128849 200895 154789 67308 51493 102641
34581 102641 77387 -112157 -329959 -348984 -147358 50618 63567 -39264 -86882 -45249
34571d5249M5572R889n551l8946j03748j08196l990J01548Q6770j9407j00847
34560a82155j01165l4439O5602J37894J21215M9689K7548O0231L4358p3335j22201
34549a6758m1884K4692m2893j19451l8583J06095R5940n2269j12333j7217N0595
34538a64066j9214q4778J501J47051J62529L8379o9778p8872o2726r3550j11776
34527c35300j9899J41873K04380Q1105r9002j43514l8158O5517Q1259O9073O9625
34516G6959K0107r2755j48295p1872K8759L1997j2075m761J1373m2299q6033N489
34504b83406J58053J74047K7672j10253j31463q8737l8899K7645Q8088Q9295O3328
34493b4630Q4440J15296O4406k0389j2403N2029J7275j01842j25925l5053q678
$$ plain form
34571 -45249 323 10212 4661 -34285 -138033 -246229 -250219 -148671 -61901 -81308 -182155
34560 -182155 -283320 -317759 -252157 -114263 6952 56641 84189 144420 178778 105443 -16758
34549 -16758 -58642 -33950 -76843 -196294 -234877 -128782 -32842 -85111 -197444 -214661 -164066
34538 -164066 -183280 -268058 -266557 -119506 43023 81402 11624 -67248 -129974 -223524 -335300
34527 -335300 -355199 -213326 -8946 72159 -26843 -170357 -208515 -142998 -61739 7334 76959
34516 76959 97066 4311 -143984 -215856 -187097 -155100 -167175 -171936 -160563 -202862 -288895 -283406
34504 -283406 -125353 48694 76366 -33887 -165350 -254087 -292986 -265341 -177253 -87958 -24630
34493 -24630 59810 175106 239512 219123 206720 258749 276024 174182 48257 13204 4526
34482D526p9309n2066J14398J67182j6808j75301p5803R8878Q5741L648R8738
34471A73824K29294O6273k82107l43168j6725K39079J13480r9216j4603K19281
34461B85412J80255j52802l73476k39899M5013J81961J32427L3450l7391p3968
34451a9018m7784M8133J15924M4718j17652j89907q4976P0112J02424K1681j5092
34440g1437N3193J08870N7711j1519K2813R8704O0414p7676j38510o4655k627
34429C5281m1644o0343L9265J18027J2803j57347j36723O4163J64967L7207j16151
34418d0495q9264L9886R3016P6310R2308J00492j1755j82744k20257q5341N6038
34407a71806P9919L3333o158l1356k7153M3246J19996P8007n8151j01576R395
$$ plain form
34482 4526 -74783 -126849 -12451 154731 137923 -37378 -113181 -14303 71438 75086 173824
34471 173824 403118 469391 187284 -155884 -172609 66470 179950 80734 66131 285412
34461 285412 465667 312865 -60611 -300510 -255497 -73536 58891 92341 54950 -19018
34451 -19018 -66802 -18669 97255 141973 24321 -165586 -250562 -180450 -78026 -56345 -71437
34440 -71437 -18244 90626 148337 136818 159631 258335 318749 241073 102563 37908 35281
34429 35281 -6363 -66706 -27441 90586 103389 -53958 -190681 -126518 38449 75656 -40495
34418 -40495 -129759 -89873 3143 79453 171761 272253 260498 77754 -142503 -227844 -171806
34407 -171806 -91887 -58554 -64712 -96068 -123221 -79975 40021 118028 59877 -41699 -32304
34396c2304R2145P970j11717q7905K2380N9309L3422M3402M3372n5593j46530
34385a32049o8300P7830N8044p9250n7604J38701J98985N912j48849m4159J19058
34374F8319Q6680l4670k9326K3981n0985j33934o263J88989J11748j91881k98892
34363b66234n3321J98447J49152m1629o3272P6377J44767P1539p569j2418j6284
34352A79555r1919j93468k10648r0757Q9433J78361J19893L2671L2185L5785r6269
34341a5178k71647k45427o062J66545J05756k2228k4406L0291L17n7094j3192
34330c52325R0175J33138J22419J08822L7738j05569j41321O0486K91149K39774
34320D84486m8856k40393j98185j04288r0734o2028M6847J19032P4919J0625N106
$$ plain form
34396 -32304 59841 67811 -43906 -131811 -109431 -50122 -16700 26702 70074 14481 -132049
34385 -132049 -200349 -122519 -64475 -143725 -201329 -62628 136357 142269 -6580 -50739 68319
34374 68319 154999 120329 91003 114984 63999 -69935 -76198 112791 224539 32658 -266234
34363 -266234 -319555 -121108 28044 -13585 -76857 -480 144287 215826 208257 195839 179555
34352 179555 87636 -105832 -316480 -407237 -317804 -139443 -19550 13121 45306 81091 -15178
34341 -15178 -286825 -532252 -538314 -371769 -266013 -288241 -312647 -282356 -282039 -339133 -352325
34330 -352325 -262150 -129012 -6593 102229 139967 34398 -106923 -46437 244712 484486
34320 484486 435630 195237 -2948 -107236 -197970 -259998 -213151 -94119 -19200 -8575 -3469
34309c469k919l9379p408J03245J30301R933o8834L9250J68061Q5950j34764k34158
34297D5809j54548o5550m8480q492Q6662J13729J2352q2881l0739J13700J83470
34286A65032J15914K08n4470l2776L5o189j8216L1921J23314J28383k3107k08097
34274B21952k32009p5933P7891Q7301J7023N616M7800J5930j19635k05867j00953
34263b60884J13603K11853J09457l1032k9992O3858O0837q3375k00791j45553
34253a92019J9777J23588Q8699k1141r9646r0289k0508K2989q285m3402K5538
34242a94699J69655K25076J04287q8336k01044j97723j16192K6563J90823K66700
34232A85110J88723M1196n5700j08271j85954k51128j93333k1131J11654R4609
$$ plain form
34309 -3469 -6388 -45767 -53175 50070 180371 190304 121470 160720 328781 414731 279967 45809
34297 45809 -108739 -174289 -222769 -231261 -144599 -30870 -18518 -101399 -132138 -18438 165032
34286 165032 280946 281154 226684 193908 193943 187754 169538 201459 324773 453156 430049 221952
34274 221952 -10057 -85990 -8099 79202 96225 101841 149641 165571 45936 -159931 -260884
34263 -260884 -147281 64572 174029 142997 113005 176863 237700 154325 -46466 -192019
34253 -192019 -172242 -48654 40045 18904 -80742 -171031 -191539 -168550 -176835 -220237 -194699
34242 -194699 -25044 200032 304319 215983 14939 -182784 -298976 -272413 -81590 185110
34232 185110 373833 415029 359329 251058 65104 -186024 -379357 -400488 -288834 -194225
34222a94225j9197j04233r6484j4308Q8484J56071J51361P2627m3565j27163j05225
34211b35857J6014J10142N9559o6345p5499P2319J89518J25441l2503j18732j12377
34200f8320p7835j7827O2762O8355l8910j09179j0062J35211J18597k9628j10888
34189g7724p9598n1846m4881K9086J28370J08955o086m6306R03k0377j07939o5120
34177b32563J29867K20808P0837j12261j08693J417L6526M037J199J3349j982
34166B2541Q229O5843P5168J2952J6585J22040J28449p4015k56503j78944K5478
34155c2177P0734l8091q1978k5490k2035r6985j25271q0264l5321K9659J57112
34144b80107K17767Q1620q4972k6341J45350Q2327k01325k85780j511K82072K19527
$$ plain form
34222 -194225 -213422 -317655 -414139 -428447 -339963 -183892 -32531 40096 -3469 -130632 -235857
34211 -235857 -219843 -109701 -50142 -116487 -191986 -119667 69851 195292 162789 44057 -68320
34200 -68320 -146155 -163982 -101220 -32865 -71775 -180954 -191016 -55805 62792 33164 -77724
34189 -77724 -157322 -209168 -254049 -224963 -96593 12362 6276 -40030 -39127 -59504 -167443 -232563
34177 -232563 -102696 118112 188949 76688 -32005 -30588 5938 9975 11174 24523 22541
34166 22541 30770 96613 171781 184733 201318 323358 451807 377792 121289 -57655 -32177
34155 -32177 38557 466 -81512 -107002 -129037 -226022 -351293 -431557 -466878 -437219 -280107
34144 -280107 -62340 19280 -65692 -92033 53317 135644 -65681 -351461 -352972 -70900 148627
34133A48627j8378p9781K8340M9419o2138j12528k0732P2514M0676p0548j29819
34122a54348n6198J10614K13465J21363p5228j28248L2115J70097P1699j45074
34112A60257k10109p8241N9439P1317R374l1977k2875K7632Q2048P2976j2023
34101A27818p8568m8616K0917M0689L3870N6283N4702l7401j27942p3836P3199
34090D1115J19341K0624p0996p0838o9819j22150j18745J7625J60583J39217k1220
34079B4737j40465j14227n471O7210N8239J9077K6817Q1481R0812L624q0926l8782
34067g874P0859P0546n3437j12533j8433O6549O10r2559k6644J32987J68905M6766
34055B45742o4922p3139m8174l9782r834K9816L981o2690m9750M6587Q7792L4805
$$ plain form
34133 148627 130249 50468 78808 128227 66089 -46439 -67171 5343 46019 -24529 -154348
34122 -154348 -210546 -99932 113533 234896 159668 31420 63535 233632 305331 160257
34112 160257 -49852 -128093 -68654 2663 12037 -19940 -42815 -15183 66865 139841 127818
34101 127818 49250 634 21551 62240 96110 152393 207095 169694 41752 -32084 41115
34090 41115 160456 181080 110084 39246 -30573 -152723 -271468 -253843 -93260 45957 24737
34079 24737 -115728 -229955 -235426 -168216 -109977 -90900 -64083 17398 108210 111834 30908 -7874
34067 -7874 62985 133531 80094 -32439 -50872 15677 16287 -76272 -102916 30071 198976 245742
34055 245742 180820 107681 59507 19725 9891 39707 43688 -19002 -68752 -22165 65627 100432
34043A00432J8352Q7301R6804k8960j29264p1524N371p3853k01196j56350J4407
34032c38480P4545k571p134J26126K02266J01924k8493l9350r574o6836j49343
34021a36920j14001L2606J61226J97503J50090L5547j07443j86221j44112m7141
34011a58866l353l1712o7364n3196J6042R2436R9074K1503l2746K7622R9973J5629
33999B5042j54224j50598N5669J66759J9342j30723j5871J93739J63342n5265
33989A17212j16095N1435J47153P87j79108j60198r301P9172O4592K4948o363
33978A4234m0369p1777r9989j24464r1433M0700J77233J77208P3372K5660M7099
33967A27474m461j23717j07320R0257K10921P3953j26285j21696J9132M0566p2700
$$ plain form
34043 100432 118784 206085 302889 273929 144665 73141 78512 4659 -196537 -352887 -338480
34032 -338480 -263935 -266506 -273640 -147514 54752 156676 128183 88833 79259 12423 -136920
34021 -136920 -250921 -218315 -57089 140414 290504 326051 218608 32387 -111725 -158866
34011 -158866 -162219 -193931 -261295 -314491 -298449 -206013 -106939 -85436 -118182 -90560 9413 25042
33999 25042 -129182 -279780 -224111 -57352 -38010 -168733 -184604 9135 172477 117212
33989 117212 1117 52552 199705 200492 21384 -138814 -148115 -68943 -4351 20597 14234
33978 14234 -26135 -97912 -197901 -322365 -413798 -373098 -195865 -18657 54715 80375 127474
33967 127474 123013 -704 -108024 -17767 193154 267107 140822 19126 38258 78824 6124
33956F124j05931J450O3359l3288j48741j10954M4900J49678J17549J5713l4847
33945c4988J2741Q2716N9429o3118j57725j29545m0686PJ822M2039J01389P9444
33933d6475l3915j21979r6413L056Q6193J11108Q1582J5985m7286o2090k3031
33922a33265K6943N1409N6851O6225P9794P2054K0178o2011j21075j14236n8992
33911a16125l011M2621Q7343R3047J0211j06216j22266j0769Q9732O7419q965
33900B3021j4642M2875O8646M3953K4412J8810j1646n6995o7989m5911k9127j0126
33888a4719M0568Q8737P2787J1876j6679L398K0746J2405o321m5915j11634j30052
33876g4803l0553J04994J11203j9485r9612l577J53397J67448q34j94054k32541
$$ plain form
33956 6124 -99807 -98357 -34998 -68286 -217027 -327981 -283081 -133403 -15854 -141 -34988
33945 -34988 -22247 60469 119898 56780 -100945 -230490 -271176 -271169 -269347 -227308 -125919 -46475
33933 -46475 -80390 -202369 -298782 -295726 -209533 -98425 -16843 -858 -48144 -110234 -133265
33922 -133265 -106322 -54913 1938 68163 147957 220011 240189 178178 57103 -57133 -116125
33911 -116125 -119136 -76515 10828 103875 114086 7870 -114396 -125165 -35433 31986 23021
33900 23021 8379 51254 119900 163853 188265 207075 195429 138434 70445 24534 -4593 -14719
33888 -14719 25849 114586 187373 199249 182570 185968 206714 219119 212798 166883 55249 -74803
33876 -74803 -105356 -362 110841 91356 -8256 -11833 141564 309012 308178 114124 -118417
33865a18417q2588J09148J41849k1317j75013j04912J13983J91844K3126j54124
33855g6421q9901J31750K24764Q9408r6843j48434q0203k2492l7202o9995l7914
33844b13483O6535J48953J06561l5581j29046q5150L667j763q1783r0252K5321
33833b86021J46217J43672K9954p9328q6499K0370J50922J56719j6931k05754
33823b6679j69322Q8299K66585J39722j30730k06040k3363J49812J06675n2358
33813A42601j27058r4960n8492m1188P066O7161O9195L2230M1913Q3055L5853
33802A57376j17996k13034j10212R4667J78076P1432o1805m3429R8417J71868
33792B25360N8603j43970k38571j55318j3434M4487J6005l485K7229N7285L7673
$$ plain form
33865 -118417 -201005 -91857 49992 28675 -146338 -251250 -137267 54577 77703 -76421
33855 -76421 -166322 -34572 190192 279600 182757 34323 -45880 -68372 -105574 -175569 -213483
33844 -213483 -146948 2005 108566 72985 -56061 -141211 -137544 -139307 -221090 -311342 -286021
33833 -286021 -139804 3868 33822 -45506 -132005 -111635 39287 196006 179075 -26679
33823 -26679 -196001 -107702 158883 298605 167875 -38165 -61528 88284 194959 142601
33813 142601 15543 -79417 -137909 -179097 -172031 -104870 -35675 -3445 38468 121523 157376
33802 157376 39380 -173654 -283866 -189199 -11123 60309 -1496 -44925 53492 225360
33792 225360 283963 139993 -98578 -253896 -267330 -222843 -206838 -210323 -183094 -125809 -88136
33781h8136j7291o3848p1128l0853K9473N3938K7598J7150P9288J52034J20608
33770B08833j7305j40408j59170r4981k637Q8008J40200J21164O8015M8533M2141
33759C02393k9355j35015j35029N055J36058J29327L2706m9379r6254j03594k1496
33748C5417J19312J54156L293j69949j73865n5027J6195K2005O0699J13798P2661
33737A98695l7669p7473k6179N606n162K8674R6345P5019l6521q0753J440P8143
33725B20165O3313M2843P0471M3411q9312j82862j18275p742q137o9231n2185
33714h7541K0097L1849J846K9694P6318J9217r8685j00398K6842Q1201l8570j55071
33702a93201o1833J78391L10304J95118n5429k19895j74079J9523J80388J77935
$$ plain form
33781 -88136 -105427 -169275 -240403 -271256 -241783 -187845 -160247 -143097 -63809 88225 208833
33770 208833 191528 51120 -108050 -203031 -205668 -117660 22540 143704 211719 260252 302393
33759 302393 273038 138023 2994 8049 144107 273434 306140 256761 160507 56913 35417
33748 35417 154729 308885 312178 142229 -31636 -86663 -70468 -48463 12236 126034 198695
33737 198695 161026 83553 57374 62980 57818 86492 182837 257856 221335 140582 142022 220165
33725 220165 283478 326321 396792 440203 350891 168029 49754 42012 33875 -35356 -87541
33714 -87541 -67444 -35595 -33749 -4055 72263 91480 -7205 -107603 -80761 440 -38130 -193201
33702 -193201 -255034 -76643 233661 428779 373350 153455 -20624 -1101 179287 357222
33692C57222M9174o4664q4906n3508l9395n9509r9043j34232j17016j4598J08349
33681a52126J29003L0877n1527j1524Q4244J09668O9741O5862J07185Q7610l3523
33670D35490j45815j39054n3393l054j0713j1393P715j8659r9374j27116k2565
33659a87931J24780J52487L9213p3467q1005l7818l5506n2996j4985O1613R0219
33648a5396O0929M9048O7201K5626j09247k15898j64084k165R5577M7892m9631
33637b10148o3607J8828R2292O0840n2393j17361l3906J36065K14840J16327m4894
33626A16883j04235m9599J1941M0845R0201J50192J16675k7762j28967n9352Q3929
33615B40751R8833m6087j77325j53732k7694O0819O1578K6182j937l0946n8309
$$ plain form
33692 357222 406396 341732 256826 203318 163923 104414 5371 -128861 -245877 -260475 -152126
33681 -152126 -23123 7754 -43773 -55297 28947 138615 208356 274218 381403 469013 435490
33670 435490 289675 150621 97228 94174 83461 72068 79783 61124 -38250 -165366 -187931
33659 -187931 -63151 89336 128549 55082 -25923 -63741 -99247 -152243 -167228 -105615 -15396
33648 -15396 45533 94581 161782 187408 78161 -137737 -301821 -303986 -208409 -160517 -210148
33637 -210148 -273755 -254927 -162635 -101795 -154188 -271549 -305455 -169390 45450 161777 116883
33626 116883 12648 -36951 -25010 15835 106036 256228 372903 345141 216174 156822 240751
33615 240751 339584 293497 116172 -37560 -65254 -4435 57143 83325 81388 50442 -7867
33604g867l5396O0128J48958J19587r994p4297L1427J79936J51103p5077k79624
33593B08884k74815r9968Q7505J94032J96944R0398p0036j56329j10797l1189
33583C4629j6478j5604M9857J07886M6310o8012p3218J7122L3378n8987j01796
33572d4913j9235O0273L7963K820L9359N5937l9552j34076o4331J07305J56454
33561A58004P386j74431k01623o0579J17712J92368J15066l1861j03698m9499
33551c1155L0097L4120J1210O5447J60964J53001J7707q0678j0714J32736J49671
33540F32406J1866q5740J9299K32107L25322K61155K49346M26442O25286O23367
33530C320856N21004O26049R49236J071107O41263j66954q51838j106089j000236
$$ plain form
33604 -7867 -43263 16865 165823 285410 275416 201119 232546 412482 563585 488508 208884
33593 208884 -65931 -165899 -78394 115638 312582 402980 332944 176615 65818 34629
33583 34629 18151 2547 52404 160290 206600 138588 65370 82492 115870 56883 -44913
33572 -44913 -64148 -3875 34088 36908 76267 132204 92652 -41424 -105755 1550 158004
33561 158004 165390 -9041 -210664 -271243 -153531 38837 153903 122042 18344 -31155
33551 -31155 -1058 33062 44272 109719 270683 423684 441391 360713 349999 482735 632406
33540 632406 644272 558532 577831 809938 1135260 1396415 1645761 2072203 2697489 3320856
33530 3320856 3841860 4467909 5417145 6488252 7129515 6962561 6110723 5004634 4004398
33521D004398p66170n80592n01719m55613l09606o9802O0770n2955k44717k53280
33511H30714r4708j7903j12628j92489j07551M0240Q5897L6802K375O827q722
33500D68854o6696j30247j57697j21230j7011J00829J47170J01881K9306j5879
33490C39280l6327l2876J1146N3953L617j36444k17106j19066Q0936J96685J43885
33479B87683K48j06710j08925k6520N3312M5792m2791j22488j39809j35323j42986
33468d38517j07201K3289J78381K39378J90986J04415P477j06355j63283o4392
33458a35822J15946J57700Q557r3157M0340K19394J20335k04245l38098q1310
33448a90360K46023K40161m7956k36069j47921L2114J01389P4855L8337o808n7061
$$ plain form
33521 4004398 3238228 2657636 2155917 1700304 1390698 1320896 1381666 1328711 1083994 830714
33511 830714 736006 718103 605475 412986 305435 345675 431572 468374 470749 477576 468854
33500 468854 402158 271911 114214 -7016 -24027 76802 223972 325853 355159 339280
33490 339280 302953 270077 281223 335176 338793 202349 -14757 -133823 -52887 143798 287683
33479 287683 287931 181221 72296 45776 99088 144880 102089 -20399 -160208 -295531 -438517
33468 -438517 -545718 -522429 -344048 -104670 86316 190731 198208 91853 -71430 -135822
33458 -135822 -19876 137824 146381 53224 93564 312958 433293 229048 -109050 -190360
33448 -190360 55663 295824 247868 11799 -136122 -104008 -2619 72236 110573 103765 46704
33437D6704l9283N7161J11492M0708p2210j14050r3372n8108J6503J29420J55104
33426A80069M340j90799k20346q2049L6278L3329q594P04M3944P7863R1301N4561
33414B0601n8091j64680j31608J7407Q8098j1263j16724m3473J34302J89798P0867
33403d766m7145l4857K7382J6409l9063l8347M311j0617q3141j00192k3129M4746
33391b88409L0906P939M6163O8362j2508r5448p277K10648L13985J83226j7485
33380D40102p0506L1419J24988Q8111n5277j78636j62879k1782Q0117J8860r8629
33369A95888o6835J03411J79261N2455j01601j01201j4377m637o7002p7212r568
33358H8582M6294L6920j040r448L3069Q3755N2747p4956j53354n1618J05257P9923
$$ plain form
33437 46704 7421 64582 176074 216782 144572 30522 -62850 -120958 -104455 24965 180069
33426 180069 184409 -6390 -226736 -308785 -272507 -239178 -247772 -247068 -203124 -125261 -33960 20601
33414 20601 -37490 -202170 -333778 -316371 -228273 -239536 -356260 -399733 -265431 -75633 -4766
33403 -4766 -51911 -86768 -59386 -42977 -82040 -120387 -116076 -126693 -209834 -310026 -333155 -288409
33391 -288409 -257503 -249564 -203401 -135039 -147547 -242995 -250272 -39624 274361 457587 440102
33380 440102 369596 401015 526003 614114 558837 380201 217322 195540 275657 294517 195888
33369 195888 129053 232464 411725 464180 362579 261378 247001 242364 175362 98150 88582
33358 88582 134876 171796 170756 161308 194377 278132 330879 255923 102569 50951 156208 236131
33346B36131q9892j20559M3374J08658p1058k18638q7402J21794J07079l6220
33336f733k6519J01550R9953l0654q2120m7492q9027j56203m2565J86104K22261
33325A28555J4527j39193o5427O5333P9651L6610K0177n931l2954K5730J13613
33314B40691N7695j03973j24930K6761P9898p2549j64336j0723J56311O8569j35953
33303A7461j49665K6246J39332Q5768k0063q2195r3056m2244M2402M0257r1370
33292a27127j82388p6505R9810J07177l9065j01418Q710J22513R8275J0501j0005
33281h9522L2811N5475L4070M89l4950p6316q8209k2446R4851J56791R4083k4957
33269A32170o5439M698P9192O4431q957o3802q2222p2623j7937O0230P1390j0122
$$ plain form
33346 236131 146239 25680 69054 177712 106654 -111984 -199386 -77592 29487 -6733
33336 -6733 -33252 68298 168251 137597 55477 7985 -81042 -237245 -279810 -93706 128555
33325 128555 143082 3889 -61538 3795 83446 120056 140233 134302 101348 127078 240691
33314 240691 298386 194413 69483 96244 176142 103593 -60743 -71466 84845 153414 17461
33303 17461 -132204 -105958 33374 119142 99079 16884 -76172 -118416 -76014 -35757 -127127
33292 -127127 -309515 -386020 -286210 -179033 -218098 -319516 -310806 -188293 -90018 -79517 -89522
33281 -89522 -56711 -1236 32834 33323 -1627 -77943 -166152 -188598 -93747 63044 157127 132170
33269 132170 66731 71429 150621 215052 206095 142293 60071 -12552 -30489 29741 101131 91009
33257I1009o6200m450Q0467M9667n8924j06173p3766m2256j2627O5159J31492
33246E3398P5452o7520j47676j11682l1500L7281P8387N6813j1858j8178O1720
33235b5363P0764o2896j38669r724J01375n0788k54084j31324K08466L00072O4699
33224G2528r2325K9323J52413O1751o7888o4207m0913q3064m5938J18808K03259
33213B43747J13087L7313N8194k0496k40308k93320l1097K22025J70268m969k3733
33202B30711K2442n5118j27617j4587J12511J1772j71241j42807L2101P5185q702
33191c5350P207J23582J25073k0510j23664r9225l4640K4415R2647J04817M37
33180A64789j11832q9109K6238J09800J55920J84982J10177q3827j99465j04009
$$ plain form
33257 91009 24809 20359 100826 150493 91569 -14604 -88370 -130626 -143253 -78094 53398
33246 53398 128850 61330 -86346 -198028 -229528 -192247 -113860 -57047 -68905 -87083 -25363
33235 -25363 45401 -17495 -156164 -165888 -64513 -115301 -369385 -500709 -292243 7829 72528
33224 72528 -19797 9526 161939 223690 155802 91595 50682 -32382 -78320 40488 243747
33213 243747 356834 394147 452341 431845 191537 -101783 -132880 89145 259413 254444 230711
33202 230711 253153 198035 70418 55831 168342 180114 8873 -133934 -101833 -26648 -35350
33191 -35350 -28143 95439 220512 200002 76338 -22887 -57527 -33112 59535 164352 164789
33180 164789 52957 -36152 -9914 99886 255806 440788 550965 467138 267673 163664
33170A63664K5061j2579r5059j4737J18112M9224j64747k23113m4141J44589J51006
33159I7280Q135j44482j73543j8024J91692K01406k0903j79589o9243J18817J24612
33148A36158J3005k5071k4257r3246j33172k9959P6681L6861j1026Q4588J51348
33137A81910p72j74762r8393Q3767P3559l6960K8838J64475M9709k30762k78646
33126b38037m0066J38123R1116j85j7965l1223k4882P1144J24806l981j01214
33115c2364R8272L53478K13337k00753l22126m7870J25653m1341j92559o7186
33105a13459Q4999L2132m2792L7215R9787m785j01544l6229N1437M3058O1523
33094A11342J48775J03385j19312k20644l3719J67591J06014p9068j20179k9745
$$ plain form
33170 163664 188725 176146 81087 66350 184462 233686 68939 -154174 -198315 -53726 97280
33159 97280 105415 -39067 -212610 -230634 -38942 162464 141561 -38028 -107271 11546 136158
33148 136158 149163 124092 99835 6589 -126583 -156542 -79861 -43000 -54026 30562 181910
33137 181910 181138 6376 -92017 -8250 65309 28349 57187 221662 271371 40609 -238037
33126 -238037 -278103 -139980 -48864 -49049 -67014 -98237 -123119 -51975 72831 68850 -32364
33115 -32364 65908 419386 632723 431970 109844 61974 187627 146286 -46273 -113459
33105 -113459 -28460 3672 -39120 -1905 97882 93097 -8447 -44676 6761 49819 111342
33094 111342 260117 363502 244190 23546 -10173 157418 263432 184364 64185 34440
33084C4440M2424P9198Q1892l4787k05086j62730J32508L15911J24550k00244
33074B08076k87185j43733j0782M0045P2357O7169K0746O2685K17925K58713N6700
33063E62716j37528o5556R2385j0500l08553l87800r3751K51081K86595M0407
33053B29496j69448j27377O5024J45662L1811p1295K2818J75655J20852j04277
33043C18921j99484o5862P7482Q4153O3619Q4003K5626j26921j68443k8998N7246
33032A21342n5444j55052l5434J40057J16187l6201p4264J4937N5233J726m4061
33021D9026m9752n1585j6098R0080J63097Q7225o0724j03604j0795R5442J30078
33010C22390J06420N0643k3108p8711q9296q0384q8014j06160j04364n8406L6159
$$ plain form
33084 34440 76864 156062 237954 203167 -1919 -164649 -32141 283770 408320 208076
33074 208076 -79109 -222842 -233624 -193579 -121222 -54053 -33307 29378 247303 506016 562716
33063 562716 425188 359632 452017 441517 132964 -254836 -348587 -97506 189089 229496
33053 229496 60048 -67329 -2305 143357 175168 103873 126691 302346 423198 318921
33043 318921 119437 53575 131057 215210 278829 362832 388458 261537 93094 64096 121342
33032 121342 65898 -89154 -124588 15469 131656 95455 21191 36128 91361 93087 49026
33021 49026 -726 -52311 -68409 21671 184768 271993 211269 107665 96870 192312 322390
33010 322390 428810 479453 456345 377634 288338 207954 119940 13780 -90584 -148990 -112831
32999a12831J32330J48809Q7579O3928J19106J07747p4453k65762k48148q0472
32989a22167J7797K1304O2149J20962O7703m0840l1915M8274R162j02181n8502
32978h254J16371J61904M4998P803J07352J21489j1706p7854q183j951j11156
32967C40813j21862J4816N7629o2953q8657P6588J53937j1981j62798q6869K9724
32956A38387j2619p1250J2531Q1610k8557j59993j19152j2319q56O672J24714
32945d0832K10140J08821m1394l5162O9312R2336K0957n6949j18445j28939q408
32934G1437J71827J91152J7638j12910p8193l0787n3742l065J44247J54454m6348
32923D25710j81919p7318N4183J1642o4404j9129J6062p0526j05190L6862J53790
$$ plain form
32999 -112831 19499 168308 255887 319815 438921 546668 472215 206453 -41695 -122167
32989 -122167 -104370 -83066 -20917 100045 167748 126908 94993 143267 152429 50248 -8254
32978 -8254 108117 270021 315019 322822 430174 551663 539957 462103 453920 451969 340813
32967 340813 218951 233767 291396 228443 139786 216374 370311 358330 195532 108663 138387
32956 138387 125768 54518 67049 148659 120102 -39891 -159043 -171362 -172218 -165546 -40832
32945 -40832 169308 278129 236735 201573 270885 363221 384178 327229 208784 79845 71437
32934 71437 243264 434416 452054 339144 260951 230164 176422 173357 317604 472058 425710
32923 425710 243791 166473 220656 232298 167894 148765 164827 94301 -10889 25973 179763
32912A79763P1850l2373L1725J11062O863j44152j13441K7051O5164M514j2451
32901A95575L5450Q7721J35182J49209O4123n7121o2519J2313j9009j34993j19364
32890B86567K5207O4780j5977J3020J45674J14643p3173r9984O2546P8500r9506
32879E02297j06648J33789K15920j9570j88301n1857J06391O1269q8M0426M261
32868F97889r8269R677K61425K54069M5811J50692N32718N11895l8809l81469
32858A945629j76844l3138l15061m68219j30529J35850q0483k55986K0158K25587
32848H66964m6049k22165J58994M77476J32223l23618j84911J58819N4139j95252
32838H76620m7567J62017m1587k29041Q5233L61931K676m16693j37281L59130
$$ plain form
32912 179763 251613 219240 250965 362027 368890 224738 111297 138348 203512 208026 195575
32901 195575 231025 318746 453928 603137 667260 610139 547620 559933 540924 405931 286567
32890 286567 311774 376554 360577 373597 519271 633914 560741 460757 523303 601803 502297
32879 502297 395649 529438 745358 725788 537487 485630 592021 653290 653202 693628 697889
32868 697889 599620 609297 870722 1124791 1170602 1321294 1854012 2365907 2327098 1945629
32858 1945629 1768785 1735647 1420586 952367 821838 957688 877205 621219 641377 866964
32848 866964 820915 598750 757744 1235220 1367443 1043825 858914 1017733 1071872 876620
32838 876620 829053 991070 949483 720442 805675 1167606 1170282 753589 616308 975438
32828I75438K36726j63660n8026K68875J16833j84705L8697L72370Q5624l37583
32818A350589j9633O06479N41510M9261P3309M35840L47517J12010N01528R90325
32808D988735N09800n18307q14498m30746l69129n31980j07858M96582K75065
32799C497664k89628J0798P36495N47005j74682J2701P91523O79225K4043M39140
32789F274284J566574J604289Q52742J293300K726427L072966K554010L413902
32781B3358494N251394N384852M558748O838651J2298935J6014387J7471323K4496202
32773A15672986M1785853N9449616N9702497L4454484p107535m6207636o6400703
32766A91349562o1915826m0940926k0170374j1005700j0740175r928944n738159
$$ plain form
32828 975438 1212164 1048504 990478 1259353 1376186 1191481 1230178 1602548 1688172 1350589
32818 1350589 1330956 1937435 2478945 2528206 2601515 3037355 3384872 3496882 3998410 4988735
32808 4988735 5498535 4980228 4165730 3734984 3365855 2833875 2726017 3222599 3497664
32799 3497664 3208036 3218834 3955329 4502334 4327652 4340353 5131876 5811101 5835144 6274284
32789 6274284 7840858 9445147 10297889 11591189 14317616 17390582 19944592 23358494
32781 23358494 28609888 33994740 38553488 45392139 57691074 73705461 91176784 115672986
32773 115672986 157458839 216908455 276610952 311065436 303957901 257750265 191349562
32766 191349562 129433736 88492810 68322436 57316736 46576561 36647617 30909458
32759C0909458k887919l691455m543281k920881j277734j799872k560581j555747
32751I671988l06736o43410j362142q27585k0211l71949j006509o09718N2474
32742D576202k03767o67524k63347K84076r9386p24965m71588J21922m853m33699
32732B113071k35342J79424n0893m91981k60984K56168J52658l15564l18487p225
32722A020845l6435k03819M4211L64981J13981l69247l32911M7835R9442q6026
32712F62857K3271K75940J61415j57593j80041l0649j16236k45423l7731K25313
32702E81123R0596j62646k9768K45630J27229k04932k19714j3963k3534j36266
32692B53755J2162K18253P2239k00445j27325J11007L0625k21742j51006J49901
$$ plain form
32759 30909458 28021539 24330084 19786803 16865922 15588188 13788316 11227735 9671988
32751 9671988 9365252 8721842 7359700 6532115 6511904 6139955 5133446 4523728 4576202
32742 4576202 4372435 3704911 3441564 3725640 3626254 2901289 2429701 2551623 2546770 2113071
32732 2113071 1877729 2057153 2006260 1514279 1253295 1509463 1662121 1346557 1028070 1020845
32722 1020845 984410 780591 824802 1189783 1303764 934517 601606 649441 748883 662857
32712 662857 686128 962068 1123483 965890 785849 755200 638964 393541 355810 581123
32702 581123 671719 509073 479305 724935 852164 647232 427518 413555 390021 253755
32692 253755 265917 484170 556409 355964 228639 339646 370271 148529 -2477 147424
32682A47424J97119L678m6650K1805q2298k25670p6914J90863J71614k2898j0728
32671B67345J12813J5825j46341k0373J85778L7592k60105j69212J90895K19703
32661D33920j09194k27551K7032K10883J02396k8213l6042r1566j85554q7010
32651I101J38561J61587j9549q3098J0537j2120j59265j43032M9978J21183K7323
32640A01206M0261J98959K27162M6630j18134j72882k13974j68766J12547M12068
32630D65077L32615l8758j95850K083J53476J6668j48429r7086K8347L6903j2202
32619E42844l6230r9646j93013j56157L3418J69785J25066K387p5186q5802m691
32608B22775J58251K23891L1364k50084k91000p0757J21773J34272Q1745M6979
$$ plain form
32682 147424 344543 348221 301571 323376 241078 15408 -61506 129357 300971 278073 267345
32671 267345 380158 395983 249642 229269 415047 452639 192534 23322 214217 433920
32661 433920 324726 97175 124207 335090 437486 409273 373231 281665 96111 9101
32651 9101 147662 309249 289700 206602 217139 205019 45754 -97278 -47300 73883 101206
32640 101206 141467 340426 567588 614218 496084 323202 109228 -59538 53009 465077
32630 465077 797692 758934 563084 565167 718643 735311 586882 489796 518143 555046 542844
32619 542844 506614 406968 213955 57798 91216 261001 386067 388454 313268 227466 222775
32608 222775 381026 604917 636281 386197 95197 24440 146213 280485 362230 409209
32598D09209k0311r5628q2072l0664o6555j11434R361K00892J78133p3408k47472
32587G0051j70195k35P3654N6235J4340l0952l6125L3325R6580O8499K6430O4462
32575B66069P9862m5586j63787o0199J57537J97167L8962q0168q5224j15353j84256
32564E024j41686J3255J00238N8823M02l0343o9545n1153R2882K02546Q2905j24986
32552A38362j16152P4469J15738q0328k44307j97254m5383J04277K57296L21558
32542C28276J55838j10370j68884j2040M5685j01881j90220o5019O7849L9212
32532a1554m329P2634J16181k2872j83135j38771M2872J24792M3482o4518p7810
32521a03028R349J17573J31484J3100j03963o4814O2374P3655m1217q8417j4138
$$ plain form
32598 409209 388898 293270 211198 180534 113979 2545 11906 212798 390931 317523 70051
32587 70051 -100144 -100379 -26725 29510 43850 12898 -23227 10098 106678 175177 201607 266069
32575 266069 345931 300345 136558 76359 233896 431063 470025 389857 304633 189280 5024
32564 5024 -136662 -123407 -23169 35654 36056 5713 -63832 -114985 -22103 180443 263348 138362
32552 138362 22210 96679 212417 132089 -112218 -309472 -354855 -250578 6718 328276
32542 328276 484114 373744 204860 192820 238505 136624 -53596 -118615 -50766 -11554
32532 -11554 -15883 56751 172932 150060 -33075 -171846 -128974 -4182 39300 -25218 -103028
32521 -103028 -93679 23894 155378 168478 64515 -299 62075 135730 94513 6096 -8042
32510h042Q480q9351j29024k217J19906O5376o1100p0675O288J2647n3513m8910
32498b50135P1876J81680J45017l1833k06357k15689k3489K20733L12559J97340
32488D01702o20j40890j86023j64571j02178j3927Q1838J52014J43233L4523q8987
32477A16114j02220j5406K9838j1288j2268Q6226J36520J9543j40109j60094o0754
32466a13898K7718P5278R2610J5322j51061k17452n9329J57832K14146J44797
32456A85963R1326K4505j15029j80707m3620J03261J2276j78911j48825P0012
32446a79749J55210L3342n8347k7819k9490q6679k1804J64446K22368O4507q8639
32435A47346q2540l8987p6558j02856j4707J21832J95628J72018M7659j30768
$$ plain form
32510 -8042 438 -88913 -217937 -220154 -100248 -34872 -95972 -166647 -160359 -147712 -201225 -250135
32498 -250135 -178259 3421 148438 116605 -89752 -305441 -328930 -108197 204362 401702
32488 401702 401082 260192 74169 -90402 -192580 -206507 -124669 27345 170578 205101 116114
32477 116114 13894 -1512 28326 17038 4770 90996 227516 247059 106950 -53144 -113898
32466 -113898 -86180 -10902 81708 97030 -54031 -271483 -330812 -172980 41166 185963
32456 185963 277289 301794 186765 6058 -37562 65699 77975 -100936 -249761 -179749
32446 -179749 -24539 8803 -49544 -77363 -106853 -193532 -215336 -50890 171478 235985 147346
32435 147346 64806 25819 -50739 -153595 -168302 -46470 149158 321176 368835 238067
32425B38067k07898q6902P9263Q9051R058K0559N7900n4151j97933j11512J13752
32414e0746J36089n0803j18326r950j8831j77510j36710J71502L15531P7424j48473
32403a0803j7376J91169Q6335j56353j23361J24582J80779l0968j80031p1893
32393g920J19171J64702M6803j05571j57762o3381O6270O0325o6983j13684p899
32382f5929P9455M4430J8879P6780M9116j50327k78663j16841J49089J94031K7681
32371B7701r1113p0922k5679m171L8915P6747N8697N1856J18017J42331O092j65112
32359A63359j59669p549P8828K5327n9583r9511r9846m1344P3841J26393K4312
32348B4558j16402j23651l1116Q679m653M1802J23532J07213R477m828J03877
$$ plain form
32425 238067 30169 -56733 22530 111581 120639 141198 199098 144947 -52986 -164498 -50746
32414 -50746 85343 34540 -83786 -93736 -112567 -290077 -426787 -255285 60246 137670 -10803
32403 -10803 -28179 162990 249325 92972 -30389 94193 274972 244004 63973 -7920
32393 -7920 111251 275953 322756 217185 59423 -3958 62312 122637 55654 -58030 -65929
32382 -65929 13526 57956 76835 153615 202731 52404 -226259 -343100 -194011 20 27701
32371 27701 -63412 -134334 -160013 -164184 -125269 -48522 10175 62031 180048 322379 328471 163359
32359 163359 3690 -3859 74969 100296 40713 -58798 -158644 -199988 -126147 246 24558
32348 24558 -91844 -215495 -246611 -237932 -242585 -200783 -77251 29962 39439 34611 138488
32337A38488J82336J19920j9840j30426j74986j45940m8322N3517Q4399O1919
32327A21065N6301O6583M3057M744J2871M4843J8182o2462r6060l5364M3559M0099
32315B57418n6589j56272j50564l5893N0168p335j11188o5319J08949J67488K4474
32304B5337r3321j8234P1484l1023j64453l7641K58681L37207R1887j53647j38076
32293A48201L458K4625o5938j05132o9183o5359j12712j08663l899J12626J29132
32282a12844M8478j9547J3329J11352J56679R3969m112m0265j5681R23j0472p737
32270B14072K2424L0944k0494r9074j36186j03084l5335J4833L7157N2351M6812
32259B4420k1563j16822j05955N8907K07020J41052p1141j69495p1754K3337m0143
$$ plain form
32337 138488 320824 440744 420904 290478 115492 -30448 -78770 -25253 59146 121065
32327 121065 177366 243949 287006 291750 304621 349464 367646 305184 209124 173760 217319 257418
32315 257418 200829 44557 -106007 -141900 -91732 -99067 -210255 -275574 -166625 863 25337
32304 25337 -67984 -86218 -14734 -45757 -210210 -247851 10830 348037 439924 286277 148201
32293 148201 151659 176284 110346 5214 -63969 -129328 -242040 -350703 -354602 -241976 -112844
32282 -112844 -64366 -83913 -70584 40768 197447 291416 287304 247039 231358 232281 221809 214072
32270 214072 236496 267440 246946 147872 11686 -91398 -126733 -111900 -74743 -22392 24420
32259 24420 2857 -113965 -219920 -161013 46007 187059 115918 -53577 -125331 -101994 -142137
32248a42137j41448q8961R3462K27984K25577J33541J9721o7912q6267m7175l1042
32237I5343p0886r1433m0272R943j2670m2131J3077R1280N3408r2131j74593q2521
32225c43586R6781J88958J28128R714l6751k489P442n6899j03467m4896N0079
32214a06986O6146K8396L0039M3413n500l6580O5869J69768L0195k72851l66152
32203c54243j41092O5332K879j20550l0794J58595J81532O5589K0740O0602N0536
32192d0874j863j086Q848m8885p1132M5601J38886Q668j96216j62663Q6024K27098
32180g594J41430K4678k655l7608j05791p5676N4486R5204r151p7836j7639K7613
32168I461l2866o7203J7449R0009L1472n8484m9993J1506L8198N8269R5969P1261
$$ plain form
32248 -142137 -283585 -372546 -279084 -51100 174477 308018 327739 259827 173560 126385 95343
32237 95343 24457 -66976 -107248 -97305 -109975 -152106 -139029 -47749 5659 -86472 -261065 -343586
32225 -343586 -246805 -57847 70281 79995 43244 40755 48197 -8702 -112169 -157065 -106986
32214 -106986 -40840 -12444 17595 61008 55508 18928 84797 254565 284760 11909 -354243
32203 -354243 -495335 -430003 -427124 -547674 -578468 -419873 -238341 -172752 -152012 -91410 -40874
32192 -40874 -42737 -43823 -34975 -83860 -154992 -109391 29495 38163 -158053 -320716 -234692 -7594
32180 -7594 133836 158514 155859 118251 12460 -63216 -8730 86474 77323 -513 -18152 9461
32168 9461 -23405 -90608 -73159 16850 48322 -10162 -60155 -48649 -10451 47818 143787 215048
32156B15048l2608p8503q015J7124j15560k36847j47323M9621J08668K6291N982
32145a96122J02124J57586Q7503j2468o7949j21821j76231j34177J6443J26251
32135b18861R8603M4147R4552J71595J03472q2643j62616l1525J36258J23902
32125B76884l9343j42813q9763O809K0854k5602m4584j9330J4883M9275P7203
32114H4473N0622m7788j31406j04518n852L7162j2517o0099k3306O2464J05010
32103d5755O5944r491m4421j1724K6586m221o7429m6532O2846J05396l381j17442
32091h9624o7262P7221J28265Q3447Q7711J33393N3210j58749k68877j37084Q0604
32080g7745J71586J26820M7047l4062r7524p2469K6301M2303p8889j38707K5714
$$ plain form
32156 215048 182440 103937 95922 113046 -2514 -239361 -386684 -337063 -228395 -202104 -196122
32145 -196122 -93998 63588 151091 138623 70674 -51147 -227378 -361555 -345112 -218861
32135 -218861 -120258 -76111 18441 190036 293508 210865 48249 16724 152982 276884
32125 276884 237541 94728 4965 11774 32628 7026 -37558 -56888 -42005 7270 84473
32114 84473 135095 87307 -44099 -148617 -154469 -117307 -129824 -189923 -213229 -150765 -45755
32103 -45755 20189 10698 -33723 -45447 -18861 -23082 -90511 -137043 -74197 31199 27818 -89624
32091 -89624 -156886 -79665 48600 132047 219758 353151 406361 247612 -21265 -158349 -77745
32080 -77745 93841 220661 267708 233646 136122 63653 89954 132257 53368 -85339 -59625
32069e9625K36061J96950o0126k18755j33639J5783M6313m060l8156o3018q8385
32058a70657m6265O9622J33417P2876n656P633N3338L0464k5076l3274l2820q9369
32046c5767j32509o4010M1749M1819j9649K1964J46101J50473l499r8555j4007
32035C4110O5897l9378j87981j30975Q1465J64671K6937j14349p3815N7556R5775
32024b0087L1153r358K7406P3173O6159K4465j1765l8738o3927o8433l5232L266
32012b1918n116m8616n2918K218L1852k1865p0942o426J04783J00157j5220o7903
32000g1914l532L1870k9093l9451Q2269J56224K9670j25063n8864J40683J71049
31989B83848k4261k04197k08180j06558J8683J59340K23570P8929j82502k84817
$$ plain form
32069 -59625 176436 373386 313260 94505 -39134 -23351 22962 18902 -19254 -82272 -170657
32058 -170657 -216922 -147300 -13883 58993 53337 60970 114308 144772 119696 86422 53602 -35767
32046 -35767 -168276 -232286 -190537 -148718 -168367 -146403 -302 150171 146672 48117 34110
32035 34110 100007 60629 -127352 -258327 -176862 -12191 14746 -99603 -173418 -115862 -20087
32024 -20087 11066 1708 29114 102287 168446 192911 181146 142408 78481 10048 -25184 -21918
32012 -21918 -27034 -75650 -128568 -126350 -94498 -116363 -187305 -193731 -88948 11209 -4011 -71914
32000 -71914 -75446 -43576 -72669 -112120 -29851 126373 156043 30980 -27884 112799 283848
31989 283848 259587 55390 -152790 -259348 -240665 -81325 142245 221174 38672 -246145
31979b46145j53193o772J3504L4431J45145J85063L1594j34750q7246R2780J51648
31968B6059L6745q3125r3006l5471J2011R396n4300j25175r8414L4894J35194
31957b35192J01246R839k5501j3749L415N7786J33800R4028r5820k08232m1275
31946b19655K39641K92604P2443j37897j51525p8508o4768o7863K601R3742R1261
31935G2076N16o4687l6113L8418O8823L0393j2665M088N1041M7935n800l2475
31923A61550k3931o6838j64899j73697k0950J32431R9788n4224j10553j0557R9943
31912a31937J14499Q0172N8383K8955k5001n8564m5012k8751n0257p7903n5436
31901a90852J6630P5595O5954R798r295L4798M0566q3601k30009j85625N0672
$$ plain form
31979 -246145 -399338 -406110 -392606 -358175 -213030 -27967 3627 -131123 -218369 -125589 26059
31968 26059 62804 -20321 -113327 -148798 -136787 -127391 -181691 -306866 -405280 -370386 -235192
31957 -235192 -133946 -124107 -149608 -163357 -159942 -102156 31644 125672 29852 -178380 -219655
31946 -219655 19986 312590 385033 247136 95611 17103 -47665 -115528 -112927 -19185 72076
31935 72076 72592 7905 -28208 10210 79033 109426 96761 100849 151890 199825 194025 161550
31923 161550 137619 70781 -94118 -267815 -288765 -156334 -56546 -110770 -221323 -231880 -131937
31912 -131937 -17438 62734 121117 150072 125071 66507 21495 -7256 -57513 -135416 -190852
31901 -190852 -174222 -98627 -32673 -22875 -32170 2628 43194 -40407 -270416 -456041 -405369
31890d05369K15489J38474j7550k3674O2345K6321j17184j31265N4646K10552
31880A2785J41452l5841q4592P108L8523q2153j90993j05634R9109J84806R0270
31869G4840J2661Q8848J68826O0490j38364j79543n6504R146n0620p2467M593
31858g8094L2527l5323l4127Q2135J07312m2784j26447K3424J83160J06207n3384
31847A64606k0663J14400P2083j09035j43161L672Q2681J0594k8203M2143O0020
31836B49137m9189j24060n1229M6364J8548j00591j78347j35968K6259K18062
31826h1014K69898J09152q7931r0231O7014J43082M4337r7517j80742k31631k37708
31815c73291j21524P3623J79846J35778M5522j2026m9408m4129M8638J45996J10056
$$ plain form
31890 -405369 -189880 -51406 -68956 -92630 -30285 -3964 -121148 -252413 -197767 12785
31880 12785 154237 118396 33804 40912 79435 -2718 -193711 -299345 -200236 -15430 74840
31869 74840 87501 176349 345175 405665 267301 87758 31254 40400 -10220 -82687 -78094
31858 -78094 -45567 -80890 -115017 -32882 74430 31646 -94801 -71377 111783 217990 164606
31847 164606 143943 258343 330426 221391 78230 81902 164583 175177 146974 189117 249137
31836 249137 199948 75888 24659 71023 89571 -11020 -189367 -325335 -299076 -81014
31826 -81014 188884 298036 210105 119874 186888 329970 374307 276790 96048 -135583 -373291
31815 -373291 -494815 -421192 -241346 -105568 -60046 -72072 -121480 -165609 -116971 29025 139081
31804A39081j5446n4064J0258K0813n5749p1660K4890J05893J08176J10791J13385
31793D36368P480j54552j49472M0682J28448m1424k22263j39809R2563J72962
31783A70983N4983n6303m5387P660J2829k2675n5840n4232o253L7808o717j21932
31771h5076j59770l2534J46883J99840R3983n0363j09076n4240M2922P4351R542
31760G6462n1887j1193P3041O9203j4274m6563L608K9846j2673m0703j2018K605
31748F5454l5238o3406m2252r566J4491L8647J5466q8479j48463j9703J73899
31737i9150J42585j23608k78997j02126J95050K85588J41739l6311j26156j37589
31727a38975r2827j7908L1051M2692O5681R1002M8861k6678j797J16978J39869
$$ plain form
31804 139081 123635 69571 79829 100642 44893 -26767 -1877 104016 212192 322983 436368
31793 436368 443848 289296 139824 180506 308954 267530 45267 -94542 -1979 170983
31783 170983 225966 169663 124276 131936 144765 122090 66250 12018 5765 43573 36856 -85076
31771 -85076 -244846 -277380 -130497 69343 163326 112963 3887 -50353 -7431 66920 76462
31760 76462 24575 13382 86423 155626 141352 94789 98397 128243 115570 74867 62849 65454
31748 65454 30216 -33190 -75442 -85008 -70517 -31870 -16404 -104883 -253346 -273049 -99150
31737 -99150 43435 -80173 -359170 -461296 -266246 19342 161081 124770 -1386 -138975
31727 -138975 -231802 -249710 -218659 -175967 -110286 -19284 29577 2899 1102 118080 257949
31716B57949p049j36009q3780L8470L8591o7108j23448p7021M921O5936Q7603
31705i45O1401J7000p05j8614q4037j21963j9692J34843J26280l8659j15734k3408
31693h4233L7011l0489l3506J29127K27051P6111j33142j57860r0597j22064j58246
31682c40837j9315J73937J79474N6665M3004J16030N2916j34155j94292o1869
31672a28442N6827M4166R754K8934K6654k1407k4057K9788L4481k6002m7238j4685
31660c1227k6552p1307j6095J24128J44851k2673j64316r4864O5519Q5510l8257
31649d5283j05748j0259J37915J75235P3897n1108p8419j538Q4237R8139L9440
31638C16508n8278j60887j96158q6616J10221J98256Q3407p3406o8620N8555J00519
$$ plain form
31716 257949 250900 114891 31111 69581 108172 41064 -82384 -159405 -154484 -88548 -945
31705 -945 60456 77456 76751 58137 -25900 -147863 -167555 -32712 93568 54909 -60825 -84233
31693 -84233 -47222 -77711 -111217 17910 244961 321072 187930 30070 -60527 -182591 -340837
31682 -340837 -360152 -186215 -6741 49924 92928 208958 261874 127719 -66573 -128442
31672 -128442 -71615 -27449 -17695 11239 37893 16486 -7571 22217 56698 30696 -16542 -31227
31660 -31227 -57779 -129086 -145181 -21053 123798 101125 -63191 -158055 -92536 -7026 -45283
31649 -45283 -151031 -161290 -23375 151860 225757 174649 96230 94692 178929 277068 316508
31638 316508 258230 97343 -98815 -185431 -75210 123046 206453 133047 64427 122982 223501
31627B23501j4995j52738j75280p5298Q2072K12925K22046R0986m5613m1787M4632
31616C70451J7058j65482l02896k16837J4038J57989J03684m3191j14272o9716
31606b49174n273J6547O7108K08231L08448J65504j68658l71217k51594p120O1344
31595b25854n4083j31906p0690L2145R4228J34341J53234J10474L8639K7807P0722
31584A79057N9816k8386p3388R924J31860J38931Q805j29353j52060p3650n975
31573F5581p158k1176P732L0329j5904p0683l4953M7545N4880J4315O3415J65450
31561B99373J01049j69529l65562k52902L0755J75645Q0816j07111k04614j17457
31551e29537J09067K63767J52141j06151j69378L3695J69629K1150j58833o8420
$$ plain form
31627 223501 208506 55768 -119512 -194810 -112738 100187 322233 413219 367606 325819 370451
31616 370451 387509 222027 -80869 -297706 -283668 -125679 -21995 -65186 -179458 -249174
31606 -249174 -254447 -237900 -170792 37439 345887 511391 342733 -28484 -280078 -287198 -225854
31595 -225854 -279937 -411843 -482533 -450388 -356160 -221819 -68585 41889 80528 108335 179057
31584 179057 238873 210487 137099 147023 278883 417814 426619 297266 145206 71556 65581
31573 65581 58423 37247 44979 75308 59404 -11279 -46232 1313 56193 70508 133923 299373
31561 299373 400422 230893 -134669 -387571 -356816 -181171 -100355 -207466 -412080 -529537
31551 -529537 -420470 -156703 -4562 -110713 -280091 -246396 -76767 -55617 -214450 -282870
31541b82870J49617J69479J4824m6682J6608J5573o2525n3112M1300N9262k691
31530A8783j3928n948r9833j81043k6069K54505K98727N7501j23761o6235N304
31519A18003p7617j29234J1639J47098M0802j75695k01985j5293J33805Q0317
31509f8160r3337j95077r8163J52808L33160K33711p4065k87527k36238n1128
31499c84016P3159J00493O3775m2978j60203j33464O0630K10197J46059o956k1165
31488i4469J00718J61630P1475n9578j05452n9719J7605Q2601J13199R1691P898
31477C27599j22100k29465k10537l3771J78000K48928J41836k0622j20937j45380
31467A3551j19673n4734J4108K5845k5903p2272n4102J8174R0531J07681N0029
$$ plain form
31541 -282870 -133253 36226 51050 4368 20976 36549 -25976 -79088 -37788 21474 18783
31530 18783 4855 -1093 -100926 -281969 -308038 -53533 245194 302695 178934 112699 118003
31519 118003 40386 -88848 -77209 69889 110691 -65004 -266989 -282282 -148477 -68160
31509 -68160 -161497 -356574 -454737 -301929 31231 264942 190877 -96650 -332888 -384016
31499 -384016 -310857 -210364 -146589 -189567 -349770 -483234 -422604 -212407 -66348 -73304 -94469
31488 -94469 6249 167879 239354 179776 74324 14605 32210 114811 228010 319701 327599
31477 327599 205499 -23966 -234503 -268274 -90274 158654 300490 279868 158931 13551
31467 13551 -106122 -160856 -146748 -120903 -146806 -219078 -273180 -255006 -164475 -56794 -6765
31456f765k6826l3672K2329K5780o0950j09797l3704M5676k523p2847J1134J78727
31444f3438K05693P3448k4391j4613j6472o9170n8355L3875O1219k6798q9847
31433A1151n0101k2816r3850j64693j24137l339J24639K30331K48646J06878r6348
31422A66361j45795k6023L5690n8989j07545M5566K22558J76969l8206j86584
31412H4002j96310j70493j44450n2779R5283J86173J50998L4436p2489r7606k5488
31401b08723P1990R5337M3380J186j6375q0365j66819j26270P1614K23735J61980
31390G0670M598k2499Q3192J28495L2476p3599o2174K0656N1333L231m2950k9874
31378A63555J74j6840n4695l4037L2746L7549m2474q1922q849O2488K8074j3914
$$ plain form
31456 -6765 -33591 -67263 -44934 -19154 -80104 -189901 -223605 -177929 -180452 -253299 -242165 -63438
31444 -63438 142255 215703 191312 176699 160227 91057 32702 66577 127796 100998 11151
31433 11151 -38950 -61766 -155616 -320309 -444446 -447785 -323146 -92815 155831 262709 166361
31422 166361 20566 -5457 30233 -28756 -136301 -90735 131823 308792 270586 84002
31412 84002 -112308 -282801 -427251 -480030 -384747 -198574 -47576 -13140 -85629 -183235 -208723
31401 -208723 -136733 -41396 1984 3170 -13205 -93570 -260389 -386659 -315045 -91310 70670
31390 70670 75268 52769 135961 264456 296932 223333 161159 181815 233148 236379 193429 163555
31378 163555 163729 146889 92194 58157 90903 128452 85978 4056 -4793 57695 85769 71855
31366G1855N3654J19936J7080j55636j51671K4584J23991M9143m0672m0153k7296
31355D4815l7257J1151R7735Q2143k5187m5672L9863L7168r3765j26065M2733
31344B7662J88394J22087k0620m3266R956J2335j6102k9406q6897j82191j64422
31333a82470p211Q2739R002k7963R8462J68258j2891k31850j83944M1881J37176
31322a08811O5670L1032P7594P1331M022o569K3557k6443j25415j22220p739Q4735
31310c9256J03580R3269M3085o6257j29783m7459P7560P9912J210M847R0840J11689
31298C23237J8563r9591j61239j20556L8382J83063Q3697k23191l44846o8916
31288c71397K51555J94069q6681j43695K2041L3259j49129j65291O3872J75403
$$ plain form
31366 71855 125509 245445 262525 106889 -44782 -20198 103793 152936 112264 72111 44815
31355 44815 7558 18709 116444 198587 173400 127728 167591 204759 110994 -15071 27662
31344 27662 216056 338143 317523 274257 284213 296548 280446 251040 164143 -18048 -182470
31333 -182470 -189681 -106942 -97940 -125903 -27441 140817 127926 -103924 -287868 -245987 -108811
31322 -108811 -43141 -12109 65485 136816 140838 134269 157826 131383 5968 -116252 -123991 -39256
31310 -39256 64324 157593 200678 134421 4638 -42821 34739 114651 115861 120708 211548 323237
31298 323237 341800 242209 80970 -39586 -1204 181859 265556 42365 -302481 -371397
31288 -371397 -119842 74227 -12454 -156149 -134108 -100849 -249978 -415269 -351397 -175994
31278a75994J9259o7455J30402L07308J53325j31129j85323m2366K5966j7222
31268A6771j6044K3713l1444j41428j30473Q509R9698O4866R502K2485O0186N2107
31256C8448j791n9541q3368n7112r073O289j4223j1479L5803O7276L8556j1949
31244f2164m0203o2626r1548p9935P127J19737J69251J08570m0508j78741j64132
31233c15172M1114K61931K75192R4734n0078m2694j4599r0052j78339j42536k7308
31222a87807L4323L6023N8757Q6658L0790q5328j18727j0695J16387J13833r456
31211F4758j07804p5912L5020Q7431K8065m7356k4575P0284J03701J6478r9240
31200E0850j22685m6159L7685N5796L0463L6059Q3421P3816o8724k23405j57479
$$ plain form
31278 -175994 -156735 -224190 -93788 213520 366845 235716 50393 8027 33993 16771
31268 16771 727 24440 -7004 -148432 -278905 -270396 -170698 -105832 -96330 -73845 -13659 38448
31256 38448 36657 -22884 -106252 -163364 -172437 -166148 -180371 -191850 -156047 -88771 -50215 -62164
31244 -62164 -102367 -164993 -256541 -336476 -329349 -209612 -40361 68209 27701 -151040 -315172
31233 -315172 -274058 -12127 263065 357799 307721 265027 250428 160376 -17963 -160499 -187807
31222 -187807 -153484 -117461 -58704 27954 58744 -26584 -145311 -156006 -39619 74214 64758
31211 64758 -43046 -118958 -83938 3493 31558 -15798 -40373 29911 133612 150090 50850
31200 50850 -71835 -117994 -80309 -24513 5950 42009 125430 199246 130522 -92883 -250362
31189b50362J42031L56526K08765j46885l06250j42347P6955J09523L1422J6736
31179I6114M4314q680j21597j62533r8104j3614M4158J06496J68474J53696K6504
31168B35228j30906j91663j12003K5417R0231L7706l7302j1367J02689J58856
31158A66886O8140p8312j29169o8226j4994m4332q4999l0858R5697J52667N4972
31147H7472j06829j64176o7099O6853J02674L4822l7667l7720K4178Q3265Q5758
31136G1531L3111k3743m5219m7889n7013l9857M4255J38389J25211j2882j58475
31125B7419k07658j66122p5963M7529J64828K00537J36762L7998m2744q8963n5660
31114b2037P6301J75862Q1936j18890j58950Q3Q3556n0964j69980n7052J27103
$$ plain form
31189 -250362 -108331 248195 456960 310075 3825 -138522 -61567 47956 79378 96114
31179 96114 140428 131748 10151 -152382 -250486 -264100 -219942 -113446 55028 208724 235228
31168 235228 104322 -87341 -199344 -173927 -83696 -45990 -83292 -94659 8030 166886
31158 166886 235026 156714 27545 -40681 -55675 -100007 -185006 -215864 -120167 32500 87472
31147 87472 -19357 -183533 -250632 -183779 -81105 -46283 -83950 -121670 -97492 -14227 71531
31136 71531 104642 80899 35680 -12209 -69222 -109079 -64824 73565 198776 185894 27419
31125 27419 -180239 -346361 -422324 -374795 -209967 -9430 127332 165330 122586 33623 -22037
31114 -22037 54264 230126 312062 193172 34222 34305 117861 66897 -103083 -160135 -33032
31103c3032J33651K7237j024J701q3227j12272Q7969L02809J86019j47419k47159
31092A15253k7631J29457J9247j12551n9967K7677L307j1207O2158M7331j29179
31081F3895k07503j0733K01201J15827j31642j82233j516J35363R3054o908n5585
31070A3220o6095m7926r30K726p1438q9961O4931K50124K25800J7786j16661o3948
31058A17628L5233N2528J9593k6117j23321k37233k15487n277K17762K50737J07574
31047A93620l2971n8463j0967J8815N9l7963n9598n3848k9314O12K1237J8586
31035c0195l992j8696n276J8178K4191K3254M5396Q4932J01654O4709l3372j67225
31023A03558k43550j49175Q1504K25716J27734o8142j00289M2469J32176O3508
$$ plain form
31103 -33032 100619 127856 126832 128533 45306 -66966 21003 323812 509831 362412 115253
31092 115253 87622 217079 236326 123775 63808 91485 94792 83585 145743 193074 63895
31081 63895 -143608 -154341 46860 162687 31045 -151188 -152704 -17341 75713 68805 13220
31070 13220 -52875 -100801 -101731 -99005 -170443 -260404 -195473 54651 280451 298237 181576 117628
31058 117628 152861 205389 224982 198865 75544 -161689 -377176 -382453 -164691 86046 193620
31047 193620 160649 102186 91219 110034 110093 72130 12532 -41316 -70630 -70018 -48781 -30195
31035 -30195 -34187 -52883 -58159 -39981 -15790 7464 52860 137792 239446 304155 270783 103558
31023 103558 -139992 -289167 -207663 18053 145787 77645 -22644 19825 152001 215509
31013B15509k2802j1639K2534M072n771L0008J8555p9111j34497n9518L5573L4589
31001D7502K248K1309R365j10067k00778j00909R0805J45209M4803l1307j3010
30990i4830L654j1090L7149J59056K13384J11437n5161j50334j46073r4773m3009
30979g0590j1536N479L5336O9006L4645r5422k07619j58952L1435J99225K28691
30968E9698J39262N187j03885j17705j6855J00871J02458j6794j27958j30464
30958a06185m8079L3568N4092M555p0487r8835n3412J7513O2834Q4055Q4818M3136
30946G573j2980m62P2344P0038n2053j24960j5320J27311P9649r2312j28998O410
30934f3760Q0066k2433j26490p4080L5616M0050l5618o5786k8899J2398L8231
$$ plain form
31013 215509 192707 181068 203602 207674 201903 231911 250466 171355 36858 -22660 12913 47502
31001 47502 49750 71059 80424 -29643 -230421 -331330 -240525 -95316 -50513 -81820 -94830
30990 -94830 -91176 -102266 -65117 93939 307323 418760 363599 213265 67192 -27581 -70590
30979 -70590 -82126 -76647 -41311 27695 62340 -33082 -240701 -399653 -368218 -168993 59698
30968 59698 198960 204147 100262 -17443 -34298 66573 169031 152237 24279 -106185
30958 -106185 -154264 -120696 -66604 -62049 -132536 -231371 -284783 -267270 -204436 -120381 -35563 7573
30946 7573 -5407 -5869 66475 136513 84460 -40500 -55820 71491 151140 58828 -70170 -63760
30934 -63760 16306 -6127 -132617 -206697 -171081 -131031 -166649 -232435 -261334 -248936 -210705
30923b10705O1066O3274L6309J2690n237o0346j26932r5025N2626J64653J22679
30912A5052J1506k5836k469k3314q7178j02964n7649k5853l2137k8007L142K5744
30900c29963L0247L9445M9166M5639N5524R0928Q4025j6479j22990j12025k0669
30889b07152Q976l1008o089J05740J40925J2658j23476q7864P0043J71420J56831
30878B11004R3406K0255n6616p6940n41O6889n104j37570j14820Q1974K03025
30867B84962P3171j53803k07332n4976R3545P8264m3946j10538l9052J00791J50784
30856A71870J9144j90770k53654q0352J50489J99040O0018n2231j401J06058R5084
30845B23295l2728j15268n9293M1268N0547j2523j0559Q8465J36772K0912j43695
$$ plain form
30923 -210705 -149639 -86365 -50056 -37366 -42603 -102949 -229881 -324906 -272280 -107627 15052
30912 15052 26558 722 -1747 -25061 -112239 -215203 -272852 -298705 -330842 -358849 -355707 -329963
30900 -329963 -299716 -260271 -211105 -165466 -109942 -19014 65011 48532 -74458 -186483 -207152
30889 -207152 -198176 -229184 -235273 -129533 11392 24050 -99426 -187290 -117247 54173 211004
30878 211004 304410 324665 268049 191109 190568 257457 252353 114783 -37 81937 284962
30867 284962 358133 204330 -3002 -57978 35567 113831 69885 -40653 -79705 21086 171870
30856 171870 191014 244 -253410 -333762 -183273 15767 75785 23554 22153 128211 223295
30845 223295 190567 75299 16006 57274 107821 95298 84739 173204 309976 330888 187193
30834A87193j53920p104R5818L2649r8022j46431r0625L437Q3851J19064J00484
30823A26394P7717R4493Q5093k7789j40954q1755O8515L0301k08869k92537l6276
30812c05667K39617J90238k0301k3867J32676J06013j28121k39833j07322K7720
30802a28847K0726K7491J37002J78110M9012q5001r0724p2493j11155q1655P9000
30791g8534J86696J03556k1360k0706Q779p0616j44392m8988R9572P2803q4469
30780B341j23625Q436J07869M8473n0534l1894Q6869J63245J07110k3216q1840
30769B13234j2743N8404N261o9099K4006J92817J25106k00466l78215j43394K11179
30758B6090K54914J9740j32921o3521O6452J39630J61562P6534j50883l15446
$$ plain form
30834 187193 33273 26169 121987 154636 56614 -89817 -180442 -177005 -93154 25910 126394
30823 126394 204111 298604 383697 355908 214954 133199 201714 232015 23146 -269391 -305667
30812 -305667 -66050 124188 103887 80020 212696 318709 190588 -49245 -156567 -128847
30802 -128847 -108121 -80630 56372 234482 283494 198493 107769 35276 -75879 -157534 -78534
30791 -78534 108162 211718 190358 169652 178431 107815 -36577 -85565 14007 86810 2341
30780 2341 -121284 -112848 -4979 43494 -7040 -38934 47935 211180 318290 295074 213234
30769 213234 200491 258895 264156 195057 219063 411880 536986 336520 -41695 -185089 26090
30758 26090 281004 300744 167823 104302 170754 310384 471946 548480 397597 82151
30748H2151j75247J33368K21052O226j83907j29189J799o66o4589k9462P7511
30737f0953J37869J34616R1050k6695j97613k73702j65923O993Q2559O5983O0009
30726a45807Q2819Q2908O0203N1166M4160J0153k4603k1384o307l1544r0760j30713
30714a19709j18195n6971K3971P2880N7368K5226N5676J27268J23342J1576q3246
30703A19186o0008K731j7238p0150p786J48569J86826R445j86320j60475K6544
30692h676R4710m5973j61469m9566J45558J46523l8115j35040k5066R9209N7391
30681G9486n5458o0251K2149N0677J6475L0082J06450J31310M0671r0048j48199
30670A23344r5503J7013Q6428L5810r1519j55220q5889K5609N9420J6746k5776
$$ plain form
30748 82151 -93096 40272 261324 267550 83643 -45546 -43747 -44413 -109002 -138464 -60953
30737 -60953 76916 211532 302582 275887 78274 -195428 -361351 -354358 -271799 -205816 -145807
30726 -145807 -62988 19920 80123 131289 175449 185602 160999 139615 133308 101764 11004 -119709
30714 -119709 -237904 -294875 -270904 -198024 -140656 -115430 -59754 67514 190856 202432 119186
30703 119186 59178 61909 44671 -25479 -33265 115304 302130 311575 125255 -35220 -8676
30692 -8676 86034 40061 -121408 -170974 -25416 121107 82992 -52048 -77114 22095 79486
30681 79486 24028 -36223 -14074 36603 53078 83160 189610 320920 361591 271543 123344
30670 123344 27841 44854 131282 167092 75573 -79647 -165536 -139927 -80507 -63761 -89537
30659h9537l5996k5576Q57K6275K1760J7431P4320J38568O8371j15948j84991
30648a04466l1659J33270R5662k7222o82J24342J08747n6810j37079m3200M9352
30637A10255J2070o3305p3248o3214q7900r1482k7149M2156N0840L0377L2138
30626a28462M0916K1613j8938n4370o9523n6187k0422J8571O3881J22332J30946
30615E0357J5724j31729j05504Q9484J67592j9020k08414j12636J27312J73427
30605D6593J5173q8902p7870j12279j92528j49262l259N0791K6044J13656K52164
30594a19679J61290j21869j95902P2427L09325K25706K8766l120L7699l1982j12945
30583B49716n9900J100p5973j45214l9534Q4959J8857j02354l2980J30910J09831
$$ plain form
30659 -89537 -125533 -151109 -150252 -123977 -102217 -84786 -10466 128102 196473 80525 -104466
30648 -104466 -136125 -2855 92807 65585 64903 189245 297992 241182 104103 60903 110255
30637 110255 122325 59020 -14228 -77442 -165342 -256824 -283973 -241817 -190977 -160600 -128462
30626 -128462 -87546 -65933 -84871 -139241 -208764 -264951 -285373 -266802 -202921 -80589 50357
30615 50357 66081 -65648 -171152 -81668 85924 66904 -141510 -254146 -126834 46593
30605 46593 61766 -27136 -105006 -217285 -409813 -559075 -562334 -511543 -485499 -371843 -119679
30594 -119679 41611 -80258 -276160 -203733 105592 331298 360064 356944 394643 362661 249716
30583 249716 189816 190916 114943 -30271 -69805 15154 34011 -68343 -101323 29587 139418
30572A39418q2603j86130j17635q491Q9371J99943K13760K7068j77307j34477
30562c7083P0043J23105n370n0980N7081R6343j2297o2224L8317Q9705k4573j19081
30550A62986m6600L8303k9005j19904m1434J26468J68046O7292k2997m7666p1215
30539A84274r7923o3217K3113P6928O5668K1969l6240j00401j28214r9312o6484
30528b19839o3816k8317Q2832J65964R6516o2290j23420l7443N4160M2170j4194
30517a07677k1320L573L41j4249Q770M3958L0318j0345O837Q8809J33365O8154
30505B30534m9690j14141r2232j5621R2369K02831K29316R5559j27286k44135
30495B07504j53033K0466P3862k3362j13232p8482L741q659j02684j20657P444
$$ plain form
30572 139418 56815 -129315 -246950 -255441 -166070 33873 247633 274701 97394 -37083
30562 -37083 32960 156065 150695 99715 156796 253139 240842 178618 216935 306640 282067 162986
30550 162986 116386 154689 125684 5780 -35654 90814 258860 326152 303155 255489 184274
30539 184274 86351 23134 46247 123175 188843 210812 174572 74171 -54043 -153355 -219839
30528 -219839 -283655 -311972 -229140 -63176 33340 -28950 -152370 -189813 -135653 -93483 -107677
30517 -107677 -128997 -125424 -125083 -139332 -130562 -86604 -56286 -66631 -59794 29015 162380 230534
30505 230534 180844 66703 -25529 -41150 51219 254050 483366 578925 451639 207504
30495 207504 54471 74937 148799 125437 12205 -66277 -62536 -71195 -173879 -294536 -287092
30484b87092J47376J38519R182q3469p3789k0833M5958J47072K07749R0996j47923
30473A73746k40103p1389J15238P0833q2543p5652N1376L6490j28781j67855J2323
30462c06317J64594J06510k9009p7778q6536j05841k1709J88323K77568P2844
30452A82649j93129j75040Q6670K39601J16933r6737j66420n7810J03132J60789
30442B00638M6256j21347j29470K6297Q7780o8265j85845k6039K01649J48222
30432A79876r1668j26036P7841J47422n5494k15959j12017N4424O6525L6729R5730
30421E7373R7749o4894j67895j6447J67819R7626o9238M624K24826J94830j07289
30410D19084k67891r5621J13629R1793l0655n3192m4711j17418j58211n2521N8330
$$ plain form
30484 -287092 -139716 -1197 7985 -75484 -149273 -170106 -124148 22924 230673 321669 173746
30473 173746 -66357 -137746 -22508 48325 -34218 -109870 -58494 -22004 -150785 -318640 -306317
30462 -306317 -141723 -35213 -64222 -142000 -228536 -334377 -356086 -167763 109805 182649
30452 182649 -10480 -185520 -98850 140751 257684 160947 -5473 -63283 39849 200638
30442 200638 246894 125547 -3923 22374 110154 41889 -143956 -169995 31654 179876
30432 179876 88208 -37828 40013 187435 131941 -84018 -196035 -141611 -75086 -38357 57373
30421 57373 155122 90228 -77667 -94114 73705 171331 102093 106717 331543 526373 419084
30410 419084 151193 55572 169201 260994 230339 177147 132436 15018 -143193 -195714 -137384
30399a37384J4066o7045m572J03146N5741o9994m7060Q4139P4861q3113j23775
30388b00990L6985J51197M9331j00147q9283K5846Q8063R0423Q9126N1009l4035
30377A57525n2984M1521R8073J443j15990r2685j0766k7262q2109l6117K5744
30366i3607o8488k18323j59024R1021K23504J13272k6118l5672l5903j21108j34495
30355d64941L8718J98369J11380r6722j10028R9812K34429J08988j02068j34663
30345a16726J4286J25712O8090o1322j08968o7911k8832L884J03036K20341J74367
30334C25957o8842k63348j89747L1336J23797N1665K15L0640J9354o7096j00436
30323a06505l2683K3785P144j7014k8013p7713j11377n302J67136J69834k1930
$$ plain form
30399 -137384 -123318 -190363 -194935 -91789 -36048 -106042 -153102 -68963 5898 -77215 -200990
30388 -200990 -164005 -12808 36523 -63624 -152907 -127061 -38998 51425 140551 191560 157525
30377 157525 104541 146062 244135 245578 129588 36903 26137 -1125 -83234 -119351 -93607
30366 -93607 -162095 -380418 -539442 -448421 -224917 -111645 -137763 -173435 -209338 -330446 -464941
30355 -464941 -426223 -227854 -116474 -213196 -323224 -223412 11017 120005 17937 -116726
30345 -116726 -102440 23272 91362 30040 -78928 -146839 -175671 -171787 -68751 151590 325957
30334 325957 257115 -6233 -195980 -164644 -40847 10818 11033 41673 61027 -6069 -106505
30323 -106505 -139188 -115403 -108259 -125273 -153286 -230999 -342376 -347678 -180542 -10708 -32638
30312c2638j52622q5060J5823J7270L6345J55560K12921R0579m4664k0892N1650
30301B44272J1441n7434j4131N5516R392p8217p5577m7545q7156q1005O7052J62392
30289A09000j400k45407k37935m512J50150J32280J02889J01232P077j43155j68953
30278a98734p8374m4544n1006P9196K82882K70826J3460j63395q4208L0097k4557
30267C1643j10515m1537Q1339O5573m7065p9575k130P7509R8924P0873N86p7103
30255F8522q4501q120N9993M9958o028n7311r1598q7166l0398J1481k5127n2597
30243b52892N6748K21262K23696M5710j04099j23015j13970j01787M7384L01682
30233B00719L60266P3909k74585l34796j38210M0657R4845J05982R0631l329j12675
$$ plain form
30312 -32638 -185260 -270320 -254497 -237227 -200882 -45322 167599 258178 213514 192622 244272
30301 244272 255713 198279 184148 239664 249056 170839 95262 47717 -39439 -120444 -53392 109000
30289 109000 107600 -137807 -375742 -380254 -230104 -97824 5065 106297 113374 -29781 -198734
30278 -198734 -277108 -321652 -372658 -293462 -10580 260246 273706 110311 26103 56200 31643
30267 31643 -78872 -120409 -39070 26503 -20562 -100137 -102267 -24758 74166 145039 145625 68522
30255 68522 -15979 -24099 35894 85852 79824 22513 -69085 -156251 -186649 -175168 -200295 -252892
30243 -252892 -196144 25118 248814 294524 190425 67410 -46560 -148347 -100963 200719
30233 200719 560985 634894 360309 25513 -112697 -72040 22805 128787 219418 216089 103414
30222A03414j15767n0634o6802j61946j57439K9460K41283K71204J07706p1894
30212A28585j14194m9824k8231j09584j84446j42133l5553K4968O0752J47994
30202c01666K16673J39173q083k0776Q3560P0147j00475j68571o662J51201R9939
30191A54460o301L5557R6887l5229k25820j71543R1230K20073Q3827q5903r0260
30180F6978j1214J2719K963J7620Q194o8886j29083o7685Q5397K00584J87936
30169C05523N9732r3524j65530j24225n0381l8214o7692m1106O1314J39197R9184
30158H4278l1448j34339j13910J4864J33265J32626L1215o0567q7891q7292p0268
30147a89467Q409J20668J38494K6074o8069k7313M5184L943p8977k2562J51132
$$ plain form
30222 103414 -12353 -62987 -129789 -291735 -449174 -419714 -178431 92773 200479 128585
30212 128585 14391 -35433 -63664 -173248 -357694 -499827 -535380 -510412 -449660 -301666
30202 -301666 -84993 54180 46097 25321 108881 179028 78553 -90018 -96680 54521 154460
30191 154460 148159 183716 280603 245374 19554 -151989 -60759 159314 243141 157238 66978
30180 66978 55764 68483 71446 89066 97260 28374 -100709 -168394 -82997 117587 305523
30169 305523 365255 271731 106201 -18024 -68405 -106619 -174311 -215417 -154103 -14906 84278
30158 84278 52830 -81509 -195419 -180555 -47290 85336 116551 55984 -31907 -119199 -189467
30147 -189467 -181058 -60390 78104 104178 36109 8796 53980 57923 -21054 -43616 107516
30136A07516K18558P3128j34773k14776j53069o1728k1786l3225m7786r301Q9263
30125a87979J72837J56968N6824k8342l8717q956J296j9835m6037o2123q2771
30114h6835j14741j03200L0715K42345L20849J26722j61661k22678k7058J18030
30104A22488K7825j03403n2594O5309J6676j46207j83968o5903K1703R595R738
30093b78741O0797P2592L7045M9447R4427M8163p0038q6844K8887R3961J1427
30082F1123q3945p5718l9434m8117j9551Q9207J25689l3535k42653k59866o9630
30071e96430J30674J95372J42400O2684L9135J02090J73606J26786k4619j02175
30061B49523j7494Q0331L3018q9933j38518j29724j50421j33052K6103J99808
$$ plain form
30136 107516 326074 399202 264429 49653 -103416 -165144 -186930 -220155 -267941 -277242 -187979
30125 -187979 -15142 141826 198650 170308 131591 122635 123931 104096 58059 -4064 -86835
30114 -86835 -201576 -304776 -274061 -31716 289133 415855 254194 31516 4458 122488
30104 122488 150313 46910 -5684 59625 76301 -69906 -253874 -319777 -298074 -288479 -278741
30093 -278741 -217944 -145352 -108307 -58860 35567 83730 13692 -73152 -44265 49696 61123
30082 61123 -22822 -98540 -137974 -186091 -205642 -116435 9254 -24281 -266934 -526800 -596430
30071 -596430 -465756 -270384 -127984 -65300 -26165 75925 249531 376317 351698 249523
30061 249523 232029 312360 345378 255445 116927 -12797 -163218 -296270 -270167 -70359
30051g0359J57614n3286j35408J0482J40633O8362n6219l2237N0017j5738j79476
30040a15615j98958k6252J14235O1292p0438r1898n741M1756q657o7095m5535
30029d12906K6488O6842O2922P1793J10936J13151K7609p7215q1118K3286J06606
30018C8394O5217n5357j34324j18579m9526P723J8261l598J443O9751J32112P5825
30006D7342p5547j50332o9388K0497k4324r8089j3709J59715J64387m1084j85831
29995b66363p0021J62102K47125J37972j3874q3917n3613L6674R7620L9973r1500
29984A42178j31731l1121N0301l768o5520K3709J73291J79197M4893n2830n7974
29973B70625o7476r7950n4840M9354O4663n6171j69577j54239n8451K0004N9232
$$ plain form
30051 -70359 87255 33969 -101439 -90957 49676 118038 61819 29582 79599 63861 -115615
30040 -115615 -314573 -340825 -226590 -165298 -235736 -327634 -333375 -291619 -300276 -367371 -412906
30029 -412906 -386418 -319576 -256654 -184861 -73925 39226 66835 -10380 -91498 -68212 38394
30018 38394 103611 48254 -86070 -204649 -254175 -246452 -228191 -231789 -230346 -160595 -28483 47342
30006 47342 -28205 -178537 -247925 -227428 -251752 -349841 -363550 -203835 -39448 -80532 -266363
29995 -266363 -336384 -174282 72843 210815 196941 113024 59411 96085 193705 233678 142178
29984 142178 10447 -20674 29627 25859 -39661 -15952 157339 336536 381429 328599 270625
29973 270625 203149 105199 50359 99713 164376 108205 -61372 -215611 -274062 -254058 -194826
29962a94826O5065K9200j1501Q139O2110M5298n7456j28793q4098K5340J05073
29951a36449J16618O8805M800p271L2394R901j30233k33002j28912P8852J44223
29940a80274N0943m261K3246j4104j10259o4765J25466J86148K3248q7947K9508
29929b3051J41849K4142j30530n5503J08854O7942j00797r9075M8868M8987j19227
29918h7541j57096K2449J36025J2108j35220q5773L6290P847j17963j17420M9542
29907d36752K03083K09809J20879M7713J4165l1491j02600j22308k2905J18255
29897b152J33452m352j13251n1873P4510Q8239J5836J2713Q1449P3647m3880j28641
29885A35697r3214j9130L274m509n47l631k7363l6366j2424J7463L7127M5035
$$ plain form
29962 -194826 -129761 -100561 -112062 -103923 -41813 3485 -53971 -182764 -266862 -241522 -136449
29951 -136449 -19831 48974 53774 46503 78897 88798 -41435 -274437 -403349 -324497 -180274
29940 -180274 -129331 -133592 -110346 -124450 -234709 -299474 -174008 12140 35388 -52559 -23051
29929 -23051 118798 142940 12410 -43093 65761 133703 32906 -66169 -17301 31686 -87541
29918 -87541 -244637 -222188 -86163 -74055 -209275 -295048 -258758 -250911 -368874 -486294 -436752
29907 -436752 -233669 -23860 97019 144732 158897 127406 24806 -97502 -120407 -2152
29897 -2152 131300 126948 13697 -38176 36334 124573 140409 153122 234571 308218 264338 135697
29885 135697 42483 23353 26627 22118 21571 17940 -9423 -45789 -58213 -40750 -3623 41412
29873D1412Q583q8110j64111j23417r135M5373J5322K937N0545P6025K6864l0995
29861a48707k9503J495O902j054K1366O8268P8919K839j26499j87192r5792N3415
29849c55543Q0445j6836m0727Q8568J79297P8091n6043n492J37387J24938l5374
29838A78711j21484p8868n2735o7791N155J45978J58644N523j11446p4876k402
29827a5591m561l6258n4344q6107q9036J4059J25601O9412p8427o9805P1322O2390
29815i1345j03698p7785K24636L83970J34849j72769j40681L9666k5393k24657
29805e3207j62348J15333J88878j0449j05174O0177J75828L0928j34081o1338
29795D4547R9947P3291r7473j60591n7343M7638N4402K3835J1256j2582n0151
$$ plain form
29873 41412 49995 -38115 -202226 -325643 -334778 -289405 -274083 -271146 -220601 -144576 -117712 -148707
29861 -148707 -178210 -176715 -169813 -170867 -149501 -81233 -2314 525 -125974 -313166 -408958 -355543
29849 -355543 -275098 -291934 -332661 -244093 -64796 13295 -42748 -48240 89147 214085 178711
29838 178711 57227 -21641 -74376 -142167 -137012 8966 167610 173133 61687 -13189 -15591
29827 -15591 -20152 -56410 -110754 -196861 -285897 -271838 -146237 -76825 -155252 -225057 -153735 -91345
29815 -91345 -195043 -272828 -48192 335778 470627 297858 157177 196843 171450 -53207
29805 -53207 -215555 -100222 88656 78207 -26967 33210 209038 239966 105885 44547
29795 44547 144494 217785 120312 -40279 -97622 -49984 4418 28253 39509 26927 -23224
29784b3224k4358R4978J87534J00544j29376k62508j32829J21178K16881R2939
29774B41759l6463p864Q9774J09522O2522K2319k5006r2200r8247j9763Q055q8026
29762A66382j48929l6783R2585K4269j32725r6819J20070K15594O1957j33508
29752A32093j72061r4920r984O1434Q8677J3068r1426n3458J15357J85789M8982
29741B23551j19062j38197o7297l9476m1599o370L2651K9788M1752J12118J55984
29730A83843R3431n044l1082r45R475j650l309j5868n0569n3560l061L2048J2788
29717A66497k716P544l1443j22635j31084j7764L8762o7809j38633L1223K65773
29706b285K23846o6988k19396m8173J85965J88321J9369q1486n7900k9223m0376
$$ plain form
29784 -23224 -47582 47396 234930 335474 206098 -56410 -189239 -68061 148820 241759
29774 241759 205296 197432 287206 396728 459250 481569 456563 364363 266116 246353 254408 166382
29762 166382 17453 -19330 73255 97524 -35201 -132020 -11950 203644 265601 132093
29752 132093 -39968 -134888 -144872 -83438 5239 18307 -73119 -126577 -11220 174569 223551
29741 223551 104489 -33708 -101005 -140481 -182080 -188450 -155799 -126011 -84259 27859 183843
29730 183843 277274 272230 241148 240203 249678 248028 244719 228851 178282 124722 121661 153709 166497
29717 166497 163781 171325 139882 17247 -113837 -131601 -92839 -160648 -299281 -268058 -2285
29706 -2285 221561 154573 -64823 -112996 72969 261290 280659 199173 141273 112050 71674
29695G1674j5208O9708J15127L3810j19861j95464j11390M4711J08209L5665m6951
29684i970k9930K9350K4219j9278j1614J4877l7841j22916q8938O0308J45884
29673d5849R0996J4899r547o8494j72921j45671Q4719K80451K06009j4480r4837
29662A25275j4199K6327j6014J607Q0192M4880j16440j81388n5998O4750K9187
29651a1821l5349J2295O4900j2494r9981k0973J20809Q6747r4132j55745j2147
29640a57891J24816Q2952m7308r9915n6532J484K2233p883p1561r2892j1981R5859
29628b18619J06221N2771P4685J39481M2621k31985l82417j82647J74177L23311
29618a02401J91619R810m7237j8103O498K029l8851j16557j70294j32307l5415
$$ plain form
29695 71674 56466 126174 241301 275111 155250 -40214 -151604 -106893 1316 36981 -9970
29684 -9970 -39900 -10550 13669 -5609 -17223 -2346 -40187 -163103 -252041 -191733 -45849
29673 -45849 45147 60046 50499 -17995 -190916 -336587 -251868 28583 234592 220112 125275
29662 125275 111076 137403 121389 122996 203188 248068 131628 -49760 -105758 -41008 -11821
29651 -11821 -47170 -34875 30025 17531 -82450 -103423 17386 104133 10001 -145744 -157891
29640 -157891 -33075 49877 2569 -97346 -153878 -152394 -130161 -138044 -209605 -302497 -314478 -218619
29628 -218619 -112398 -59627 15058 154539 197160 -34825 -417242 -599889 -425712 -102401
29618 -102401 89218 99028 51791 33688 40186 42215 3364 -113193 -283487 -415794 -451209
29607d51209L6247P7136J27140J48076P4364l7297o1688j576K3941j0598n784
29596h1248O0204P2589j8260r7352o9364m38J9673K8813R0297J42831Q3016o3468
29584A67293j68151j59871o9307M5869J33995J41924O0133l9889p5419m1587J2028
29573G018N4356P3096M9886k674k1106K6124P1709L0884q0882j70774j75556r0845
29561b28764N5971J87590J82488K721k03723k32594o2835J19495J48597M9423
29551A8369m0529m3100R864M7183L1620j9434n6499m3281J1496O5250P6820L4368
29539I2127k8969n0730q752K9964r141p9230n9831M4036P5269l5127j36006q3443
$$ plain form
29607 -451209 -414962 -337826 -210686 -62610 11754 -25543 -87231 -88807 -64866 -75464 -81248
29596 -81248 -21044 51545 33285 -64067 -133431 -133869 -114196 -85383 4914 147745 230761 167293
29584 167293 -858 -160729 -230036 -184167 -50172 91752 151885 111996 36577 -5010 7018
29573 7018 61374 134470 184356 181682 160576 186700 258409 289293 208411 37637 -137919 -228764
29561 -228764 -172793 14797 197285 200006 -3717 -236311 -299146 -179651 -31054 18369
29551 18369 -22160 -65260 -55396 -8213 23407 3973 -52526 -95807 -84311 -19061 57759 92127
29539 92127 63158 12428 3676 33640 24499 -54731 -114562 -70526 4743 -30384 -166390 -249833
$$ [...]
##END NTUPLES=NMR SPECTRUM
##END=
