##TITLE=31Pdec_LY-TMF-1.24.R.t
 D2O, 24 sc
 25.2.2020
##JCAMPDX= 6.0         $$ Bruker NMR JCAMP-DX V2.0
##DATA TYPE= NMR SPECTRUM
##DATA CLASS= NTUPLES
##ORIGIN= UXNMR, Bruker Analytische Messtechnik GmbH
##OWNER= root
$$ XWIN-NMR		Version 3.5
$$ Tue Feb 25 14:07:48 2020 Russian Standard Time (UT+4h)  she@DPX200
##.OBSERVE FREQUENCY= 81.013821
##.OBSERVE NUCLEUS= ^31P
##.ACQUISITION MODE= SIMULTANEOUS
##.ACQUISITION SCHEME= undefined
##.AVERAGES= 24
##.DIGITISER RES= 17
##SPECTROMETER/DATA SYSTEM= spect
##.PULSE SEQUENCE= zgpg30
##.SOLVENT NAME= CDCl3
##.SHIFT REFERENCE= (INTERNAL, CDCl3, 0, 182.463)
##AUDIT TRAIL= $$ (NUMBER, WHEN, WHO, WHERE, WHAT)
$$ ##TITLE= Audit trail, XWIN-NMR		Version 3.5
$$ ##JCAMPDX= 5.01
$$ ##ORIGIN= Bruker BioSpin GmbH
$$ ##OWNER= she
$$ F:/spectra/data/she/nmr/P31/1/pdata/1/auditp.txt
$$ ##AUDIT TRAIL=  $$ (NUMBER, WHEN, WHO, WHERE, WHAT)
(   1,<2020-02-25 14:06:28.45 +0400>,<she>,<DPX200>,
      <created by zg, POWCHK disabled, PULCHK disabled
       configuration hash MD5:
       00 E9 B6 7A A2 85 ED C7 34 08 36 98 17 FE 4E 26
       data hash MD5: 32K
       EE BF D2 D2 8F 40 2A 36 5F 89 23 E5 8B 07 EF 44>)
(   2,<2020-02-25 14:06:43.48 +0400>,<she>,<DPX200>,
      <Start of raw data processing
       efp BC_mod = 2 LB = 1 FT_mod = 6 PKNL = 1 PHC0 = -1411.083 PHC1 = 245.6013 SI = 64K 
       data hash MD5: 64K
       05 D9 09 77 F5 F4 AE D7 17 9E B8 CE D0 60 5B 4A>)
(   3,<2020-02-25 14:07:07.29 +0400>,<she>,<DPX200>,
      <pk PHC0 = -105.2679 PHC1 = 219.8 
       data hash MD5: 64K
       40 91 DD AA D4 FF E1 E0 BB 28 C2 20 24 D9 C0 7A>)
(   4,<2020-02-25 14:07:10.70 +0400>,<she>,<DPX200>,
      <abs ABSG = 5 
       data hash MD5: 64K
       F4 74 DC DA D1 07 A5 BA C9 0D 00 E6 22 B5 AF C2>)
$$ ##END=
$$ 
$$ hash MD5
$$ CD 18 33 27 58 0C 4A 76 AF D1 18 F2 FB D7 6B 51
##$RELAX= 
##$RELAX= 
##$RELAX= 
##$RELAX= 
##$RELAX= 
##$RELAX= 
##$RELAX= 
##$RELAX= 
$$ Bruker specific parameters
$$ --------------------------
##$DU= <F:/spectra>
##$EXPNO= 1
##$NAME= <P31>
##$PROCNO= 1
##$TYPE= <nmr>
##$USER= <she>
##$AMP= (0..31)
100 100 100 100 100 100 100 100 100 100 100 100 100 100 100 100 100 100 
100 100 100 100 100 100 100 100 100 100 100 100 100 100 
##$AQSEQ= 0
##$AQ_mod= 1
##$AUNM= <au_zg>
##$AUTOPOS= <>
##$BF1= 81.014009
##$BF2= 200.13
##$BF3= 200.13
##$BF4= 200.13
##$BF5= 200.13
##$BF6= 200.13
##$BF7= 200.13
##$BF8= 200.13
##$BYTORDA= 1
##$CFDGTYP= 0
##$CFRGTYP= 5
##$CHEMSTR= <none>
##$CNST= (0..31)
1 1 145 1 1 1 1 1 1 1 1 1 1 1 1 1 1 1 1 1 1 1 1 1 1 1 1 1 1 1 1 1 
##$CPDPRG= <waltz16>
##$CPDPRG1= <>
##$CPDPRG2= <waltz16>
##$CPDPRG3= <>
##$CPDPRG4= <mlev>
##$CPDPRG5= <mlev>
##$CPDPRG6= <mlev>
##$CPDPRG7= <mlev>
##$CPDPRG8= <mlev>
##$CPDPRGB= <>
##$CPDPRGT= <>
##$D= (0..31)
0 1 0 0 0 0 0 0 0 0 0 0.03 2e-05 3e-06 0 0 0 0 0 0 0 0 0 0 0 0 0 0 0 0 
0 0 
##$DATE= 1582625187
##$DBL= (0..7)
120 120 120 11 120 120 24 19 
##$DBP= (0..7)
150 150 150 150 150 150 150 150 
##$DBP07= 0
##$DBPNAM0= <>
##$DBPNAM1= <>
$$ [...]
##$SUBNAM3= <"">
##$SUBNAM4= <"">
##$SUBNAM5= <"">
##$SUBNAM6= <"">
##$SUBNAM7= <"">
##$SUBNAM8= <"">
##$SUBNAM9= <"">
##$SW= 369.568048894756
##$SWIBOX= (0..15)
0 1 3 0 0 0 0 0 0 0 0 0 0 0 0 0 
##$SW_h= 29940.119760479
##$TD= 32768
##$TD0= 1
##$TE= 0
##$TE2= 300
##$TE3= 300
##$TEG= 300
##$TL= (0..7)
0 120 53 12 22 120 120 120 
##$TP= (0..7)
150 150 150 150 150 150 150 150 
##$TP07= 0
##$TPNAME0= <>
##$TPNAME1= <>
##$TPNAME2= <>
##$TPNAME3= <>
##$TPNAME4= <>
##$TPNAME5= <>
##$TPNAME6= <>
##$TPNAME7= <>
##$TPOAL= (0..7)
0.5 0.5 0.5 0.5 0.5 0.5 0.5 0.5 
##$TPOFFS= (0..7)
0 0 0 0 0 0 0 0 
##$TUNHIN= 0
##$TUNHOUT= 0
##$TUNXOUT= 0
##$USERA1= <user>
##$USERA2= <user>
##$USERA3= <user>
##$USERA4= <user>
##$USERA5= <user>
##$V9= 5
##$VALIST= <valist>
##$VCLIST= <CCCCCCCCCCCCCCC>
##$VD= 0
##$VDLIST= <DDDDDDDDDDDDDDD>
##$VPLIST= <PPPPPPPPPPPPPPP>
##$VTLIST= <TTTTTTTTTTTTTTT>
##$WBST= 1024
##$WBSW= 4
##$XGAIN= (0..3)
0 0 0 0 
##$XL= 0
##$YL= 0
##$YMAX_a= 10025
##$YMIN_a= -9183
##$ZGOPTNS= <>
##$ZL1= 120
##$ZL2= 120
##$ZL3= 120
##$ZL4= 120
##$ABSF1= 182.463
##$ABSF2= -187.1042
##$ABSG= 5
##$ABSL= 3
##$ALPHA= 0
##$AQORDER= 0
##$ASSFAC= 0
##$ASSFACI= 0
##$ASSFACX= 0
##$ASSWID= 0
##$AUNMP= <proc_1d>
##$AZFE= 0.1
##$AZFW= 0.5
##$BCFW= 0
##$BC_mod= 2
##$BYTORDP= 0
##$COROFFS= 0
##$CY= -3
##$DATMOD= 1
##$DC= 0
##$DFILT= <>
##$DTYPP= 0
##$F1P= 0
##$F2P= 0
##$FCOR= 1
##$FTSIZE= 65536
##$FT_mod= 6
##$GAMMA= 0
##$GB= 0
##$INTBC= 1
##$INTSCL= 5.30512e-09
##$ISEN= 30
##$LB= 1
##$LEV0= 0
##$LPBIN= 0
##$MAXI= 10000
##$MC2= 0
##$MEAN= 0
##$ME_mod= 0
##$MI= 50
##$NCOEF= 0
##$NC_proc= -5
##$NLEV= 6
##$NOISF1= 182.463
##$NOISF2= 159.3651
##$NSP= 0
##$NTH_PI= 0
##$NZP= 0
##$OFFSET= 182.463
##$PC= 4
##$PHC0= -1516.351
##$PHC1= 465.4013
##$PH_mod= 1
##$PKNL= yes
##$PPARMOD= 0
##$PSCAL= 0
##$PSIGN= 0
##$REVERSE= no
##$SF= 81.0140089999434
##$SI= 65536
##$SIGF1= 159.3651
##$SIGF2= -187.1042
##$SINO= 113.3802
##$SIOLD= 16384
##$SREGLST= <1H.CDCl3>
##$SSB= 0
##$STSI= 65536
##$STSR= 0
##$SW_p= 29940.119760479
##$SYMM= 0
##$S_DEV= 0
##$TDeff= 32768
##$TDoff= 0
##$TI= <>
##$TILT= no
##$TM1= 0
##$TM2= 0
##$TOPLEV= 0
##$USERP1= <user>
##$USERP2= <user>
##$USERP3= <user>
##$USERP4= <user>
##$USERP5= <user>
##$WDW= 1
##$XDIM= 65536
##$YMAX_p= 481941333
##$YMIN_p= -13379942
$$ End of Bruker specific parameters
$$ ---------------------------------
##NTUPLES= NMR SPECTRUM
##VAR_NAME=  FREQUENCY,     SPECTRUM/REAL,   SPECTRUM/IMAG
##SYMBOL=    X,             R,               I
##VAR_TYPE=  INDEPENDENT,   DEPENDENT,       DEPENDENT
##VAR_FORM=  AFFN,          ASDF,            ASDF
##VAR_DIM=   65536,         65536,           65536
##UNITS=     HZ,            ARBITRARY UNITS, ARBITRARY UNITS
##FACTOR=    0.456856943014862, 1,           1
##FIRST=     14782.0589164792, 0,            0
##LAST=      -15158.0608439998, 0,           0
##MIN=       -15158.0608439998, -13379942,   0
##MAX=       14782.0589164792, 481941333,    0
$$ Real data points
##PAGE= N=1
##DATA TABLE= (X++(R..R)), XYDATA
$$ [...]
36798h75474n4355J27706J65594K41228J61425k85192p55630o76053o7796M52320
36788a566227N37933M88655N92507N71499O2962o49308q65071l54037L96473Q27954
36778D3340Q23249N23134P3550k43843o6797M81399O31366r5223j009422r87060
36768A73693m9402N55330P9610p00203p13468j47011O8889j47412l6512N11608
36758d04878O49079M0604m50540j60550K25235j89573r27549q03668J95057Q83635
36748i43148O78129K62350K54684L11092J7715k86656k30848j62116m21257n38603
36738a058658m5380M36448k8381j082595j366907m53665N68482P25961M21356
36729a883339N38556J040762J177273O69941L322l09260k10036R5190L78938M17718
$$ y = [-875474, -929829, -802123, -636529, -395301, -233876, -519068, -1274698, -1950751, -2018547, -1566227, -1028294, -539639, 52868, 624367, 687329, 38021, -827050, -1181087, -784614, 43340, 866589, 1389723, 1463273, 1219430, 1152633, 1634032, 2265398, 2170175, 1160753, 173693, 124291, 679621, 759231, 59028, -654440, -801451, -732562, -879974, -916486, -404878, 244201, 284805, -165735, -326285, -101050, -290623, -1218172, -2021840, -1826783, -943148, -265019, -2669, 252015, 563107, 580822, 294166, 63318, -98798, -520055, -1058658, -1104038, -667590, -695971, -1778566, -3145473, -3599138, -3030656, -2304695, -1883339, -1344783, -304021, 873252, 1543193, 1546515, 1237255, 1027219, 1122409, 1501347, 1919065]
36719A919065R8574m07312p28098o05846j26260K97514K30140k88824o15853k26109
36709d53009M50984M45415l63149r20068m61306L45425M11008j40427k90598J69578
36699h06147L62162j26479n02901o8897O23093O50396J14459k15702k47857n57033
36689g74906j115811j058180k3666J087121J263635P33238M76349P24041P44275
36680B056096J31689m83239l91379Q7373M6659o93919j331526j156952l69166
36671b104364L51501O46770N76129K49815k40799o65028p54234m41437J43477
36662b238170P69923J073693P46553M5592k43013J97043N94454J16705p65510
36653B97270q29799M7644O62628L58485q481L74670Q08826K26425r32347j273132
$$ y = [1919065, 2017639, 1610327, 882229, 276383, 150123, 447637, 677777, 388953, -226900, -453009, -2025, 443390, 80241, -839827, -1301133, -955708, -544700, -685127, -975725, -806147, -443985, -570464, -1073365, -1142262, -519169, 131227, 245686, 29984, -217873, -774906, -1890717, -2948897, -2972563, -1885442, -621807, 111431, 587780, 1311821, 2056096, 2187785, 1704546, 1313167, 1400540, 1447199, 753280, -578246, -1735198, -2104364, -1752863, -1106093, -529964, -280149, -520948, -1185976, -1940210, -2381647, -2238170, -1468247, -394554, 351999, 397591, 154578, 351621, 946075, 1062780, 297270, -532529, -484885, 177743, 536228, 527747, 902417, 1711243, 1937668, 1005321, -267811]
36643b67811n30920K13177L41371M04066P71821Q52233K34043m28896m44502k01589
36633I42993m33465r64410j056838n91431o1217L06166N92495N91798O0991n05928
36623a118846k57311P24017J300335P28545m04338j016007p84164k20739J11426
36614i37082R8494J6499K01659O33338Q24923M01803k66377m53458r4391J53600
36604E79008k6701j61318J03520L18969l996m90026m35492Q5685L55753R4182
36594D19584k58831l09476j56479j701J51929K64023J56450j56970l71764l04334
36584e67569j38987j11021j80183j76882p6239L4035J17957J86121K21018K04680
36574d87070J58495J15844J18090K22531M11954N24105M03980J05038j98637m52497
$$ y = [-267811, -798731, -585554, -244183, 159883, 931704, 1783937, 2017980, 1589084, 1144582, 942993, 509528, -454882, -1511720, -2103151, -2164368, -1858202, -1265707, -673909, -612918, -1118846, -1376157, -652140, 648195, 1376740, 972402, -43605, -827769, -1048508, -937082, -838588, -822089, -620430, 12908, 837831, 1239634, 973257, 519799, 425408, 579008, 552307, 390989, 494509, 813478, 809482, 319456, -116036, -30351, 325402, 419584, 160753, -148723, -305202, -306903, -154974, 109049, 265499, 108529, -263235, -567569, -706556, -817577, -997760, -1174642, -1250881, -1216846, -1098889, -912768, -691750, -487070, -328575, -212731, -94641, 127890, 539844, 1063949, 1467929, 1572967, 1374330, 921833]
36564I21833o81674p47037m19575K10695O48105N15597M1168j91246M8700L72910
36554G19476K95644j27301l71222j42330K31216K61456l9983k56687k28161k24326
36544A17782l97969m73149k11976J25604J10078k50591n28809m04591M7747N10413
36534a355461O91718N46962L32071K81979K19545j81852o90354o06785J66886
36525e95291P40495M18614k51865k89507K76823N76341K61822j56562k67236k12188
36515E01446j47058j6923N2552j25729k37130J82593P54383N29420n19365j226392
36505b52203q42329j1795L52603L01119L31185M39605M07548L46575K51988k89866
36495A034430j181298j366189k84041R23224Q47578q2701l08501L83192O53173
$$ y = [921833, 240159, -506878, -926453, -715758, -67653, 447944, 489112, 297866, 346566, 719476, 1015120, 887819, 516597, 374267, 605483, 866939, 826956, 570269, 342108, 117782, -280187, -753336, -965312, -839708, -729630, -980221, -1509030, -1913621, -1865874, -1355461, -663743, -116781, 215290, 497269, 716814, 534962, -155392, -762177, -595291, 145204, 563818, 311953, 22446, 299269, 875610, 1137432, 980870, 713634, 501446, 354388, 337465, 390017, 264288, 27158, 209751, 964134, 1493554, 974189, -252203, -1094532, -1106327, -753724, -452605, -121420, 318185, 725733, 1072308, 1324296, 1034430, -146868, -1513057, -1797098, -873874, -26296, -108997, -417498, -34306, 618867]
36486F18867p5435p00006l22089L56638L24041j56508k14672J55581L03010J10588
36476D00015L4080K12226L50577L41893L08666J56188k58185o14071m63977m5193
36466D22219n0268n08920o25642J2923P40862P58413K43975l5980J28214K57384
36456A343180L2504l34180n71377o47646n21692j01555M02020N58047L34968J59711
36446F53980J56096r0268o58733q48849k16202N36427N18898L0239k4234K59143
36436C16497M011o99182p00554K33583P83017J18511p13642m81561K48156J31840
36426g59324p07794r37799j55742O57313P74411N32824L85812K85645K36958M42942
36416G55246O25411J57149p94984j177016n25200L04507L96422O871q6409J47191
$$ y = [618867, 543432, -156574, -478663, -122025, 202016, 45508, -169164, -13583, 289427, 400015, 434095, 646321, 996898, 1338791, 1647457, 1803645, 1545460, 931389, 467412, 422219, 371951, -136969, -762611, -749688, -8826, 749587, 993562, 957582, 1085796, 1343180, 1375684, 1041504, 470127, -177519, -699211, -800766, -398746, 159301, 494269, 653980, 810076, 719808, 61075, -787774, -1003976, -467549, 51349, 81588, 57354, 316497, 320508, -378674, -1079228, -845645, -62628, 55883, -657759, -1139320, -891164, -759324, -1467118, -2404917, -2560659, -1903346, -1128935, -596111, -210299, 75346, 312304, 755246, 1380657, 1537806, 742822, -434194, -959394, -654887, -258465, -251594, -338003, -190812]
36406a90812J09725l58002o92971l67570M35099R51930O03416k95247p50271k81716
36396h36419L96488L88205o4986r6230K54498J77559k80242j14769P69337J029139
36386A622580m2150j221462j168203m01011k01164m68916j80734N99476P85973
36377f75611J73395k38094O4631M16569K54169p2162j45156j36980j87593j1732
36367e58564M03304M95180L1855l74039k02381J28286m5240n65085p18193k77550
36357a682427K95054N40337M46762K80807K85004M75134N57944K08859m24454
36348I83020p45053m29193J34419L61372J75940o6749j28763m8557P5347J40974
36338D52757p843l88930o96017n73698o4304M33282O35227O02537N02927L59409
$$ y = [-190812, -81087, -439089, -1132060, -1499630, -1064531, -112601, 490815, 195568, -554703, -836419, -439931, -51726, -116712, -212942, 41556, 219115, -61127, -175896, 593441, 1622580, 1580430, 358968, -809235, -1210246, -1411410, -1880326, -2061060, -1461584, -675611, -502216, -740310, -675679, -259110, -4941, -77103, -222259, -359239, -546832, -558564, -155260, 339920, 371775, -2264, -204645, -76359, -121599, -686684, -1404877, -1682427, -1387373, -847036, -400274, -119467, 165537, 640671, 1198615, 1407474, 983020, 237967, -191226, -56807, 304565, 480505, 413756, 284993, 236436, 311783, 452757, 444914, 55984, -640033, -1213731, -1278035, -844753, -209526, 393011, 895938, 1255347]
36328A255347J23283j41703k85215k68517k45192l77838n93895o23711l38826
36319a496267L4086J48062n2650k62926j53036K94289P68070R15353O84379L74247
36309A253607K44721J43340k27289p03306p53504l17796l4408k84265n33473j93513
36299a405886L26832K25921l25856l98075J52977L96804j36353o24326k23012
36290b010974O25127Q94087M48972L3177Q6093L12322L18517P0990k63413m72594
36280D2304l28213J57543N63235M83689L9989l22605l83086j88642K02970O21490
36270H88674O65638J73526l77704m51082k33197k58971m51148k66692K76966N54190
36260E20200L99228L56801O02176M84062l57399j167945j046276k06914L96502
$$ y = [1255347, 1378630, 1236927, 951712, 683195, 438003, 60165, -533730, -1157441, -1496267, -1462181, -1314119, -1366769, -1629695, -1782731, -1488442, -720372, 194981, 879360, 1253607, 1498328, 1641668, 1414379, 711073, -42431, -360227, -394635, -678900, -1212373, -1405886, -1079054, -853133, -1178989, -1577064, -1424087, -1027283, -1163636, -1787962, -2010974, -1385847, -491760, -42788, -9611, 76482, 388804, 707321, 778311, 514898, 42304, -285909, -128366, 434869, 918558, 958547, 635942, 252856, 64214, 267184, 888674, 1554312, 1727838, 1350134, 899052, 665855, 406884, -44264, -310956, -33990, 520200, 919428, 1276229, 1878405, 2362467, 2005068, 837123, -209153, -416067, -19565]
36251a9565L17245j44908n88258p35952l37409M48853Q22317K28529p15834r63224
36241a688206n22083k90063m76443k96053N26324J063618N83788k65795m36091
36232a801004K5730K72396j7367m12951n18011k56062L55255J018474J041578
36223b91962J88885o06976k80079P52275J002113J0967r85935q27563N4402M39186
36213e44687l3042o49578o73610p2349O01377P43432L03963m0174L35081J026355
36203I96768R75101n7249j067990j142836n04242J44978N77536Q06685O23448
36194A352199P3599k08833R4525K93918k74356j031344r20769k829P23887Q12368
36184I12365O27077L15246l14970q87156o21099L44608Q55666L43223m03611m82932
$$ y = [-19565, 297680, 152772, -435486, -1171438, -1508847, -1059994, -237677, -9148, -724982, -1688206, -2210289, -2500352, -2976795, -3272848, -2746524, -1682906, -1099118, -1364913, -1801004, -1775274, -1502878, -1520245, -1933196, -2451207, -2707269, -2352014, -1333540, -291962, -103077, -710053, -990132, -237857, 764256, 775223, -210712, -1038275, -983873, -544687, -577729, -1227307, -1900917, -1973266, -1371889, -628457, -324494, -364668, -29587, 996768, 1971869, 1914620, 846630, -296206, -800448, -655470, -77934, 728751, 1352199, 1425798, 1216965, 1311490, 1605408, 1331052, 299708, -621061, -623890, 99997, 912365, 1539442, 1854688, 1539718, 652562, 31463, 376071, 1231737, 1574960, 1171349, 688417]
36174F88417m0937K91815L34341J56253l76888j202135j672795j197250j6451
36165c035630J052427J401886R46164M6573o17759n06320J92570P51468P69481
36156A000860M08820j85934r72229j442831r10242L16172R68599N14842j00705
36147d02648R442L73223J93077k38850k05450P9656n6081m33137l72710r599n3218
36136a116295m30810l53196K95003P39234N79153K72541K06899J79966j6683k64402
36126I1410m82095o34919m24802K49173O72339J50735o31077k97105J071303J795472
36116A560434R73266l20247q00868o77402p36739q53045n06958K5372J36590l0589
36106a230186j7284o4173n99769j088527n67305P70207J603635J196538J89174
$$ y = [688417, 647480, 939295, 1273636, 1429889, 1053001, -149134, -1821929, -3019179, -3035630, -1983203, -581317, 364847, 411420, -206339, -712659, -520089, 231379, 1000860, 1409680, 1223746, 251517, -1191314, -2101556, -1785384, -816785, -301943, -402648, -393206, -19983, 173094, -65756, -271206, -191550, -247631, -680768, -1053478, -1063077, -1116295, -1547105, -1900301, -1605298, -866064, -286911, -14370, 192529, 372495, 355812, 91410, -390685, -1025604, -1450406, -1201233, -528894, -378159, -1009236, -1306341, -235038, 1560434, 2533700, 2213453, 1412585, 735183, -1556, -854601, -1361559, -1336187, -1199597, -1230186, -1247470, -1311643, -1911412, -2999939, -3567244, -2797037, -1193402, 3136, 192310]
36097A92310m61336n40865l56068j30248N0459J17548J05180J16996J48417J57056
36087f00551K11217K90271J29725l59221p33785n43719j1919L04649L14441K85627
36077g13265J80786j98997n64247m27157p16J9973l67205l75357L05075R81603
36067a159507R99383N38337M6180l57251n32423j77668M67535N48307j73631p44450
36057e45188l75113L28945L41622k00717l94028q3225J32549J49118M28165Q41802
36047F23930O26530k60387p85511k83462N79626P94036K93833k55778m19803k37090
36037F75924P4832K02785j21018o69816p65094j44817N66028O52554K40777q475
36027G03680J44942L37338J93415l01860q75902j085555n72443M28155J036363
$$ y = [192310, -269026, -809891, -1165959, -1296207, -1245748, -1128200, -1023020, -906024, -757607, -600551, -389334, -99063, 30662, -328559, -1062344, -1606063, -1617982, -1313333, -998892, -713265, -532479, -731476, -1295723, -1722880, -1723596, -1703623, -2070828, -2446185, -2141110, -1159507, -160124, 378213, 424393, 67142, -465281, -642949, -175414, 372893, 199262, -545188, -920301, -591356, -249734, -450451, -844479, -927704, -795155, -646037, -217872, 623930, 1250460, 990073, 204562, -78900, 500726, 1294762, 1588595, 1332817, 913014, 675924, 750756, 953541, 832523, 162707, -602387, -747204, -181176, 471378, 712155, 703680, 848622, 1185960, 1379375, 1077515, 201613, -883942, -1456385, -1028230, 8133]
36018H133O10448m31979j049625p38139P7433O76155O86626J90496m16265o58521
36008a045238l94108o588N2596j30074m9413M95845J037600Q82443j18106j230640
35998e05683j392708l54119Q45145R92170K38063j63429K68387N75768P444o97604
35988a86566n30323J41258K82506o8634o9162L06453L05831p6728l0214N31374
35978F05795P19268J96967l42048n17549p46528r90867m64307P60122J271323
35969D92176L64549p05356n84049K09392L73065j22757m03986k79115o6533M34106
35959b88508J308334J497983R7024j696367j735086p048J217315O00506o10820
35950C83333p57222l6399L67813K46548K72885O07135O98716K67258l12784n98171
$$ y = [8133, 618581, 186602, -863023, -1601162, -1523729, -847574, -160948, 29548, -386717, -1045238, -1439346, -1445934, -1393338, -1523412, -1572825, -1076980, -39380, 843063, 724957, -505683, -1898391, -2252510, -1407365, -415195, -177132, -340561, -72174, 503594, 511038, -186566, -716889, -575631, -293125, -361759, -430921, -124468, 181363, 104635, 74421, 605795, 1325063, 1522030, 1179982, 662433, -84095, -1074962, -1539269, -779147, 492176, 856725, 151369, -432680, -223288, 149777, 27020, -376966, -656081, -722614, -288508, 1019826, 2517809, 2614833, 918466, -816620, -823668, 393647, 994153, 383333, -373889, -410288, -42475, 204073, 476958, 1084093, 1782809, 2050067, 1737283, 1139112]
35940A139112n70689n07647n83361o41286m03236L8895K07790l3949j44515K35207
35930a263679N45942J74116l81952k10599M45305N33604J6978k4585O84986J023829
35920A543945L21305n32636n82896k13179j24899J7O57107J191571O40389n83491
35910B317233j131559o40594p0446j54840n37375n96480l06300k8417q019k57051
35900a413848n42931m52417J60604Q17097Q82976L68531r6246n8887K95321M61946
35890D22146J64732l73218n84437j35448N81884Q22536M20413o9417k61243l94678
35880E93270o64354p52144m35795m1623J80397M88074R15847Q40362M557p25392
35870D03199n27900P3208J16339j52741J89118R21097Q37472k45420j030725o30231
$$ y = [1139112, 568423, 60776, -522585, -1163871, -1567107, -1528212, -1320422, -1354371, -1498886, -1263679, -717737, -543621, -925573, -1136172, -690867, -157263, -140285, -164870, 520116, 1543945, 1865250, 1332614, 749718, 536539, 411640, 411657, 1068764, 2260335, 2900724, 2317233, 1185674, 545080, 474634, 319794, -217581, -814061, -1120361, -1148778, -1156797, -1413848, -1956779, -2409196, -2248592, -1431495, -548519, -179988, -276234, -335121, -39800, 422146, 586878, 213660, -370777, -506225, 75659, 898195, 1318608, 1249191, 987948, 593270, -71084, -823228, -1259023, -1300646, -1120249, -632175, 283672, 1124034, 1128591, 403199, -124701, -51493, 64846, -87895, 101223, 1022320, 1859792, 1614372, 583647, -46584]
35860d6584K58385N39461J09473m68613q51761q99490m33855L91664R40085P81712
35850C20477K02808k54020l66255j59868K42998M82651J89090l96923n48106n8996
35840c46144M01804K43476k71803n41239m08855q8145K27343L22634N854m38811
35830h93886l37738M06783R28872M98445m10008p44662k78252K42930K18796j21288
35820d90008k09798R5740M02937L06030o5071j28058L55416P65201L73393m89459
35810I16323p26790n9527N06621J87862m34002m40386k5626K8l25630k10619M88054
35799a23692R59320O33615j31637p15565q72009n50737J92761Q44819O76373k65111
35789F48137r61075o56539J76163N73610L55202Q1692L8705m6940l16974m50595
$$ y = [-46584, 211801, 751262, 860735, 392122, -459639, -1359129, -1792984, -1401320, -461235, 320477, 523285, 269265, -96990, -256858, -13860, 468791, 657881, 260958, -287148, -346144, 55660, 299136, 27333, -513906, -922761, -1010906, -783563, -460929, -455075, -893886, -1231624, -824841, 104031, 602476, 192468, -552194, -830446, -587516, -368720, -490008, -699806, -604066, -201129, 104901, 39830, -88228, 267188, 1032389, 1405782, 916323, 189533, 130006, 636627, 824489, 390487, -49899, -75525, -75497, -401127, -611746, -123692, 835628, 1469243, 1337606, 622041, -249968, -800705, -607944, 236875, 913248, 648137, -312938, -969477, -793314, -219704, 135498, 217190, 255895, 208955, -108019, -558614]
35779e58614k08189J55419K78711J77589Q4082N1780J2243M1820K36864M07850
35769F79555K48318j68485l80280j24474L22075N18324L50496J3384k83652m28138
35759G47123m00893l07486k53104j23558K34749N58619L52553k52017l89142L20188
35749D87032R79546N74396m68509p91922l7560P16971N69252r9886m68098l98548
35739A062674k21913l8588J72991J87942j64291n92505o73730m03287j14655m3680
35729h29042j68043k55615O197O00316R15143M20552l83490m35681L17983P12526
35719I00846Q4009p46323q02208l35655o3438J15027N78539Q52088K59621o94939
35709A47567q55032j35830M57685M42414L09529L50749K19979j59349l56073l34742
$$ y = [-558614, -766803, -611384, -332673, -155084, -71002, -19222, -6979, 34841, 271705, 679555, 927873, 759388, 379108, 254634, 576709, 1095033, 1445529, 1458913, 1175261, 747123, 346230, 38744, -214360, -337918, -103169, 455450, 808003, 555986, 166844, 487032, 1466578, 2040974, 1572465, 780543, 742983, 1459954, 2029206, 1929320, 1461222, 1062674, 840761, 802173, 975164, 1163106, 998815, 406310, -267420, -670707, -785362, -829042, -997085, -1252700, -1246503, -646187, 268956, 689508, 306018, -129663, 188320, 900846, 984855, 238532, -563676, -899331, -962769, -847742, -269203, 582885, 842506, 147567, -707465, -843295, -385610, 56804, 366333, 717082, 937061, 777712, 421639, 86897]
35699H6897n26134p46310k20004Q96152J248030K57772p52039l77823Q07187J153500
35689A827228K99173n74702n79205n6091L26807M10843K54783j83017p05163p86848
35679B33808k33056M18701N06746O0107k89732j21882L04991M33032P9109m17133
35669I74691o59880n92793l52533O720L86324M63253M5482m92624n85552k61204
35659a068116n5468j26386m8956L60314O60908N45869L69169M62541M79261J5283
35649A594419n48330n26759n925K70763o767m00495n09024m36509l45574j09329
35639a023530L14281N69815L15387k46751n32424k17167M37769Q73134P48277
35630A238791J79382m38756p48722n96060r9518L03617J43235m27429n15887M28162
$$ y = [86897, -439237, -1185547, -1405551, -509399, 738631, 996403, 244364, -133459, 673728, 1827228, 2126401, 1551699, 972494, 916403, 1243210, 1654053, 1908836, 1725819, 1020656, 233808, 752, 419453, 926199, 986306, 696574, 574692, 879683, 1312715, 1391824, 974691, 314811, -277982, -630515, -623795, -237471, 225782, 271264, -221360, -806912, -1068116, -1123584, -1249970, -1298926, -938612, -277704, 268165, 637334, 1099875, 1579136, 1594419, 1046089, 519330, 513405, 784168, 777401, 376906, -132118, -568627, -914201, -1023530, -709249, -139434, 175953, -70798, -603222, -820389, -382620, 490514, 1238791, 1418173, 979417, 230695, -365365, -464883, -161266, -18031, -445460, -961347, -533185]
35620e33185J581309J556145K75600q55904r07059n34980n96527p11459j96525
35611i22585M31669K06460n28345n27097L44775Q95193M89113j74045m23112m77360
35601f85334n23457j67596N64008P94225J42895m54367j26023N83682O65229K05361
35591I98623p452J52502K14161J02605P8555M2737j83901k74624j6204l6255q26552
35580B44195j519919r65900L14199P66198K45802J08275P24775Q10637j69444
35571E58818q23354j56468O11788P1284q99818n40779Q12962J229131K96114l47124
35561H12554K24351Q55601L66404o25023r09145n26599k78477k07725K30745Q81586
35551H24272R08196J15004o08738m14342M39517R05626L20347q72679j509895
$$ y = [-533185, 1048124, 2604269, 2879869, 2023965, 1116906, 581926, -14601, -726060, -922585, -490916, -284456, -812801, -1339898, -995123, -99930, 389183, 215138, -207974, -685334, -1208791, -1376387, -812379, -18154, 124741, -329626, -455649, 128033, 793262, 998623, 991171, 1143673, 1357834, 1460439, 1538994, 1581731, 1397830, 1123206, 1107002, 1070747, 244195, -1275724, -2241624, -1927425, -1161227, -915425, -807150, -82375, 728262, 558818, -264536, -421004, 190784, 262068, -637750, -1178529, -365567, 863564, 1159678, 812554, 1036905, 1892506, 2258910, 1633887, 724742, 198143, -80334, -288059, -57314, 824272, 1732468, 1847472, 1238734, 824392, 1263909, 2169535, 2489882, 1617203, 107308]
35542A07308q65777N19781J321398Q23953l67744j132481j058241o11770l28820
35533a592393k24446J2328N18539J034583J104558N32513l22689q31001p35658
35524e03666l64862j40556r9145k9812J49457L66562N67075O94069O42903M39602
35514A721627L11259L58401L14649r6459o74676r07210n87653k2334L68732M31649
35504A217985K60640K7289j08697p1090P2459J72251J17711j26316n06943q14813
35494B40476p33284j21167P51683J331932J171705K68872q28364j309359p90280
35485a7786J88892O32717J94930m63897n70664j24407L72543O50323O83271L03755
35475A849677n66147j417309j523106q62451j44936J56796K58945M29536N06802
$$ y = [107308, -758469, -238688, 1082710, 1906663, 1538919, 406438, -651803, -1263573, -1592393, -1816839, -1804511, -1285972, -251389, 853169, 1385682, 1062993, 231992, -503666, -868528, -1009084, -1108229, -1138041, -988584, -622022, -54947, 639122, 1282025, 1721627, 2032886, 2391287, 2705936, 2609477, 1934801, 1027591, 439938, 417604, 786336, 1217985, 1478625, 1505914, 1397217, 1326127, 1398586, 1570837, 1688548, 1562232, 1055289, 240476, -492808, -613975, 137708, 1469640, 2641345, 2910217, 2081853, 772494, -17786, 171106, 803823, 998753, 534856, -35808, -160215, 212328, 862651, 1545922, 1849677, 1283530, -133779, -1656885, -2519336, -2664272, -2507476, -2248531, -1818995, -1312193]
35466a312193L60249K88365M91826N59943N1837o53336p14902n084O61304O02022
35456C30031O8978k66676j91704N5259L18468N41963M39491k29175j003918r82079
35446i19362k3190Q42921O68671j84453o56902m76710k54111k43823M6657Q08993
35436c91309J359190J087941L45190j65592l65488n88642q09697p33031l99875
35427f61313j05778J12928L68859M71193J43799m04264o41613l85095J17008O22395
35417c61881R59654Q61785K93228k12893j35179K45465K46881j57702l81114k37576
35407A120668j36146k26378j55431J56531K51480j04752n48961p43623p56207
35398a142819o23049j96935L50948N56205M17633M18832N84723L64387k36175
$$ y = [-1312193, -951944, -663579, -171753, 388190, 440027, -213309, -928211, -933295, -271991, 330031, 399009, 132333, -59371, -4112, 314356, 856319, 1295810, 1066635, 62717, -919362, -942552, -99631, 569040, 384587, -272315, -749025, -1003136, -1246959, -1200302, -391309, 967881, 2055822, 2401012, 2235420, 1869932, 1281290, 471593, -261438, -661313, -767091, -654163, -285304, 185889, 329688, -74576, -716189, -1101284, -984276, -361881, 597773, 1459558, 1752786, 1539893, 1404714, 1650179, 1897060, 1739358, 1358244, 1120668, 984522, 758144, 602713, 759244, 1010724, 905972, 357011, -386612, -1142819, -1765868, -1962803, -1611855, -1055650, -638017, -219185, 365538, 729925, 493750]
35389D93750l84652J84227N01688j38335r30534p95499r8704N5734k87154j01564
35379a501043P41621J115747L81227o15441p39334K954P03805P17785J80853l21423
35369F66751l26891Q5828L66893J45639k77764l58699o9885J52225J01388m924
35359D80561L1309J80270L73608M97380K83961l34696q49894o66478N2181N40161
35349E88363M26701M9275k43168m95002p13681o27674j63315K87095L89521L23900
35339a77985M13361N57101L60091k63951q65305r03704l84522O4749n3016l52837
35329a606018k5556Q51335J152329L23494n54307j95796R10966J117741K3660
35320A997848j007434r16368k99196j78565m74916m53714L5237N33011P13699
$$ y = [493750, 109098, 293325, 795013, 656678, -273856, -1069355, -1168059, -1112325, -1399479, -1501043, -759422, 356325, 737552, 122111, -617223, -614269, 89536, 807321, 988174, 666751, 339860, 425688, 792581, 938220, 660456, 301757, 231872, 384097, 485485, 480561, 511870, 692140, 1065748, 1563128, 1847089, 1512393, 662499, -3979, 48202, 588363, 1015064, 1064339, 821171, 326169, -387512, -1015186, -1178501, -891406, -501885, -177985, 235376, 792477, 1152568, 888617, 23312, -880392, -1264914, -1200165, -1253181, -1606018, -1631574, -780239, 372090, 695584, 141277, -54519, 856447, 1974188, 1997848, 990414, 74046, -225150, -403715, -878631, -1332345, -1297108, -764097, -50398]
35311e0398N34046M5500m35878m02628J19499L81506o0216o24700n77410j12399
35301a183078J07605M3445J35255L82768L83376J33642M5738K27269L84591L68059
35291A028670K28738j17654o37394p67225l6052R78425J162411L88179l31985
35282A896113l52153j36315j98592k64373o3052j01661q12064j519727j220156
35273b771980q7456P27949P19596N23932O74399P62647K98669k87565k14991M00657
35263G45857O12322k0883p81819p46707L4359O97815O78741K23723j53552k79442
35253A010414k54568j60262r2030k30444n73532p52543m18336K65484P69769P67524
35243C31476L38536k42150o19583m29787L10018R48214Q15645J10515l34693k22484
$$ y = [-50398, 483648, 529148, 93270, -309358, -189859, 191647, 131431, -493269, -1070679, -1183078, -1075473, -1032028, -896773, -514005, -130629, 3013, 48751, 276020, 660611, 1028670, 1257408, 1139754, 502360, -264865, -300917, 677508, 1839919, 2228098, 1896113, 1543960, 1407645, 1209053, 944680, 881628, 779967, -32097, -1551824, -2771980, -2859436, -2131487, -1411891, -887959, -213560, 549087, 847756, 560191, 345200, 745857, 1358179, 1337296, 555477, -191230, -156871, 540944, 1219685, 1443408, 1289856, 1010414, 755846, 595584, 503554, 273110, -300422, -1052965, -1471301, -1205817, -436048, 331476, 670012, 427862, -191721, -621508, -311490, 636724, 1452369, 1562884, 1228191, 1005707]
35233A005707j18664m14968o42278k74800L45122N08915J88962p4680p6885n8120
35223C88311p3675M7309J75624J4855k39342j02219K68413J46588n31833q36616
35213g42585j68186Q03994J071475N59029j03849n30023o58244l92944J28085
35204c3248L20805p3886m16672j26558K66621j5679n32736k58566N44308N38285
35194B12674m74244j050212l19584O94968P62411K16512J8614P7745k44379o66850
35184g72345l74366M80082Q90558M98882p0402l21350l65772k78201J19355O96337
35174E02778R70816P47494K41778l62092q81847q72306j47742O05473N72739M144
35164A381235k47530j76939m78439j034741r05125k4944M71576Q1020k66390J12208
$$ y = [1005707, 887043, 472075, -170203, -445003, -99881, 409034, 597996, 523316, 446431, 388311, 314636, 361945, 537569, 552424, 313082, 210863, 479276, 625864, 94031, -742585, -910771, -106777, 964698, 1523727, 1419878, 889855, 231611, -161333, -33248, 287557, 213671, -203001, -329559, -62938, -78617, -611353, -869919, -325611, 212674, -261570, -1311782, -1631366, -936398, -173987, 42525, 61139, 138884, -105495, -772345, -1146711, -666629, 223929, 722811, 652409, 331059, -34713, -312914, -193559, 502778, 1473594, 2221088, 2462866, 2100774, 1218927, 346621, 198879, 804352, 1377091, 1381235, 1133705, 956766, 478327, -556414, -1461539, -1486483, -1014907, -933887, -1200277, -1088069]
35154a088069M84130J08183l89124j53168L84980L60174J6923J00842L68014O6470
35144B59355n83424p59489n00017m04661k42542N61220J274159N31337j180286
35135a044348j635592p9055J493243J240271J9945l12965K43991L98803M601J9033
35125C47927M64861L40541m26272p17295k44916j63396r93029j450288m03274
35116c245141J181348J539385N86046k69347l43320k89883n45352n39715J44387
35107a781592Q88036R15992L57136j38740l08695k66336l0630L65279N97980M25690
35097A024120J39136J63352L68294K49300k89136p74389p93086m26045l3447J24371
35087b47530M0567o6769K6783K27599J68293k52351o01174m47168N0233M01005
$$ y = [-1088069, -603939, -495756, -884880, -1038048, -653068, -292894, -275971, -175129, 192885, 259355, -324069, -1083558, -1583575, -1988236, -2230778, -1669558, -395399, 135938, -1044348, -2679940, -2758995, -1265752, -25481, -5536, -318501, -74510, 324293, 328894, 347927, 812788, 1153329, 727057, 9762, -235154, -398550, -1391579, -2841867, -3245141, -2063793, -524408, 61638, -207709, -551029, -840912, -1386264, -1925979, -1781592, -893556, 22436, 379572, 240832, -67863, -334199, -364829, 450, 598430, 1024120, 1163256, 1326608, 1694902, 1944202, 1655066, 880677, 87591, -338454, -371901, -247530, -206963, -273732, -246949, -19350, 148943, -103408, -704582, -1151750, -1101517, -700512]
35077g00512M29692L21625K27650K07375L86370P49655R17036N49085j23283n57944
35067B406749n65198l52277j06698M2153j23698n91032q47903m67195K21261N52090
35057A68252L78127j7574m79980p84900l76078P57700J395385M94905r93808j155632
35047f13603J17682R72753M08613m69846n56740l63231n76665n87357K33132J037415
35037c97847P52973r7123k69695K36227N13010M18115M57168M77169k7750o12507
35027A449740l65774M49490O72991J27727j94508P3717J10907n43345j153874
35018F27071j007795m32326o9684K6378Q0421O8702o4463j82532k13139j77809
35008a345176P5558O12462R54296N87558j44786m62996l62662m57426o85554l39429
$$ y = [-700512, -270820, 50805, 278455, 485830, 872200, 1621855, 2538891, 3087976, 2964693, 2406749, 1841551, 1489274, 1382576, 1424729, 1301031, 709999, -137904, -605099, -383838, 168252, 546379, 528805, 48825, -736075, -1112153, -354453, 1040932, 1535837, 542029, -613603, -495921, 476832, 885445, 415599, -141141, -504372, -1081037, -1668394, -1435262, -397847, 355126, 258003, -11692, 224535, 737545, 1155660, 1612828, 2089997, 2062247, 1449740, 1083966, 1533456, 2206447, 2334174, 2139666, 2213383, 2324290, 1780945, 627071, -380724, -813050, -882734, -856356, -775935, -707233, -771696, -954228, -1167367, -1345176, -1269618, -657156, 297140, 884698, 739912, 276916, -85746, -543172, -1228726, -1568155]
34998a568155M92265P79803K17776k05021J37947M78748N5944n23375l16116L68976
34988h1208M88752j30032o76817n52668R8989Q03638J065754N69815l52007q07184
34978D27032m54525p5670l85648q04210l36727O82235Q69029j53876j074960o72376
34968a979696N51652J138029N81853k21870l13749J74787M07929P623n52998o44031
34958h50471k11477L02469N10612L61800O6504n6852J63218M70267L82747j37549
34948A001268n52059n26672l84973l84428j14838P01874J333513R01994j89171
34939A786508p29427m45118j74577l42854m53766k53568j83060l25502q3178N99949
34929f04593Q26290K05787l22970O4040P26498N83929k10565n88368j20374N79410
$$ y = [-1568155, -1075890, -296087, -78311, -283332, -145385, 333363, 389307, -134068, -450184, -81208, 407544, 277512, -399305, -951973, -852984, -49346, 1016408, 1586223, 1234216, 427032, -27493, -103163, -488811, -1293021, -1629748, -947513, -78484, -232360, -1307320, -1979696, -1428044, -290015, 291838, 69968, -243781, -68994, 338935, 346558, -206440, -850471, -1061948, -759479, -248867, 112933, 179437, 122585, 285803, 756070, 1138817, 1001268, 449209, -77463, -462436, -846864, -961702, -259828, 1073685, 1975679, 1786508, 1057081, 611963, 437386, 94532, -359234, -612802, -795862, -1121364, -1204542, -604593, 221697, 427484, 104514, 168554, 895052, 1478981, 1268416, 680048, 559674, 1139084]
34919A139084P39870J36760q04333j221314n58755N89529R50874J86514o70060
34910D88169p03924j90687K22587M17870L49103k40420r49870o96932N81589J365591
34900F43076P18444j86135J2425N99944R3942j129030j400325m15020N24930O43530
34890A05781L54817j2613m99793o61727m6660N95494K15894o00312m08355N23002
34880d34472M98133o11289r40774K30115J173937N36087n96007p17112j84548
34871a045930j1253L8249N15069P64617O9726p12735l95542M59578M28407m22536
34861c12350p86557l09066J48297K09474L38009N58155L55681q2131J9660N23157
34851F62329M21067l50701n81737K35386R43916M87090m87386o96430o3999M58384
$$ y = [1139084, 1878954, 2015714, 1211381, -9933, -568688, 20841, 971715, 1158229, 488169, -215755, -406442, -183855, 234015, 583118, 342698, -607172, -1304104, -722515, 643076, 1361520, 1175385, 1187810, 1787754, 1881696, 752666, -647659, -1062679, -537749, 105781, 460598, 447985, -51808, -713535, -760195, -164701, 51193, -549119, -957474, -434472, 63661, -547628, -1488402, -1258287, -84350, 451737, -144270, -861382, -1045930, -1057183, -1018934, -503865, 260752, 330478, -382257, -777799, -318221, 110186, -312350, -1098907, -1407973, -1259676, -1050202, -712193, -154038, 201643, 119512, 139172, 662329, 1083396, 732695, 150958, 386344, 1330260, 1817350, 1329964, 633534, 569535, 1027919]
34841A027919L65829k668k36281k67712j66336p7057k33867o05303p20848k77939
34831a194263K79726K62715l03926o85438l92411K56222N88622L26998j97379
34822a059134m18410q4049N06111Q45875P87591N80594L56072o0551o61751r89426
34812a97078p00966r9821K85000L77206L93976L15667N9974r0243Q7585J24546
34802E55846m96779j177793p46310O73686J501072Q92364o0527j21312K14272
34793A234519j88426j028997j108573m38248j57498m72514l65796M13144P42903
34784a369486J16498l03339M38509J418304J211322K4333p80265o73873k77135
34775a95132o9491Q2664K52147K54431J08399m167j49792m29872n55969k38947
$$ y = [1027919, 1393748, 1391080, 1154799, 887087, 720751, 643694, 409827, -195476, -916324, -1194263, -914537, -651822, -955748, -1641186, -2033597, -1777375, -1188753, -861755, -1059134, -1477544, -1561593, -1055482, -209607, 577984, 1158578, 1514650, 1454099, 792348, -197078, -898044, -997865, -712865, -335659, 58317, 373984, 433958, 343715, 431300, 555846, 59067, -1118726, -1865036, -1191350, 309722, 1202086, 1141559, 1020247, 1234519, 1046093, 17096, -1091477, -1529725, -1687223, -2159737, -2525533, -2112389, -1369486, -1252988, -1556327, -1117818, 300486, 1511808, 1536141, 755876, 82003, -195132, -264623, -181959, 70188, 324619, 433018, 428851, 279059, -150813, -706782, -945729]
34765i45729K11343K69992k6037k30532j73788J7749K87254N34341M96139K09213
34755F49945J13153K37262j5950o75677p03743L80248J304327P36766o17256j096608
34745C12467o11895l81411n87947k38946P16505J100008N70301J23953J57168
34736A160203j20253p97340p04195M09590R71742J6064j114198q56049J82910
34727h51526M61760L120j3033O15581J010687Q01628L87707p8046o83891r85656
34717F68331m61246L89621N12495j76102p08234m96241M3261L32932L23775K39509
34707F68101K02943J73390p2003o92773j246276r11611K70988J037362N14774
34698e5105m23514l74810N33612R49939L75309l04725l67233j44745j13585j13106
$$ y = [-945729, -734386, -464394, -490431, -720963, -894751, -877002, -589748, -55407, 440732, 649945, 763098, 1000360, 984410, 308733, -395010, -14762, 1289565, 2026331, 1409075, 312467, -299428, -680839, -1268786, -1507732, -791227, 308781, 879082, 1003035, 1160203, 1039950, 242610, -461585, -51995, 919747, 935811, -178387, -1034436, -851526, -389766, -386646, -399679, 215902, 1226589, 2028217, 2415924, 2337878, 1653987, 668331, 207085, 596706, 1109201, 933099, 224865, -271376, -228115, 104817, 428592, 668101, 871044, 1044434, 972431, 279658, -966618, -1878229, -1607241, -569879, -55105, -478619, -853429, -319817, 630122, 1005431, 700706, 333473, 188728, 75143, -37963]
34688c7963P8291J69953j12286m46936l62535M6659K65178P8208j69305o8030
34678e58766K73581L39144m0513l29370m8001L60865J00028o28362p40372N6200
34668a215566O96699L61813l03366k98683K28764M64849K34269r9643m67189q69066
34658a267119q26650n8226P08168O10194l918j20069L47200N54313J42330l48474
34648b62251l89625N1800P65039J254847P99796n56955j502727r84894J93511
34639f31459N01401n2628k32526J78820J87824l36298k45039P68746J326360M38501
34629A903702r43343j357529p33492K3882M58597O93339P92737P53634O79330
34620B270857N06751N5630m25819m61824k44366m08624p43269l13837P47640R58635
$$ y = [-37963, 40328, 210281, 97995, -348941, -711476, -664817, -399639, -321431, -490736, -558766, -285185, 53959, 13446, -315924, -363925, -3060, 96968, -531394, -1271766, -1215566, -518867, -157054, -460420, -759103, -530339, -65490, 168779, 69136, -398053, -1267119, -2093769, -2151995, -1443827, -833633, -837551, -957620, -610420, -56107, 86223, -262251, -651876, -600076, 164963, 1419810, 2219606, 1662651, 159924, -824970, -631459, -130058, -182686, -415212, -236392, -48568, -384866, -629905, 138841, 1465201, 1903702, 960359, -397170, -1130662, -1106780, -648183, 45156, 837893, 1591527, 2270857, 2777608, 2833238, 2407419, 1945595, 1701229, 1292605, 549336, 235499, 983139, 1941774]
34610A941774k48431j310954p04210P69631J197231K79802n75257m49940J43428
34601A043074L69226k633p30605j269834r32959K70430J158993O82072m78282
34592A09482o84824K95788R25646K05093q42299p52180K05976N35348j81478o85076
34582h68524J7138J113593J143251J17716n53282k02315J75020l61834j084671
34573e03908p13516N00377J094063N82670m369R0093L25750O3198l75636m87239
34563E71483m38653m23056p5111O48128Q57553k494r83023q39063J20432N88972
34553B5168L03695K03958O26009P18069l605p00717m70419K74202M49805j52858
34543A273307p10494n62835N2537M81119M17211M6343k98335m19973l15373j41831
$$ y = [1941774, 1693343, 382389, -321821, 447810, 1645041, 1924843, 1349586, 899646, 1043074, 1412300, 1409667, 679062, -590772, -1523731, -1253301, -94308, 587764, 109482, -575342, -279554, 646092, 851185, 8886, -743294, -537318, -1970, -183448, -868524, -851386, 262207, 1405458, 1523174, 969892, 767577, 942597, 580763, -503908, -1217424, -717047, 377016, 959686, 955317, 1045410, 1371160, 1434358, 1058722, 571483, 132830, -290226, -365337, 282791, 1140344, 1137850, 154827, -684236, -563804, 25168, 328863, 532821, 1158830, 1876899, 1873294, 1172577, 702158, 976360, 1426165, 1273307, 562813, -22, 52515, 533634, 950845, 997188, 698853, 278880, -36493, -178324]
34533a78324j19174l06627m48070k18889K97624O08857M46371J34096O3176J06487
34523C85527k5416j39841J20704N05602M48310R4520J86872P58835Q44584p2755
34513C106942j113177j136653k66411L95746K00267n25463j111314j124347m88815
34504b063225M55424J073037R62486L14398m01790q62172q69778l46633L66069
34495a372184O32630L23672R4766M53508R47075P82774n5777q44746j056902p64780
34485h59964k63068K34514N65318O35733M78336J65705j91075l31234p9669K36950
34475E91546R4411l74299m40453O5702L99361J25392j05312L10225P58579L29524
34465A754676o11677q69914k14482L63335K13440j63923j24177J59752J74785
$$ y = [-178324, -297498, -604125, -1052195, -1271084, -973460, -364603, 81768, 215864, 279040, 385527, 360111, 220270, 340974, 846576, 1294886, 1389406, 1576278, 2335113, 3179697, 3106942, 1993765, 857112, 590701, 986447, 1186714, 661251, -450063, -1574410, -2063225, -1607801, -534764, 427722, 742120, 340330, -521842, -1391620, -1738253, -1372184, -739554, -415882, -321116, 132392, 1079467, 1862241, 1806464, 961718, -95184, -859964, -1123032, -888518, -323200, 312533, 790869, 956574, 765499, 434265, 354596, 591546, 685957, 311658, -128795, -63093, 336268, 461660, 356348, 666573, 1425152, 1754676, 1142999, 273085, 58603, 421938, 635378, 471455, 347278, 507030, 681815]
34456F81815r7017l08078l46378l54776l30876j15783K16326K93276l0800k87748
34446f80039P3302P51277P45955k17810j025997o47553K47452K26657o21816p43648
34436a892220L98359J392168J013029q3381o67103o92795o78143m38032K56970
34427a391148O53058Q5262n86601j16238J018619J201232J42734p85120o94920
34418d73122j91058J062Q6700M28281P38021N47248j53843r89330j418840r75980
34408b400861J05589P74803M34785p4920K45262P97749K78758j008098j402097
34399b249030m55234N03286O50675O98923J061640Q57467k46873q96624j22756
34390a98526Q43068M23887p28972q13108J99343O49581m1462o08980j97712L32843
$$ y = [681815, 584798, 276720, -69658, -424434, -755310, -871093, -654767, -361491, -392291, -680039, -606737, 144540, 890495, 672685, -353312, -1000865, -753413, -526756, -1148572, -1892220, -1493861, -101693, 911336, 827955, 160852, -531943, -1210086, -1648118, -1391148, -738090, -652828, -1239429, -1355667, -337048, 864184, 1006918, 221798, -473122, -664180, -663118, -576418, -148137, 589884, 1137132, 983289, -6041, -1424881, -2400861, -2295272, -1520469, -1085684, -1160604, -915342, -117593, 161165, -846933, -2249030, -2704264, -2200978, -1550303, -851380, 210260, 1067727, 820854, -75770, -198526, 644542, 1068429, 339457, -473651, -274308, 375273, 333811, -275169, -472881, -140038]
34380a40038M5261m85122k15971N95036P75007J3175p45608o82339q6303K77291
34370f49611K02954N3645P9757J91399K80800L39843K68258l0285l22064k45640
34360A69056O7572P3642l00879m37376k7473L23262M1680m34218l63881N7812
34350h30803O2660l56957m37963R0594O57450Q33006P98310O80397K57892m04834
34340A349752p76073o33176l90345l61013k99713K3862L83919N60364O98426Q72242
34330A428245Q04578L86228J4227K9103J90027O2271l79417q19762r95396q02929
34320h2825l03324K07387M17350L96815M54591N58620L46774j90508n53780m60590
34310G90510k33528j93754j38555J95610N10274K60076n19643j079500p55714
$$ y = [-140038, -94777, -579899, -795870, -200834, 574173, 587348, -158260, -840599, -926902, -649611, -446657, -393012, -313255, -121856, 158944, 498787, 767045, 736760, 414696, 169056, 236628, 310270, 9391, -427985, -455458, -132196, -90516, -524734, -888615, -830803, -768143, -1125100, -1563063, -1472469, -815019, 17987, 816297, 1496694, 1754586, 1349752, 573679, -59497, -449842, -810855, -1110568, -1086706, -702787, -142423, 556003, 1428245, 2232823, 2619051, 2633278, 2662381, 2852408, 2914679, 2535262, 1715500, 720104, -82825, -386149, -178762, 238588, 635403, 1089994, 1648614, 1995388, 1804880, 1251100, 790510, 556982, 363228, 224673, 420283, 930557, 1190633, 670990, -408510, -1164224]
34301a164224K19120Q55050M87223l67965n94237L8674N35843J47580m64282k10345
34291e17563P47181J188879N31872n28682j076086r27726m52233n0377O8561K7329
34281i88845J88185O00559P89868M79981R5291K3643o4268m69584o86329k73294
34271c04793J59553m6829k71421L41434J087425O21362o58607r87523J3836Q12025
34261G66462M40700k62237l37509J9487L94101Q27937J014560L09775q96609j274582
34251A002085n40961J34064J60031K85679P78586P12378j37702n87412k03039
34242A603709k28897j189238j569856l83719Q78817O53126j07744K37309J159761
34233A053268J150697M39803J67897m5598j177265k268714j517066M88736J277968
$$ y = [-1164224, -945104, -90054, 397169, 29204, -565033, -526359, 9484, 157064, -307218, -517563, 229618, 1418497, 1950369, 1421687, 345601, -582125, -1034358, -1084735, -1016174, -988845, -800660, -200101, 589767, 1069748, 1165039, 1188682, 1124414, 654830, -31499, -304793, -145240, -192069, -463490, -122056, 965369, 1586731, 928124, -59399, -45563, 766462, 1207162, 944925, 607416, 626903, 1021004, 1848941, 2863501, 3173276, 2276667, 1002085, 461124, 595188, 755219, 1040898, 1819484, 2531862, 2394160, 1806748, 1603709, 1374812, 185574, -1384282, -1768001, -889184, -236058, -343802, -106493, 1053268, 2203965, 2643768, 2811665, 2766067, 1588802, -679912, -2196978, -1708242, -430274]
34224d30274K44090o34533j18563O29389L62575l52840m83445j32221J47237L69391
34214c99194O23296N87802K07258k6531N2072j0813l46462m42412j21667Q2971
34204B06320p4622q7451L27254O26763L31584j95911l80597k67126k38082l42547
34194i4415l31840p6748L22579O29005N81596J62216k67131l59769k02654m8439
34184C14400J29229M08998N33436K62109j33008k64284k58960m04095m52542j2735
34174A22548N53883M38150l93127j012681p51582l7213K51819q3512l75097K0235
34164a266577Q17856J041213K94674n77700n80560P2860M74023N30927Q08084
34155A614800J041049L21517j051809j555732p90667j68004m91297o20660L25744
$$ y = [-430274, -186184, -820717, -939280, -309891, 52684, -300156, -783601, -915822, -768585, -399194, 224102, 811904, 1019162, 992631, 1044703, 1033890, 687428, 245016, 123349, 206320, 131698, 44247, 371501, 998264, 1329848, 1133937, 753340, 486214, 248132, -94415, -426255, -503003, -180424, 448581, 1030177, 1192393, 925262, 565493, 362839, 314400, 443629, 852627, 1386063, 1648172, 1515164, 1250880, 991920, 587825, 135283, 122548, 676431, 1114581, 721454, -291227, -1042809, -1080022, -828203, -911715, -1286812, -1266577, -448721, 592492, 887166, 309466, -271094, -198234, 275789, 806716, 1614800, 2655849, 2977366, 1925557, 369825, -420842, -588846, -1080143, -1700803, -1375059]
34146a375059J182503O83577k99188k40011N23784O30114Q5784q2057J79182J71476
34136A460105N8934M21583P11975M830j097081j137121j40394M78783J92074j43355
34126H10333L377K17200K58575L78182M62859J03822n01999p68066o34872l48665
34116a9254J77441Q03239P22173k52660q62807k09949O28581L51469l12164K1429
34106A047498Q24815O49545j97994l33509L6538l89065j308086j162275L4843
34097g97690O87127L50178J11979K96501J24180l47826k41176K00829n8280o63749
34087c37927l34145O15641O53616j67850l38312K33626J41310o58187o52653L38624
34077e06257Q04595L46471J59187M65904K22017l78527K9482J117311J027072
$$ y = [-1375059, -192556, 491021, 191833, -48178, 475606, 1105720, 1191504, 1109447, 1288629, 1460105, 1519039, 1940622, 2652597, 2657427, 1560346, 423225, 282831, 761614, 953688, 810333, 813710, 1030910, 1289485, 1667667, 2130526, 2234348, 1732349, 964283, 329411, -19254, 158187, 961426, 1683599, 1430939, 568132, 358183, 986764, 1338233, 1026069, 1047498, 1872313, 2521858, 2323864, 1990355, 2026893, 1637828, 329742, -832533, -797690, -110563, 239615, 351594, 648095, 772275, 424449, 183273, 384102, 325822, -337927, -672072, -56431, 597185, 429335, 91023, 324649, 465959, -192228, -844881, -506257, 298338, 644809, 803996, 1269900, 1491917, 1113390, 1142872, 2260183, 3287255]
34068C287255k57783p67952j37901j03841r61063r61711J15187L75750m01265
34059A86676j44010J312325J366407n84322j556759l4244J346676M38639q71649
34050A459739m18577M55425j36061r69211k00276J090868R75738R6528P8915M86444
34040B919532R7427n57097m34588p9941k75252l33958K69243M64443l42457q20964
34030I06388j37007M19880k633j16305P95810J156632J15046n23727L95325J023492
34020D032901j22164j328111q22621R7612k00719o25756J50667Q72398K26126
34011B280333m82106K1855L97245m68304r47279J39577R08070j1528n33918R88024
34001B291969K257499R63736j040126j180895n53107j053083j395037K58J319282
$$ y = [3287255, 3029472, 2261520, 2123619, 2019778, 1058715, 97004, 212191, 587941, 186676, 42666, 1354991, 2721398, 2137076, 580317, 546073, 1892749, 2331388, 1459739, 1041162, 1496587, 1360526, 391315, 191039, 1281907, 2257645, 2354173, 2433088, 2919532, 3016959, 2459862, 2025274, 1945333, 1670081, 1336123, 1605366, 2069809, 1727352, 906388, 769381, 1189261, 1186628, 1070323, 1866133, 3022765, 3137811, 2614084, 3009409, 4032901, 3910737, 2582626, 1760005, 1857617, 1656898, 1031142, 1181809, 2054207, 2280333, 1798227, 1820082, 2217327, 1749023, 801744, 941321, 1849391, 1837863, 1303945, 2291969, 4549468, 5513204, 4473078, 3292183, 2739076, 1685993, 290956, 291214, 1610496]
33992A610496O30600k91326N79103J533480O19180m10872K57464P15743n75429
33983D668439j130542N96966J256431j356257l291546j140026J481052M52338
33975A536855j225867N65299K852233J292686j105604L74679K775556R64959k225763
33966E805033j189272J661514O36065k075716q78333J906678O58754j954794j44946
33957D424983K816768O50549k572972M97052N182745K596121k463481M48458O664920
33948A8245143M368193j562211K529512J1525401R639448K906692J0430734K4367703
33940H2450615K0448830J3759486N0914567J23066391J41826396M9475048q6195972
33933C95745361j45421362j02440220l7969109j7528028k3721328j7658389l943118
$$ y = [1610496, 2241096, 1949770, 2528873, 4062353, 4681533, 4270661, 4528125, 5243868, 4668439, 3537897, 4134863, 5391294, 4035037, 743491, -396535, 1084517, 1536855, 310988, 876287, 3728520, 5021206, 3915602, 4290281, 7065837, 8030796, 5805033, 4615761, 6277275, 6913340, 4837624, 3959291, 5865969, 6524723, 4569929, 4424983, 7241751, 7892300, 5319328, 5816380, 10999125, 13595246, 11131765, 11580223, 18245143, 22613336, 21051125, 23580637, 35106038, 44745486, 47652178, 58082912, 82450615, 102899445, 116658931, 167573498, 290639889, 432466285, 481941333, 395745361, 250323999, 147883779, 109914670, 92386642, 68665314, 51006925, 47063807]
33926D7063807m422929j2266651q858129N46435J1147o516143n105603J446102
33918A1898036R93599m366626l761733J440565J562551k644337k720298R34047
33910C335804J050868j895249j489080J483786R38000k200694j827580J486322
33902H82177J832661p88982j166698Q58726P84017j318066j299926N46430K59642
33893E89981j645887j152740J211036J307165o07703n48347J383909J347268p56112
33884A128570j328645n1650N1517j036977n74824R27230M80378j166955n87364
33875b158720J592408J559491n12039q04735Q22045O39638j589842j863738O30661
33866a684831J877521J54456j302565m22183N28714j96996q53559q6639O58113
$$ y = [47063807, 42640878, 30374227, 21516098, 22062533, 22073680, 15557537, 10451934, 11898036, 12891635, 8525009, 4763276, 6203841, 7766392, 5122055, 2401757, 3335804, 4386672, 2491423, 1002343, 2486129, 3424129, 1223435, -604145, 882177, 2714838, 1925856, 759158, 1617884, 2401901, 1083835, -216091, 330339, 589981, -1055906, -2208646, -997610, 309555, -298148, -846495, 537414, 1884682, 1128570, -200075, -251725, -200208, -1237185, -1812009, -884779, -404401, -1571356, -2158720, -566312, 993179, 481140, -323595, 498450, 1138088, -451754, -2315492, -1684831, 192690, 347146, -955419, -1377602, -848888, -1045884, -1899443, -1986082, -1327969]
33857a327969M19932L90865Q16479J25355j545909j798884j67083Q83470K64264
33848a939480j66265N63711Q88729P1510m13014m6221k92064j314358j173409
33839c820861N21809J576969R67144K68270L18630m6834q79311m36287J109415
33830d21056J076796j020846j965908r106K046277J304517q65588j515447m73069
33821a843430N48419R54449R86932L48306p69308j003555K5996O42682k02073
33812c11582j081977n81785L39592K68748k30055O340N63528N19534K66916N15820
33802B75079P61552L58928p5844J81541N54852K59368l08539m68529m14376m35077
33792F88955k05324K02261k4579q25278q42905L51433J236375P24877r2147L7893
$$ y = [-1327969, -908037, -517172, 299307, 424662, -1121247, -2920131, -3087214, -2203744, -1939480, -2105745, -1542034, -653305, -581795, -994809, -1041030, -1333094, -2647452, -3820861, -3299052, -1722083, -754939, -486669, -168039, -214873, -1094184, -1530471, -421056, 655740, -365106, -2331014, -2340120, -293843, 1010674, 145086, -1370361, -1843430, -1295011, -340562, 646370, 994676, 225368, -778187, -752191, -109509, -311582, -1393559, -1975344, -1635752, -1367004, -1597059, -1590719, -1027191, -507657, -240741, 275079, 1036631, 1395559, 1319715, 1501256, 2056108, 2315476, 2006937, 1538408, 1124032, 688955, 483631, 685892, 661313, -163965, -1006870, -655437, 580938, 1305815, 1213668, 1251561]
33782A251561L91182k30301j250519j331218n81874r1830p0692L1635K16510J10691
33772a554855p4881J09642N08016P01173O50592L87978j91945p13514m47919M11263
33762b14450O87177j1520o68788n97150m38180p07346p75018j97228L27975L12736
33752b281792M21832J025010J186291K77309o83097n55136J98091N17895L81524
33743D87927K54393P026m50324n23968m0311J50237k50502j63405Q57321J298868
33733A627262K4924j464110j116818M06551P80254l56378j110692m71374M38291
33724a242090M73299k744k01814j16317o6646m1316M1709R6780J36795K34195
33714f88149J90959j96376o05841n03181N9947M67996L20408j85288n41637l49897
$$ y = [1251561, 1642743, 1412442, 161923, -1169295, -1751169, -1842999, -1913691, -1882056, -1665546, -1554855, -1629736, -1520094, -1012078, -310905, 339687, 727665, 535720, -177794, -625713, -214450, 472727, 461207, -207581, -804731, -1242911, -1950257, -2725275, -2922503, -2594528, -2281792, -1859960, -834950, 351341, 628650, -54447, -609583, -411492, 106403, 487927, 742320, 749346, 299022, -224946, -265257, -115020, -365522, -528927, 328394, 1627262, 1652186, 188076, -928742, -522191, 258063, -98315, -1209007, -1680381, -1242090, -768791, -771535, -973349, -1089666, -1156312, -1197628, -1155919, -1059139, -922344, -688149, -497190, -693566, -1299407, -1802588, -1742641, -1274645, -954237, -1139525, -1681162, -2031059]
33704b031059L31721Q94651P72215K00863j11228q2375k74487p41743q27854l63554
33694b232850k4397j01388J1863N97966R66036O37331J47180K7663J4950j08477
33684f4123K3898M05592L33542k54301l83210K27479M26770m06114j113088o60959
33674a464514J37122J90382J8385M46971P30800j07065j112153o67621P75727
33665a051966J324126N68565j28782o1685N6183k08178l05322P1689M96777P07692
33655A469099P73686M22860n30788j240804p18257M18731N77792l99399j015128
33646b42208n02555J43291k581l82740j32995M59935N60273J15232k26218j47859
33636c58425n975k40725p62215r78077m84398L16696O47172M31394L12131M35545
$$ y = [-2031059, -1699338, -804687, -32472, 168391, 57163, -25212, -299699, -1041442, -1869296, -2232850, -2257247, -2358635, -2346772, -1748806, -782770, -145439, 1741, 29404, 44354, -64123, -40225, 365367, 698909, 444608, 61398, 288877, 715647, 309533, -803555, -1464514, -1327392, -1137010, -1118625, -671654, 59146, -47919, -1160072, -1827693, -1051966, 272160, 840725, 711943, 650258, 706441, 498263, 192941, 264630, 761407, 1469099, 2242785, 2665645, 2134857, 894053, 175796, 594527, 1172319, 772920, -242208, -744763, -601472, -604053, -986793, -1119788, -659853, -99580, 15652, -210566, -358425, -364400, -605125, -1367340, -2345417, -2829815, -2513119, -1865947, -1434553, -1122422, -686877]
33626f86877J60347n71240o95538K92199J195265P97728k50123n50700j26377
33617d35316L9661o8362K69017P86715N14894l86900p51480l34563l5283j61888
33607e63505o7085L54820L80942q1788k61747n6669k97557j050545j144096l0112
33597b817342J191902J346280O85148J18940p9842r4284P2604L38559K91199k04718
33587H48446o55995o22799k79733q764R0031Q8154Q7498K55890N49896N19226
33577H71850n7473n98796m93925j10665j38870l10199R1703P43593O47129j26101
33567E18246m64190m7702K61222L2256j54228k4957j04129n04462n83819k23161
33557a294924r7012k51514J35746J046561J217457K00542o78860l87488K08502
$$ y = [-686877, -526530, -1097770, -1793308, -1501109, -305844, 491884, 241761, -308939, -435316, -395655, -464017, -195000, 591715, 1106609, 719709, -31771, -366334, -401617, -563505, -630590, -275770, 105172, 23384, -238363, -295032, -592589, -1643134, -2787230, -2817342, -1625440, -279160, 405988, 524928, 445086, 350802, 423406, 761965, 1053164, 848446, 192451, -430348, -710081, -718845, -628814, -540660, -453162, -197272, 352624, 871850, 814377, 215581, -278344, -389009, -527879, -838078, -746375, -2782, 644347, 518246, 54056, 6354, 267576, 299832, 145604, 120647, 16518, -487944, -1071763, -1294924, -1391936, -1643450, -1507704, -461143, 756314, 956856, 277996, -109492, 99010]
33548I9010l9398o05014l12384O53297J171342R48005N37710J01094o05623j291720
33538F56319j299522o24645M9872K46785M2338k58349l16707M8678M78904L42717
33528f33610k61203m24676J91334O77414K23673o19296q41148m58815j75576j00125
33518b422028J80896N97047O50628L27809J10676J58380J85021P6946rm0346j85382
33507c60362l35359k58861o073K09040M15881P63671J093461J007015L33115o58681
33497B202847j384510j256300k40261P97083Q20006p9127o78856k26350N97861
33488E52393P67712L28664O1459J95942K42568p7564m27112m13063j03289J03395
33478A231105p9188n08709p09526m36007q1394j92667o34918p25063k20073L78592
$$ y = [99010, 59612, -545402, -857786, -204489, 966853, 1914858, 2452568, 2553662, 1948039, 656319, -643203, -1267848, -1217976, -971191, -928853, -1187202, -1503909, -1455231, -976327, -633610, -894813, -1319489, -1128155, -450741, -227068, -846364, -1687512, -2146327, -2321903, -2422028, -2241132, -1644085, -993457, -665648, -554972, -396592, -211571, -134625, -134634, -174980, -360362, -695721, -954582, -960655, -751615, -335734, 427937, 1521398, 2528413, 2861528, 2202847, 818337, -437963, -678224, 118859, 938865, 859738, 180882, -45468, 552393, 1320105, 1648769, 1710228, 1906170, 2148738, 2071174, 1644062, 1230999, 1127710, 1231105, 1151917, 643208, -66318, -502325, -583719, -776386, -1411304, -2136367, -2356440, -1977848]
33468a977848N92567M72208K30124m2292j70252J3577K94133L67105M35693P80120
33458I95135R15497K25587o74157n52468L62986N09949m15967p67698L12750J247421
33448B159035M68560j026041j285931m05088L2546k73857j94605N06316P16653
33439F97588J1267o00153m05280l7424j94908m53111p3578P58170J171509P01983
33429A576063k55905q61304n69845L10127Q60180N84077m8038l90430n00990o87764
33419A6171o83161j10103N46977M10824m09086q22721k60459O20060R28088N74075
33409H10665N2803k74022l70435l24978k07836k6017K07672L15711O4618m22838
33399a74657o43093l18532K51611O39240P41068O17280L29532J21539K09479K19134
$$ y = [-1977848, -1385281, -913073, -682949, -725241, -895493, -881916, -587783, -220678, 215015, 995135, 1910632, 2136219, 1462062, 909594, 1272580, 1782529, 1366562, 598864, 911614, 2159035, 2627595, 1601554, 315623, -89465, -56919, -330776, -525381, -19065, 697588, 708855, 108702, -296578, -334002, -528910, -982021, -1055599, -297429, 874080, 1576063, 1320158, 458854, -110991, 199136, 1059316, 1643393, 1595355, 1204925, 703935, 16171, -666990, -777093, -230116, 180708, -228378, -1051099, -1311558, -691498, 236590, 810665, 863468, 589446, 219011, -105967, -313803, -339820, -132148, 183563, 248181, -174657, -817750, -1136282, -884671, -245431, 495637, 1112917, 1442449, 1563988, 1773467, 1992601]
33389A992601m35000j364774j358263j90086P75397N29070j04990O3682O72943
33380E80580O53688J52543Q0684L01953p9888q61510q18442K48554J012084M99884
33370A770130o91533j409714j204311l00185Q00227J418339J147265L89147j42195
33361A777170l77615o60962q08557l54591M01354O32642K48728r0094j79281l98817
33351A89977o33521k75681N15002P52417J54993l68939j61974K94030L81883K59763
33341A107950K30820O7373m38955r23640r66198o35739j83563K72192N44337M70274
33331d55149L57961O45870J002592N95136n40723j290642r67076j97154J04336
33322g44849j02662k99059k40361k4537J88046K07114l2417k44933j71023o9832
$$ y = [1992601, 1557601, 192827, -1165436, -1355522, -580125, -51055, -156045, -92363, 580580, 1234268, 1386811, 1467495, 1769448, 1689560, 828050, 9608, 258162, 1270246, 1770130, 1078597, -331117, -1535428, -1835613, -1035386, 382953, 1530218, 1919365, 1777170, 1399555, 738593, -69964, -424555, -23201, 609441, 858169, 768075, 588794, 189977, -443544, -719225, -204223, 548194, 703187, 334248, 172274, 466304, 848187, 1107950, 1338770, 1406143, 967188, 43548, -922650, -1558389, -1741952, -1469760, -925423, -455149, -97188, 548682, 1551274, 2146410, 1605687, 315045, -652031, -849185, -744849, -847511, -1146570, -1386931, -1411468, -1223422, -1016308, -1048725, -1293658, -1464681, -1534513]
33312a534513k14385j57997N71950J287137Q69316l55397q58340j94580M23554
33303a63255K08903r8380J48061L27160o0393k48076L70464R00159L91677l84300
33293A392020j43763O46860L73582j130972k160405j467976J77012J131349P60786
33284d21507k06324p22334m69640J7292J55252O0983J96034M53183K88306k13216
33274h61971k87965K27159N12830J12367l06376j57794N4226k41952n39190j31370
33264a620036N74062P13097L85697L03219M41425K15551k47560j99135L81687
33255I48007O10119N6367o05562o16365j38709J05041j99989o54389o55990r0799
33245a242269N11011O13252L62008K82336L99329K88305o729L2660L08114M6540
$$ y = [-1534513, -1748898, -1906895, -1334945, -47808, 821508, 466111, -392229, -586809, -163255, 45648, -52732, 95329, 422489, 362096, 114020, 484484, 1384643, 1776320, 1392020, 1248257, 1895117, 2268699, 1137727, -1022678, -2490654, -2313642, -1182293, -421507, -627831, -1350165, -1819805, -1802513, -1647261, -1586278, -1390244, -937061, -648755, -861971, -1149936, -922777, -409947, -297580, -603956, -761750, -707524, -949476, -1488666, -1620036, -1045974, -332877, 52820, 356039, 797464, 1013015, 765455, 566320, 948007, 1558126, 1614493, 1008931, 392566, 253857, 358898, 158909, -495480, -1151470, -1242269, -731258, -118006, 244002, 526338, 925667, 1213972, 1207243, 1239903, 1548017, 1594557]
33235A594557p35787q62381J46013R67391L37135r25433j096604q1813P11229
33226E4307O39576M14614M91545L76851j72869n34437k85946P7516p08l18140
33216G42309m14852k90955j73880k6399K88740O26786O63578K67087l48694p46441
33206E87279n82760M0375O04311O69925K36879l94278q28660o68372R4502P14398
33196D73599L88759n18950p68754l8402N76015L61218J17350N84824Q90511p1042
33186A995128j529016j722970n12278M94178L58062j31131m0315L72030L83761
33177c32551n2434l95720k24283L69414P60654L11060p02296j098773l26828N91926
33167a099831M85990k32703l61540J51400M17414L32732N47440R00641N15713
$$ y = [1594557, 858770, -3611, 142402, 1109793, 1446928, 521495, -575109, -656922, 54307, 693883, 1108497, 1600042, 1976893, 1804024, 1269587, 983641, 1061157, 1060449, 742309, 327457, 36502, -137378, -163777, 124963, 751749, 1415327, 1682414, 1333720, 587279, 4519, 44894, 649205, 1319130, 1556009, 1161731, 333071, -335301, -240799, 473599, 862358, 343408, -425346, -463748, 112267, 473485, 590835, 1175659, 2066170, 1995128, 466112, -1256858, -1769136, -1274958, -916896, -1048027, -1088342, -716312, -332551, -384985, -780705, -1004988, -635574, 125080, 436140, -266156, -1364929, -1691757, -1099831, -613841, -846544, -1208084, -1056684, -639270, -306538, 240902, 1141543, 1657256]
33158A657256m69557q32395j58674O26960Q49830P68676M66984l62475j193128
33149A353477q97592K76085O59692k32727q39314k07792L36276m68625j503133
33140a523653j062872L18341Q09655J87790k04336P9991J50085l04114m96975
33131b046088j71812j13952n81268o15422M08253J615562J774459Q62403j89975
33122I42160p61309q71768o24279j3864P31102J096761P53310n2337o71547o54634
33112a26405j85193J56664R1890o0287R4016M02130L56368j40627n16965j97446
33102a25855O20684J098616P25685m8536l92393j64016K9700j42796k74938p3669
33092A252482M827m21132p84951l82685L51501M03795k03053m82474j50909o033
$$ y = [1657256, 1187699, 355304, 196630, 823590, 1673420, 2442096, 2909080, 2546605, 1353477, 455885, 731970, 1391662, 1158935, 319621, 111829, 448105, -20520, -1523653, -2586525, -2268184, -1458529, -1270739, -1475075, -1395084, -1244999, -1549113, -2046088, -2217900, -2331852, -2913120, -3528542, -3120289, -1504727, 269732, 1132135, 942160, 180851, -690917, -1315196, -1329060, -597958, 498803, 1252113, 1199776, 528229, -126405, -311598, -154934, -63044, -123331, -29315, 372815, 729183, 588556, 71591, -125855, 494829, 1593445, 2319130, 2270594, 1878201, 1714185, 1743885, 1601089, 1326151, 1252482, 1257309, 836177, 51226, -331459, 20042, 423837, 220784, -261690, -412599, -418632]
33082d18632m12786o31685j52873M00261L75397J52620L17788N73275L48205j13258
33072D38312j61093J89060M04281L28354J95150K9045k75765n01361l69387p3850
33062B02746J4760k6135J01177K72219J25979k35166l29982p2561O6955k17458
33052i7466n74404m21828K72536Q01613M45994n58696j074403m20609O24310P89707
33042b13246M1142n23133m16392k88693m92495l59643M68434J097856O77807k13122
33032b21485m75263j25885P756k58197l75394j32247J60711L74435N94414O15908
33022A64753K18293k01631o8317L98393M21638j54748o53204n62059j18667J68885
33012c86664O9393l28303o86280n61790J26382Q38684R59526M97412j7848j37093
$$ y = [-418632, -831418, -1463103, -1615976, -1215715, -840318, -687698, -369910, 203365, 551570, 438312, 277219, 466279, 870560, 1198914, 1394064, 1423109, 1147344, 645983, 276596, 202746, 217506, 191371, 292548, 564767, 690746, 455580, 125598, 53037, 119992, -97466, -671870, -1093698, -821162, -19549, 426445, -132251, -1206654, -1627263, -1002953, -213246, -172104, -695237, -1111629, -1400322, -1892817, -2252460, -1784026, -686170, -8363, -221485, -696748, -822633, -814877, -1073074, -1448468, -1580715, -1420004, -1045569, -451155, 164753, 383046, 181415, 113098, 511491, 933129, 778381, 125177, -436882, -555549, -386664, -317271, -645574, -1331854, -1893644, -1767262, -928578, 30948, 528360, 510512, 373419]
33002C73419K19147P49300Q52730J84859o70343p32023r8115o883r21387j592559
32992a641855r06551L22865O18619J09375P9571P32622R83107L91780j79331p4004
32982D36198K16282j9252p44239j422909j548997q52867L57984J149668R63853
32973a464279M63089N72397J007453P91404m6979n23489l27067j04873j05421
32964B62235J31616N71720M98770j58861n42297k55056J06566J29675J14459J17408
32954I76235k74286q25713o28852L16902Q35507M43211P4908K71114J85887o37808
32944G37105j063367k51260O23153J39295r78808j008430L1152O44011L78640
32935g48509J79616L70391J78470m87083n34272M28090J159763O03360m63392
$$ y = [373419, 592566, 1341866, 2194596, 2379455, 1709112, 977089, 878974, 872091, -49296, -1641855, -2548406, -2225541, -1606922, -1497547, -1417976, -685354, 297753, 689533, 510202, 436198, 652480, 633228, -111011, -1533920, -3082917, -3935784, -3577800, -2428132, -1464279, -1001190, -428793, 578660, 1370064, 1323085, 799596, 472529, 367656, 262235, 393851, 965571, 1464341, 1305480, 763183, 508127, 614693, 744368, 858827, 976235, 701949, -123764, -752616, -435714, 399793, 843004, 917912, 1189026, 1374913, 737105, -326262, -577522, 45631, 184926, -793882, -1802312, -1771160, -1127149, -748509, -568893, -198502, -20032, -507115, -1041387, -613297, 546466, 1149826, 686434]
32926F86434n87130K61621P98783L47739l27106k69925K86276L17795m41867j017639
32916E4981n60237L37122M26487l20681o39390O6274P99219N70816j32589l79852
32906B22150l48776o34639p47362J62237J432758J448520J60187o15040J10870
32897A190905J060945P89509j67464m43758r0454j80527p56444p69991J5091N52420
32887A200232K41122j87932r4297p6314p81365j451894q83550N82294J317922
32878a33782O81352j73776j17263M01858L07971l99276q04287m95563P6057M71260
32868a85449O64623O00233J17828n31078p22895k53344L55311N25554K51836o5863
32858G56756j09020J05951K12917j97991r76534j324957p52619J32081L89306
$$ y = [686434, 99304, 360925, 1159708, 1507447, 1180341, 910416, 1196692, 1514487, 1072620, 54981, -505256, -168134, 258353, -62328, -701718, -635444, 163775, 734591, 602002, 222150, -126626, -761265, -1508627, -1346390, 86368, 1534888, 1695075, 1080035, 1190905, 2251850, 3041359, 2873895, 2430137, 2339683, 2159156, 1402712, 632721, 647812, 1200232, 1441354, 1253422, 1159125, 1082811, 301446, -1150448, -2033998, -1451704, -133782, 547570, 373794, 256531, 658389, 966360, 567084, -237203, -732766, -656709, -185449, 479174, 1079407, 1197235, 666157, -56738, -310082, 45229, 570783, 822619, 756756, 647736, 753687, 966604, 768613, -207921, -1532878, -2285497, -2153416, -1764110]
32849a764110P7865K9809M17292N04562m2428n56052m17227J11225M92973O26255
32839e19836N47549J41519m16495n88024k59515M4552Q7264K74823O64161N45368
32829E21366l11292q81857k65720Q64808J173352M81568l04922o53256p53719
32820a29672p08218m03783q1269j11561k51188O5136P36346J066957P88149K83176
32810A254073j45818m92817n69734r7836O39661R27555N26676j02736n07528o09694
32800H21802m14789m454J84329k24844p78440n60982M80805J267577R52545j8227
32790A705322o06334n12482l36398n81568r27359o52014L16461J044580O09898
32781F0106o16382j261543o83228K46039M65153J22123m737J65972J72262M8168
$$ y = [-1764110, -1686245, -1656436, -1239144, -734582, -777010, -1333062, -1750289, -1639064, -1146091, -519836, 27713, 169232, -247263, -835287, -1094802, -1050250, -962986, -688163, -24002, 521366, 210074, -671783, -937503, -72695, 1100657, 1582225, 1277303, 624047, -129672, -837890, -1241673, -1322942, -1434503, -1685691, -1620555, -884209, 182748, 970897, 1254073, 1108255, 615438, 45704, -52132, 587529, 1515084, 2041760, 1939024, 1431496, 821802, 407013, 402559, 586888, 362044, -416396, -977378, -496573, 771004, 1723549, 1705322, 1098988, 586506, 250108, -331460, -1258819, -1910833, -1594372, -549792, 60106, -556276, -1817819, -2501047, -2255008, -1789855, -1667732, -1672469, -1506497, -1334235, -1286067]
32771a286067K10052N32216M95222J34051n9523n7327j99786l12477O6325O30959
32761A53645N74164l6977k82932N4374J52224l28308o01928j58886L61135L81102
32751B67613L79296P96890R31389K7572j220939j461995o09961J51354J52022
32742e86759m1420J97621N67889M08270l03547r28266r08053k85801M15519P03876
32732g60671N32620K43398J53228K95626N18244O47976N67640L21725J14660P662
32722B642108k49649p72672j108725p49285J7678L75329J18859j42224o1895r9479
32712b9955o24171j133344r17219r2933N58857N57881J10770k90919l31487n8677
32702b251197J80422J28567J2003K70661Q37698J091099O84453K0181l27395k84666
$$ y = [-1286067, -1076015, -543799, -48577, 85474, 25951, -31376, -231162, -543639, -477314, 153645, 727809, 690832, 407900, 462274, 614498, 286190, -315738, -474624, -113489, 267613, 646909, 1443799, 2375188, 2402760, 1181821, -280174, -890135, -738781, -586759, -628179, -430558, 137331, 545601, 242054, -686212, -1594265, -1880066, -1464547, -760671, -228051, 15347, 168575, 464201, 982445, 1630421, 2198061, 2519786, 2634446, 2642108, 2392459, 1619787, 511062, -238223, -220545, 154784, 273643, 131419, 69524, -29955, -654126, -1787470, -2704689, -2797622, -2238765, -1680884, -1570114, -1861033, -2192520, -2251197, -2070775, -1942208, -1930205, -1659544, -821846, 269253, 953706, 973887, 646492, 361826]
32692C61826j25280N571J17764J73082J07854p8252l34479m87271k44072L81996
32682a21261P65639L19338n63155q27027j36215O60935O38995j53021r30540r97165
32672a343477k29454P73344J015479J58490q13992p11856J86578N49709P0531
32663c44648j15474O17231J343447J136738M45508O2687k11190q43535j372874
32654G17890j070410k16942L14474L19716K24766K02298J25339N645j83504o27020
32644a87748j047356o95015L74020R11768K42382n48025k71242M93341N33260
32635a94615R1844J91994N84039K16056o60049p80102j27448L4111n10783n08140
32625a663093M62857J110334N24901m54421p50056n01040j95447L23246J067531
$$ y = [361826, 236546, 242117, 359881, 532963, 640817, 562565, 228086, -259185, -503257, -121261, 644378, 963716, 400561, -426466, -562681, 98254, 737249, 584228, -346312, -1343477, -1572931, -799587, 215892, 374382, -439610, -1151466, -964888, -415179, -344648, -460122, 157109, 1500556, 2637294, 3082802, 3145489, 2934299, 2090764, 717890, -352520, -569462, -254988, 64728, 289494, 491792, 617131, 622776, 439272, -187748, -1235104, -1930119, -1556099, -644331, -401949, -949974, -1221216, -727875, -194615, -102771, 89223, 673262, 889318, 229269, -550833, -678281, -644170, -1154953, -1663093, -1200236, -89902, 434999, -19422, -769478, -1270518, -1465965, -1142719, -75188]
32616g5188J293341O31108j64514m49366o46022j076932r68059K00391J304950
32607D9709R57030l34259q13375K846Q30802O34546j09281m40497k37209m5454
32597D94858j84138m62885n34258k89250L023l4740l56417m11158J46182Q44857
32587g83926Q67084O9878p98266r36622l06265M57245P71595O18581L55906J83507
32577D98717J8676j17524J4045L67002M02314j68313p68268o73630r9322J22447
32567d03856j93412m05956j25567K88456M05816K22492j11655m26314l75288J67915
32557i57369O10228L34656j94647j2792P02587P79116k7145o19648m34459k68314
32547h7787o00035n79061L23851J020994M43668o29229p91810j83505N4575j77463
$$ y = [-75188, 1218153, 1849261, 1684747, 1235381, 589359, -487573, -1455632, -1255241, 49709, 1006739, 672480, -140895, -138049, 692753, 1327299, 1218018, 777521, 540312, 494858, 310720, -152165, -686423, -975673, -972650, -1007390, -1363807, -1774965, -1628783, -783926, 83158, 153036, -645230, -1581852, -1888117, -1430872, -659277, -40696, 315210, 498717, 517393, 399869, 413914, 780916, 1183230, 1014917, 246649, -426981, -526303, -403856, -597268, -1003224, -1128791, -840335, -434519, -212027, -323682, -749996, -1125284, -957369, -347141, -12485, -207132, -219924, 482663, 1261779, 1234634, 614986, 180527, -87787, -687822, -1266883, -943032, 77962, 521630, -107599, -899409, -1082914, -1028339, -1205802]
32537a205802k4209N80851Q01939M10551L7004o8208k77628n59844l90858J80393
32527e15811M27137O7821l91762n10453k90030K31587Q90944J049933L27813m78701
32517H08478l34202L16272R4327j031672j513083n82454O40854R75164O98578
32508G2262M82224J44964n02096p31533o3985N36831r254j007056q70981M07722
32498a540902J158666M86683n16536m76017M03490Q99238N43543J3548m3180J55912
32488A084445N3605l32855m32220K7572N88185O61316K60001j77673m48563o22257
32478F61556n89168j66061L51499L89931j1069j78940O3617j327p54174j317708
32468a551844o93574O26436J173821N22275k03955n2381M63800L73574j51790
$$ y = [-1205802, -1230011, -649160, 152779, 563330, 600334, 532126, 254498, -305346, -696204, -515811, -88674, -20853, -412615, -923068, -1213098, -981511, -90567, 959366, 1287179, 808478, 474276, 790548, 884875, -146797, -1659880, -2242334, -1601480, -626316, 72262, 554486, 699450, 197354, -534179, -598164, -61333, -70587, -1077643, -1948624, -1540902, -382236, 104447, -412089, -888106, -484616, 414622, 958165, 971713, 928533, 1084445, 1138050, 805195, 372975, 400547, 988732, 1650048, 1910049, 1732376, 1283813, 661556, 72388, -93673, 257826, 647757, 636688, 457748, 521365, 520038, -234136, -1551844, -2245418, -1618982, -445161, 77114, -126841, -179222, 284578, 658152, 506362]
32459E06362j17619O09992R37191J50260r07724r39607k3030N27123N1203o06287
32449A87864m37980L19869O92747L28686l03306o97774o44166r3405O23045P36916
32439G12496l2590p72316m80073L55515L75323n14281r26487j84337O26582M48279
32429c91889j37265o8077M06063L09720l07753m94380J365M30614L13452j2207
32419D9643j89929k92009l15534m3135L69008L78319j01050m60874k76432J46376
32409g35617L79844M64667N35858L81581j56654p19993q42535n64410k18643J26734
32399a349168N38828P63670M97746M4874N1392M66182M29671m40837j258120r92692
32389a248454M019M53718L5270j61268O19620J509456J199224j79451j252334
$$ y = [506362, 388743, 998735, 1935926, 2086186, 1178462, 238855, 215825, 742948, 794151, 187864, -250116, 69753, 762500, 1091186, 787880, 90106, -554060, -647465, -24420, 712496, 679906, -92410, -572483, -216968, 158355, -355926, -1282413, -1466750, -840168, -391889, -529154, -597231, -191168, 118552, -189201, -683581, -682216, -251602, 61850, 49643, -140286, -432295, -747829, -790964, -421956, -43637, -144687, -605561, -881993, -735617, -355773, 108894, 644752, 1026333, 869679, 149686, -692849, -1257259, -1475902, -1349168, -810340, -46670, 451076, 495950, 547342, 1013524, 1443195, 1002358, -255762, -1248454, -1244435, -790717, -755447, -916715, -297095, 1212361, 2411585, 2232134, 979800]
32380I79800j214607n58572n3389J21214O5492k25532n97287o63977l37876M949
32370b479785J14560J72408L19949L77139K37452N4212j25509l54753l06254M42481
32360a548100J407601J388437J48423r69532p82198J78516O46857M07682J24766
32351A002452j657k84609o17562n71058k32199j6654J39796N01546P34509L85261
32341A039825j16637m2258K73172j11788j021283j244863m55221K97016K82773
32332a099264J057M268P3948N9620L30270Q11952P36093k2210m96706j84620J38532
32321C52940r5814k26074K39207N07591j8971m07559K12358Q56442K08421r89967
32311F38574j025918n4411K68504l22022m13069L95592P64894R5272l71927K05674
$$ y = [979800, -234807, -793379, -846768, -725554, -660062, -885594, -1482881, -2146858, -2484734, -2479785, -2365225, -2192817, -1872868, -1495729, -1258277, -1204065, -1329574, -1684327, -1990581, -1548100, -140499, 1247938, 1396361, 426829, -355369, -176853, 470004, 877686, 1002452, 1000795, 716186, 98624, -472434, -704633, -721287, -581491, -79945, 654564, 1039825, 923188, 880930, 1154102, 1042314, 21031, -1223832, -1679053, -1382037, -1099264, -1098207, -1093939, -1019991, -960371, -630101, 181851, 917944, 895734, 399028, 214408, 352940, 257126, 31052, 270259, 777850, 758879, 351320, 563678, 1420120, 1628541, 638574, -387344, -441755, -173251, -495273, -908342, -512750, 252144, 347416, -24511, 181163]
32301A81163Q06489M22207k47706k58018j29064o43340j154711p19422M1289n3355
32291a754468n66049j30616J027960J203677l9853j042398n09664P18280J162771
32282F9640P58453M08658L35139n045p13363j146293q50881j62408K89251L07558
32272g09291J88077K05753K40798K6659l18031l34618P2047L92080K89196J43123
32262A95793K91337K65148l78423r19168l42098Q62439J162913L42173j74592
32253A305522K18144K48285q55764j621394n71976J095986J112133l66094j087703
32244e22861k87797L95083j12383o89870k39288M28817K08111l61938k69086N3926
32234a397286l56907r85417m90714R94220J862794J314441K22381m09550n82867
$$ y = [181163, 987652, 1409859, 1162153, 904135, 775071, 131731, -1022980, -1742402, -1701113, -1754468, -2320517, -2451133, -1423173, -219496, -259349, -1301747, -1811411, -1093131, 69640, 828093, 1236751, 1571890, 1566845, 853482, -292811, -1143692, -1306100, -1016849, -709291, -521214, -315461, -74663, -48004, -366035, -700653, -628606, -236526, 52670, 195793, 487130, 752278, 373855, -545313, -887411, -24972, 1137941, 1480114, 1305522, 1523666, 1771951, 916187, -705207, -1277183, -181197, 930936, 564842, -522861, -810658, -415575, -527958, -1217828, -1457116, -1028299, -820188, -1182126, -1451212, -1397286, -1754193, -2739610, -3230324, -2236104, -373310, 941131, 1163512, 753962, 171095]
32225A71095o12022m27211k9591K05765J15151j2737n5447k50179n28111l77746
32215a801033K91139Q09425O61000J68540r3163n0593L2270k2565l25305q39383
32205a169668j060113m21264O81511J025817J80694p63655o88224O6391M73701
32196a674810M04481M43310N99141L40209k45293m15359K4527M22518L43158R0711
32186C32593l3592j91994m35311m14084m5509J86786K1829r3374K11733N26918
32176F5995L39827l9022N5030N13667N65116r568m82946k33752L34184L30582
32166A439113l93466r72054n61858N75294J285485Q58564j22113n56199k65468
32157A287298j11657n96693j015589m99870N78017J004120L86661l61560l40261
$$ y = [171095, -440927, -868138, -897729, -691964, -576813, -589550, -644997, -895176, -1423287, -1801033, -1509894, -700469, -39469, 129071, 35908, -14685, 17585, -4980, -330285, -1169668, -2229781, -2651045, -1969534, -943717, -763023, -1526678, -2214902, -2148511, -1674810, -1270329, -827019, -227878, 112331, -132962, -548321, -523794, -101276, 241882, 332593, 299001, 107007, -328304, -742388, -787897, -601111, -579282, -672656, -460923, 65995, 405822, 366800, 421830, 935497, 1500613, 1491045, 1008099, 774347, 1108531, 1439113, 1045647, 73593, -488265, 87029, 1372514, 2231078, 2108965, 1552766, 1287298, 1175641, 578948, -436641, -936511, -358494, 645626, 1032287, 670727, 330466]
32148C30466K38253O02651M99437K25854n149j66726j31239J40592K61478j35505
32138A860112o65150n64683J16782M19290j47630q22391p02269m6496K37142r201
32128c24494j48065J06036L89606N27709P47253Q84585L38883p61575j258112
32119E01826n17144M59137L62351n26894q13174o5750P06371O75223J88215j45524
32109H24637l50116n26198k67024N79647J157138N33097q58787j582615j005250
32100a495471K1482M25153J59855j40173j73966j10471k4659K29063O13034Q10106
32090C13953O17288J64912k95811n68253m70143L1988N53064N55347J16422J6553
32080A035320O42955J177834N50179r32525j697897q54052O75355J359077Q26480
$$ y = [330466, 568719, 1171370, 1670807, 1896661, 1891512, 1724786, 1593547, 1734139, 1995617, 1860112, 1194962, 630279, 747061, 1166351, 1018721, 196330, -505939, -552435, -315293, -324494, -472559, -366523, 23083, 550792, 1298045, 2182630, 2521513, 1759938, 501826, -15318, 443819, 806170, 279276, -533898, -599648, 106723, 781946, 970161, 824637, 474521, -51677, -318701, 260946, 1418084, 1951181, 1092394, -490221, -1495471, -1473989, -1048836, -888981, -1029154, -1203120, -1313591, -1338250, -1109187, -496153, 313953, 931241, 1096153, 800342, 232089, -238054, -206066, 346998, 902345, 1018767, 1035320, 1678275, 2856109, 3406288, 2473763, 775866, -78186, 597169, 1956246, 2782726]
32071B782726r7406o41708o72557l02089K87764O20270K31804n98531r76781n02933
32061A30559J92447K92408k08226o60261o07000j35073L93803O19315L48446k16072
32051A50346n07351j83179L59604L94732j84668o80014m97241Q0979L35940J19652
32041f11200j3700L09098P22853O85072K31207k11524n04076p80220q78509m16861
32031a467860M59658R96504P61266J74204j77755k61649k70432r1643L70937P49580
32021A242810O67218L37443J64254O8513j88187l59994j27744J36819j45117o96239
32011A099776p00214r9699L49104L10515J82248J08234k56946p77502p30448o8226
32001e83158K70875j62715n71495k71177J97258J30702q0217K60153Q50775R30993
$$ y = [2782726, 2685320, 2043612, 1371055, 1068966, 1356730, 1977000, 2208804, 1610273, 633492, 130559, 323006, 615414, 407188, -253073, -860073, -995146, -601343, 17972, 366418, 150346, -357005, -540184, -180580, 214152, 29484, -650530, -1147771, -1066792, -730852, -611200, -624900, -315802, 407051, 1092123, 1323330, 1111806, 607730, -172490, -1050999, -1467860, -1008202, -11698, 749568, 923772, 746017, 484368, 213936, 122293, 493230, 1242810, 1910028, 2247471, 2411725, 2480238, 2292051, 1932057, 1804313, 1941132, 1796015, 1099776, 399562, 299863, 648967, 959482, 1141730, 1249964, 993018, 215516, -514932, -583158, -312283, -474998, -1046493, -1317670, -1120412, -989710, -1069927, -809774, 41001, 971994]
31991I71994N48165K54578K1919m92600r96630r44707n54187l88116k28795M85012
31981a323367J310656J161509M6065p56410m53727L94360R74152J108954P71372
31972C233564j83255j297859j513140n41107N10949N24593k36441p12076m74874
31963f89646N6242M22924N31042M52204K74633O8865j74737m08379l57625J25791
31953C01314O06560N20606M4520j88926k05092n83254j134962q47793M09581J291600
31943B14154Q21659k02436n43797k97390k23162j68644M64274J217238J007597
31934B289493j31689j077911j303925j236413r51104K6280J304650J457826L619
31925C80826j546929j498396p3172J115230J103753K90632m66811o71258l07687
$$ y = [971994, 1520159, 1774737, 1796656, 1304056, 307426, -637281, -1191468, -1579584, -1808379, -1323367, -12711, 1148798, 1194863, 438453, -15274, 379086, 1353238, 2462192, 3233564, 3050309, 1752450, 239310, -301797, 209152, 733745, 497304, -214772, -689646, -633404, -210480, 320562, 772766, 1047399, 1116264, 941527, 533148, 175523, 301314, 907874, 1428480, 1473000, 1284074, 1078982, 495728, -639234, -1487027, -1077446, 214154, 1035813, 833377, 289580, -7810, -230972, -399616, 64658, 1281896, 2289493, 2157804, 1079893, -224032, -1460445, -2411549, -2385269, -1080619, 377207, 380826, -1166103, -2664499, -2737671, -1622441, -518688, -228056, -694867, -1366125, -1673812]
31916a673812K21564L79869J07227o5095J81858M44340L27269J97276N32153R06215
31906A558864M98753n18465j019489m85026K92742L80433j06672m23688k73643
31897i6191N0450K52666K64516R8339j14501j11715J23878J98057j09642l76629
31887A79228j59902J84530P524m45192k38718P07493J213208M59478p69735j168537
31877c0623o25034j9986K38315M76469P47270O31061J58023n0105J45745Q4423
31867A755558m97938q04307j74509P39045Q27846J22529l55175j29379K25558
31858A709228J46176j61409k72537k24806k69710l49193k12452J52392N07566
31849A025255O64104N57298J30241n89110j274348j396362p17925L39264R83473
$$ y = [-1673812, -1452248, -1072379, -965152, -1030247, -848389, -404049, -76780, 120496, 652649, 1558864, 2057617, 1539152, 519663, 34637, 327379, 707812, 601140, 177452, -96191, -45741, 206925, 471441, 569780, 455279, 343564, 467442, 665499, 555857, 179228, 19326, 203856, 211380, -233812, -472530, 234963, 1448171, 1907649, 1137914, -30623, -655657, -675643, -437328, 39141, 786411, 1417472, 1575495, 1525390, 1671135, 1755558, 1257620, 453313, 278804, 1017849, 1845695, 1968224, 1613049, 1483670, 1709228, 1855404, 1693995, 1421458, 1196652, 926942, 577749, 365297, 517689, 1025255, 1689359, 2246657, 2376898, 1787788, 513440, -882922, -1600847, -1261583, -278110]
31840b78110P95396J06425m28810n06897k89424k2683J56102J15587j86228m66160
31830a004802l19783K23653O58891O28228K85368m6119k22053j93538J0849R7022
31820A17716k26614o44856m73309K69931P06525L81764m7130L6064J75421j96696
31810I8816n25763l0975O89588L71583p57676j060981Q911R59751M87540n76227
31800c35433n59085O18371J433096Q56365n00059j322680j025428j44090L45520
31791f33423N8038l70850q2372P82003J174603O27400o0767q5348J37284k04554
31781A342014q28900p75115q2871J48351m36213p36204J16295J278449J314105
31772A339911K41255n87608m83091k03664n03123r03008n86055J89381M95146
$$ y = [-278110, 517286, 623711, 194901, -311996, -601420, -624103, -468001, -352414, -538642, -1004802, -1324585, -1100932, -442041, 186187, 471555, 425436, 203383, 9845, 20694, 117716, -108898, -753754, -1227063, -957132, -250607, 131157, 84027, 120091, 295512, 98816, -426947, -457922, 231666, 603249, -154427, -1215408, -1206497, -246746, 240794, -335433, -894518, -276147, 1156949, 2013314, 1513255, 190575, -834853, -978943, -633423, -575385, -946235, -1028607, -246604, 927999, 1555399, 1494632, 1409284, 1546568, 1342014, 513114, -262001, -344872, -196521, -632734, -1368938, -1252643, 25806, 1339911, 1581166, 993558, 510467, 306803, -196320, -1099328, -1685383, -1496002, -1000856]
31763a000856K19346J36591N02496O04464L1076n51168m73868j28660j74279l19278
31753a154136J28043Q90581R83680K31797n04006o64279n72887n17748k41492
31744a420447L01697N84075L73656J80511L22209L00015k69094p84253m90187
31735i01818L17232O91913L24586k61408n43736m01590P6848N83269O13402Q4722
31725E83420l29054j01501K16281k36567j138236j233709j67786Q88245Q29790
31716f89117N1822l09516j5152J68660j84068m89965q4838P07560R60810M38990
31706E55186r8161o0856R1118l30739r81926q99891o6928M36521P2117l52728
31696a636287m8997M97431M36567j3291n1827K74560K38131k09266l54419O26
$$ y = [-1000856, -781510, -644919, -142423, 462041, 493117, -58051, -531919, -660579, -834858, -1154136, -1026093, -135512, 848168, 1079965, 575959, -88320, -661207, -1178955, -1420447, -1118750, -534675, -161019, 19492, 341701, 641716, 372622, -411631, -901818, -584586, 107327, 431913, 170505, -373231, -774821, -697973, -114704, 498698, 583420, 254366, 152865, 369146, 132579, -1005657, -2239366, -2407152, -1518907, -689117, -637295, -946811, -961963, -793303, -977371, -1467336, -1552174, -844614, 116196, 555186, 457025, 396169, 487287, 156548, -825378, -1725269, -1792197, -1355676, -1283559, -1636287, -1685284, -1187853, -751286, -764577, -816404, -541844, -303713, -512979, -867398, -866772]
31686h66772K28275J6797j33162J24986L53575J05001l32957m27946j29017L04821
31676g56399P28751R48515N86281l67186j168930j047102k00602L97197K04138
31667f75337k95908l59377j1128P9681l07868m96421P9309Q07240N94382m21433
31657a006860p99477J84574J353536J204834m7719r67714r10500m34626j5533
31648a439485M18613O98163L75852l08326m99519n1176K31149j7217j41556K51646
31638d81856M85923k9028p20511p25618j48749L30129N12733N74831M21302m2548
31628A76608l82343j50525L46088M74457K17031N1156J15866J01135j94124o61748
31618I3601j019666p99000L49734J850588K261073Q75378j141861k012558j408195
$$ y = [-866772, -638497, -621700, -754862, -629876, -276301, -171300, -504257, -932203, -1061220, -756399, -27648, 920867, 1507148, 1139962, -28968, -1076070, -1276672, -879475, -675337, -971245, -1330622, -1341750, -1262069, -1569937, -2066358, -1987049, -1179809, -585427, -1006860, -1806337, -1621763, -268227, 936607, 888888, -78826, -989326, -1423952, -1439485, -1020872, -322709, 53143, -255183, -754702, -805878, -574729, -591946, -733502, -481856, 4067, -24961, -745472, -1471090, -1619839, -1289710, -776977, -202146, 219156, 176608, -205735, -356260, -10172, 464285, 681316, 732472, 848338, 949473, 755349, 93601, -926065, -1725065, -1375331, 475257, 2736330, 3611708, 2469847, 457289, -950906]
31609i50906m51267J6677J90798M40446O78337P30156N76029J06709p08005j380300
31599g51326j325486p49696l97454l90379j33599N10745Q62499N47436J38797
31590a688463K16492N14129N40054M04630M03034L16503j38584n44114k70848
31581b47167M15963N44289j72720q36154n81857K17182M83634p4966o17931l94870
31571a264597K53051N17433L33740K91425M78001K73290m72696r12822m16917
31562i20092M01151O37005M78530O63949J014648P26693m5589k64840J54347l827
31552B841975j194661k011651j133956O12089J348627O76214j79187m25767n36606
31543b923r06447r54162j55962Q73866J087543L88088l33686l94078k3944J51294
$$ y = [-950906, -1402173, -1385496, -1194698, -754252, -75915, 654241, 1230270, 1336979, 628974, -751326, -2076812, -2826508, -3223962, -3614341, -3747940, -3237195, -2374696, -1827260, -1688463, -1471971, -957842, -417788, -13158, 389876, 706379, 567795, 23681, -247167, 168796, 713085, 540365, -295789, -877646, -660464, -176830, -251796, -869727, -1264597, -1011546, -494113, -160373, 131052, 609053, 882343, 409647, -503175, -920092, -518941, 118064, 596594, 1260543, 2275191, 3001884, 2956295, 2691455, 2845802, 2841975, 1647314, -364337, -1498293, -886204, 462423, 1138637, 959450, 533683, -2923, -909370, -1863532, -2019494, -1145628, -58085, 330003, -3683, -397761, -421705, -270411]
31533b70411n1324k64856j59008J08371J44433p6906j25879K55825O75801N34939
31523G70985j34188o23503m33389R2153K33629j67481n30540l04329L42172P59518
31513E027O01684J26050k60400m47958m80206k62090K47859O88826N60788r2168
31503F87412n99314m33334J63713M96088J94270m66230q84691o45889J40224Q62097
31493d85654R03467K86922k76680j55827M55762P59580L11903m50194p59203m46142
31483A43934p3249j18894l44022k42755J23234K57586J34477K65256O45246M65838
31473A256651n08073j068300j39090J288036J205193m77728j589623p32589Q20319
31464E4796J156214L59719j88497j94191m85263j089811j002783r021P59193N48671
$$ y = [-270411, -321735, -586591, -745599, -637228, -492795, -569701, -695580, -439755, 236046, 770985, 636797, 13294, -420095, -327942, -94313, -261794, -792334, -1096663, -754491, 5027, 606711, 732761, 472361, 24403, -455803, -717893, -470034, 218792, 779580, 687412, 88098, -345236, -181523, 314565, 508835, 42605, -842086, -1487975, -1347751, -485654, 417813, 704735, 428055, 272228, 727990, 1487570, 1799473, 1349279, 590076, 143934, 70685, -48209, -392231, -634986, -511752, -254166, -119689, 145567, 790813, 1256651, 748578, -319722, -458812, 829224, 2034417, 1556689, -32934, -765523, 54796, 1211010, 1570729, 1382232, 1188041, 702778, -387033, -1389816, -1398837, -639644, -90973]
31454i0973M6940J13263M80720M57872R3241j65046l22536n33852m81535P8376
31444c23530N72230L28497k54452k34060L48519N26784K3702l23525n7616J04510
31434G11059l97096q32772l35960N18163M54392n08122j011222l40483O58495
31425a083546R41612N72334J80456o0151k62047k62097L6495J94710j56657n57471
31415d56362l08824L92792O83646K98770j65939k70747k27763k32417o7503L06749
31405d7598M31725O4597k88876m7696N67159P86815K47987o44151j186203j000122
31395a116363l20616K24111K70233J32360K82684N48143L67909j85908l81283
31386a78730J9606L83109L06575K33840M44497L36591m63678j087471o09231L40891
$$ y = [-90973, -44033, 69230, 549950, 1007822, 1101063, 936017, 613481, 79629, -401906, -323530, 248700, 577197, 322745, 88685, 437204, 963988, 987690, 664165, 606549, 711059, 313963, -518809, -854769, -336606, 117786, -390336, -1401558, -1742041, -1083546, -141934, 430400, 610856, 550705, 288658, 26561, 63056, 257766, 101109, -456362, -765186, -372394, 311252, 610022, 444083, 173336, -54427, -286844, -354347, -47598, 384127, 448724, 159848, 112152, 679311, 1466126, 1714113, 1069962, -116241, -1116363, -1436979, -1212868, -942635, -810275, -527591, 20552, 388461, 202553, -178730, -159124, 223985, 530560, 764400, 1208897, 1545488, 1081810, -5661, -614892, -274001]
31376b74001M07953l82246p11752j02732M54604K74880K6290M09440R29663Q08381
31366A840480K58313m1744j01103l25515n36932k46428L32210M60788J9566l52898
31356A306737l22736k73463m40116l68392L15127J113975J199483M78496l72843
31347B636268p92148p55999m02799J62505N32641R7495j044449j735980j027963
31338b330429M13797R89424K82696m19342o3165O51719M40736n77056j083759
31329a695379m59445N25764Q95081M98934j96084o26351l90575L40269P15962
31320c91824K44616k27005M10157J557573J391855l82850j773918j253258J50899
31311b73755O57717L46928L96395O72186O4777j118185j177982K47929J329736
$$ y = [-274001, 133952, -248294, -960046, -1062778, -608174, -333294, -307004, 102436, 1032099, 1840480, 2098793, 2057049, 1955946, 1630431, 1093499, 847071, 1179281, 1640069, 1659635, 1306737, 984001, 710538, 270422, -97970, 217157, 1331132, 2530615, 3009111, 2636268, 1844120, 1088121, 685322, 847827, 1380468, 1477963, 433514, -1302466, -2330429, -1916632, -927208, -644512, -1063854, -1127019, -475300, -34564, -611620, -1695379, -2154824, -1629060, -733979, -235045, -431129, -1057480, -1448055, -1107786, -391824, -147208, -374213, 35944, 1593517, 2985372, 2602522, 828604, -424654, -273755, 383962, 730890, 1127285, 1799471, 1864248, 746063, -431919, -183990, 1145746]
31302A145746O89704n85104o50759M53533J132815O02080l26880o87247n41382
31293A232506n03199p46790q59147m53638K92228P60520O07767K38753K55341
31284H24341N02329K34660o04802r88079k11901Q82319R13549j09595p97987l54312
31274B90522L81854K44812o26672j118195p15145l4291J74646n4559j87359K8429
31264a615958L72560N30827L69392n8237n02665n76749j18903M87366O52678L06185
31254a53504l0403j0103O5879k04160o51103q09044o11366l48467r6948K81810
31244b567409O37918N93556J74218j35089p5080J32395L03716M97765N54801J20189
31234B36980n51470n56376L35820J002083M08058p87187j054797j50648O44535
$$ y = [1145746, 1835450, 1250346, 599587, 1053120, 2185935, 2788015, 2461135, 1773888, 1232506, 729307, -17483, -876630, -1330268, -1038040, -277520, 330247, 569000, 824341, 1326670, 1561330, 956528, -31551, -243452, 638867, 1552416, 1442821, 644834, 290522, 672376, 917188, 290516, -827679, -1542824, -1577115, -1402469, -1457028, -1644387, -1615958, -1243398, -712571, -343179, -401416, -904081, -1480830, -1599733, -1112367, -459689, -153504, -183907, -194010, -128131, -332291, -983394, -1792438, -2403804, -2752271, -2849219, -2567409, -1929491, -1335935, -1161717, -1296806, -1371886, -1239491, -935775, -438010, 116791, 236980, -314490, -870866, -535046, 467037, 875095, 87908, -966889, -1117537, -473002]
31225d73002M48562j66934l57290k18697k15231k02603J64335N70053M62413P4184
31215H5790J33681N80760M54531o47493j719123j509231j38251J061079J191301
31206e06956O81207M14837N16563M27305r0551n85803o03278k68036L4324J93293
31196B12905K67087J36500k90904o88580o15282j82730P2956L6578J89592P40410
31186a21468J114092P14253j78172p40590o31611k34953j8066r0646l48149o17732
31176a153042o16916j54923N05079P95121N02904L7829j15468J8745Q5045n723
31166a01349L3493L43305N50086J66111o85711j231072r00653l4863N41936N17198
31156h01519K74182J46462M2450m2625K29718Q52142J055834K46929r46384j304005
$$ y = [-473002, -24440, -191374, -548664, -767361, -982592, -1185195, -1020860, -450807, 11606, 85790, 219471, 800231, 1254762, 607269, -1111854, -2621085, -2759336, -1698257, -506956, 174251, 589088, 1105651, 1532956, 1442405, 856602, 253324, -14712, 19612, 212905, 479992, 616492, 325588, -362992, -978274, -1161004, -1088048, -1051470, -861878, -121468, 992624, 1706877, 1528705, 788115, 156504, -78449, -96515, -187161, -535310, -1153042, -1769958, -1924881, -1419802, -624681, -121777, -83948, -199416, -180671, -95626, -101349, -67856, 275449, 825535, 991646, 305935, -925137, -1825790, -1860653, -1318717, -801519, -527337, -380875, -338425, -381050, -151332, 700810, 1756644, 2003573, 1057189, -246816]
31146b46816n93966K08599L33315J13206K23117O56058Q84213O32059P0070n10773
31136A769082q70802q43924m76383m2123K47430M14110M88104L24908j85480q71031
31126d6109j355677j287761n35164O01618J413160J376113P63189L07260K52672
31117A489301J86430j64850n49915p46034q60128q13546k10527Q31218J354755
31108E16704O89647n57166j252595j084651n51194k5522M28352O26373M59638
31099g50414L38713O55692R36511L84525p35603j164011l31982P95657R66326
31090A095414J68688n36228l93695K38418M12832k38690r59423p18274L71511
31081e59447J029645N39664j89451j9349O16327M44550n03491q90682k26452M33686
$$ y = [-246816, -840782, -632183, -298868, -185662, 37455, 693513, 1577726, 2209785, 2279855, 1769082, 898280, 54356, -422027, -464150, -216720, 197390, 685494, 1010402, 824922, -46109, -1401786, -2689547, -3224711, -2623093, -1209933, 166180, 929369, 1236629, 1489301, 1675731, 1510881, 960966, 214932, -645196, -1458742, -1669269, -838051, 516704, 1206351, 649185, -603410, -1688061, -2239255, -2264777, -1836425, -1210052, -750414, -411701, 243991, 1180502, 1565027, 829424, -334587, -666569, 129088, 1095414, 1264102, 727874, 334179, 572597, 985429, 746739, -212684, -930958, -559447, 470198, 1009862, 820411, 801062, 1417389, 1861939, 1358448, 467766, 241314, 675000]
$$ [...]
##END NTUPLES=NMR SPECTRUM
##END=
