##TITLE=31Pdec_LY-1Dix.60.4
 CD3CN, 24 sc
 1.03.2021
##JCAMPDX= 6.0         $$ Bruker NMR JCAMP-DX V2.0
##DATA TYPE= NMR SPECTRUM
##DATA CLASS= NTUPLES
##ORIGIN= UXNMR, Bruker Analytische Messtechnik GmbH
##OWNER= root
$$ XWIN-NMR		Version 3.5
$$ Mon Mar  1 13:39:01 2021 Russian Standard Time (UT+4h)  she@DPX200
##.OBSERVE FREQUENCY= 81.013821
##.OBSERVE NUCLEUS= ^31P
##.ACQUISITION MODE= SIMULTANEOUS
##.ACQUISITION SCHEME= undefined
##.AVERAGES= 24
##.DIGITISER RES= 16
##SPECTROMETER/DATA SYSTEM= spect
##.PULSE SEQUENCE= zgpg30
##.SOLVENT NAME= CD3CN
##.SHIFT REFERENCE= (INTERNAL, CD3CN, 0, 248.564)
##AUDIT TRAIL= $$ (NUMBER, WHEN, WHO, WHERE, WHAT)
$$ ##TITLE= Audit trail, XWIN-NMR		Version 3.5
$$ ##JCAMPDX= 5.01
$$ ##ORIGIN= Bruker BioSpin GmbH
$$ ##OWNER= she
$$ F:/spectra/data/she/nmr/P31/1/pdata/1/auditp.txt
$$ ##AUDIT TRAIL=  $$ (NUMBER, WHEN, WHO, WHERE, WHAT)
(   1,<2021-03-01 13:37:38.42 +0400>,<she>,<DPX200>,
      <created by zg, POWCHK disabled, PULCHK disabled
       configuration hash MD5:
       00 E9 B6 7A A2 85 ED C7 34 08 36 98 17 FE 4E 26
       data hash MD5: 32K
       06 59 26 68 06 21 6D 6D E5 C0 3C 01 09 1F AC B0>)
(   2,<2021-03-01 13:37:43.39 +0400>,<she>,<DPX200>,
      <Start of raw data processing
       efp BC_mod = 2 LB = 1 FT_mod = 6 PKNL = 1 PHC0 = -3014.925 PHC1 = 166.0025 SI = 64K 
       data hash MD5: 64K
       4E CD 2B 93 D3 DC 27 A8 96 D1 C3 0C 20 84 AA CB>)
(   3,<2021-03-01 13:38:15.59 +0400>,<she>,<DPX200>,
      <pk PHC0 = -34.48291 PHC1 = 19.40001 
       data hash MD5: 64K
       AA 91 C1 10 16 BB 9C 3D 5A E5 94 8D 38 A3 DC 38>)
(   4,<2021-03-01 13:38:19.92 +0400>,<she>,<DPX200>,
      <abs ABSG = 5 
       data hash MD5: 64K
       0F 8D 81 86 2E C5 CA 3A 78 86 CD 6B 5F 10 2A CB>)
$$ ##END=
$$ 
$$ hash MD5
$$ F8 DD 19 5C 52 39 B0 40 FC 7E C4 BE DB C5 32 05
##$RELAX= 
##$RELAX= 
##$RELAX= 
##$RELAX= 
##$RELAX= 
##$RELAX= 
##$RELAX= 
##$RELAX= 
$$ Bruker specific parameters
$$ --------------------------
##$DU= <F:/spectra>
##$EXPNO= 1
##$NAME= <P31>
##$PROCNO= 1
##$TYPE= <nmr>
##$USER= <she>
##$AMP= (0..31)
100 100 100 100 100 100 100 100 100 100 100 100 100 100 100 100 100 100 
100 100 100 100 100 100 100 100 100 100 100 100 100 100 
##$AQSEQ= 0
##$AQ_mod= 1
##$AUNM= <au_zg>
##$AUTOPOS= <>
##$BF1= 81.014009
##$BF2= 200.13
##$BF3= 200.13
##$BF4= 200.13
##$BF5= 200.13
##$BF6= 200.13
##$BF7= 200.13
##$BF8= 200.13
##$BYTORDA= 1
##$CFDGTYP= 0
##$CFRGTYP= 5
##$CHEMSTR= <none>
##$CNST= (0..31)
1 1 145 1 1 1 1 1 1 1 1 1 1 1 1 1 1 1 1 1 1 1 1 1 1 1 1 1 1 1 1 1 
##$CPDPRG= <waltz16>
##$CPDPRG1= <>
##$CPDPRG2= <waltz16>
##$CPDPRG3= <>
##$CPDPRG4= <mlev>
##$CPDPRG5= <mlev>
##$CPDPRG6= <mlev>
##$CPDPRG7= <mlev>
##$CPDPRG8= <mlev>
##$CPDPRGB= <>
##$CPDPRGT= <>
##$D= (0..31)
0 1 0 0 0 0 0 0 0 0 0 0.03 2e-05 3e-06 0 0 0 0 0 0 0 0 0 0 0 0 0 0 0 0 
0 0 
##$DATE= 1614591457
##$DBL= (0..7)
120 120 120 11 120 120 24 19 
##$DBP= (0..7)
150 150 150 150 150 150 150 150 
##$DBP07= 0
##$DBPNAM0= <>
##$DBPNAM1= <>
$$ [...]
##$SUBNAM3= <"">
##$SUBNAM4= <"">
##$SUBNAM5= <"">
##$SUBNAM6= <"">
##$SUBNAM7= <"">
##$SUBNAM8= <"">
##$SUBNAM9= <"">
##$SW= 501.771253377433
##$SWIBOX= (0..15)
0 1 3 0 0 0 0 0 0 0 0 0 0 0 0 0 
##$SW_h= 40650.406504065
##$TD= 32768
##$TD0= 1
##$TE= 0
##$TE2= 300
##$TE3= 300
##$TEG= 300
##$TL= (0..7)
0 120 53 12 22 120 120 120 
##$TP= (0..7)
150 150 150 150 150 150 150 150 
##$TP07= 0
##$TPNAME0= <>
##$TPNAME1= <>
##$TPNAME2= <>
##$TPNAME3= <>
##$TPNAME4= <>
##$TPNAME5= <>
##$TPNAME6= <>
##$TPNAME7= <>
##$TPOAL= (0..7)
0.5 0.5 0.5 0.5 0.5 0.5 0.5 0.5 
##$TPOFFS= (0..7)
0 0 0 0 0 0 0 0 
##$TUNHIN= 0
##$TUNHOUT= 0
##$TUNXOUT= 0
##$USERA1= <user>
##$USERA2= <user>
##$USERA3= <user>
##$USERA4= <user>
##$USERA5= <user>
##$V9= 5
##$VALIST= <valist>
##$VCLIST= <CCCCCCCCCCCCCCC>
##$VD= 0
##$VDLIST= <DDDDDDDDDDDDDDD>
##$VPLIST= <PPPPPPPPPPPPPPP>
##$VTLIST= <TTTTTTTTTTTTTTT>
##$WBST= 1024
##$WBSW= 4
##$XGAIN= (0..3)
0 0 0 0 
##$XL= 0
##$YL= 0
##$YMAX_a= 14061
##$YMIN_a= -48579
##$ZGOPTNS= <>
##$ZL1= 120
##$ZL2= 120
##$ZL3= 120
##$ZL4= 120
##$ABSF1= 248.5645
##$ABSF2= -253.2056
##$ABSG= 5
##$ABSL= 3
##$ALPHA= 0
##$AQORDER= 0
##$ASSFAC= 0
##$ASSFACI= 0
##$ASSFACX= 0
##$ASSWID= 0
##$AUNMP= <proc_1d>
##$AZFE= 0.1
##$AZFW= 0.5
##$BCFW= 0
##$BC_mod= 2
##$BYTORDP= 0
##$COROFFS= 0
##$CY= -3
##$DATMOD= 1
##$DC= 0
##$DFILT= <>
##$DTYPP= 0
##$F1P= 0
##$F2P= 0
##$FCOR= 1
##$FTSIZE= 65536
##$FT_mod= 6
##$GAMMA= 0
##$GB= 0
##$INTBC= 1
##$INTSCL= 5.30512e-09
##$ISEN= 30
##$LB= 1
##$LEV0= 0
##$LPBIN= 0
##$MAXI= 10000
##$MC2= 0
##$MEAN= 0
##$ME_mod= 0
##$MI= 50
##$NCOEF= 0
##$NC_proc= -2
##$NLEV= 6
##$NOISF1= 182.463
##$NOISF2= 159.3651
##$NSP= 0
##$NTH_PI= 0
##$NZP= 0
##$OFFSET= 248.5645
##$PC= 4
##$PHC0= -3049.408
##$PHC1= 185.4025
##$PH_mod= 1
##$PKNL= yes
##$PPARMOD= 0
##$PSCAL= 0
##$PSIGN= 0
##$REVERSE= no
##$SF= 81.014009
##$SI= 65536
##$SIGF1= 159.3651
##$SIGF2= -187.1042
##$SINO= 113.3802
##$SIOLD= 16384
##$SREGLST= <1H.CDCl3>
##$SSB= 0
##$STSI= 65536
##$STSR= 0
##$SW_p= 40650.406504065
##$SYMM= 0
##$S_DEV= 0
##$TDeff= 32768
##$TDoff= 0
##$TI= <>
##$TILT= no
##$TM1= 0
##$TM2= 0
##$TOPLEV= 0
##$USERP1= <user>
##$USERP2= <user>
##$USERP3= <user>
##$USERP4= <user>
##$USERP5= <user>
##$WDW= 1
##$XDIM= 65536
##$YMAX_p= 455601571
##$YMIN_p= -14883149
$$ End of Bruker specific parameters
$$ ---------------------------------
##NTUPLES= NMR SPECTRUM
##VAR_NAME=  FREQUENCY,     SPECTRUM/REAL,   SPECTRUM/IMAG
##SYMBOL=    X,             R,               I
##VAR_TYPE=  INDEPENDENT,   DEPENDENT,       DEPENDENT
##VAR_FORM=  AFFN,          ASDF,            ASDF
##VAR_DIM=   65536,         65536,           65536
##UNITS=     HZ,            ARBITRARY UNITS, ARBITRARY UNITS
##FACTOR=    0.620285442955139, 1,           1
##FIRST=     20137.2065510759, 0,            0
##LAST=      -20513.1999529892, 0,           0
##MIN=       -20513.1999529892, -14883149,   0
##MAX=       20137.2065510759, 455601571,    0
$$ Real data points
##PAGE= N=1
##DATA TABLE= (X++(R..R)), XYDATA
$$ [...]
$$ plain form
35987 10120 -36737 -9433 -11989 -50663 -55191 6080 101679 199510 287343 332008 280889 138637
35975 138637 5828 -15028 48972 61335 -48122 -189140 -245750 -240726 -266549 -296525 -211697
35964 -211697 -28554 59436 -58963 -244716 -299924 -214943 -105853 -7160 120305 238776
35954 238776 258620 199331 178326 229170 255071 184468 69758 4485 18269 68509 80171
35943 80171 5994 -98121 -98928 41532 181450 188719 143775 211314 367369 433489 359553
35932 359553 274729 242758 173986 40829 -19247 75010 187932 162366 54958 34393 128739
35921 128739 216799 227030 213438 233985 249776 175290 -7218 -202515 -282080 -226376 -159776
35910 -159776 -194523 -275165 -261203 -135161 -14625 33823 60950 100175 104903 61917 40533
$$ packed form
35987A0120m6857K7304k556l8674m528O1271R5599R7831Q7833M4665n1119j42252
35975A38637j32809k0856O4000J2363j09457j41018n6610N024k5823k9976Q4828
35964b11697J83143Q7990j18399j85753n5208Q4981J09090R8693J27465J18471
35954B38776J9844n9289k1005N0844K5901p0603j14710o5273J3784N0240J1662
35943H0171p4177j04115q07J40460J39918P269m4944O7539J56055O6120p3936
35932C59553q4824l1971o8772j33157o0076R4257J12922k5566j07408k0565R4346
35921A28739Q8060J0231j3592K0547J5791p4486j82508j95297p9565N5704O6600
35910a59776l4747q0642J3962J26042J20536M8448K7127L9225M728m2986k1384
$$ plain form
35899 40533 77468 125619 155210 179994 151965 -8197 -217941 -254112 -68945 95951 47079
35888 47079 -87084 -97276 -42383 -118607 -290073 -323916 -165142 -17964 -23886 -86000 -82981
35877 -82981 -64601 -128353 -239318 -287059 -242601 -171373 -136646 -140286 -120144 8312 250321
35866 250321 471582 518643 399251 247203 112270 -76627 -307156 -407818 -280679 -78700
35856 -78700 -7879 -42369 -1251 142433 219156 141311 40188 49316 100967 58562 -54723
35845 -54723 -110581 -103234 -153620 -277620 -308981 -123740 168848 347328 319831 168698 20164
35834 20164 -41597 15784 143156 211060 133774 -16896 -98528 -78256 -41007 -40709 -47512 -38585
35822 -38585 -34276 -32502 -5710 26075 19451 10851 77699 180384 179613 52685 -52262 -48495
$$ packed form
35899D0533L6935M8151K9591K4784k8029j60162k09744l6171J85167J64896m8872
35888D7079j34163j0192N4893p6224j71466l3843J58774J47178n922o2114L019
35877h2981J8380o3752j10965m7741M4458P1228L4727l640K0142J28456K42009
35866B50321K21261M7061j19392j52048j34933j88897k30529j00662J27139K01979
35856g8700P0821l4490M1118J43684P6723p7845j01123R128N1651m2405j13285
35845e4723n5858P347n0386j24000l1361J85241K92588J78480k7497j51133j48534
35834B0164o1761N7381J27372O7904p7286j50670q1632K0272L7249K98o803Q927
35822c8585M309J774K6792L1785o624q600O6848J02685p71j26928j04947L767
$$ plain form
35810 -48495 -50002 -166460 -286035 -217984 17881 200535 188824 66696 -908 38734 104357
35799 104357 99490 25870 -21055 22057 95693 113105 111098 185890 287620 244480 34227
35788 34227 -147031 -170102 -139512 -151669 -85627 170890 452142 511940 378868 268946 236759
35777 236759 183408 142907 248635 420742 407192 191797 57465 145139 241301 147095 -15326
35766 -15326 -57294 -43851 -120942 -207321 -127088 61728 131626 28264 -76185 -50640 66644
35755 66644 194218 285565 284997 169315 40803 32328 112559 124565 23963 -65547 -53841
35744 -53841 -1531 781 -51564 -119559 -168596 -145138 -21975 100288 65343 -110397 -207661
35733 -207661 -82070 138525 229285 145266 13335 -71707 -107066 -82464 28522 166523
$$ packed form
35810d8495j507j16458j19575O8051K35865J82654j1711j22128o7604L9642O5623
35799A04357m867p3620m6925M3112P3636J7412k007P4792J01730m3140k10253
35788C4227j81258k3071L0590j2157O6042K56517K81252N9798j33072j09922l2187
35777B36759n3351m0501J05728J72107j3550k15395j34332Q7674R6162r4206j62421
35766a5326m1968J3443p7091q6379Q0233J88816O9898j03362j04449K5545J17284
35755F6644J27574R1347n68j15682j28512q475Q0231J2006j00602q9510J1706
35744e3841N2310K312n2345o7995m9037K3458J23163J22263l4945j75740r7264
35733b07661J25591K20595R0760q4019j31931q5042l5359K4602J10986J38001
$$ plain form
35723 166523 207616 138313 107584 224640 375523 351096 138813 -33526 13155 179065
35713 179065 233613 118776 -26186 -104993 -157282 -189917 -111112 64496 123762 -60577 -286207
35702 -286207 -271182 -57285 71290 17231 -48996 -30448 -30828 -79029 -24868 158340 244623
35691 244623 116656 6412 134919 325673 270742 27923 -73309 62758 215920 244959
35681 244959 239724 253382 195679 73401 57608 195874 298334 236418 133842 121238 112494
35670 112494 -5892 -148226 -182351 -156228 -172405 -164837 -20423 165020 183521 37571 -43462
35659 -43462 75287 264341 317568 187051 -4622 -100685 -38254 99856 163003 104946 43454
35648 43454 100663 245163 359617 393818 366029 288468 194727 167991 224075 233251 85202
$$ packed form
35723A66523M1093o9303l0729J17056J50883k4427k12283j72339M6681J65910
35713A79065N4548j14837j44962p8807n2289l2635P8805J75608N9266j84339k25630
35702b86207J5025K13897J28575n4059o6227J8548l80m8201N4161J83208Q6283
35691B44623j27967j10244J28507J90754n4931k42819j01232J36067J53162K9039
35681B44959n235J3658n7703j22278j5793J38266J02460o1916j02576j2604q744
35670A12494j18386j42334l4125K6123j6177P568J44414J85443J8501j45950q1033
35659d3462J18749J89054N3227j30517j91673r6063O2431J38110O3147n8057o1492
35648D3454N7209J44500J14454L4201k7789p7561r3741k6736N6084R176j48049
$$ plain form
35637 85202 -132899 -258493 -284137 -307914 -320352 -235885 -102926 -70123 -136317 -140835 -35565
35626 -35565 36532 -6409 -50890 4428 82734 81933 42958 41602 38944 -25324 -85916 -33377
35614 -33377 116690 245024 271415 191740 31549 -150173 -260973 -256530 -181509 -83289 38975
35603 38975 147100 136435 -6172 -115945 -46819 122711 214716 212154 232314 285114 248675
35592 248675 98279 -22730 -20201 17056 -13926 -60996 -30860 33201 33778 19862 139532
35581 139532 389703 567739 528360 364205 243382 170803 42017 -123877 -170355 -42702
35571 -42702 100665 87586 -52153 -151011 -117389 -5604 78932 67615 -41447 -169546 -203162
35560 -203162 -117601 -23498 -30908 -109269 -151030 -128350 -102234 -110649 -133872 -145031 -116798 -10263
$$ packed form
35637H5202k18101j25594k5644k3777j2438Q4467J32959L2803o6194m518J05270
35626c5565P2097m2941m4481N5318P8306q01l8975j356k658o4268o0592N2539
35614c3377J50067J28334K6391p9675j60191j81722j10800M443P5021R8220J22264
35603C8975J08125j0665j42607j09773O9126J69530R2005k562K0160N2800l6439
35592B48675j50396j21009K529L7257l0982m7070L0136O4061N77j3916J19670
35581A39532K50171J78036l9379j64155j20823p2579j28786j65894m6478J27653
35571d2702J43367j3079j39739r8858L3622J11785Q4536j1317j09062j28099l3616
35560b03162Q5561R4103p410p8361m1761K2680K6116q415k3223j1159K8233J06535
$$ plain form
35548 -10263 162684 302122 324062 255265 149180 -10291 -210196 -312091 -220203 -73081
35538 -73081 -74761 -187648 -209667 -119124 -86273 -139572 -108698 36329 84260 -51343 -144158
35527 -144158 -19819 138347 86090 -80151 -98829 16867 21129 -139588 -244835 -169213
35517 -169213 -76576 -158682 -364099 -492234 -439601 -261388 -67818 55754 62985 -48257
35507 -48257 -227300 -377713 -398768 -267518 -90032 -15998 -76924 -162773 -178647 -149807 -137960
35496 -137960 -139988 -125045 -95181 -51861 24103 107896 129285 88677 80277 141056 185292 164180
35484 164180 172646 294332 443190 473241 364042 198853 48179 -30600 15632 136234
35474 136234 176687 88541 15614 50302 59413 -78036 -217829 -162963 -4179 18788 -80457
$$ packed form
35548a0263J72947J39438K1940o8797j06085j59471j99905j01895R1888J47122
35538g3081j680j12887k2019R0543L2851n3299L0874J45027M7931j35603r2815
35527a44158J24339J58166n2257j66241j8678J15696M262j60717j05247P5622
35517a69213R2637q2106k05417j28135N2633J78213J93570J23572P231j11242
35507d8257j79043j50413k1055J31250J77486P4034o0926q5849j5874K8840J1847
35496a37960k028J4943K9864M3320P5964Q3793K1389m0608q400O0779M4236k1112
35484A64180Q466J21686J48858L0051j09199j65189j50674p8779M6232J20602
35474A36234M0453q8146p2927L4688R111j37449j39793N4866J58784K2967r9245
$$ plain form
35463 -80457 -60235 139050 294392 250471 120218 61558 62979 39327 -24016 -98446 -147815
35452 -147815 -93851 109176 330406 351862 151280 -53156 -85824 9215 115149 197591
35442 197591 247644 233985 197229 246226 372969 412852 286243 142628 147623 243151 249403
35431 249403 120364 -28107 -87815 -46045 56125 160666 212638 209449 205257 225933 225403
35420 225403 169363 109526 121483 207944 308746 374236 394196 384626 373781 379919 394150 407387
35408 407387 442331 526070 655483 828747 1065293 1335784 1534160 1610957 1679032 1877330
35398 1877330 2180762 2466787 2708871 2943635 3091935 3010283 2723232 2416163 2174128 1910670
35388 1910670 1588701 1319855 1180130 1099910 1011106 945821 916001 849198 722529 617198
$$ packed form
35463h0457K0222J99285J55342m3921j30253n8660J421k3652o3343p4430m9369
35452a47815N3964K03027K21230K1456k00582k04436l2668R5039J05934Q2442
35442A97591N0053j3659l6756M8997J26743L9883j26609j43615M995R5528O252
35431B49403j29039j48471n9708M1770J02170J04541N1972l189m192K0676n30
35420B25403n6040n9837J1957Q6461J00802O5490J9960r570j0845O138J4231J3237
35408D07387L4944Q3739J29413J73264K36546K70491J98376P6797O8075J98298
35398A877330L03432K86025K42084K34764J48300q1652k87051l07069k42035k63458
35388A910670l21969k68846j39725q0220q8804o5285k9820o6803j26669j05331
$$ plain form
35378 617198 567423 498084 379553 293375 274735 248073 192478 202108 297449 350621 293715
35367 293715 223407 196695 117094 -49028 -143204 -62448 47262 21134 -70850 -84547 -48162
35356 -48162 -47086 -25166 75196 124565 2469 -151864 -144993 -61018 -98396 -181785 -72940
35345 -72940 180326 263321 85179 -90478 -80097 -24398 -75131 -135439 -95522 -81718 -240534
35334 -240534 -439911 -425910 -193470 10857 25843 -63038 -107756 -95786 -107989 -165567 -197165
35323 -197165 -147042 -60273 -22760 -38147 -31298 13832 10171 -81222 -148402 -79465 54909 97135
35311 97135 32625 -16240 2974 23210 10384 14044 50251 76464 105000 197746 317104 330822
35299 330822 212306 89503 36533 -29632 -161876 -246110 -173906 -30496 26551 -15005 -64561
$$ packed form
35378F17198m9775o9339j18531q6178j8640k6662n5595R630R5341N3172n6906
35367B93715p0308k6712p9601j66122r4176Q0756J09710k6128r1984j3697L6385
35356d8162J076K1920J00362M9369j22096j54333O871Q3975l7378q3389J08845
35345g2940K53266Q2995j78142j75657J0381N5699n0733o0308L9917J3804j58816
35334b40534j99377J4001K32440K04327J4986q8881m4718J1970j2203n7578l1598
35323a97165N0123Q6769L7513j5387O849M5130l661r1393o7180O8937J34374M2226
35311I7135o4510m8865J9214K0236j2826L660L6207K6213K8536R2746J19358J3718
35299C30822j18516j22803n2970o6165j32244q4234P2204J43410N7047m1556m9556
$$ plain form
35288 -64561 -113451 -221072 -352278 -383501 -280889 -151890 -98031 -113846 -152836 -197753 -224793
35277 -224793 -179628 -50904 82513 140737 151627 206165 309376 342094 205301 -38040
35267 -38040 -217770 -242153 -175392 -122496 -98085 -51248 25087 80104 95310 123253 205106
35256 205106 285415 257558 103412 -47498 -45087 93853 187077 113262 -33286 -94852 -84423
35245 -84423 -122349 -178966 -89268 137077 251218 137839 40916 211531 492047 515892 235195
35234 235195 -35867 -88133 -43491 -63856 -100164 -52231 26418 32548 -15373 -39237 -28826
35223 -28826 -1474 65174 160931 197412 127943 25014 -43200 -113802 -221558 -303062 -313544
35212 -313544 -327758 -397696 -413675 -260916 -37565 51029 -24821 -98269 -46073 94102 230411
$$ packed form
35288f4561m8890j07621j31206l1223J02612J28999N3859j5815l8990m4917k7040
35277b24793M5165J28724J33417N8224J0890N4538J03211L2718j36793k43341
35267c8040j79730k4383O6761N2896K4411M6837P6335N5017J5206K7943Q1853
35256B05106Q0309k7857j54146j50910K411J38940R3224p3815j46548o1566J0429
35245h4423l7926n6617Q9698K26345J14141j13379r6923J70615K80516K3845k80697
35234B35195k71062n2266M4642k0365l6308M7933P8649O130m7921k3864J0411
35223b8826K7352O6648R5757L6481o9469j02929o8214p0602j07756q1504j0482
35212c13544j4214o9938j5979J52759K23351Q8594p5850p3448N2196J40175J36309
$$ plain form
35201 230411 296845 231163 19258 -218864 -315158 -248681 -141065 -51104 84770 277669
35191 277669 407584 394553 318534 277673 241755 153707 72544 77966 105362 32350 -102414
35180 -102414 -129733 -10523 90466 47283 -47387 -41202 41215 48630 -61954 -178644 -220654
35169 -220654 -240217 -294668 -327079 -263536 -166293 -181202 -336782 -485183 -475541 -329225 -197157
35158 -197157 -172681 -201641 -185196 -124409 -111906 -182679 -237401 -168875 -29196 18333 -76117
35147 -76117 -169631 -127827 -20496 -17044 -134468 -211458 -137014 5232 58957 -20174 -146466
35136 -146466 -204937 -122760 96749 342841 438471 291797 8842 -197801 -223829 -161615
35126 -161615 -165086 -265200 -355537 -347161 -282525 -257738 -268168 -213495 -71288 28759 -20857
$$ packed form
35201B30411O6434o5682k11905k38122r6294O6477J07616Q9961J35874J92899
35191B77669J29915j3031p6019m0861l5918q8048q1163N422K7396p3012j34764
35180a02414k7319J19210J00989m3183r4670O185Q2417P415j10584j16690m2010
35169b20654j9563n4451l2411O3543R7243j4909j55580j48401R642J46316J32068
35158a97157K4476k8960J6445O0787J2503p0773n4722O8526J39679M7529r4450
35147g6117r3514M1804J07331L452j17424p6990P4444J42246N3725p9131j26292
35136a46466n8471Q2177K19509K46092R5630j46674k82955k06643k6028O2214
35126a61615l471j00114r0337Q376O4636K4787j0430N4673J42207J00047m9616
$$ plain form
35115 -20857 -124564 -94593 74408 170803 45070 -180667 -256158 -95564 147607 267434
35105 267434 202816 56966 -29256 -10328 40092 27185 -56468 -132897 -128083 -30448 111972
35094 111972 205291 152414 -44308 -241722 -300758 -254939 -231360 -224844 -106847 114317 224958
35083 224958 97380 -104661 -151868 -58703 -1352 -18346 13167 138630 248344 243758 134651
35072 134651 -26173 -162011 -143402 83957 335332 344419 124134 -30831 30401 108569
35062 108569 1353 -162263 -142585 21020 99941 63651 96030 236631 279980 102278
35052 102278 -135002 -217226 -142108 -37493 42575 106361 117176 40991 -58129 -86915 -45470
35041 -45470 5281 41492 57895 24646 -37168 -15835 130535 248119 174980 -2971 -62698
$$ packed form
35115b0857j03707K9971J69001R6395j25733k25737p5491J60594K43171J19827
35105B67434o4618j45850q6222J8928N0420j2907q3653p6429M814R7635J42420
35094A11972R3319n2877j96722j97414n9036M5819K3579O516J17997K21164J10641
35083B24958j27578k02041m7207R3165N7351j6994L1513J25463J09714m586j09107
35072A34651j60824j35838J8609K27359K51375R087k20285j54965O1232P8168
35062A08569j07216j63616J9678J63605P8921l6290L2379J40601M3349j77702
35052A02278k37280q2224P5118J04615Q0068O3786J0815p6185r9120k8786M1445
35041d5470N0751L6211J6403l3249o1814K1333J46370J17584p3139j77951n9727
$$ plain form
35030 -62698 22924 69323 2186 -35204 37211 74503 -42571 -182857 -162188 -25009 56250
35019 56250 54314 58023 48108 -72057 -244254 -280135 -152146 -58779 -128047 -231410 -199653
35008 -199653 -82446 -52322 -134091 -177049 -75523 102575 226105 256192 247813 237918 191520
34997 191520 75734 -52940 -95962 -48730 -14269 -45182 -54763 39631 161946 179574 107266
34986 107266 73963 114515 144492 137068 158334 199078 146868 -5425 -89750 -8377 93088
34975 93088 33124 -133948 -203580 -110791 8894 14633 -100046 -238341 -280358 -168390 7745
34964 7745 66681 -36311 -114331 1424 198756 231979 78319 -45006 -14163 50196 13104
34953 13104 -72747 -85963 -17906 72856 183305 325265 427410 392750 230270 45642 -84192
$$ packed form
35030f2698Q5622M6399o7137l7390P2415L7292j17074j40286K0669J37179Q1259
35019E6250j936L709r915j20165j72197l5881J27989R3367o9268j03363L1757
35008a99653J17207L0124q1769m2958J01526J78098J23530L0087q379r895m6398
34997A91520j15786j28674m3022M7232L4461l0913r581R4394J22315J7628p2308
34986A07266l3303M0552K9977p424K1266M0744n2210j52293q4325Q1373J01465
34975I3088n9964j67072o9632R2789J19685N739j14679j38295m2017J11968J76135
34964G745N8936j02992p8020J15755J97332L3223j53660j23325L0843O4359l7092
34953A3104q5851j3216O8057R0762J10449J41960J02145l4660j62480j84628j29834
$$ plain form
34942 -84192 -159694 -193846 -166599 -63654 71110 147071 102926 -20468 -101372 -60077 52372
34931 52372 120232 93348 2636 -119651 -246358 -290892 -148176 156185 437041 522398 406284
34920 406284 205587 34157 -46604 -30834 17854 8908 -68584 -129012 -113758 -66009 -41780
34909 -41780 -25768 5459 18320 -4680 -9588 16145 -41728 -266461 -523185 -581863 -412535
34898 -412535 -213149 -138900 -152369 -171660 -210124 -288718 -337764 -298899 -241732 -261290 -308392
34887 -308392 -240332 -27898 192351 286965 262856 204711 145036 57371 -51681 -117721 -110601
34876 -110601 -100292 -166360 -253862 -209998 -8866 149205 67634 -168820 -287946 -197532 -95168
34865 -95168 -153269 -257070 -189481 32991 179482 119714 -38919 -131057 -112412 -34138 42666
$$ packed form
34942h4192p5502l4152K7247J02945J34764P5961m4145j23394q0904M1295J12449
34931E2372O7860k6884r0712j22287j26707m4534J42716L04361K80856Q5357j16114
34920D06284k00697j71430q0761J5770M8688q946p7492o0428J5254M7749K4229
34909d1780J6012L1227J2861k3000m908K5733n7873k24733k56724n8678J69328
34898d12535J99386P4249j3469j9291l8464p8594m9046L8865N7167j9558m7102
34887c08392O8060K12434K20249R4614k4109n8145n9675q7665j09052o6040P120
34876a10601J0309o6068q7502M3864K01132J58071q1571k36454j19126R0414J02364
34865i5168n8101j03801O7589K22472J46491n9768j58633r2138J8645P8274P6804
$$ plain form
34854 42666 63830 7453 -63805 -52539 38297 98461 69347 22149 34836 80917 99451 94925
34842 94925 100821 115210 136884 190358 248164 218410 97912 38823 137863 248738 169898
34831 169898 -39215 -124999 -10141 109545 74802 -35527 -97738 -147963 -257263 -352476
34821 -352476 -330753 -254067 -256738 -321739 -320827 -241731 -199185 -221012 -195609 -69257 56133 84181
34809 84181 55987 47672 46960 20112 8873 55856 100047 60452 -14632 264 111804 176949
34797 176949 103177 -4965 34798 246622 434881 372200 40420 -324821 -447295 -279129
34787 -279129 -38596 35545 -66699 -163182 -129333 -26538 28907 30488 45778 75394 52146
34776 52146 -20710 -33827 75763 212603 244100 189984 189197 284498 353303 292800 169475
$$ packed form
34854D2666K1164n6377p1258J1266R0836O0164k9114m7198J2687M6081J8534m526
34842I4925N896J4389K1674N3474N7806k9754j20498n9089R9040J10875p8840
34831A69898k09113q5784J14858J19686l4743j10329o2211n0225j09300r5213
34821c52476K1723P6686k671o5001R12P9096M2546k1827K5403J26352J25390K8048
34809H4181k8194q315p12k6848j1239M6983M4191l9595p5084J4896J11540O5145
34797A76949p3772j08142L9763K11824J88259o2681l31780l65241j22474J68166
34787b79129K40533P4141j02244r6483L3849J02795N5445J581J5290K9616k3248
34776E2146p2856j3117J09590J36840L1497n4116p87R5301O8805o0503j23325
$$ plain form
34765 169475 104386 93654 57202 10552 41142 121336 107210 -25225 -94243 31619 209817
34754 209817 202590 11157 -134198 -101274 -4620 8068 -39681 -53632 -53742 -124548 -236406
34743 -236406 -256686 -148529 -49214 -103590 -283226 -422652 -403831 -261583 -120235 -65049
34733 -65049 -84905 -120468 -143342 -170510 -206403 -208701 -144965 -59550 -27660 -42513 -18471 61366
34721 61366 77451 -63177 -242982 -235700 -5476 216470 216729 59040 -40579 -17656 3680
34710 3680 -54669 -116914 -111197 -85197 -86543 -52200 69858 176844 123808 -60801 -198264
34699 -198264 -185041 -84866 -2530 21888 -15788 -105912 -188950 -196478 -162391 -196455 -306045
34688 -306045 -348206 -225034 -32065 74589 81346 86826 128195 152786 133353 99027 58803
$$ packed form
34765A69475o5089j0732l6452m6650L0590Q0194j4126j32435o9018J25862J78198
34754B09817p227j91433j45355L2924R6654J2688m7749j3951j10p0806j11858
34743b36406k0280J08157R9315n4376j79636j39426J8821J42248J41348N5186
34733f5049j9856l5563k2874k7168l5893k298O3736Q5415L1890j4853K4042P9837
34721F1366J6085j40628j79805P282K30224K21946K59j57689r9619K2923K1336
34710C680n8349o2245N717K6000j346L4343J22058J06986n3036j84609j37463
34699a98264J3223J00175Q2336K4418l7676r0124q3038p528L4087l4064j09590
34688c06045m2161J23172J92969J06654O757N480M1369K4591j9433l4326m0224
$$ plain form
34677 58803 -871 -38200 16002 126066 152689 42232 -73415 -45751 85580 155503 107776
34666 107776 50747 63678 61570 -69607 -271931 -358380 -248781 -66095 28902 16061 -19662
34655 -19662 -29464 -29982 -35964 -46832 -78518 -132371 -150368 -79682 35915 116614 178840 294296
34643 294296 420070 407621 219196 3086 -110342 -163339 -240697 -311047 -314602 -304159 -353654
34632 -353654 -394862 -299633 -94945 48010 37812 -44807 -84837 -57353 -1371 39523 32617
34621 32617 -20661 -71680 -84312 -83642 -90537 -60126 29936 84852 -1982 -186149 -327780 -373328
34609 -373328 -363750 -308816 -199424 -107799 -107020 -111626 16440 208224 241765 80745 -59746
34598 -59746 -42258 24133 32264 55458 132769 101634 -145734 -410137 -426315 -240894 -112019
$$ packed form
34677E8803n9674l7329N4202J10064K6623j10457j15647K7664J31331O9923m7727
34666A07776n7029J2931k108j31177k02324q6449J09599J82686R4997j2841l5723
34655a9662r802n18n982j0868l1686n3853j7997P0686J15597Q0699O2226J15456
34643B94296J25774j2449j88425k16110j13428n2997p7358p0350l555J0443m9495
34632c53654m1208R5229K04688J42955j0198q2619m0030K7484N5982M0894o906
34621C2617n3278n1019j2632O70o895L0411R0062N4916q6834j84167j41631m5548
34609c73328R578N4934J09392R1625P79m606J28066J91784L3541j61020j40491
34598e9746J7488O6391Q131K3194P7311l1135k47368k64403j6178J85421J28875
$$ plain form
34587 -112019 -112173 -81421 55618 179960 214483 242583 311243 300055 104862 -169624 -326096
34576 -326096 -320747 -284429 -319961 -374184 -342902 -247895 -234537 -371353 -519205 -485940 -283484
34565 -283484 -112875 -84020 -93741 -39194 3605 -67319 -183201 -225276 -245218 -368290 -523990
34554 -523990 -486266 -200706 113597 242742 208460 157941 159925 195710 243981 271544 206725
34543 206725 18479 -210320 -358914 -391427 -345951 -234944 -41393 177122 264462 120317
34533 120317 -138529 -255380 -117744 92096 106247 -105076 -322151 -374472 -312851 -247425
34523 -247425 -166173 -19966 124869 156303 78846 -13885 -80820 -133050 -137867 -51513 71278
34512 71278 118746 71972 18538 20563 51117 55406 11105 -51778 -48556 78836 227151 191825
$$ packed form
34587a12019j54L0752J37039J24342L4523K8100O8660j1188j95193k74486j56472
34576c26096N349L6318l5532n4223L1282R5007J3358j36816j47852L3265K02456
34565b83484J70609K8855r721N4547M2799p0924j15882m2075j9942j23072j55700
34554e23990L7724K85560L14303J29145l4282n0519J984L5785M8271K7563o4819
34543B06725j88246k28799j48594l2513M5476J11007J93551K18515Q7340j44145
34533A20317k58846j16851J37636K09840J4151k11323k17075n2321O1621O5426
34523b47425Q1252J46207J44835L1434p7457r2731o6935n2230m817Q6354J22791
34512G1278M7468m6774n3434K025L0554M289m4301o2883L222J27392J48315l5326
$$ plain form
34500 191825 -39490 -190384 -57940 153906 93536 -225321 -442729 -369956 -201695 -159675
34490 -159675 -199993 -191300 -147803 -127751 -85284 6349 27596 -117801 -310307 -355449 -242034
34479 -242034 -113915 -49957 -17911 86 -16500 -39589 -8326 60612 76977 5552 -83546
34468 -83546 -108634 -66795 -18031 -15980 -63474 -116749 -129889 -97760 -48026 -3224 26741 36370
34456 36370 46087 100216 186229 194922 49662 -150001 -222139 -135264 -34242 -25025 -53138 -24478
34444 -24478 66403 167155 225524 186343 38370 -106301 -99287 38411 122802 63784 -23432
34433 -23432 -25020 9022 9193 43030 181289 318329 293979 136236 24952 35192 55345
34422 55345 -30391 -187876 -292258 -274029 -174548 -84038 -41550 -759 94653 221800 302269
$$ packed form
34500A91825k31315j50894J32444K11846o0370l18857k17408P2773J68261M2020
34490a59675m0318Q693M3497K0052M2467R1633K1247j45397j92506m5142J13415
34479b42034J28119O3958L2046J7997j6586k3089L1263O8938J6365p1425q9098
34468h3546k5088M1839M8764K051m7494n3275j3140L2129M9734M4802K9965R629
34456C6370R717N4129Q6013Q693j45260j99663p2138Q6875J01022R217k8113K8660
34444b4478R0881J00752N8369l9181j47973j44671P014J37698Q4391n9018q7216
34433b3432j588L4042J71L3837J38259J37040k4350j57743j11284J0240K0153
34422E5345q5736j57485j04382J8229R9481R0510M2488M0791R5412J27147Q0469
$$ plain form
34411 302269 292424 200569 53473 -80075 -89760 33036 104932 -35695 -260766 -297385 -127810
34400 -127810 -3497 -31713 -30052 107064 190707 71775 -66002 4453 173684 185056 54210
34389 54210 -145 51263 34870 -79668 -116313 -889 123100 141452 115575 115217 93139
34378 93139 8863 -71762 -81885 -48542 -25675 -27780 -65053 -147380 -225224 -221236 -142190 -67730
34366 -67730 -20252 46207 115296 92373 -35529 -133635 -81989 67912 159192 100079 -81592
34355 -81592 -307863 -508544 -614766 -554921 -316139 -17698 145944 105011 8088 15554 53441
34344 53441 -59210 -261472 -270288 -13990 211088 168478 29493 73395 235958 233500 10467
34333 10467 -223642 -331391 -346490 -281719 -111066 67451 103333 30337 5302 32223 -3758
$$ packed form
34411C02269r845r1855j47096j33548r685J22796P1896j40627k25071l6619J69575
34400a27810J24313k8216J661J37116Q3643j18932j37777P0455J69231J1372j30846
34389E4210n4355N1408j6393j14538l6645J15424J23989J8352k5877l58k2078
34378I3139q4276q0625j0123L3343K2867k105l7273q2327p7844L988P9046P4460
34366f7730M7478O6459O9089k2923j27902r8106N1646J49901R1280n9113j81671
34355h1592k26271k00681j06222N9845K38782K98441J63642m0933r6923P466L7887
34344E3441j12651k02262q816K56298K25078m2610j38985M3902J62563k458k23033
34333A0467k34109j07749j5099O4771J70653J78517L5882p2996k5035K6921l5981
$$ plain form
34322 -3758 -51642 61243 279088 319067 98306 -125522 -142009 -49815 -12241 -7523 32699
34311 32699 66587 74989 138075 233327 179501 -51962 -197841 -80299 89175 27197 -180725
34300 -180725 -238442 -112228 -44151 -146104 -265740 -267515 -207473 -183010 -196798 -223847 -268644
34289 -268644 -307761 -288860 -220753 -173544 -176225 -198643 -228761 -271360 -276571 -178000 -13992 89123
34277 89123 78678 34772 39495 64155 29545 -74578 -178452 -220968 -215068 -219057 -255233 -280510
34265 -280510 -253337 -198515 -162041 -134164 -88803 -67900 -117957 -157097 -51685 148447 215710
34254 215710 60542 -117697 -111720 6645 36933 -29216 -33329 63644 122352 52678 -70495
34243 -70495 -148108 -174600 -174931 -138873 -67342 281 46589 98721 163853 205154 208360 216952
$$ packed form
34322c758m7884J12885K17845L9979k20761k23828j6487R2194L7574M718M0222
34311C2699L3888Q402O3086R5252n3826k31463j45879J17542J69474o1978k07922
34300a80725n7717J26214O8077j01953j19636j775O0042K4463j3788k7049m4797
34289b68644l9117J8901O8107M7209k681k2418l0118m2599n211R8571J64008J03115
34277H9123j0445m3906M723K4660l4610j04123j03874m2516N900l989l6176k5277
34265b80510K7173N4822L6474K7877M5361K0903n0057l9140J05412K00132O7263
34254B15710j55168j78239N977J18365L0288o6149m113R6973N8708o9674j23173
34243g0495p7613k6492l31L6058P1531O7623M6308N2132O5132M1301L206Q592
$$ plain form
34231 216952 271580 350271 388203 340043 228987 146990 168841 236076 185426 -44803 -295186
34220 -295186 -363247 -259003 -173057 -210795 -281703 -264555 -162157 -47323 46888 119200 149172
34209 149172 119933 58127 7774 -11880 -2335 23560 28488 -26506 -118567 -165365 -124714 -53806
34197 -53806 -29684 -43442 -23726 51526 122672 134769 109318 101604 115577 104165 51783 11961
34185 11961 38727 112272 170873 196647 220645 249356 243285 181480 96340 23718 -34234 -73695
34173 -73695 -68972 -22457 13469 5448 -15802 -23558 -53673 -130157 -182839 -131949 -29564 -10736
34161 -10736 -98613 -166697 -130409 -68021 -73922 -82953 31195 218689 266893 91683 -112038
34150 -112038 -104761 96908 271071 289115 219472 145282 47966 -71892 -114468 -34795 37335
$$ packed form
34231B16952N4628P8691L7932m8160j11056q1997K1851O7235n0650k30229k50383
34220b95186o8061J04244Q5946l7738p0908J7148J02398J14834R4211P2312K9972
34209A49172k9239o1806n0353j9654R545K5895M928n4994r2061m6798M0651P0908
34197e3806K4122j3758J9716P5252P1146J2097k5451p714J3973j1412n2382l9822
34185A1961K6766P3545N8601K5774K3998K8711o071o1805q5140p2622n7952l9461
34173g3695M723M6515L5926q021k1250p756l0115p6484n2682N0890J02385J8828
34161a0736q7877o8084L6288O2388n901r031J14148J87494M8204j75210k03721
34150a12038P277K01669J74163J8044o9643p4190r7316j19858m2576P9673P2130
$$ plain form
34139 37335 -33429 -180128 -237384 -188550 -148711 -143284 -84311 36500 112126 103047 82597 59829
34127 59829 -59131 -257260 -334569 -170584 83364 204299 171875 113097 87116 75828 98683
34116 98683 175780 237310 220902 205491 293156 402721 352078 131486 -71929 -132122 -111662
34105 -111662 -105750 -104836 -62412 17675 111770 199188 222553 128094 -19081 -67239 26158 131101
34093 131101 131338 75012 71886 130855 181392 184918 141663 46511 -76895 -146952 -116433 -57355
34081 -57355 -66533 -114977 -86144 45870 175425 221144 233944 299393 388968 375789 192130
34070 192130 -73063 -253643 -272705 -209136 -187390 -224429 -229353 -147986 -35231 47039 119964
34059 119964 195683 168053 -67212 -398845 -561535 -454894 -259872 -159380 -87005 104948
$$ packed form
34139C7335p0764j46699n7256M8834L9839N427N8973J20811P5626r079k0450k2768
34127E9829j18960j98129p7309J63985K53948J20935l2424n8778k5981j1288K2855
34116I8683P7097O1530j6408j5411Q7665J09565n0643k20592k03415o0193K0460
34105a11662N912R14M2424Q0087R4095Q7418K3365r4459j47175m8158R3397J04943
34093A31101K37n6326l126N8969N0537L526m3255r5152j23406p0057L0519N9078
34081e7355r178m8444K8833J32014J29555M5719J2800O5449Q9575j3179j83659
34070A92130k65193j80580j9062O3569K1746l7039m924Q1367J12755Q2270P2925
34059A19964P5719k7630k35265l31633j62690J06641J95022J00492P2375J91953
$$ plain form
34049 104948 337137 363983 121269 -171648 -285101 -203255 -41653 104739 170339 121269
34039 121269 34646 53367 178074 229384 108513 -45560 -79148 -53429 -84339 -92872 61189
34028 61189 288069 363323 280271 256388 381417 502962 501209 442448 394733 316562 212441
34017 212441 176850 182614 56511 -200192 -304926 -96322 173392 187363 25022 -8243
34007 -8243 120640 171717 76605 40810 154723 210323 37283 -207498 -253054 -75002 106680
33996 106680 104410 -75743 -281476 -332152 -150971 138893 298760 218812 30055 -73953
33986 -73953 -56395 -15736 -20601 -57230 -93304 -101718 -51003 42116 79434 -2807 -102569 -51370
33974 -51370 142197 267484 178583 -24797 -162203 -212601 -261881 -285187 -162303 86151
$$ packed form
34049A04948K32189K6846k42714k92917j13453Q1846J61602J46392O5600m9070
34039A21269q6623J8721J24707N1310j20871j54073l3588K5719l0910q533J54061
34028F1189K26880P5254q3052k3883J25029J21545j753n8761m7715p8171j04121
34017B12441l5591N764j26103k56703j04734K08604K69714J3971j62341l3265
34007h243J28883N1077r5112l5795J13913N5600j73040k44781m5556J78052J81682
33996A06680k270j80153k05733n0676J81181K89864J59867p9948j88757j04008
33986g3953J7558M0659m865l6629l6074q414N0715R3119L7318q2241r9762N1199
33974e1370J93567J25287q8901k03380j37406n0398m9280k3306J22884K48454
$$ plain form
33964 86151 256332 222240 93608 20661 -21723 -122463 -225019 -210156 -119489 -96284 -126582
33953 -126582 -52707 130401 214568 104097 1106 111271 309369 289980 -15154 -350300
33943 -350300 -454381 -317741 -104601 49392 103577 63937 -40723 -140487 -142839 -16982
33933 -16982 139079 165787 20985 -141140 -134080 38181 195845 202920 82507 -73178 -192527
33922 -192527 -215943 -123480 -4571 15899 -47158 -63991 -19702 -55444 -210595 -299196 -167054
33911 -167054 73937 211037 206675 160609 114081 63339 72247 183568 282164 228860 81750
33900 81750 6020 8329 -46943 -181199 -260860 -219282 -134009 -62641 21475 99671 88215 -4660
33888 -4660 -61840 -47004 -52216 -100421 -73767 68352 161620 60346 -129314 -183311 -50703
$$ packed form
33964H6151J70181l4092j28632p2947m2384j00740j02556J4863R0667K3205l0298
33953a26582P3875J83108Q4167j10471j02991J10165J98098j9389l05134l35146
33943c50300j04081J36640K13140J53993N4185l9640j04660r9764k352J25857
33933a6982J56061K6708j44802j62125P060J72261J57664P075j20413j55685j19349
33922a92527k3416R2463J18909K0470o3057j6833M4289l5742j55151q8601J32142
33911a67054K40991J37100m362m6066m6528n0742Q908J11321R8596n3304j47110
33900H1750p5730K309n5272j34256p9661M1578Q5273P1368Q4116P8196j1456r2875
33888d660n7180J4836n212m8205K6654J42119R3268j01274j89660n3997J32608
$$ plain form
33877 -50703 124383 221635 251198 252815 205500 72853 -117481 -270304 -293435 -183358 -43337
33866 -43337 14854 -10851 -39165 -45965 -96035 -207752 -281852 -235460 -132305 -87146 -93643 -59341
33854 -59341 9438 -15521 -190655 -386738 -435069 -324328 -183218 -111810 -106052 -122972 -135923
33843 -135923 -125989 -95412 -96107 -167733 -242035 -206344 -80927 -10807 -36581 -23897 87576 135854
33831 135854 -721 -154124 -117080 -18461 -140092 -415473 -473596 -223255 -18476 -103230
33821 -103230 -246646 -158113 41787 61368 -85895 -172652 -160079 -178314 -222278 -199237 -199395
33810 -199395 -378724 -610920 -601506 -357560 -205246 -288379 -380451 -294716 -165245 -160447 -185335
33799 -185335 -72782 121479 216812 171344 80401 12376 -17876 -2635 20809 -22028 -109086
$$ packed form
33877e0703J75086R7252K9563J617m7315j32647j90334j52823k3131J10077J40021
33866d3337N8191k5705k8314o800n0070j11717p4100M6392J03155M5159o497L4302
33854e9341O8779k4959j75134j96083m8331J10741J41110P1408N758j6920j2951
33843a35923R934L0577o95p1626p4302L5691J25417P0120k5774J2684J11473M8278
33831A35854j36575j53403L7044R8619j21631k75381n8123K50341K04779q4754
33821a03230j43416Q8533J99900J9581j47263q6757J2573j8235m3964K3041j58
33810a99395j79329k32196R414K43946J52314q3133r2072Q5735J29471M798k4888
33799a85335J12553J94261R5333m5468r0943o8025l0252J5241K3444m2837q7058
$$ plain form
33788 -109086 -112021 -14542 -1225 -192166 -409896 -380929 -98201 182977 275121 231349 190179
33777 190179 181946 132801 -9412 -192006 -283244 -186213 58925 303910 425301 397892 258824
33766 258824 79739 -23792 40214 219320 342574 309564 185700 85487 50222 73092
33756 73092 140117 190503 136372 -8075 -104375 -66158 26659 58899 34065 15409 2864
33745 2864 -32471 -65724 -71590 -92771 -150012 -149456 -2490 206299 296333 213859 65922 -44994
33733 -44994 -101860 -103630 -47425 3369 -44979 -174827 -254133 -217304 -149514 -134094 -114956 -4765
33721 -4765 134968 137574 -51926 -292480 -397957 -314526 -131514 30118 106902 105006 66832
33710 66832 29573 5199 -5466 2153 18984 15643 -3644 34145 175204 314530 279840 81881
$$ packed form
33788a09086k935R7479J3317j90941k17730K8967K82728K81178R2144m3772m1170
33777A90179q233m9145j42213j82594r1238R7031K45138K44985J21391k7409j39068
33766B58824j79085j03531O4006J79106J23254l3010j23864j00213l5265K2870
33756G3092O7025N0386n4131j44447r6300L8217R2817L2240k4834j8656j2545
33745B864l5335l3253n866k1181n7241N56J46966K08789R0034q2474j47937j10916
33733d4994n6866j770N6205N0794m8348j29848p9306L6829O7790J5420J9138J10191
33721d765J39733K606j89500k40554j05477Q3431J83012J61632P6784j896l8174
33710F6832l7259k4374j0665P619J6831l341j9287L7789J41059J39326l4690j97959
$$ plain form
33698 81881 -40613 77626 286337 317588 149314 -2224 -14823 14996 -6085 -25161 11169
33687 11169 49011 60230 121989 250188 304392 199645 84691 145325 323708 402502 305650
33676 305650 150291 37776 -44729 -118450 -147948 -107283 -26011 42140 49719 -17461 -100572
33665 -100572 -107924 -38177 11265 -234 -2439 28505 4486 -88830 -104361 26746 126970
33654 126970 27662 -145603 -154086 1921 138756 198686 253613 272753 159473 -7416 -37296
33643 -37296 60234 78785 -41760 -116434 -14439 154057 216179 127658 -59152 -252604 -313805
33632 -313805 -158083 98510 239572 208810 129532 85891 57292 47112 81290 91724 187
33621 187 -100141 -57398 74868 124134 114923 214293 369764 327007 60974 -133967 -83974
$$ packed form
33698H1881j22494J18239K08711L1251j68274j51538j2599K9819k1081j9076L6330
33687A1169L7842J1219O1759J28199N4204j04747j14954O0634J78383P8794r6852
33676C05650j55359j12515q2505p3721k9498M0665Q1272O8151P579o7180q3111
33665a00572p352O9747M9442j1499k205L0944k4019r3316j5531J31107J00224
33654A26970r9308j73265q483J56007J36835N9930N4927J9140j13280j66889k9880
33643c7296R7530J8551j20545p4674J01995J68496O2122q8521j86810j93452o1201
33632c13805J55722K56593J41062l0762p9278m3641k8599j0180L4178J0434r1537
33621A87j00328M2743J32266M9266r211R9370J55471m2757k66033j94941M9993
$$ plain form
33610 -83974 34169 23955 -54635 -83802 -101104 -155328 -178242 -145859 -148440 -170380 -37757
33599 -37757 271145 505024 492640 386583 386638 451224 466036 467361 490526 417119 205482 75337
33587 75337 208538 426120 424784 218789 96145 209868 435936 597799 652388 667590
33577 667590 725340 823163 842912 713310 598506 733803 1047296 1195575 1054557 900048
33567 900048 978042 1184540 1337215 1469588 1643428 1753647 1769057 1903395 2278622 2672698
33557 2672698 2891051 3133111 3657486 4318960 4818426 5229259 5874950 6802332 7748663
33548 7748663 8532950 9122218 9401902 9246385 8761593 8134909 7333704 6289012 5256738
33539 5256738 4584165 4185601 3681884 3032133 2571771 2398238 2196019 1789289 1427826
$$ packed form
33610h3974J18143j0214p8590k9167j7302n4224k2914L2383k581k1940J32623
33599c7757L08902K33879j2384j06057N5O4586J4812J325K3165p3407k11637j30145
33587G5337J33201K17582j336k05995j22644J13723K26068J61863N4589J5202
33577F67590N7750R7823J9749j29602j14804J35297L13493J48279j41018j54509
33567I00048P7994K06498J52675J32373J73840J10219J5410J34338L75227L94076
33557B672698K18353K42060N24375O61474M99466M10833O45691R27382R46331
33548G748663P84287N89268K79684j55517m84792o26684q01205j044692j032274
33539E256738o72573l98564n03717o49751m60362j73533k02219m06730l61463
$$ plain form
33530 1427826 1336712 1357961 1261695 1102247 1028628 991030 872397 723780 655574 637828 586485
33519 586485 524771 505481 483979 409289 349777 399693 522208 585392 518526 377474 284344
33508 284344 315009 414069 451616 405665 402356 494383 530537 396648 251022 303456 469616
33497 469616 504788 400128 349757 369970 283259 94026 39441 189093 308282 236193 118100
33486 118100 122113 176638 146733 61245 13704 14664 63917 190330 314780 271231 77209
33475 77209 -25994 67767 148507 26921 -161615 -189537 -90913 -56385 -112281 -139421 -120785
33464 -120785 -141503 -188580 -160555 -70049 -56857 -169782 -267075 -183745 69039 303312 332586
33453 332586 155601 -36236 -64627 40099 110340 75152 12188 -17924 -42604 -63412 -25725
$$ packed form
33530A427826r1114K1249r6266j59448p3619l7598j18633j48617o8206j7746n1343
33519E86485o1714j9290k1502p4690n9512M9916J22515O3184o6866j41052r3130
33508B84344L0665R9060L7547m5951l309R2027L6154j33889j45626N2434J66160
33497D69616L5172j04660n0371K0213q6711j89233n4585J49652J19189p2089j18093
33486A18100M013N4525k9905q5488m7541R60M9253J26413J24450m3549j94022
33475G7209j03203R3761Q0740j21586j88536k7922R8624L4528n5896k7140J8636
33464a20785k0718m7077K8025R0506J3192j12925r7293Q3330K52784K34273K9274
33453C32586j76985j91837k8391J04726P0241l5188o2964l0112k4680k0808L7687
$$ plain form
33442 -25725 50434 58683 -12965 -37099 44883 121181 107616 94233 171700 246249 177613 6751
33430 6751 -104327 -100879 -70514 -88103 -139980 -182420 -187803 -145903 -76542 -19444 19335 67598
33418 67598 115917 116786 76490 60311 78024 65148 11897 -8902 8717 -35696 -160261 -214504
33406 -214504 -99513 47880 34259 -120391 -245384 -280760 -305813 -340623 -299111 -166754
33396 -166754 -77662 -143580 -289664 -329500 -173355 72931 205178 115395 -94793 -212028
33386 -212028 -145808 -30402 -44290 -165322 -196806 -45349 128649 110950 -74889 -185819
33376 -185819 -76609 108493 128665 -43390 -206752 -195523 -45348 103427 160528 122861
33366 122861 55853 61661 171344 261647 200445 73643 89827 230677 229227 -4365 -190430
$$ packed form
33442b5725P6159Q249p1648k4134Q1982P6298j3565j3383P7467P4549o8636j70862
33430F751j11078L448L0365j7589n1877m2440n383M1900O9361N7098L8779M8263
33418F7598M8319Q69m0296j6179J7713j2876n3251k0799J7619m4413j24565n4243
33406b14504J14991J47393j3621j54650j24993l5376k5053l4810M1512J32357
33396a66754Q9092o5918j46084l9836J56145K46286J32247q9783k10188j17235
33386b12028O6220J15406j3888j21032l1484J51457J73998j7699j85839j10930
33376a85819J09210J85102K0172j72055j63362J1229J50175J48775N7101l7667
33366A22861o7008N808J09683R0303o1202j26802J6184J40850j450k33592j86065
$$ plain form
33355 -190430 -96136 95615 92329 -35875 -16168 137922 175995 88688 131879 336572 386549
33344 386549 119517 -179235 -174912 74359 270903 279797 182662 75889 2390 -8112 24757
33333 24757 26623 -11955 -11331 28089 -25829 -212315 -344350 -243724 44 155044 148965
33322 148965 99343 100862 127522 128411 109756 118167 194887 317480 356957 172744 -185799 -456511
33310 -456511 -436741 -221104 -75700 -122842 -247214 -283315 -193035 -54902 38947 46568 -15739
33299 -15739 -96846 -151210 -166905 -157231 -131520 -77367 24627 157526 251295 251229 205064 219083
33287 219083 306099 352753 279278 148127 53398 -7728 -70835 -103745 -80099 -75963 -166146
33276 -166146 -278674 -277454 -150860 -9036 61642 41855 -57269 -161967 -138890 46319 242524
$$ packed form
33355a90430R4294J91751l286j28204J9707J54090L8073q7307M3191K04693M9977
33344C86549k67032k98752M323K49271J96544Q894r7135j06773p3499j0502L2869
33333B4757J866l8578O24L9420n3918j86486j32035J00626K43768J55000o079
33322A48965m9622J519K6660Q89j8655Q411P6720J22593L9477j84213l58543k70712
33310d56511J9770K15637J45404m7142j24372l6101R0280J38133R3849P621o2307
33299a5739q1107n4364j5695R674K5711N4153J01994J32899R3769o6m6165J4019
33287B19083Q7016M6654p3475j31151r4729o1126o3107l2910K3646M136r0183
33276a66146j12528J220J26594J41824P0678j9787r9124j04698K3077J85209J96205
$$ plain form
33265 242524 300538 255187 197064 92781 -92054 -219111 -147600 20218 94213 101537 180335
33254 180335 259123 148263 -89228 -177804 -49146 79656 73370 25032 -6778 -99621 -227724
33243 -227724 -215509 -40872 76252 1537 -137560 -204816 -238574 -270375 -207902 -36617 81767
33232 81767 47797 -39195 -96587 -193384 -347092 -411501 -316018 -210915 -222106 -256068 -199523
33221 -199523 -118727 -99140 -73616 18526 74294 6654 -72013 -20463 112902 202460 243530
33210 243530 283094 283603 213688 156116 175297 187395 99481 -33515 -117863 -166507 -208224 -178629
33198 -178629 -40526 104275 160374 183953 251526 301485 248602 148498 101365 85855 31836
33187 31836 -27435 -20975 12591 -11443 -57559 -3646 164605 291877 211526 -60954 -303601
$$ packed form
33265B42524N8014m5351n8123j04283j84835j27057P1511J67818P3995P324P8798
33254A80335P8788j10860k37491q8576J28658J28802o286m8338l1810r2843j28103
33243b27724J2215J74637J17124p4715j39097o7256l3758l1801O2473J71285J18384
33232H1767l3970q6992n7392r6797j53708o4409R5483J05103j1191l3962N6545
33221a99523Q0796J9587K5524R2142N5768o7640p8667N1550J33365Q9558M1070
33210B43530L9564N09o9915n7572J9181J2098q7914j32996q4348m8644m1717K9595
33198a78629J38103J44801N6099K3579O7573M9959n2883j00104m7133j5510n4019
33187C1836n9271O460L3566k4034m6116N3913J68251J27272q0351k72480k42647
$$ plain form
33176 -303601 -293069 -68044 84762 -11039 -180605 -162564 -3483 39643 -81949 -168171
33166 -168171 -133621 -116166 -186261 -233930 -208397 -195066 -183957 -45517 176976 245821 110517
33155 110517 14933 90133 141844 14139 -125217 -72277 88691 163447 138924 98178 41630
33144 41630 -23646 -6830 88383 102139 -18050 -105299 -62149 -15139 -33678 20261 174284
33133 174284 184611 -57108 -245872 -94025 207152 285082 142256 71397 167128 266471
33123 266471 280862 271514 251160 185793 151701 250963 407167 453100 382881 335120 368382
33112 368382 411901 394878 298115 134265 -29271 -108070 -122114 -158232 -174607 -31331 225092
33101 225092 339559 209407 32308 -13975 11821 29473 83451 136986 27021 -209484
$$ packed form
33176c03601J0532K25025J52806r5801j69566J8041J59081M3126j21592q6222
33166a68171L4550J7455p0095m7669K5533J3331J1109J38440K22493O8845j35304
33155A10517r5584P5200N1711j27705j39356N2940J60968P4756k4523m0746n6548
33144D1630o5276J6816R5213J3756j20189q7249M3150M7010j8539N3939J54023
33133A74284J0327k41719j88764J51847L01177P7930j42826p0859R5731R9343
33123B66471J4391r348k0354o5367l4092R9262J56204M5933p0219m7761L3262
33112C68382M3519j7023r6763j63850j63536p8799j4044l6118j6375J43276K56423
33101B25092J14467j30152j77099m6283K5796J7652N3978N3535j09965k36505
$$ plain form
33091 -209484 -285147 -122832 -17817 -122109 -154713 83325 300480 198159 4416 83920
33081 83920 319092 366872 288289 394390 622740 603023 283220 2376 -52122 -21896 -2003
33070 -2003 94188 238672 230132 29020 -141637 -117771 20250 143168 239414 328332 383165
33059 383165 394342 391023 383919 367422 348596 315486 248202 196919 226640 268804 216477 176271
33047 176271 350631 628708 646702 359516 153401 223513 281892 131934 59672 289332
33037 289332 491841 297146 -65806 -136188 70938 227476 299503 461782 611854 508203
33027 508203 259044 177431 259251 261507 178128 185893 242790 198707 184177 418551 736876
33016 736876 784498 599670 531967 649718 696275 585091 479216 409902 254834 73171
$$ packed form
33091b09484p5663J62315J05015j04292l2604K38038K17155j02321j93743P9504
33081H3920K35172M7780p8583J06101K28350j9717l19803k80844n4498L0226J9893
33070b003R6191J44484q540k01112j70657K3866J38021J22918R6246Q8918N4833
33059C83165J1177l319p104j6497j8826l3110o7284n1283K9721M2164n2327m0206
33047A76271J74360K78077J7994k87186k06115P0112N8379j49958p2262K29660
33037B89332K02509j94695l62952p0382K07126J56538P2027J62279J50072j03651
33027E08203k49159q1613Q1820K256q3379P765N6897m4083j4530K34374L18325
33016G36876M7622j84828o7703J17751M6557j11184j05875o9314j55068j81663
$$ plain form
33006 73171 49870 135704 129300 58380 92526 166464 104277 21068 156080 391332 403304
32995 403304 230992 214791 404466 503570 396931 277676 241351 184410 114858 157058 251189
32984 251189 234035 185609 308868 525266 589543 522772 510031 477897 247834 9698 119795
32973 119795 481843 657286 564265 535173 684713 761765 665072 587931 594958 542558 468854
32962 468854 586631 842242 941391 841540 763136 718355 525939 293980 351494 656443
32952 656443 801507 672111 576660 651765 670858 546587 501342 605422 635033 527870
32942 527870 515907 668715 749967 664154 623052 736580 835405 818740 809056 869306 911897
32931 911897 934354 1001367 998160 775704 510363 513841 723528 804405 705807 667178 721206
$$ packed form
33006G3171k3301Q5834o404p0920L4146P3938o2187q3209J35012K35252J1972
32995D03304j72312j6201J89675R9104j06639j19255l6325n6941o9552M2200R4131
32984B51189j7154m8426J23259K16398O4277o6771j2741l2134k30063k38136J10097
32973A19795L62048J75443r3021k9092J49540P7052r6693p7141P027n2400p3704
32962D68854J17777K55611R9149r9851p8404m4781j92416k31959N7514L04949
32952F56443J45064j29396r5451P5105J9093j24271m5245J04080K9611j07163
32942E27870j1963J52808Q1252q5813m1102J13528R8825j6665r684O0250M2591
32931I11897K2457O7013l207k22456k65341L478K09687Q0877r8598l8629N4028
$$ plain form
32920 721206 662782 481920 377452 387573 432562 608164 971866 1200767 993630 644901
32910 644901 640631 863854 843236 616518 626361 876072 942816 770840 705070 772666 675974
32899 675974 475756 536747 810809 906495 824455 873587 949713 723192 446059 657450
32889 657450 1141046 1157515 718565 595250 979649 1210042 1003549 893041 1167037 1397439
32879 1397439 1349675 1397598 1683567 1786626 1583984 1559367 1901905 2156884 2117278 2219559
32869 2219559 2706005 3195163 3392995 3451091 3385268 2967823 2407099 2263483 2489712 2446263
32859 2446263 2025211 1794966 1891267 1827171 1578286 1716786 2227571 2363930 1969598 1757157
32849 1757157 1964316 1965498 1567637 1421585 1741290 1890728 1670336 1714348 2170440 2332148
$$ packed form
32920G21206n8424j80862j04468J0121M4989J75602L63702K28901k07137l48729
32910F44901m270K23223k0618k26718R843K49711O6744j71976o5770O7596r6692
32899F75974k00218O0991K74062R5686q2040M9132P6126k26521k77133K11391
32889F57450M83596J6469m38950j23315L84399K30393k06493j10508K73996K30402
32879A397439m7764M7923K85969J03059k02642k4617L42538K54979l9606J02281
32869B219559M86446M89158J97832N8096o5823m17445n60724j43616K26229m3449
32859B446263m21052k30245R6301o4096k48885J38500N10785J36359l94332k12441
32849A757157K07159J182l97861j46052L19705J49438k20392M4012M56092J61708
$$ plain form
32839 2332148 2049582 2099015 2640682 2782396 2260576 2035266 2543476 2905532 2620677 2489508
32829 2489508 3007096 3396000 3166272 3110880 3757951 4313389 4163571 3996977 4431193 4951703
32819 4951703 5181995 5741650 6885847 7787482 8066682 8436090 8994898 8706063 7486269
32810 7486269 6819063 7252541 7419828 6686819 6444278 7422056 8187228 7899832 8022166
32801 8022166 9487451 10775400 10816608 11144228 12944197 14721053 15336456 16511716 19616456
32792 19616456 22944622 25158350 28305651 34091641 40478626 45746647 52353689 62462133
32784 62462133 73653208 84431538 99772631 124626223 156514717 193512705 245033780
32777 245033780 320356499 403991776 455601571 443396232 373448843 282636855 208321545
$$ packed form
32839B332148k82566M9433N41667J41714n21820k25310N08210L62056k84855j31169
32829B489508N17588L88904k29728n5392O47071N55438j49818j66594M34216N20510
32819D951703K30292N59655J144197R01635K79200L69408N58808k88835j219794
32810G486269o67206M33478J67287p33009k42541R77778P65172k87396J22334
32801H022166J465285J287949M1208L27620J799969J776856O15403J175260L104740
32792A9616456L328166K213728L147301N785990O386985N268021O607042J0108444
32784F2462133J1191075J0778330J5341093K4853592L1888494L6997988N1521075
32777B45033780P5322719Q3635277N1609795j2205339o9947389r0811988p4315310
$$ plain form
32770 208321545 166858990 151669341 143248726 124878923 96046840 70144559 56934811
32763 56934811 51728659 44965412 35875406 29998057 28042125 25505219 21195106 18347911
32755 18347911 17754930 16482165 13694029 11930373 11950821 11425281 9557402 8408761 8710919
32746 8710919 8546289 7175966 6332385 6674103 6522112 5205063 4352758 4743285 4933307
32737 4933307 4148958 3654785 4097781 4202727 3301980 2645865 2996139 3254910 2674814
32728 2674814 2237559 2639921 2949505 2453364 1966257 2152273 2289597 1805286 1408657
32719 1408657 1644447 1838209 1468087 1150933 1348867 1473992 1133722 927624 1202741
32710 1202741 1326055 954286 735417 1020540 1159766 786325 526496 734461 791942 375223
$$ packed form
32770B08321545m1462555j5189649q420615j8369803k8832083k5902281j3209748
32763E6934811n206152o763247r090006n877349j955932k536906m310113k847195
32755A8347911n92981j272765k788136j763656K0448n25540j867879j148641L02158
32746H710919j64630j370323q43581L41718j51991j317049q52305L90527J90022
32737D933307p84349m94173M42996J04946r00747o56115L50274K58771n80096
32728B674814m37255M02362L09584m96141m87107J86016J37324m84311l96629
32719A408657K35790J93762l70122l17154J97934J25125l40270k06098K75117
32710A202741J23314l71769k18869K85123J39226l73441k59829K07965N7481m16719
$$ plain form
32700 375223 166393 574585 952420 802294 598584 724319 751215 457784 408482 834036
32690 834036 1069709 779572 602667 911618 1085906 723335 418573 593692 693424 326081
32680 326081 91166 443593 795928 600189 313747 438430 576816 307812 58842 233423
32670 233423 376061 81635 -143093 187981 598099 533796 368716 606589 876966 679100
32660 679100 389625 552019 830398 653086 296882 350254 625207 566498 289054 280897
32650 280897 463947 426517 251250 300800 491424 522033 509419 696485 854322 652844
32640 652844 312186 244652 364635 357883 298197 400258 501407 376962 237395 351048
32630 351048 513451 429522 264538 291030 368546 293228 257102 430441 516068 271613 38939
$$ packed form
32700C75223k08830M08192L77835j50126k03710J25735K6896k93431m9302M25554
32690H34036K35673k90137j76905L08951J74288l62571l04762J75119R9732l67343
32680C26081k34915L52427L52335j95739k86442J24683J38386k69004k48970J74581
32670B33423J42638k94426k24728L31074M10118o4303j65080K37873K70377j97866
32660F79100k89475J62394K78379j77312l56204N3372K74953n8709k77444q157
32650B80897J83050l7430j75267M9550J90624L0609j2614J87066J57837k01478
32640F52844l40658o7534J19983o752n9686J02061J01149j24445j39567J13653
32630C51048J62403q3929j64984K6492P7516p5318l6126J73339Q5627k44455k32674
$$ plain form
32619 38939 177694 409581 329995 139136 220111 390171 245926 -83433 -180510 -39044
32609 -39044 82453 193340 370964 364746 8540 -296038 -122983 264055 348483 186684
32599 186684 167369 267749 218989 130767 266821 435712 279832 -35876 -82588 79765
32589 79765 62102 -120750 -134349 6059 -976 -126888 -84757 82592 87668 -22053 43265
32578 43265 230463 228012 60867 38086 172124 193180 74985 17667 -12638 -194099 -386975
32567 -386975 -307530 -83459 -79083 -240294 -192962 57314 128170 -42431 -107324 38693 109253
32556 109253 12623 15727 191247 238612 29773 -152754 -115370 -51002 -133661 -214471 -144863
32545 -144863 -60203 -112044 -193838 -143636 -1324 110245 179852 245059 283633 268701 216670
$$ packed form
32619C8939J38755K31887p9586j90859Q0975J70060j44245l29359r7077J41466
32609c9044J21497J10887J77624o218l56206l04578J73055L87038Q4428j61799
32599A86684j9315J00380m8760q8222J36054J68891j55880l15708m6712J62353
32589G9765j7663j82852j3599J40408p035j25912M2131J67349N076j09721O5318
32578D3265J87198k451j67145k2781J34038K1056j18195n7318l0305j81461j92876
32567c86975P9445K24071M376j61211M7332K50276P0856j70601o4893J46017P0560
32556A09253r6630L104J75520M7365k08839j82527L7384O4368q2659q0810O9608
32545a44863Q4660n1841q1794N0202J42312J11569O9607O5207L8574j4932n2031
$$ plain form
32534 216670 138081 52824 41708 146359 254079 235319 144731 122789 163791 159278 102777
32523 102777 69062 60883 51642 93416 205007 254621 138183 -35557 -117736 -142094 -185622
32512 -185622 -171013 -37155 53639 -60284 -239079 -222065 2192 239478 378719 413022
32502 413022 318491 146495 84173 190805 246956 102824 -33506 68586 260735 266969
32492 266969 122082 9267 -129648 -421303 -670421 -575448 -228256 8952 37060 36408
32482 36408 43346 -68819 -238701 -262500 -174814 -197754 -321517 -315068 -155277 -67856 -114503
32471 -114503 -100162 56770 189487 181271 116842 85828 79238 96614 128864 64312 -147567
32460 -147567 -302753 -187785 53468 105198 -32708 -78122 55669 171985 171066 161729 173173
$$ packed form
32534B16670p8589q5257j1116J04651J07720j8760r0588k1942M1002m513n6501
32523A02777l3715q179r241M1774J11591M9614j16438j73740q2179k4358m3528
32512a85622J4609J33858R0794j13923j78795J7014K24257K37286J39241L4303
32502D13022r4531j71996o2322J06632N6151j44132j36330J02092J92149O234
32492B66969j44887j12815j38915k91655k49118R4973L47192K37208K8108o52
32482C6408O938j12165j69882k3799Q7686k2940j23763O449J59791Q7421m6647
32471a14503J4341J56932J32717q216o4429l1014o590J7376L2250o4552k11879
32460a47567j55186J14968K41253N1730j37906m5414J33791J16316r19r337J1444
$$ plain form
32449 173173 102851 -5561 31590 191104 223147 59866 -58104 34679 190240 207828
32439 207828 102420 2372 -29553 19307 144893 276397 324645 306564 299236 290895 220064
32428 220064 120692 68899 37216 -33053 -83971 -43503 6045 -47398 -144293 -175221 -192393
32417 -192393 -276351 -313893 -168223 36964 78719 -14409 -51995 -25015 -60335 -118284 -53139
32406 -53139 85041 121596 78658 117003 208259 180943 51644 -6405 9616 -49388 -173219
32395 -173219 -213231 -177408 -187466 -185727 -20930 209656 254165 121857 55904 109633 110021
32384 110021 31591 29303 90215 34487 -109788 -114349 28317 73424 -38336 -94845 -18902
32373 -18902 34109 50091 208993 462547 488669 220842 13042 88055 211254 138314 24114
$$ packed form
32449A73173p0322j08412L7151J59514L2043j63281j17970R2783J55561J7588
32439B07828j05408j00048l1925M8860J25586J31504M8248j8081p328q341p0831
32428B20064r9372n1793l1683p0269n0918M0468M9548n3443r6895l0928j7172
32417a92393q3958l7542J45670K05187M1755r3128l7586K6980l5320n7949O5145
32406e3139J38180L6555m2938L8345R1256k7316j29299n8049J6021n9004j23831
32395a73219m0012L5823j0058J739J64797K30586M4509j32308o5953N3729L88
32384A10021p8430k288O0912n5728j44275m561J42666M5107j11760n6509P5943
32373a8902N3011J5982J58902K53554K6122k67827k07800P5013J23199p2940j14200
$$ plain form
32362 24114 115135 333664 448219 426407 366274 270735 115038 -24956 -96968 -169812 -261785
32351 -261785 -247528 -79155 76947 68595 -37990 -106268 -119198 -108865 -60744 4422 6695
32340 6695 -50124 -66535 -34005 -53722 -123289 -113495 -13333 25889 -40941 -69306 14032 96864
32328 96864 105882 110689 127976 70194 -30107 -12737 98412 66055 -149730 -253830 -71274
32317 -71274 142813 80477 -164511 -276753 -184001 -84719 -111610 -191043 -198887 -107292 2741
32306 2741 10350 -109767 -212126 -147397 14891 94343 99439 184822 313719 259969 11161
32295 11161 -139638 -31640 123378 100447 -11217 -37257 -27177 -99587 -176067 -119996 -4215
32284 -4215 -4891 -115348 -166268 -77012 68375 154632 135671 47315 -11829 26495 92036 50162
$$ packed form
32362B4114R1021K18529J14555k1812o0133r5539j55697j39994p2012p2844r1973
32351b61785J4257J68373J56102q352j06585o8278j2930J0333M8121O5166K273
32340F695n6819j6411L2530j9717o9567R794J00162L9222o6830k8365Q3338Q2832
32328I6864R018M807J7287n7782j00301J7370J11149l2357k15785j04100J82556
32317g1274K14087o2336k44988j12242R2752R9282k6891p9433p844R1595J10033
32306B741P609j20117j02359O4729J62288P9452N096Q5383J28897n3750k48808
32295A1161j50799J07998J55018k2931j11664k6040J0080p2410p6480N6071J15781
32284d215o76j10457n0920Q9256J45387Q6257j8961q8356n9144L8324O5541m1874
$$ plain form
32272 50162 -99835 -214814 -201337 -88758 72382 219373 218344 11552 -199098 -166878
32262 -166878 15647 41349 -102663 -111821 86195 162451 -62711 -277937 -144979 197822
32252 197822 377742 297759 130249 -4324 -84273 -66575 33741 68147 -35255 -117919
32242 -117919 -37109 82829 50475 -80954 -119636 -41794 17677 -2789 -55960 -114166 -174665
32231 -174665 -197171 -159047 -105359 -59580 15376 101306 112241 70295 119795 273265 335331
32220 335331 195914 2052 -94333 -152827 -250999 -282723 -146637 37071 102637 91645 140601
32209 140601 240821 288522 265549 215579 146012 81973 100464 198501 254530 209021 130468
32198 130468 36187 -146962 -364594 -424414 -313019 -258796 -352155 -394079 -272890 -163297
$$ packed form
32272E0162j49997j14979J3477J12579J61140J46991j029k06792k10650L2220
32262a66878J82525K5702j44012r158J98016P6256k25162k15226J32958L42801
32252A97822J79920p9983j67510j34573p9949J7698J00316L4406j03402q2664
32242a17919Q0810J19938l2354j31429l8682P7842N9471k0466n3171n8206o0499
32231a74665k2506L8124N3688M5779P4956Q5930J0935m1946M9500J53470O2066
32220C35331j39417j93862r6385n8494r8172l1724J36086J83708O5566j0992M8956
32209A40601J00220M7701k2973m9970o9567o4039J8491R8037N6029m5509p8553
32198A30468r4281j83149k17632n9820J11395N4223r3359m1924J21189J09593
$$ plain form
32188 -163297 -154579 -42059 240135 343386 20192 -404204 -489356 -338167 -341712 -488254
32178 -488254 -440154 -174259 -21446 -88746 -120947 16955 139473 102537 6687 -48631 -102393
32167 -102393 -144715 -77162 62154 92918 -14900 -78738 1822 107334 115667 58527 9727
32156 9727 -11012 1947 21293 -52198 -241667 -365178 -261238 -71158 -46236 -143722 -117590
32145 -117590 29931 40269 -134817 -224606 -95880 22625 -70919 -231175 -227960 -96642
32135 -96642 -24717 -63495 -137554 -203929 -240997 -195257 -76941 -1431 -18267 -11975 112004
32124 112004 258853 288630 226952 198093 228173 248456 238123 235580 237809 201583 137245 109895
32112 109895 139784 171416 162013 152221 210958 322290 370797 272530 96978 -129 38371
$$ packed form
32188a63297Q718J12520K82194J03251l23194m24396q5152J51189l545j46542
32178d88254M8100K65895J52813o7300l2201J37902J22518l6936r5850n5318n3762
32167a02393m2322O7553J39316L0764j07818o3838Q0560J05512Q333n7140m8800
32156I727k0739J2959J9346p3491j89469j23511J03940J90080K4922r7486K6132
32145a17590J47521J0338j75086q9789J28726J18505r3544j60256L215J31318
32135i6642P1925l8778p4059o6375l7068M5740J18316P5510j6836O292J23979
32124A12004J46849K9777o1678k8859L0080K0283j0333k543K229l6226o4338k7350
32112A09895K9889L1632r403r792N8737J11332M8507r8267j75552r7107L8500
$$ plain form
32101 38371 127879 186188 210769 178646 11752 -259287 -423254 -325627 -95763 12647 -50646
32090 -50646 -113420 -44078 120009 280373 362350 301872 91005 -152990 -279617 -270965 -223963
32079 -223963 -194165 -164979 -138527 -130997 -98011 11971 148048 220660 250050 321009 409868
32068 409868 396846 250455 73388 -36762 -59767 949 123389 228765 256422 263108 330707
32057 330707 400248 331335 112241 -121573 -266040 -317923 -290783 -205281 -145237 -174201 -210799
32046 -210799 -139198 -21314 -23632 -144696 -214035 -176320 -163941 -236489 -261393 -148671 -15271
32035 -15271 11039 -2007 74184 200067 226451 125524 34908 85156 260362 418035 408717
32024 408717 208346 -39300 -152608 -104233 -33738 -55885 -124737 -119495 -5893 127285 157420
$$ packed form
32101C8371Q9508N8309K4581l2123j66894k71039j63967R7627K29864J08410o3293
32090e0646o2774O9342J64087J60364Q1977o0478k10867k43995j26627Q652M7002
32079b23963K9798K9186K6452P530L2986J09982J36077P2612K9390P0959Q8859
32068D09868j3022j46391j77067j10150k3005O0716J22440J05376K7657O686O7599
32057C30707O9541o8913k19094k33814j44467n1883K7140Q5502O0044k8964l6598
32046b10799P1601J17884k318j21064o9339L7715J2379p2548k4904J12722J33400
32035a5271K6310j3046P6191J25883K6384j00927r0616N0248J75206J57673r318
32024D08717k00371k47646j13308M8375P0495k2147o8852N242J13602J33178L0135
$$ plain form
32013 157420 36723 -151789 -244549 -150067 44843 161553 113160 -39938 -188778 -262880
32003 -262880 -239087 -143503 -47952 -6116 1384 11925 4294 -53868 -116198 -105745 -39593 -15946
31991 -15946 -73490 -139939 -131871 -48113 45408 85994 71482 65869 122966 199845 206138 146575
31979 146575 118731 145615 139130 82437 92252 198286 219386 11132 -292258 -452801 -438045
31968 -438045 -381787 -338398 -269671 -195267 -160083 -117427 -27497 10997 -75799 -145134 -49126
31957 -49126 60142 -68637 -339477 -398032 -170653 32095 18720 -18879 113466 271314
31947 271314 222509 19866 -99502 -47222 76964 180792 246347 260052 207201 111275 12472
31936 12472 -54697 -42599 72249 216074 273928 228929 149247 54077 -74435 -165765 -119034
$$ packed form
32013A57420j20697j88512r2760R4482J94910J16710m8393j53098j48840p4102
32003b62880K3793R5584R5551M1836P500J0541p631n8162o2330J0453O6152K3647
31991a5946n7544o6449Q068Q3758R3521M0586j4512n613N7097P6879O293n9563
31979A46575k7844K6884o485n6693R815J06034K1100k08254l03390j60543J4756
31968d38045N6258M3389O8727P4404L5184M2656Q9930L8494q6796o9335R6008
31957d9126J09268j28779k70840n8555K27379K02748j3375l7599J32345J57848
31947B71314m8805k02643j19368N2280J24186J03828O5555J3705n2851r5926r8803
31936A2472o7169J2098J14848J43825N7854m4999p9682r5170j28512r1330M6731
$$ plain form
31925 -119034 7861 45517 -34825 -100196 -98782 -113208 -145395 -87117 35869 41039 -96104
31914 -96104 -155226 -24602 103408 46140 -92377 -139491 -130761 -161840 -164092 -62164 16135
31903 16135 -60119 -155963 -65873 129561 173044 24854 -117634 -149572 -144244 -125426 -17472
31892 -17472 149143 220082 161762 120616 174656 211754 131580 -157 -89406 -155318 -227947
31881 -227947 -232981 -108185 51244 99794 54046 70700 208816 324095 253541 40645 -106957
31870 -106957 -79588 -335 -45649 -194435 -256503 -135322 53109 149910 131091 64085 -4204
31859 -4204 -34003 35190 187946 276581 181381 -15011 -128057 -113645 -90632 -140626 -215423
31848 -215423 -256136 -284347 -336124 -398742 -454559 -510088 -541231 -481964 -315733 -120808 20181
$$ packed form
31925a19034J26895L7656q0342o5371J414j4426l2187N8278J22986N170j37143
31914i6104n9122J30624J28010n7268j38517m7114Q730l1079k252J01928P8299
31903A6135p6254r5844R0090J95434M3483j48190j42488l1938N328J8818J07954
31892a7472J66615P0939n8320m1146N4040L7098q0174j31737q9249o5912p2629
31881b27947n034J24796J59429M8550m5748J6654J38116J15279p0554k12896j47602
31870a06957K7369P9253m5314j48786o2068J21181J88431R6801j8819o7006o8289
31859d204k9799O9193J52756Q8635r5200j96392j13046J4412K3013m9994p4797
31848b15423m0713k8211n1777o2618n5817n5529l1143N9267J66231J94925J40989
$$ plain form
31837 20181 104296 161155 182757 162443 153967 207608 266591 215109 44424 -101541 -83970
31826 -83970 73261 220709 244736 156115 45217 -10730 -7403 -4880 -43608 -64704 30645
31815 30645 217905 330076 270519 155361 130484 133373 10135 -185490 -240735 -144328 -144119
31804 -144119 -352492 -535056 -448515 -183798 17017 104108 158973 153981 41926 -29937 109553
31793 109553 333163 357935 177894 49489 49215 -19245 -216645 -307967 -151760 46040 54166
31782 54166 -53062 -90626 -75230 -114926 -162033 -124256 -90658 -186518 -289801 -165072 143308
31771 143308 311178 167262 -89131 -178014 -74445 45903 70942 40975 34657 72996 127352
31760 127352 155928 128126 55576 5504 46477 163254 256995 261370 229597 253027 315402
$$ packed form
31837B0181Q4115N6859K1602k0314q476N3641N8983n1482j70685j45965J7571
31826h3970J57231J47448K4027q8621j10898n5947L327K523l8728k1096R5349
31815C0645J87260J12171n9557j15158k4877K889j23238j95625n5245R6407K09
31804a44119k08373j82564Q6541K64717K00815Q7091N4865m992j12055p1863J39490
31793A09553K23610K4772j80041j28405k74o8460j97400r1322J56207J97800Q126
31782E4166j07228l7564J5396l9696m7107L7777L3598r5860j03283J24729L08380
31771A43308J67870j43916k56393q8883J03569J20348K5039k9967o318L8339N4356
31760A27352K8576k7802p2550n0072M0973J16777R3741M375l1773K3430O2375
$$ plain form
31749 315402 311119 206854 76614 -46607 -213894 -389153 -399792 -194747 -1413 -33400
31739 -33400 -165117 -134425 26861 60575 -53819 -37951 221496 465547 453985 288835
31729 288835 171630 77224 -109509 -312520 -364086 -280055 -216830 -215935 -181155 -75176 21445
31718 21445 34380 -37294 -155619 -256132 -264106 -177630 -90926 -74962 -98202 -115370 -139932
31707 -139932 -162812 -108882 36140 156398 157497 92632 49069 14029 -47928 -90478 -69317
31696 -69317 -37278 -52212 -79880 -78058 -73688 -73475 -25198 42840 -1281 -164938 -252826 -157956
31684 -157956 -44211 -61389 -78228 62355 207731 122695 -76090 -62383 171063 279663
31674 279663 93812 -144705 -165743 -20144 80431 61454 -15900 -103855 -187034 -241553 -256045
$$ packed form
31749C15402m283j04265j30240j23221j67287j75259j0639K05045J93334l1987
31739c3400j31717L0692J61286L3714j14394J5868K59447K44051j1562j65150
31729B88835j17205r4406j86733k03011n1566Q4031O3225Q95L4780J05979R6621
31718B1445J2935p1674j18325j00513p974Q6476Q6704J5964k3240j7168k4562
31707a39932k2880N3930J45022J20258J099o4865m3563l5040o1957m2550K1161
31696f9317L2039j4934k7668J822M370K13M8277O8038m4121j63657q7888R4870
31684a57956J13745j7178j6839J40583J45376q5036j98785J3707K33446J08600
31674B79663j85851k38517k1038J45599J00575j8977p7354q7955q3179n4519j4492
$$ plain form
31663 -256045 -234938 -167689 -75779 -62167 -184524 -305336 -231805 -952 148373 99395 -23106
31652 -23106 -74940 -46002 40443 180020 276355 177630 -80208 -240691 -142202 87572 250066
31641 250066 323849 370016 347764 195076 -2470 -86049 -23040 81467 130206 103791 34440
31630 34440 -17381 -9053 15528 -24022 -94509 -64884 73814 146896 51667 -64340 -15811
31619 -15811 144462 217425 139516 13283 -78215 -125695 -107899 -12349 82501 91977 70510
31608 70510 132362 255050 314457 291769 271913 241481 84203 -184722 -369885 -355311 -249858
31597 -249858 -194084 -184364 -185370 -246810 -366775 -388122 -209926 7400 42582 -58823 -67006
31586 -67006 65350 148491 80424 542 44728 136455 134188 46405 -23081 -45527 -65761 -95828
$$ packed form
31663b56045K1107O7249R1910J3612j22357j20812P3531K30853J49325m8978j22501
31652b3106n1834K8938Q6445J39577R6335r8725k57838j60483R8489K29774J62494
31641B50066P3783M6167k2252j52688j97546q3579O3009J04507M8739k6415o9351
31630C4440n1821Q328K4581l9550p0487K9625J38698P3082r5229j16007M8529
31619a5811J60273P2963p7909j26233r1498m7480J7796R5550R4850R476k1467
31608G0510O1852J22688N9407k2688j9856l0432j57278k68925j85163J4574J05453
31597b49858N5774R720j006o1440j19965k1347J78196K17326L5182j01405q183
31586f7006J32356Q3141o8067p9882M4186R1727k267q7783o9486k2446k0234l0067
$$ plain form
31574 -95828 -108657 -93909 -53235 9731 49616 6013 -81731 -83996 30547 125239 96926 25791
31562 25791 12114 -10494 -142653 -299726 -306064 -148080 38371 177381 270712 263463 105333
31551 105333 -76067 -84635 51620 112178 30509 -18333 69743 157940 108238 -11848 -78935
31540 -78935 -96567 -112868 -115119 -116901 -189526 -294281 -256935 -45464 100253 -16820 -257848
31529 -257848 -348930 -239034 -68912 85966 221676 256002 113731 -85668 -145104 -66910
31519 -66910 -10461 -2794 86125 273248 388917 325850 177187 59673 -40959 -168146 -271903
31508 -271903 -284025 -229091 -179406 -154622 -123878 -70163 -16409 -7046 -62752 -129765 -107143 30773
31496 30773 185532 266810 306658 353152 331033 154332 -69852 -130930 -16677 51545 -62266
$$ packed form
31574i5828j2829J4748M0674O2966L9885m3603q7744k265J14543R4692k8313p1135
31562B5791j3677k2608j32159j57073o338J57984J86451J39010R3331p249j58130
31551A05333j81400q568J36255O0558q1669m8842Q8076Q8197m9702j20086o7087
31540g8935j7632j6301k251j782p2625j04755L7346K11471J45717j17073k41028
31529b57848r1082J09896J70122J54878J35710L4326j42271j99399n9436P8194
31519f6910N6449P667Q8919J87123J15669o3067j48663j17514j00632j27187j03757
31508b71903j2122N4934M9685K4784L0744N3715N3754R363n5706o7013K2622J37916
31496C0773J54759Q1278L9848M6494k2119j76701k24184o1078J14253O8222j13811
$$ plain form
31485 -62266 -219395 -234336 -156137 -171594 -292679 -309706 -85936 227811 366375 278733 160374
31474 160374 150888 144295 -14 -180861 -179743 -13962 64369 -47224 -154688 -100284 -8898
31463 -8898 -39471 -101060 -42417 38292 -57955 -273389 -365485 -289376 -227716 -243071 -185684 -4102
31451 -4102 114411 25841 -152897 -232406 -195383 -130868 -60773 36004 122524 150250 147889 169483
31439 169483 200674 194443 163672 169756 232351 292068 265620 136752 -5557 -53535 -21929
31428 -21929 -35352 -130854 -171759 -52198 113695 147611 68085 22843 26345 -25657 -109167
31417 -109167 -74462 80927 171459 120232 81881 172418 272494 229568 94431 11029 -2887
31406 -2887 -18639 -41844 -45214 -83658 -223933 -391120 -421954 -279418 -117670 -110648 -273030
$$ packed form
31485f2266j57129j4941P8199j5457j21085j7027K23770L13747J38564q7642j18359
31474A60374r486o593j44309j80847J118J65781P8331j11593j07464N4404R1386
31463h898l0573o1589N8643Q0709r6247k15434r2096P6109O1660j5355N7387J81582
31451d102J18513q8570j78738p9509L7023O4515P0095R6777Q6520K7726k361K1594
31439A69483L1191o231l0771O084O2595N9717k6448j28868j42309m7978L1606
31428b1929j3423r5502m0905J19561J65893L3916p9526m5242L502n2002q3510
31417a09167L4705J55389R0532n1227l8351R0537J00076m2926j35137q3402j3916
31406b887j5752k3205l370l8444j40275j67187l0834J42536J61748P022j62382
$$ plain form
31395 -273030 -467941 -552092 -486292 -316596 -95461 123813 237385 151224 -60333 -176787
31385 -176787 -109447 -38811 -136004 -271238 -207647 2688 78768 -56628 -182588 -154594 -96417
31374 -96417 -125779 -148144 -68198 13141 -14368 -62602 -4262 100735 116532 56039 20973
31363 20973 8083 -54410 -141173 -158367 -97995 -32905 6825 39344 49061 6058 -54287 -54404
31351 -54404 37334 184154 305534 302206 136526 -78535 -165468 -96364 -17850 -31615 -83004
31340 -83004 -108875 -134571 -159057 -122335 -72861 -164927 -369147 -411152 -177968 38823 -49416
31329 -49416 -274825 -275096 -67933 -4633 -201881 -387191 -352021 -227153 -197978 -221125 -173749
31318 -173749 -76330 -11401 26410 61826 46687 -39011 -103337 -78393 -44755 -103841 -210623
$$ packed form
31395b73030j94911q4151O5800J69696K21135K19274J13572q6161k11557j16454
31385a76787O7340P0636r7193j35234O3591K10335P6080j35396j25960K7994N8177
31374i6417k9362k2365P9946Q1339k7509m8234N8340J04997J5797o0493l5066
31363B0973j2890o2493q6763j7194O0372O5090L9730L2519R717m3003o0345j17
31351e4404R1738J46820J21380l328j65680k15061q6933O9104P8514j3765n1389
31340h3004k5871k5696k4486L6722M9474r2066k04220m2005K33184K16791q8239
31329d9416k25409k71K07163O3300j97248j85310L5170J24868K9175k3147M7376
31318a73749R7419O4929L7811L5416j5139q5698o4326K4944L3638n9086j06782
$$ plain form
31307 -210623 -257464 -260697 -330318 -478747 -580129 -530277 -360048 -171260 -28700 54793 79231
31296 79231 55624 30848 65939 165352 251556 244807 158201 71657 16934 -50397 -149402 -213843
31284 -213843 -176637 -61476 53210 112453 89575 -19400 -148111 -173228 -51144 112277
31274 112277 201474 237232 292097 325969 235059 39171 -108179 -106974 -12881 53759 22792
31263 22792 -90354 -180312 -104982 154853 405481 425649 238792 78072 76193 131980 117040
31252 117040 59944 41833 37990 -18068 -92547 -91679 -3064 99622 163247 180811 136214 13201
31240 13201 -144167 -254445 -286389 -266829 -211141 -117520 -29453 -17314 -69659 -82595 -5600
31229 -5600 74622 64587 12853 29484 100441 110732 46674 28282 98115 125770 13741 -133416
$$ packed form
31307b10623m6841l233o9621j48429j01382M9852J70229J88788J42560Q3493K4438
31296G9231k3607k4776L5091R9413Q6204o749q6606q6544n4723o7331r9005o4441
31284b13843L7206J15161J14686N9243k2878j08975j28711k5117J22084J63421
31274A12277Q9197L5758N4865L3872r0910j95888j47350J205R4093O6640l0967
31263B2792j13146q9958P5330K59835K50628K0168j86857j60720j879N5787j4940
31252A17040n7096j8111l843n6058p4479Q68Q8615J02686O3625J7564m4597j23013
31240A3201j57368j10278l1944J9560N5688R3621Q8067J2139n2345j2936P6995
31229e600Q0222j0035n1734J6631P0957J0291o4058j8392O9833K7655j12029j47157
$$ plain form
31217 -133416 -174511 -153218 -188315 -231087 -141458 33220 88569 -9048 -57243 53319 169277
31206 169277 148741 99406 179198 320388 339934 214064 63483 -49036 -133107 -154494 -77944
31195 -77944 24093 61115 66137 93297 52894 -152504 -384780 -400172 -218787 -123186 -240653
31184 -240653 -356581 -245593 2214 124891 30606 -140358 -218695 -156747 -16023 115248
31174 115248 202616 280403 356900 341064 160267 -76581 -175089 -115244 -51324 -31027 80721
31163 80721 313343 436156 254699 -93845 -326317 -374570 -359217 -302368 -118046 135548
31153 135548 253154 188640 143456 245678 330473 197829 -47634 -118254 43158 174147
31143 174147 54480 -205457 -334542 -252779 -120694 -75787 -64114 23400 154547 191681
$$ packed form
31217a33416m1095K1293l5097m2772Q9629J74678N5349r7617m8195J10562J15958
31206A69277k0536m9335P9792J41190J9546j25870j50581j12519q4071k1387P6550
31195g7944J02037L7022N022K7160m0403k05398k32276j5392J81385R5601j17467
31184b40653j15928J10988K47807J22677r4285j70964p8337O1948J40724J31271
31174A15248Q7368P7787P6497j5836j80797k36848r8508N9845O3920K0297J11748
31163H0721K32622J22813j81457l48544k32472m8253J5353N6849J84322K53594
31153A35548J17606o4514m5184J02222Q4795j32644k45463p0620J61412J30989
31143A74147j19667k59937j29085Q1763J32085M4907J1673Q7514J31147L7134
$$ plain form
31133 191681 86964 -48288 -77821 16132 141409 204307 187540 148820 160392 232467 291181
31122 291181 255270 136981 37405 34863 107886 176670 185178 125311 17681 -93881 -145113
31111 -145113 -91290 39061 145284 133277 9111 -113663 -127247 -52784 -10087 -46420 -55298
31100 -55298 71477 255422 297766 141057 -36593 -39057 110724 223773 189292 77353
31090 77353 1923 -31646 -93056 -183936 -202470 -75944 114646 201638 124977 1561 -31304
31079 -31304 11417 7817 -87942 -193855 -231480 -220276 -203491 -149086 10882 265866 501475
31068 501475 593381 517602 376028 301792 310798 270673 78349 -153760 -197486 -14337 168398
31057 168398 159974 57009 63968 169875 194181 108282 85127 191002 246073 106916 -85793
$$ packed form
31133A91681j04717j35252k9533R3953J25277O2898j6767l8720J1572P2075N8714
31122B91181l5911j18289r9576k542P3023O8784Q508n9867j07630j11562n1232
31111a45113N3823J30351J06223j2007j24166j22774j3584P4463M2697l6333q878
31100e5298J26775J83945M2344j56709j77650k464J49781J13049l4481j11939
31090G7353p5430l3569o1410r0880j8534J26526J90590Q6992p6661j23416l2865
31079c1304M2721l600r5759j05913l7625J1204J6785N4405J59968K54984K35609
31068E01475R1906p5779j41574p4236R006m0125j92324k32109m3726J83149J82735
31057A68398q424j02965O959J05907K4306q5899k3155J05875N5071j39157j92709
$$ plain form
31046 -85793 -105301 31237 112334 48552 -42263 -45064 28544 134851 254571 320271 236910
31035 236910 35828 -114386 -115010 -48465 -26725 -44435 -53632 -68347 -101993 -98191 -19264 79853
31023 79853 145475 193203 204004 87863 -130426 -235295 -99741 86891 76396 -59804
31013 -59804 -54664 122826 240263 194323 144774 211760 306696 344548 374494 393534 268515
31002 268515 -16962 -244615 -238767 -81923 77191 228984 361566 332225 96778 -110065
30992 -110065 -62198 130212 216071 186378 192936 205136 69231 -141407 -168871 12034 123118
30981 123118 2274 -173345 -185740 -65123 42048 95320 113850 70959 -24233 -68621 -18523
30970 -18523 10735 -76445 -179990 -139569 32735 183854 223351 174090 72596 -48487 -103938
$$ packed form
31046h5793j9508J36538Q1097o3782r0815k801P3608J06307J19720O5700q3361
31035B36910k01082j50214o24O6545K1740j7710r197j4715l3646L802P8927R9117
31023G9853O5622M7728J0801j16141k18289j04869J35554J86632j0495j36200
31013e9804N140J77490J17437m5940m9549O6986R4936L7852K9946J9040j25019
31002B68515k85477k27653N848J56844J59114J51793J32582k9341k35447k06843
30992a10065M7867J92410Q5859k9693O558J2200j35905k10638k7464J80905J11084
30981A23118j20844j75619j2395J20617J07171N3272J8530m2891r5192m4388N0098
30970a8523K9258q7180j03545M0421J72304J51119L9497m9261j01494j21083n5451
$$ plain form
30959 -103938 -17345 143265 199774 78069 -86061 -110633 5176 82131 -11466 -191649
30949 -191649 -262028 -158138 -17529 10810 -47920 -57804 35534 161373 243730 270199 242894
30938 242894 153244 31208 -50719 -54358 -9184 46254 103260 146986 139379 71895 -1680 -15638
30926 -15638 42884 132101 199514 219652 199411 147309 45830 -111505 -255220 -277848 -170387
30915 -170387 -54776 -31013 -61855 -72881 -84492 -145210 -202256 -162563 -42545 64661 138215
30904 138215 217522 268813 209931 67089 -36082 -59377 -77393 -113872 -99022 -35738 -49084
30893 -49084 -183115 -282685 -196824 -10513 54408 -70466 -224698 -240436 -154791 -149345 -295227
30882 -295227 -422728 -316906 -31094 120380 -45184 -316119 -356283 -145057 41353 39600
$$ packed form
30959a03938Q6593J60610N6509j21705j64130k4572J15809P6955r3597j80183
30949a91649p0379J03890J40609K8339n8730r884R3338J25839Q2357K6469k7305
30938B42894q9650j22036q1927l639M5174N5438N7006M3726p607o7484p3575j3958
30926a5638N8522Q9217O7413K0138k0241n2102j01479j57335j43715k2628J07461
30915a70387J15611K3763l0842j1026j1611o0718n7046L9693J20018J07206P3554
30904A38215P9307N1291n8882j42842j03171k3295j8016l6479J4850O3284j3346
30893d9084j34031r9570Q5861J86311O4921j24874j54232j5738Q5645N446j45882
30882b95227j27501J05822K85812J51474j65564k70935m0164K11226J86410j753
$$ plain form
30872 39600 -33015 -33930 6540 17441 27515 70462 101124 106394 163115 285081 344277 253986
30860 253986 108337 25188 -30773 -137848 -237355 -213877 -83990 35156 94059 123931 133528
30849 133528 119962 144397 270823 443719 530646 479922 359407 259998 227327 251387 254372
30838 254372 137215 -83211 -233198 -164065 68811 285941 383867 370159 275693 154220
30828 154220 109194 179211 233927 131373 -46975 -85630 37058 94604 -55713 -255508
30818 -255508 -272254 -122161 -22305 -76901 -155609 -95879 80210 206965 187328 104648 112317
30807 112317 242238 361940 333500 180520 57539 68352 165573 236812 235849 192096 128180
30796 128180 30681 -92375 -178682 -173484 -101010 -36932 -22202 -41331 -68888 -79547 -21986
$$ packed form
30872C9600p2615r15M0470J0901J0074M2947L0662N270N6721J21966N9196r0291
30860B53986j45649q3149n5961j07075r9507K3478J29887J19146N8903K9872R597
30849A33528j3566K4435J26426J72896Q6927n0724j20515r9409l2671K4060K985
30838B54372j17157k20426j49987O9133K32876K17130R7926j3708r4466j21473
30828A54220m5026P0017N4716j02554j78348l8655J22688N7546j50317j99795
30818b55508j6746J50093R9856n4596p8708N9730J76089J26755j9637q2680P669
30807A12317J29921J19702k8440j52980j22981J0813R7221P1239r63m3753o3916
30796A28180r7499j23056q6307N198P2474O4078J4730j9129k7557j0659N7561
$$ plain form
30785 -21986 129542 278093 264815 89976 -31683 56335 211170 169710 -80739 -283004
30775 -283004 -260886 -117889 -42878 -73747 -133160 -172697 -181012 -135246 -41572 29482 22673 -29337
30763 -29337 -63338 -63411 -37622 18749 79118 59520 -96298 -328251 -495724 -491857 -327598 -139021
30751 -139021 -86021 -176326 -221641 -64476 187527 287671 184849 58962 21640 -5091
30741 -5091 -58697 -18632 155066 273994 189451 44374 56392 175971 183476 47226 -47765
30730 -47765 -6412 57575 40235 7846 68427 196952 267911 217962 129035 146219 306625
30719 306625 467798 462901 314382 196761 189861 210048 211089 269195 385595 397724 230596
30708 230596 70012 108009 250782 272633 151436 47396 26830 8362 -63376 -163902
$$ packed form
30785b1986J51528J48551j3278j74839j21659Q8018J54835m1460k50449k02265
30775b83004K2118J42997P5011l0869n9413l9537q315M5766R3674P1054o809n2010
30763b9337l4001p3K5789N6371O0369j9598j55818k31953j67473L867J64259J88577
30751a39021N3000r0305m5315J57165K52003J00144j02822j25887l7322k6731
30741e091n3606M0065J73698J18928q4543j45077J2018J19579P505j36250r4991
30730d7765M1353O3987j7340l2389O0581J28525P0959m9949q8927J7184J60406
30719C06625J61173m897j48519j17621o900K0187J041N8106J16400J2129j67128
30708B30596j60584L7997J42773K1851j21197j04040k0566j8468p1738j00526
$$ plain form
30698 -163902 -266579 -334886 -307649 -220002 -224124 -341283 -351130 -130673 71970 -24373 -280886
30687 -280886 -359626 -272821 -311258 -484040 -480730 -234324 -72686 -172023 -267304 -108160 151761
30676 151761 258663 243648 238889 173577 -49456 -271203 -268757 -96935 24663 52785 102343
30665 102343 186334 218824 209953 235409 264053 214170 126225 93558 86063 31626 -2057 81574
30653 81574 182264 125154 -31036 -61566 53008 87259 -53350 -175542 -115467 15973
30643 15973 47270 20141 74743 191305 235397 191558 170419 200987 180125 59473 -50415
30632 -50415 -32820 64225 97147 25503 -50642 -50382 -17902 -27751 -59598 -46621 -4138 -7145
30620 -7145 -47619 -27967 69723 114406 -1745 -198878 -305656 -271748 -192475 -147837 -115368
$$ packed form
30698a63902j02677o8307K7237Q7647m122j17159r847K20457K02643r6343k56513
30687b80886p8740Q6805l8437j72782L310K46406J61638r9337r5281J59144K59921
30676A51761J06902j5015m759o5312k23033k21747K446J71822J21598K8122M9558
30665A02343Q3991L2490q871K5456K8644m9883q7945l2667p495n4437l3683Q3631
30653H1574J00690n7110j56190l0530J14574L4251j40609j22192O0075J31440
30643A5973L1297k7129N4602J16562M4092m3839k1139L0568k0862j20652j09888
30632e0415J7595R7045L2922p1644p6145K60L2480r849l1847J2977M2483l007
30620g145m0474J9652R7690M4683j16151j97133j06778L3908P9273M4638L2469
$$ plain form
30609 -115368 -53427 11204 20421 -32549 -97285 -128204 -123619 -104586 -81517 -59605 -57505 -79365
30597 -79365 -70410 38862 218511 336809 323533 265033 259213 252448 143808 -2620 -10271
30586 -10271 149360 305774 324091 244859 154256 65220 -12635 -25834 23294 49559 24970
30575 24970 23309 64465 61372 2834 24384 176486 280809 176551 -20790 -83982 6496
30564 6496 91851 99281 80440 41660 -63063 -186591 -214799 -138641 -51293 13967 93398 154699
30552 154699 109366 -29087 -141623 -167907 -149149 -115999 -67372 -46813 -95529 -142702 -95389
30541 -95389 -19230 -53822 -159921 -159146 -46238 -34677 -221099 -420622 -445810 -358141 -308146
30530 -308146 -292409 -226184 -127754 -68794 -33849 25621 74109 59935 28271 44029 75053
$$ packed form
30609a15368O1941O4631R217n2970o4736l0919M585J9033K3069K1912K100k1860
30597g9365Q955J09272J79649J18298j3276n8500n820o765j08640j46428p651
30586a0271J59631J56414J8317p9232r0603q9036p7855j3199M9128K6265k4589
30575B4970j661M1156l093n8538K1550J52102J04323j04258j97341o3192R0478
30564F496Q5355P430j8841l8780j04723j23528k8208P6158Q7348O5260P9431O1301
30552A54699m5333j38453j12536k6284J8758L3150M8627K0559m8716m7173M7313
30541i5389P6159l4592j06099P75J12908J1561j86422j99523k5188Q7669M9995
30530c08146J5737O6225R8430N8960L4945N9470M8488j4174l1664J5758L1024
$$ plain form
30519 75053 73499 94115 194310 287439 247661 109305 8337 -30734 -81644 -118499 -24558
30508 -24558 177641 288248 193965 28143 -18139 65704 148635 144491 64865 -47878 -144275
30497 -144275 -165655 -104603 -41368 -47276 -81540 -65522 -33440 -100113 -265183 -363033 -273889
30486 -273889 -101997 -44335 -122801 -164005 -54618 99393 132253 51795 12726 92485 202736
30475 202736 235477 201910 178720 183215 170302 125221 92830 109128 148374 156793 112375 29100
30463 29100 -77354 -184799 -221108 -89462 197277 440778 423694 180565 478 90526
30453 90526 325898 436443 363486 280764 293933 303550 212519 106722 119911 220432 258696
30442 258696 184342 102858 112976 170173 147441 -771 -175018 -248955 -231153 -246452 -331784
$$ packed form
30519G5053j554K0616J00195R3129l9778j38356j00968l9071n0910l6855R3941
30508b4558K02199J10607r4283j65822m6282Q3843Q2931m144p9626j12743r6397
30497a44275k1380O1052O3235n908l4264J6018L2082o6673j65070r7850Q9144
30486b73889J71892N7662p8466m1204J09387J54011L2860q0458l9069P9759J10251
30475B02736L2741l3567k3190M495j2913m5081l2391J6298L9246Q419m4418q3275
30463B9100j06454j07445l6309J31646K86739K43501j7084k43129j80087R0048
30453I0526K35372J10545p2957q2722J3169R617r1031j05797J3189J00521L8264
30442B58696p4354q1484J0118N7197k2732j48212j74247p3937J7802j5299q5332
$$ plain form
30431 -331784 -342536 -157843 96317 183615 88411 27333 110205 189606 128684 26901 38475
30420 38475 115014 96811 -41038 -195169 -302414 -341837 -250254 -20484 171146 136050 -43141
30409 -43141 -93178 74772 255333 248131 89835 -73844 -185733 -253866 -257264 -185867 -102594
30398 -102594 -77723 -102333 -117786 -90655 -29433 29232 38666 -7171 -52327 -67385 -120312 -259909
30386 -259909 -371361 -294639 -74807 72655 63273 34274 93967 169956 184921 196538 247458
30375 247458 245667 136057 45965 103925 235529 296819 294866 304976 277504 126732 -62696
30364 -62696 -124716 -67072 -44836 -105298 -148058 -127247 -106426 -105585 -68883 -421 30627 31180
30352 31180 66129 93596 2813 -160761 -205454 -79151 47866 54050 27551 67372 117055
$$ packed form
30431c31784j0752J84693K54160Q7298r5204o1078Q2872P9401o0922j01783J1574
30420C8475P6539j8203j37849j54131j07245l9423R1583K29770J91630l5096j79191
30409d3141n0037J67950J80561p202j58296j63679j11889o8133l398P1397Q3273
30398a02594K4871k4610j5453K7131O1222N8665R434m5837m5156j5058n2927j39597
30386b59909j11452P6722K19832J47462r382k8999N9693P5989J4965J1617N0920
30375B47458j791j09610r0092N7960J31604O1290j953J0110k7472j50772j89428
30364f2696o2020N7644K2236o0462m2760K0811K0821Q41L6702O8462L1048N53
30352C1180L4949K7467r0783j63574m4693J26303J27017O184k6499L9821M9683
$$ plain form
30341 117055 114454 124616 181591 169707 30660 -68623 25579 178334 154525 -13952 -97701
30330 -97701 -50987 -52874 -159311 -184528 -15363 179799 187732 35715 -94318 -115215 -64433
30319 -64433 18537 101929 109921 -114 -135302 -159667 -73184 7608 32131 60530 120893
30308 120893 148480 108580 64313 51602 -11062 -183013 -344134 -311853 -95013 99789 129753
30297 129753 59374 1519 -55477 -164406 -256754 -202435 -10638 147151 133013 -17559 -167076
30286 -167076 -220185 -179453 -115227 -99971 -132195 -124733 -16726 112379 112769 -42271 -206741
30275 -206741 -233721 -134697 -32367 -4635 -17248 11217 100222 160656 84361 -92514 -178635
30264 -178635 -62628 103286 93437 -52679 -70564 128150 308701 266650 130784 146382
$$ packed form
30341A17055k601J0162N6975j1884j39047r9283R4202J52755k3809j68477q3749
30330i7701M6714j887j06437k5217J69165J95162P933j52017j30033k0897N0782
30319f4433Q2970Q3392P992j10035j35188k4365Q6483Q0792K4523K8399O0363
30308A20893K7587l9900m4267j2711o2664j71951j61121L2281K16840J94802K9964
30297A29753p0379n7855n6996j08929r2348N4319J91797J57789j4138j50572j49517
30286a67076n3109M0732O4226J5256l2224P462J08007J29105L90j55040j64470
30275b06741k6980R9024J02330K7732j2613K8465Q9005O0434p6295j76875q6121
30264a78635J16007J65914r849j46116j7885J98714J80551m2051j35866J5598
$$ plain form
30254 146382 304497 390118 307345 145645 -24565 -200234 -297317 -183307 80266 218929
30244 218929 73754 -185738 -285939 -184493 -63896 -55029 -92631 -42473 117139 274443
30234 274443 314642 243826 167774 147732 119839 -121 -172161 -269246 -243373 -167552 -110920
30223 -110920 -68258 -35831 -53991 -117406 -128617 -22483 115764 140500 30037 -90737 -104836
30212 -104836 -19516 78037 130958 151216 167186 163865 98245 -23103 -116202 -109702 -45861 -33000
30200 -33000 -92972 -125591 -60221 21887 -9389 -133899 -174703 -23107 191578 230748 38903
30189 38903 -171866 -179164 -31856 25613 -103948 -238019 -185011 -23493 20102 -96696 -188194
30178 -188194 -126448 -8835 20192 -16095 3970 89725 114781 -2574 -178332 -247666 -138005
$$ packed form
30254A46382J58115Q5621q2773j61700j70210j75669r7083J14010K63573J38663
30244B18929j45175k59492j00201J01446J20597Q867l7602N0158J59612J57304
30234B74443M0199p0816p6052k0042k7893j19960j72040r7085K5873P5821N6632
30223a10920M2662L2427j8160o3415j1211J06134J38247K4736j10463j20774j4099
30212a04836Q5320R7553N2921K0258J5970l321o5620j21348r3099O500O3841J2861
30200c3000n9972l2619O5370Q2108l1276j24510m0804J51596K14685L9170j91845
30189C8903k10769p298J47308N7469j29561j34071N3008J61518M3595j16798r1498
30178a88194O1746J17613K9027l6287K0065Q5755K5056j17355j75758o9334J09661
$$ plain form
30167 -138005 59891 185148 163447 63252 -3271 -3982 14653 16735 10331 9824 22642 60772
30155 60772 104867 73101 -96738 -336784 -500213 -525764 -471374 -388750 -270523 -136713 -53259
30144 -53259 -19278 51622 178246 250441 196759 107346 94511 127008 115123 75419 76879 84718
30132 84718 8033 -120245 -154381 -36983 124344 196762 147319 25595 -86040 -102394 -9960
30121 -9960 82106 56313 -47662 -83646 -17836 25330 -35930 -121487 -131524 -96693 -102977 -150997
30109 -150997 -179529 -169652 -141642 -91181 -2479 108737 225270 362318 513055 604241 572451
30098 572451 447859 299372 138872 -47547 -215070 -296398 -300137 -288664 -277299 -244150 -222588
30087 -222588 -275536 -366936 -364182 -206347 11950 163776 225011 246796 262810 275270 279833
$$ packed form
30167a38005J97896J25257k1701j00195o6523p11J8635K082o404n07J2818L8130
30155F0772M4095l1766j69839k40046j63429k5551N4390Q2624J18227J33810Q3454
30144e3259L3981P0900J26624P2195n3682q9413j2835L2497j1885l9704J460P839
30132H4718p6685j28278l4136J17398J61327P2418m9443j21724j11635j6354R2434
30121i960R2066k5793j03975l5984O5810M3166o1260q5557j0037L4831o284m8020
30109a50997k8532R877K8010N0461Q8702J11216J16533J37048J50737R1186l1790
30098E72451j24592j48487j60500j86419j67523q1328l739J1473J1365L3149K1562
30087b22588n2948r1400K754J57835K18297J51826O1235K1785J6014J2460M563
$$ plain form
30076 279833 255860 175530 62764 -3331 15210 62871 78220 82378 122111 167674 140855
30065 140855 31056 -78605 -105895 -51944 15522 39150 25869 21542 29591 -7671 -103527
30054 -103527 -153374 -66340 57690 25034 -165222 -298039 -262636 -213429 -297180 -397253 -325757
30043 -325757 -131615 -9020 732 -5292 -25307 -125069 -217674 -131710 96134 244041 241946
30032 241946 237873 294347 286024 170184 88986 97166 54315 -78205 -104640 61940 183990
30021 183990 57290 -138080 -107527 113255 257984 239796 187003 167381 140690 118033 131239
30010 131239 106554 -18272 -134221 -128240 -98298 -170922 -242710 -181824 -140326 -323826 -577125
29999 -577125 -602815 -498417 -597153 -796664 -599573 57783 561611 456414 57132 -91846
$$ packed form
30076B79833k3973q0330j12766o6095J8541M7661J5349M158L9733M5563k6819
30065A40855j09799j09661k7290N3951O7466K3628j3281m327Q049l7262r5856
30054a03527m9847Q7034J24030l2656j90256j32817L5403M9207q3751j00073P1496
30043c25757J94142J22595R752o024k0015r9762r2605Q5964K27844J47907k095
30032B41946m073N6474q323j15840q1198Q180m2851j32520k6435J66580J22050
30021A83990j26700j95370L0553K20782J44729j8188n2793j9622k6691k2657J3206
30010A31239k4685j24826j15949N981K9942p2624p1788O0886M1498j83500k53299
29999e77125k5690J04398r8736j99511J97091O57356N03828j05197l99282j48978
$$ plain form
29989 -91846 37353 131205 120420 150562 188008 92357 -41346 -4140 140748 147412 8279
29978 8279 -49771 41153 122741 130260 169634 251645 238642 106112 363 -17437 -44963 -107788
29966 -107788 -101680 -34766 -79336 -279057 -436847 -425851 -394552 -491083 -571812 -409575 -81484
29955 -81484 90272 -33453 -241060 -274962 -152540 -85212 -156186 -209828 -88193 124550
29945 124550 205560 112796 51415 166034 313603 273745 79140 -40581 3670 63209 -7740
29934 -7740 -177567 -323722 -350933 -209818 50997 231234 144049 -120710 -262827 -157181
29924 -157181 3193 27911 -4893 55518 148842 119106 424 -33839 43741 93175 65145
29913 65145 78549 195801 291489 229146 52387 -85031 -99944 -20422 84241 142374 104891
$$ packed form
29989i1846J29199R3852j0785L0142L7446r5651j33703L7206J44888O664j39133
29978H279n8050R0924Q1588P519L9374Q2011j3003j32530j05749j7800k7526o2825
29966a07788O108O6914m4570j99721j57790J0996L1299r6531q0729J62237L28091
29955h1484J71756j23725k07607l3902J22422O7328p0974n3642J21635K12743
29945A24550Q1010r2764o1381J14619J47569l9858j94605j19721M4251N9539p0949
29934g740j69827j46155k7211J41115K60815J80237q7185k64759j42117J05646
29924a57181J60374K4718l2804O0411R3324k9736j18682l4263P7580M9434k8030
29913F5145J3404J17252R5688o2343j76759j37418j4913P9522J04663N8133l7483
$$ plain form
29902 104891 6902 -32783 56208 191517 233445 159943 66045 472 -93328 -239502 -333948
29891 -333948 -274755 -132008 -75373 -140227 -181248 -96855 6663 -36425 -206618 -320516 -281431
29880 -281431 -189585 -170429 -196627 -155719 -30643 79757 98657 45145 -30679 -105486 -151671
29869 -151671 -125009 -36186 21534 -14543 -73338 -42667 54701 79802 -14364 -103278 -73005
29858 -73005 19507 58662 59791 118545 215152 220364 106041 5373 11703 43541 -4842 -79358
29846 -79358 -49596 79405 165950 137234 84245 115480 197688 208373 111359 6715 -7635
29835 -7635 33272 22187 -53615 -86438 -12445 78976 69754 -10262 -29960 43197 99694 57709
29823 57709 -23769 -41852 17455 93152 140474 156759 146640 102516 17872 -82068 -122721 -36083
$$ packed form
29902A04891r7989l9685Q8991J35309M1928p3502r3898o5573r3800j46174r4446
29891c33948N9193J42747N6635o4854m1021Q4393J03518m3088j70193j13898L9085
29880b81431R1846J9156k6198M0908J25076J10400J8900n3512p5824p4807m6185
29869a51671K6662Q8823N7720l6077n8795L0671R7368K5101r4166q8914L0273
29858g3005R2512L9155J129N8754R6607N212j14323j00668O330L1838m8383p4516
29846g9358K9762J29001Q6545k8716n2989L1235Q2208J0685r7014j04644j4350
29835g635M0907j1085p5802l2823P3993R1421r222q0016j9698P3157N6497m1985
29823E7709q1478j8083N9307P5697M7322J6285j0119m4124q4644r9940m0653Q6638
$$ plain form
29811 -36083 133858 243963 231324 201724 243910 255636 119213 -32020 43109 305481 457280
29800 457280 392540 341857 456530 535751 367958 101365 11000 71199 53288 -61069 -74227
29789 -74227 55983 136887 65367 -25526 -17340 12799 -33090 -85719 -22130 131928 224279
29778 224279 158429 -8408 -123096 -73053 101401 234130 209852 87327 -340 -12437
29768 -12437 13793 81333 208311 311254 256663 50849 -135257 -165193 -75408 11138 31523
29757 31523 9681 -7399 -6176 -14753 -53397 -81180 -46372 -230 -62869 -228076 -319857 -231791
29745 -231791 -89222 -49727 -60636 20321 159504 198542 113479 25121 -15823 -58239 -86057
29734 -86057 -26710 74068 83745 7118 -11248 66245 112835 66232 25467 62222 113974 132180
$$ packed form
29811c6083J69941J10105j2639k9600M2186J1726j36423j51233P5129K62372J51799
29800D57280o4740n0683J14673P9221j67793k66593r0365O0199j7911j14357j3158
29789g4227J30210Q0904p1520r0893Q186L0139m5889n2629O3589J54058R2351
29778B24279o5850j66837j14688N0043J74454J32729k4278j22525q7667j2097
29768a2437K6230O7540J26978J02943n4591k05814j86106k9936Q9785Q6546K0385
29757C1523k1842j7080J223q577l8644k7783L4808M6142o2639j65207r1781Q8066
29745b31791J42569L9495j0909Q0957J39183L9038q5063q8358m0944m2416k7818
29734h6057N9347J00778R677p6627j8366P7493M6590m6603m0765L6755N1752J8206
$$ plain form
29722 132180 168093 236010 250303 180670 123837 138243 144730 73340 -21422 -70426 -89203 -95285
29710 -95285 -56100 7479 -375 -89781 -137186 -79419 -15390 -23507 -24930 59339 156273 174527
29698 174527 159286 170821 132707 -30101 -202960 -223125 -146632 -170537 -304511 -324422 -102394
29687 -102394 186146 286660 189759 105082 148620 190697 68493 -143180 -200154 -22555
29677 -22555 181847 204102 123570 171177 373786 508698 410113 165452 -27438 -76186 -26668
29666 -26668 23458 7059 -53140 -66729 -10997 10014 -68112 -129930 -50678 79584 96539
29655 96539 51010 113085 233895 197010 15309 -41760 114921 249841 211665 165456 243047
29644 243047 273479 109343 -40715 92705 393744 517359 377831 195862 129375 127280
$$ packed form
29722A32180L5913O7917J4293o9633n6833J4406O487p1390r4762m9004j8777o082
29710i5285L9185O3579p854q9406m7405N7767O4029q117j423Q4269R6934J8254
29698A74527j5241J1535l8114j62808j72859k0165P6493k3905j33974j9911K22028
29687a02394K88540J00514r6901q4677M3538M2077j22204k11673n6974J77599
29677b2555K04402K2255q0532M7607K02609J34912r8585k44661j92890m8748M9518
29666b6668N0126j6399o0199j3589N5732K1011p8126o1818P9252J30262J6955
29655I6539m5529O2075J20810l6885j81701n7069J56681J34920l8176m6209P7591
29644B43047L0432j64136j50058J33420L01039J23615j39528j81969o6487k095
$$ plain form
29634 127280 127258 162112 248297 335947 386025 389178 334789 253140 227292 270435 274351 173316
29622 173316 54321 7638 665 10533 114209 294117 335011 120763 -126539 -141874 -11825
29611 -11825 -8117 -142914 -191207 -90619 -6249 -7981 18681 110082 146322 92821 74028 131487
29599 131487 130232 -2618 -137544 -138000 -35909 76891 186886 296935 351858 323028 278205
29588 278205 287520 324064 313429 233216 132788 90062 144397 235061 245669 161729 113298
29577 113298 180328 247854 178613 40135 -3110 43467 33461 -58880 -97434 -3972 150637
29566 150637 279496 347578 308162 131360 -93945 -228494 -251532 -232301 -173460 -50393
29556 -50393 33943 -58755 -258348 -340989 -243057 -119972 -72655 -29198 55270 90121 14770
$$ packed form
29634A27280k2L4854Q6185Q7650N0078L153n4389q1649k5848M3143L916j01035
29622A73316j18995m6683o973R868J03676J79908M0894k14248k47302j5335J30049
29611a1825L708j34797m8293J00588Q4370j732K6662R1401L6240n3501j8793N7459
29599A31487j255j32850j34926m56J02091J12800J09995J10049N4923k8830m4823
29588B78205R315L6544j0635q0213j00428m2726N4335R0664J0608q3940m8431
29577A13298O7030O7526o9241j38478m3245M6577j0006r2341l8554R3462J54609
29566A50637J28859O8082l9416j76802k25305j34549k3038J9231N8841J23067
29556e0393Q4336r2698j99593q2641R7932J23085M7317M3457Q4468L4851p5351
$$ [...]
##END NTUPLES=NMR SPECTRUM
##END=
