##TITLE=31Pdec_LY-17.Dix.1B
 CD3CN, 24 sc
 1.06.2021
##JCAMPDX= 6.0         $$ Bruker NMR JCAMP-DX V2.0
##DATA TYPE= NMR SPECTRUM
##DATA CLASS= NTUPLES
##ORIGIN= UXNMR, Bruker Analytische Messtechnik GmbH
##OWNER= root
$$ XWIN-NMR		Version 3.5
$$ Tue Jun  1 10:58:02 2021 Russian Standard Time (UT+4h)  she@DPX200
##.OBSERVE FREQUENCY= 81.013821
##.OBSERVE NUCLEUS= ^31P
##.ACQUISITION MODE= SIMULTANEOUS
##.ACQUISITION SCHEME= undefined
##.AVERAGES= 24
##.DIGITISER RES= 16
##SPECTROMETER/DATA SYSTEM= spect
##.PULSE SEQUENCE= zgpg30
##.SOLVENT NAME= CD3CN
##.SHIFT REFERENCE= (INTERNAL, CD3CN, 0, 248.564)
##AUDIT TRAIL= $$ (NUMBER, WHEN, WHO, WHERE, WHAT)
$$ ##TITLE= Audit trail, XWIN-NMR		Version 3.5
$$ ##JCAMPDX= 5.01
$$ ##ORIGIN= Bruker BioSpin GmbH
$$ ##OWNER= she
$$ F:/spectra/data/she/nmr/P31/1/pdata/1/auditp.txt
$$ ##AUDIT TRAIL=  $$ (NUMBER, WHEN, WHO, WHERE, WHAT)
(   1,<2021-06-01 10:56:34.07 +0400>,<she>,<DPX200>,
      <created by zg, POWCHK disabled, PULCHK disabled
       configuration hash MD5:
       00 E9 B6 7A A2 85 ED C7 34 08 36 98 17 FE 4E 26
       data hash MD5: 32K
       79 C6 3B C7 45 88 F4 83 76 3D 22 99 7D 77 FA BF>)
(   2,<2021-06-01 10:56:36.67 +0400>,<she>,<DPX200>,
      <Start of raw data processing
       efp BC_mod = 2 LB = 1 FT_mod = 6 PKNL = 1 PHC0 = -6113.531 PHC1 = 550.4726 SI = 64K 
       data hash MD5: 64K
       DA D9 99 24 BE 36 7F CB CD 74 D5 80 6B 84 A7 F1>)
(   3,<2021-06-01 10:57:15.06 +0400>,<she>,<DPX200>,
      <pk PHC0 = 384.1208 PHC1 = -807.0001 
       data hash MD5: 64K
       6C C4 8C 81 5C 7D 9C F4 7A FE 7F 90 E8 59 8E 6F>)
(   4,<2021-06-01 10:57:18.21 +0400>,<she>,<DPX200>,
      <abs ABSG = 5 
       data hash MD5: 64K
       F3 62 1E FE 8F A5 1E 46 23 B2 98 51 EA 3A 03 76>)
$$ ##END=
$$ 
$$ hash MD5
$$ 5F C3 B9 94 51 16 1C EC E6 C9 99 61 77 3B D7 7C
##$RELAX= 
##$RELAX= 
##$RELAX= 
##$RELAX= 
##$RELAX= 
##$RELAX= 
##$RELAX= 
##$RELAX= 
$$ Bruker specific parameters
$$ --------------------------
##$DU= <F:/spectra>
##$EXPNO= 1
##$NAME= <P31>
##$PROCNO= 1
##$TYPE= <nmr>
##$USER= <she>
##$AMP= (0..31)
100 100 100 100 100 100 100 100 100 100 100 100 100 100 100 100 100 100 
100 100 100 100 100 100 100 100 100 100 100 100 100 100 
##$AQSEQ= 0
##$AQ_mod= 1
##$AUNM= <au_zg>
##$AUTOPOS= <>
##$BF1= 81.014009
##$BF2= 200.13
##$BF3= 200.13
##$BF4= 200.13
##$BF5= 200.13
##$BF6= 200.13
##$BF7= 200.13
##$BF8= 200.13
##$BYTORDA= 1
##$CFDGTYP= 0
##$CFRGTYP= 5
##$CHEMSTR= <none>
##$CNST= (0..31)
1 1 145 1 1 1 1 1 1 1 1 1 1 1 1 1 1 1 1 1 1 1 1 1 1 1 1 1 1 1 1 1 
##$CPDPRG= <waltz16>
##$CPDPRG1= <>
##$CPDPRG2= <waltz16>
##$CPDPRG3= <>
##$CPDPRG4= <mlev>
##$CPDPRG5= <mlev>
##$CPDPRG6= <mlev>
##$CPDPRG7= <mlev>
##$CPDPRG8= <mlev>
##$CPDPRGB= <>
##$CPDPRGT= <>
##$D= (0..31)
0 1 0 0 0 0 0 0 0 0 0 0.03 2e-05 3e-06 0 0 0 0 0 0 0 0 0 0 0 0 0 0 0 0 
0 0 
##$DATE= 1622530593
##$DBL= (0..7)
120 120 120 11 120 120 24 19 
##$DBP= (0..7)
150 150 150 150 150 150 150 150 
##$DBP07= 0
##$DBPNAM0= <>
##$DBPNAM1= <>
$$ [...]
##$SUBNAM3= <"">
##$SUBNAM4= <"">
##$SUBNAM5= <"">
##$SUBNAM6= <"">
##$SUBNAM7= <"">
##$SUBNAM8= <"">
##$SUBNAM9= <"">
##$SW= 501.771253377433
##$SWIBOX= (0..15)
0 1 3 0 0 0 0 0 0 0 0 0 0 0 0 0 
##$SW_h= 40650.406504065
##$TD= 32768
##$TD0= 1
##$TE= 0
##$TE2= 300
##$TE3= 300
##$TEG= 300
##$TL= (0..7)
0 120 53 12 22 120 120 120 
##$TP= (0..7)
150 150 150 150 150 150 150 150 
##$TP07= 0
##$TPNAME0= <>
##$TPNAME1= <>
##$TPNAME2= <>
##$TPNAME3= <>
##$TPNAME4= <>
##$TPNAME5= <>
##$TPNAME6= <>
##$TPNAME7= <>
##$TPOAL= (0..7)
0.5 0.5 0.5 0.5 0.5 0.5 0.5 0.5 
##$TPOFFS= (0..7)
0 0 0 0 0 0 0 0 
##$TUNHIN= 0
##$TUNHOUT= 0
##$TUNXOUT= 0
##$USERA1= <user>
##$USERA2= <user>
##$USERA3= <user>
##$USERA4= <user>
##$USERA5= <user>
##$V9= 5
##$VALIST= <valist>
##$VCLIST= <CCCCCCCCCCCCCCC>
##$VD= 0
##$VDLIST= <DDDDDDDDDDDDDDD>
##$VPLIST= <PPPPPPPPPPPPPPP>
##$VTLIST= <TTTTTTTTTTTTTTT>
##$WBST= 1024
##$WBSW= 4
##$XGAIN= (0..3)
0 0 0 0 
##$XL= 0
##$YL= 0
##$YMAX_a= 3287
##$YMIN_a= -6949
##$ZGOPTNS= <>
##$ZL1= 120
##$ZL2= 120
##$ZL3= 120
##$ZL4= 120
##$ABSF1= 248.5645
##$ABSF2= -253.2056
##$ABSG= 5
##$ABSL= 3
##$ALPHA= 0
##$AQORDER= 0
##$ASSFAC= 0
##$ASSFACI= 0
##$ASSFACX= 0
##$ASSWID= 0
##$AUNMP= <proc_1d>
##$AZFE= 0.1
##$AZFW= 0.5
##$BCFW= 0
##$BC_mod= 2
##$BYTORDP= 0
##$COROFFS= 0
##$CY= -3
##$DATMOD= 1
##$DC= 0
##$DFILT= <>
##$DTYPP= 0
##$F1P= 0
##$F2P= 0
##$FCOR= 1
##$FTSIZE= 65536
##$FT_mod= 6
##$GAMMA= 0
##$GB= 0
##$INTBC= 1
##$INTSCL= 5.30512e-09
##$ISEN= 30
##$LB= 1
##$LEV0= 0
##$LPBIN= 0
##$MAXI= 10000
##$MC2= 0
##$MEAN= 0
##$ME_mod= 0
##$MI= 50
##$NCOEF= 0
##$NC_proc= -5
##$NLEV= 6
##$NOISF1= 182.463
##$NOISF2= 159.3651
##$NSP= 0
##$NTH_PI= 0
##$NZP= 0
##$OFFSET= 248.5645
##$PC= 4
##$PHC0= -5729.41
##$PHC1= -256.5275
##$PH_mod= 1
##$PKNL= yes
##$PPARMOD= 0
##$PSCAL= 0
##$PSIGN= 0
##$REVERSE= no
##$SF= 81.014009
##$SI= 65536
##$SIGF1= 159.3651
##$SIGF2= -187.1042
##$SINO= 113.3802
##$SIOLD= 16384
##$SREGLST= <1H.CDCl3>
##$SSB= 0
##$STSI= 65536
##$STSR= 0
##$SW_p= 40650.406504065
##$SYMM= 0
##$S_DEV= 0
##$TDeff= 32768
##$TDoff= 0
##$TI= <>
##$TILT= no
##$TM1= 0
##$TM2= 0
##$TOPLEV= 0
##$USERP1= <user>
##$USERP2= <user>
##$USERP3= <user>
##$USERP4= <user>
##$USERP5= <user>
##$WDW= 1
##$XDIM= 65536
##$YMAX_p= 540934239
##$YMIN_p= -22543682
$$ End of Bruker specific parameters
$$ ---------------------------------
##NTUPLES= NMR SPECTRUM
##VAR_NAME=  FREQUENCY,     SPECTRUM/REAL,   SPECTRUM/IMAG
##SYMBOL=    X,             R,               I
##VAR_TYPE=  INDEPENDENT,   DEPENDENT,       DEPENDENT
##VAR_FORM=  AFFN,          ASDF,            ASDF
##VAR_DIM=   65536,         65536,           65536
##UNITS=     HZ,            ARBITRARY UNITS, ARBITRARY UNITS
##FACTOR=    0.620285442955139, 1,           1
##FIRST=     20137.2065510759, 0,            0
##LAST=      -20513.1999529892, 0,           0
##MIN=       -20513.1999529892, -22543682,   0
##MAX=       20137.2065510759, 540934239,    0
$$ Real data points
##PAGE= N=1
##DATA TABLE= (X++(R..R)), XYDATA
$$ [...]
35678a88159J41508J35167k8395k4149Q298j41085k90521j40658K26685M21522
35668A20213K08307k62474n73802l60775K65928O18785J35617p47892r41381j47059
35658a684533O22751M36628k15461k13291M54020P09471Q8286n95129n42213k4511
35648i63982L33744N23106P16988N45542k82217j038890p07407M37213R94237
35639E58334L39458n96766p88438m17333j48549L8120M41277P00629L07542k95458
35629A38816k13624M24496N97053N5988k93531J4692K02264l60188r94745q01766
35619a230545p6607L15540L11400L67500L75297L238l12213L5421N33543K10946
35609E33520n79470n46875L24781O19770q8330m22488M05050J099064M12680p13288
$$ y = [-188159, -46651, 88516, 60121, 35972, 44270, -96815, -387336, -527994, -301309, 120213, 328520, 66046, -507756, -868531, -602603, 16182, 151799, -596093, -1537474, -1684533, -1061782, -625154, -840615, -1053906, -599886, 109585, 197871, -397258, -939471, -963982, -630238, -107132, 609856, 1155398, 873181, -165709, -873116, -435903, 558334, 897792, 301026, -487412, -904745, -1053294, -1015174, -573897, 126732, 434274, 138816, -74808, 349688, 946741, 1002729, 709198, 723890, 926154, 565966, -428779, -1230545, -1307152, -991612, -680212, -312712, 62585, 65823, -246390, -210969, 322574, 533520, -45950, -592825, -268044, 351726, 263396, -159092, 245958, 1345022, 1757702, 1044414]
35599A044414p28270j9158l5351o84426o50055Q4695J92501m49006l28186R94026
35589e78816J753109O44707j014780j210483j22507M91879N6213l60075p1647
35580d12400L16072K22426j258N0684O5626k71804n42972k69398J90992J67755
35570d84277j99096j53497M06169O58296J21753n14328l73793K79373M48991o6721
35560A22870m18909q4073L59688K39391j62464j92918Q6178J54911J4859R4622
35550B14155L60888L39633j5687k44258j94863j82613k68091j51195Q6795m8832
35540a04068n10699n44775J34967P80689P11993K75887J26315J91754N3770j76132
35530I39701j32097K4817j21028m16564l29027J58188N05988M23862J18955k17499
$$ y = [1044414, 316144, 296986, 261635, -422791, -1072846, -988151, -795650, -1244656, -1572842, -578816, 1174293, 1819000, 804220, -406263, -528770, -36891, 19322, -340753, -412400, -96328, 126098, 124840, 175524, 241150, -30654, -573626, -843024, -652032, -484277, -683373, -836870, -430701, 227595, 349348, -164980, -538773, -259400, 189591, 122870, -296039, -380112, -20424, 218967, 56503, -136415, -50237, 104674, 119533, 214155, 575043, 914676, 898989, 654731, 459868, 277255, 9164, -142031, -55236, -104068, -614767, -1159542, -1024575, -243886, 468107, 743994, 870309, 1062063, 1115833, 939701, 807604, 832421, 711393, 294829, -34198, 123990, 629978, 1053840, 1172795, 955296]
35520I55296n78552p69103m48225K85307P87430N81787n5558l89836k5747O25369
35510I68168P09420p9446r42986q34172R6361N63822n8055p91465n25829L10956
35500e83226N21609M6252j20880K81759M05852j22695n00125j27186L59088J43807
35490C04255m77753o64259l11636K5421J13615J75768K70164K38636J64771K57159
35480I6141L26104k2947o39985q48656l68662K67810M59885K92375K17417K86349
35470F5831J57329k09799l53603r283L42941M5635p13755r42967j08975J033460
35460f93186J288886M92839l62422m58198o7720P7619j25680j82428P8495J91140
35450B39345j69147n45383k85157M14331O40155Q4792l84221L0009P46040N82923
$$ y = [955296, 376744, -392359, -840584, -555277, 232153, 813940, 758382, 368546, 342799, 968168, 1677588, 1598142, 655156, -179016, -82655, 481167, 423112, -368353, -894182, -583226, -61617, -15365, -136245, 145514, 551366, 428671, -71454, -198640, 160448, 304255, -173498, -837757, -1149393, -1123972, -1010357, -834589, -564425, -325789, -161018, 96141, 422245, 399298, -240687, -1089343, -1458005, -1190195, -730310, -437935, -220518, 65831, 223160, 13361, -340242, -349525, -6584, 39051, -674704, -1617671, -1726646, -693186, 595700, 1088539, 726117, 267919, 200199, 277818, 152138, -30290, 48205, 239345, 70198, -475185, -760342, -346011, 294144, 378936, -5285, 24724, 770764, 1353687]
35440A353687l84708q35548k29421L38079r8723q26801o54526J55229L96245j15687
35430i02174m30988j53891R4282m393N0539M56786O10449J83494k77000l04290
35420f77186j70067j17563J47285O47834P31627J44101l35683q5171L20171J01605
35410G06953l93016l18409K44912M93471J85503j87215k82985j83753P091J75449
35400D48001O4827k82565l32108J14715M23939J40773j43022K07260O74768M64447
35390A781035o6948r6829J49289M5610J93749J542672L059006K408295n89997
35381H425882l156517l061256j265046j3194J67859J88933L22328P5247m39742
35372A244494n10548o5444K07506m8055m77412o88851o52928m71958k32107r321
$$ y = [1353687, 968979, 133431, -95990, 242089, 143366, -683435, -1337961, -1182732, -786487, -902174, -1333162, -1487053, -1392771, -1397164, -1346625, -889839, -279390, -95896, -372896, -677186, -847253, -964816, -817531, -169697, 561930, 706031, 370348, 285177, 605348, 706953, 313937, -4472, 240440, 733911, 919414, 732199, 449214, 265461, 272552, 448001, 512828, 230263, -101845, 12870, 436809, 577582, 434560, 641820, 1316588, 1781035, 1714087, 1617258, 1766547, 1812157, 2005906, 3548578, 6607584, 9015879, 8425882, 5269365, 2208109, 943063, 929869, 1097728, 1286661, 1608989, 1684236, 1244494, 733946, 668502, 876008, 827953, 350541, -338310, -991238, -1463196, -1695303, -1704624]
35362a704624K44844N79718O82385J69847n72715o08538J42640O04534J92467
35353b69442k33845J24758N57257N3228q50006q33362Q2423O42715L76716P2668
35343b76890J99838K23494k06083n48279l15474J65496L78721L19853K10414P7234
35333B28324r3841k19656k80867k70166o0339K72016K79541j33059k58861L21619
35323b15289P08437r5915j324462j286469M0374R13331N20574K5561L67788P74323
35313D28253M14948m3136K09341N37709O3735o18787m62859J46903J41277k52970
35303E64414M158P00136N82293m20038r22222k90066M48233L63628q7620j69176
35293G73740o5168k18827m12934k83645l3702M4337J28495L51420L50554n7303
$$ y = [-1704624, -1459780, -880062, -197677, -27830, -600545, -1209083, -1066443, -461909, -269442, -503287, -378529, 178728, 231956, -618050, -1451412, -1368989, -726274, -349558, -276890, -77052, 146442, -59641, -607920, -923394, -757898, -379177, -59324, 151090, 228324, 134483, -85173, -366040, -636206, -696545, -424529, -144988, -278047, -536908, -215289, 493148, 397233, -927229, -2213698, -2173324, -1259993, -739419, -713858, -346070, 428253, 843201, 800065, 1009406, 1547115, 1610850, 992063, 529204, 676107, 817384, 564414, 568572, 1268708, 1851001, 1430963, 508741, 218675, 666908, 1030536, 942916, 773740, 708572, 489745, 76811, -206834, -240536, -196199, -67704, 283716, 634270, 576967]
35283E76967l60949j60463R7432j00285l71695r0851M39960M04585j86913n18791
35273b71003k61896O1250Q0964R0507L18689M54709K61321M3149Q3054J07504
35263I68248k31821p16952q53000n32327k5033M35252O70153M35586k31702p21592
35253h03188m39647L41331P07495K38203n11467p55264l14722M04152Q97350Q57908
35243F22151L23909k58204l84596p7967J51930N9931j1566J97984L15705r5759
35233H43518p28811q55729l48468J73989K45436J00659J66977M10205M59705J71637
35223F39118j96965l32153k14389p3903n4762n2596K9506L6793j53819k54805
35213f27975M8179L79152L3599p71217q66131J49490J047181O90401j79612j01550
$$ y = [576967, 216018, 55555, 152987, 52702, -318993, -409844, 30116, 434701, 247788, -271003, -532899, -471649, -390685, -300178, 18511, 473220, 734541, 777690, 860744, 968248, 736427, 19475, -833525, -1365852, -1390885, -955633, -285480, 150106, -81596, -803188, -1242835, -901504, -194009, 44194, -467273, -1222537, -1537259, -1133107, -235757, 622151, 946060, 687856, 303260, 225293, 377223, 437154, 425588, 623572, 939277, 843518, 114707, -741022, -1089490, -915501, -670065, -569406, -402429, 7776, 467481, 639118, 442153, 110000, -104389, -178292, -233054, -285650, -256144, -219351, -373170, -627975, -579796, -200644, -167045, -938262, -1804393, -1654903, -607722, 82679, -96933, -198483]
35203a98483P27979P85071k29754q81039l64945K76068N0578l71111n4077M35238
35193A75525P3007o78151n46412L69383O80290p3766p46528m22199L07488M45613
35183d15750K9600k02916J8635L16991L40389J16957j16340j31320J21226L74295
35173D51767K37689l08945p68987o46581k7706M98969M94420J43784j9000J49423
35163B04833J86876k16532n40630r6761P45461Q33133n6396p09034k39047N35907
35153F47810L85202l96839n40637J24974M98462O3242m07755k81614J891n7052
35143C7684j05896K50609N38288J56628m86240m51217L29358Q77678M38719n91418
35133I94193j161203p34085J88619O84758M53359K8728j14753k30799o35631q20911
$$ y = [-198483, 529496, 1314567, 1084813, 203774, -161171, 114897, 165475, -205636, -259713, 175525, 248532, -429619, -976031, -606648, 73642, -124, -746652, -1168851, -861363, -415750, -386150, -589066, -570431, -253440, 86949, 203906, 87566, -43754, 77472, 451767, 689456, 380511, -388476, -1035057, -1062763, -563794, -69374, 74410, 55410, 204833, 391709, 175177, -365453, -462214, 283247, 1116380, 1059984, 350950, 111903, 647810, 1033012, 636173, 95536, 220510, 718972, 782214, 374459, 92845, 94736, 37684, -68212, 182397, 720685, 877313, 391073, -60144, 269214, 1146892, 1585611, 994193, -167010, -901095, -712476, -27718, 425641, 454369, 339616, 108817, -526814, -1347725]
35123a347725r2330J047512J204523K6247j148869j064740j17632M87544M01230
35114f04240J41418R885q8399o2305K54558N57744M05054j84q0280J43004J09239
35103G85494k40378k99290J39252M26137N1420n20879n18443M9524M90015L82725
35093G45577l6305l44811l74688j82476Q6223K25852R3866j98892l59791k41509
35083e86954J0851J77306J98192J27987k116j44571j72185m4442K8720j62351
35073e69563m06483k11784M87829J056602Q67241R9724m92070m95118j65323R5883
35063B66938J76085R9863j43150m10620l62989J11660O11947O33411J72976l02629
35053H53492m38858l21884k12266j61558l2694J90116L05911J74312o1579j80303
$$ y = [-1347725, -1440055, -392543, 811980, 838227, -310642, -1375382, -1493014, -1005470, -604240, -462822, -452937, -541336, -603641, -349083, 208661, 613715, 613531, 533251, 676255, 785494, 545116, 245826, 385078, 811215, 862635, 341756, -176687, -127163, 362852, 745577, 709272, 364461, -10227, -192703, -106480, 119372, 213238, 14346, -345445, -586954, -576103, -398797, -200605, -72618, -74734, -219305, -391490, -435932, -407212, -569563, -976046, -1187830, -700001, 356601, 1223842, 1323566, 831496, 336378, 171055, 266938, 443023, 542886, 399736, -10884, -373873, -262213, 349734, 983145, 1156121, 853492, 414634, 92750, -119516, -281074, -313768, -123652, 182259, 356571, 294992, 114689]
35043A14689j92657k15089j34057K32020O40823N83835Q4544k06550k0645K6594
35033I13507n25868j022641n87235M06879P59215K14978k43735j3391K82212k0369
35023A63552n11219m36469J18297M83007M10290J69418o9379l29113m78520l32443
35013h12579l1890Q9562k8035j46219r4469Q8538K78864L25141J16081k24152
35003d39158l65779j71432J05227J66368K1945j35682j93277j37763l7924n8458
34993a245933k13437j32308M76745J120410R19085q9199p48229l00143N53057
34984C40048O88457J02011l37396k92174k51186n08333o52897k86361K97328M68452
34974d32051O6103l95648l19659K53657O43832L66295k10291l65685k6800K44057
$$ y = [114689, -77968, -293057, -427114, -195094, 445729, 1029564, 1114108, 907558, 886913, 913507, 387639, -635002, -1222237, -815358, -56143, 158835, -84900, -98291, 183921, 163552, -347667, -784136, -665839, -182832, 227458, 396876, 327497, -1616, -480136, -812579, -844469, -754907, -782942, -929161, -1023630, -935092, -656228, -331087, -215006, -439158, -804937, -976369, -871142, -704774, -682829, -818511, -1011788, -1149551, -1187475, -1245933, -1459370, -1591678, -1114933, 5477, 924562, 835363, 87134, -213009, 340048, 1028505, 1130516, 793120, 500946, 249760, -258573, -911470, -1197831, -900503, -432051, -365948, -761596, -1081255, -827598, -183766, 182529, -27762, -393447, -420247, -176190]
34964a76190J78741O1249J8759j74691m04723j62207M83651P02927J50953m38401
34954B40068m34628k11368k28165j40473L53200O73125L37009o6075N4826J16772
34944F94291m89782r48020k64106P46190N48817m80531n55909M96998Q89598j18440
34934E19106r93821n06123L86773L53654k16252k62386P3331L5294k22545q2845
34924i15814K44667J54847j51465p2723K22506J50054j34606m3424K67503J42934
34914a35521l06882k81393L65982Q56912O81219J88693j78745m48486o65944n85724
34904e09889j58181J97394J50814p3760q6489P8391M6389l21315o33884l45182
34894a655712N24032J158882P74599l00044q41095k61442O00436O53593J4864
$$ y = [-176190, 2551, 63800, 82559, -92132, -496855, -659062, -175411, 527516, 678469, 240068, -194560, -405928, -634093, -774566, -421366, 251759, 588768, 522693, 577519, 694291, 204509, -743511, -1007617, -261427, 287390, -193141, -749050, -252052, 637546, 519106, -474715, -980838, -594065, -240411, -456663, -719049, -645718, -610424, -832969, -915814, -671147, -516300, -667765, -740488, -517982, -367928, -502534, -545958, -278455, -135521, -442403, -723796, -357814, 499098, 1180317, 1369010, 1190265, 741779, 75835, -509889, -668070, -470676, -319862, -393622, -480111, -401720, -355331, -676646, -1310530, -1655712, -1131680, 27202, 801801, 501757, -339338, -600780, -344, 653249, 668113]
34885F68113l49888r1239K12817J14245j15738r6303P2673Q0810j18079l03858
34875G3553k41074J13767M67577L71226j80775n43776k36073K69085J57411m65049
34865b14128o77863j63759L05291J10034k56191l9494N27974N72923q1527o46154
34855e62894m53000K48407P26070N89825j274o36765r14162o01937J63728Q65281
34845e76721R94810N32738m5718k81101j80161j05596k70718m55882k97533J77693
34835e08189M52474R7636n92781q03811j87906N91030O34105j7688m63483k01122
34825i99735K88913M35897M05941N41663N51817J9548o47866o71452j52975O1649
34815a66600k17158k57316K44201N65328J75342l81278m49927k83512l19157j90317
$$ y = [668113, 318225, 226986, 439803, 554048, 438310, 342007, 414680, 495490, 377411, 73553, -167521, -53754, 413823, 785049, 604274, 60498, -175575, 93510, 250921, -214128, -891991, -1055750, -750459, -640425, -896616, -936110, -408136, 164787, 83260, -562894, -1015894, -767487, -41417, 548408, 547134, -89631, -1003793, -1605730, -1442002, -576721, 418089, 950827, 905109, 624008, 443847, 338251, 67533, -388349, -685882, -508189, -55715, 41921, -550860, -1354671, -1542577, -951547, -317442, -335130, -798613, -999735, -710822, -274925, 131016, 672679, 1224496, 1244044, 596178, -75274, -228249, -166600, -383758, -641074, -396873, 168455, 343797, -37481, -487408, -770920, -1090077, -1280394]
34805a280394N50632J273700R76988r6275o75553k92581J69473m5637n12230m68912
34795d00789L5462L81306K81028m5955k98005l09466n7580K65600L56133J53787
34785C61521q7994j95863k83787m31536m39986j20331L74580P06978P04858M28946
34775A017386M9449k23722k52333j42002j62451l80168n12857k85079J81747M84363
34765b25667L98740J05012o5439l2460k3688j94170l23524j03389L25808M59370
34755C20593J39351j87047j32277Q3749Q2839l7858L923M3387k61688o64319n05821
34744a115168K71130Q92511P40033R0796l64789l50055r1074J06855J01756o8510
34734B13485k12000j54734K8591J10538M2049m1617j27683l18049m83454l03009
$$ y = [-1280394, -729762, 543938, 1520926, 1424651, 749098, 456517, 625990, 580353, 68123, -400789, -365327, 15979, 297007, 251052, -46953, -356419, -413999, -148399, 207734, 361521, 273527, 77664, -206123, -637659, -1077645, -1197976, -823396, -116418, 588440, 1017386, 1066835, 843113, 590780, 448778, 286327, -93841, -606698, -891777, -710030, -225667, 173073, 278085, 212646, 180186, 156498, -37672, -361196, -464585, -138777, 320593, 459944, 272897, 140620, 224369, 307208, 269350, 273273, 316660, 54972, -609347, -1115168, -844038, 48473, 788506, 879302, 514513, 164458, 73384, 180239, 281995, 213485, 1485, -153249, -124658, -14120, 27929, -13688, -141371, -459420, -942874, -1245883]
34724a245883K14418N94001M90758J50999L7343J87120K18381q0646m09488l29560
34714a72557Q3267K00517l19984q55485n07674N14398R49953K75613l90826P3167
34704a49611R85206Q26380l91863j085463m31428N73681P15613P7816n24407o52268
34694e6344k78756M09109P67508J47480r28848j033619J29508J038396N26347
34685G20781m59245m13645L66636M43978l33967o69106M6723Q71790Q06726K4283
34675A404954o82192q18195l23718M87961R51245O19047j03115m30424k34588
34666H70975j2524J4141M3141O9396r2148k43251n4112K09232L7573l43313k62072
34655B37038J98046K90864r1847k75899o2935k6110l37879m22009r2208P0620
$$ y = [-1245883, -1031465, -437464, 53294, 204293, 241636, 428756, 647137, 566491, 157003, -172557, -89290, 111227, -208757, -1064242, -1571916, -1057518, -107565, 168048, -222778, -149611, 835595, 1661975, 1270112, 184649, -246779, 326902, 1042515, 1120331, 595924, -56344, -335100, 74009, 841517, 988997, 60149, -973470, -843962, 194434, 720781, 261536, -152109, 214527, 658505, 324538, -344568, -297845, 573945, 1380671, 1404954, 722762, -95433, -419151, 68810, 1020055, 1639102, 1535987, 1105563, 870975, 858451, 872592, 915733, 985129, 892981, 649730, 595618, 804850, 842423, 499110, 237038, 435084, 725948, 634101, 358202, 295267, 269157, -68722, -490731, -582939, -512319]
34645e12319j21886m3493M98197O89689M5407o76626o25341o0263L17233M34917
34635e4485N26981M75264J77185p9350j73958l66813n11230j8998Q53772Q62072
34625A690440l12584j244335q65076j13691k17484n86677m9904Q75359Q65134
34616D1182J98278K27792Q64117P03585m13417j049325n89561o9308j58095j49572
34606c94324M03288P07691J97970m17687m15459j71146k36239l68234k12605R771
34596h96974J12543K98730M31535K0975o19581m63371M37509O76299k23805p75340
34586a001480J13536J198509P83677o22196j189981m91198L31006N68072N14224
34577B04169L40103j11790n36140m47561j28343j58420k48563K48154R21972P56722
$$ y = [-512319, -634205, -677698, -179501, 510188, 555595, -121031, -746372, -806635, -489402, -54485, 472496, 947760, 1124945, 1045595, 871637, 504824, -6406, -25404, 828368, 1690440, 1377856, 133521, -731555, -845246, -1062730, -1649407, -1699311, -823952, 41182, 239460, 467252, 1331369, 2034954, 1621537, 572212, -17349, -86657, -244752, -394324, 8964, 716655, 914625, 496938, 81479, -89667, -325906, -694140, -906745, -896974, -784431, -485701, -54166, -33191, -652772, -1116143, -678634, -2335, -226140, -1001480, -887944, 310565, 1094242, 472046, -717935, -1209133, -878127, -310055, 204169, 544272, 432482, -103658, -551219, -679562, -837982, -1086545, -838391, 83581, 840303]
34567H40303j16251n05453n6008L06533K9015k99050j90782m8442k00447k33244
34557d73826J20431L40567o80m62368m46836q2580J60117K23800L14740L98246
34547I1611K90163k0445m03968o67148n11566J52784P82066O43274j60845o90290
34537d94364m10197J41124K17261j38069l30240n5734M40770P00085M47828j15513
34527D02951m04396j32064K10424L0110l81186k40485M04971O20242J0082o65909
34517a45260o44319j41663K32700L35939K92211Q1649j65488n6152L64436L77145
34507E31198l60780j063276p98949J63444P05803L38159l27546n07733j17015
34498a436695L33720L70612K6637k09647K6310M76534N81626K38823j55918l75682
$$ y = [840303, 724052, 218599, 162591, 469124, 498139, 199089, 8307, -40135, -240582, -473826, -353395, -12828, -13508, -475876, -922712, -1005292, -845175, -621375, -306635, 91611, 381774, 361329, -42639, -709787, -1221353, -1068569, -286503, 356771, 195926, -494364, -904561, -763437, -546176, -684245, -1014485, -1070219, -629449, 70636, 518464, 402951, -1445, -133509, 76915, 107025, -274161, -514646, -109675, 510567, 520649, -145260, -789579, -931242, -698542, -362603, -70392, 11257, -154231, -210383, 154053, 531198, 170418, -892858, -1691807, -1528363, -822560, -484401, -811947, -1319680, -1436695, -1102975, -732363, -705726, -915373, -889063, -412529, 169097, 407920, 252002, -123680]
34488a23680n35110n84343k85026J90663L32525J43379J78013N14805N29981K9413
34478C90620k99327m2431K37806M7840j86218j3124J74937l3729k33116o2752
34468a9494l1331m77458o20153J35905Q20730L01619o59013m66197O62038J010623
34458F57269J85099l71515P8169M41485j52992q89990p49767o6951L40660M33167
34448i5366M14026J7366o91666p92434J49451J055474P54366k72690o90663k66524
34438d18660J46838J56782J58677L04514K35898j50431n19215o64496n93058k16319
34428a559470L64186N59787P9470l14748K08741J084080R94304j09129q58257
34419D48964m80623K48187M00981J01373j75322m43217o90539m60858K82931O80898
$$ y = [-123680, -658790, -1243133, -1528159, -1337496, -1004971, -861592, -683579, -168774, 361207, 390620, 91293, 48862, 286668, 334508, 148290, 135166, 310103, 276374, 43258, -19494, -50825, -528283, -1148436, -1012531, -191801, 109818, -549195, -1015392, -353354, 657269, 842368, 470853, 549022, 990507, 837515, -52475, -802242, -869193, -528533, -95366, 318660, 336026, -355640, -1148074, -998623, 56851, 811217, 538527, -152136, -418660, -271822, -115040, 43637, 348151, 584049, 433618, -85597, -750093, -1343151, -1559470, -1195284, -635497, -556027, -870775, -662034, 422046, 1416350, 1307221, 448964, -31659, 216528, 617509, 718882, 543560, 100343, -590196, -1051054, -768123, -87225]
34409h7225J92636m14609j92245M97799O18622Q9377l14134l52648m47259n52037
34399i61723j16483P14990J006891M44823j55683j42945R7290M2355q1113O0374
34389I08776J53914j25723l53457l0756M54308L73878j78939n00291m03452l13013
34379a4755l69909k62440M8923J82073L912j61223q0266J45334L87389N43131
34369D22169L83014p9336k56797K21334N95805j22447j376700j458726n501J223307
34359d53878P98871l48865m66965L87933O83571p7844p16422l46074L36646K73388
34349G0361l57067n06286J85657Q81742O33608m00297j086500o72676K71024O14329
34339c66105J95748p4681K60946M54017j52251q82867o99629J30678M26028j01883
$$ y = [-87225, 105411, -309198, -501443, -3644, 614978, 704355, 390221, 37573, -409686, -961723, -1078206, -363216, 643675, 1088498, 932815, 789870, 887160, 929515, 848402, 908776, 1062690, 936967, 583510, 552754, 1007062, 1380940, 1202001, 701710, 298258, -14755, -384664, -647104, -598181, -416108, -412196, -573419, -653685, -508351, -120962, 422169, 805183, 725847, 469050, 690384, 1286189, 1163742, -212958, -1671684, -1677185, -453878, 344993, -3872, -470837, -82904, 600667, 522823, -193599, -539673, -203027, 70361, -286706, -792992, -607335, 274407, 908015, 507718, -578782, -1251458, -980434, -366105, -170357, -245038, 15908, 469925, 317674, -565193, -1264822, -1134144, -708116, -809999]
34329h09999n63507m12792j17374o2679J40060P39986J120565O76691j69231n12981
34319B8739j71047K50978K62419l6987k64788j78860J37227L29300J54074j32663
34309C78392o4371L02500L89758q547l57271k06335J31474J55136l3978m2353
34299F44405Q4796L1830j45551j45655k3599q6170k82609k64631n476J86362K39594
34288B33296L35572L54454l9246o27568o43323J25976Q33228O46668j21101n13741
34278E84215k46909J00733P3027j36344k13897k04719k15507r0757K50436M52826
34268C53104J39799m25227n36305K7480O44642O28265R4403k59394j23429O2457
34258F05795j80171o23514o16344j527O19408O58214K87542J37824L90979N52075
$$ y = [-809999, -1373506, -1786298, -1903672, -1966351, -1826291, -1086305, 34260, 710951, 541720, 28739, -142308, 108670, 371089, 334102, 69314, -109546, 27681, 356981, 511055, 378392, 314021, 616521, 1006279, 997732, 640461, 434126, 565600, 720736, 686758, 644405, 729201, 761031, 615480, 469825, 446226, 360056, 77447, -187184, -192660, -6298, 233296, 568868, 923322, 884076, 256508, -386815, -260839, 572389, 1219057, 1097956, 584215, 337306, 438039, 511066, 374722, 160825, -43894, -259401, -350158, -99722, 353104, 492903, 67676, -468629, -441149, 203493, 831758, 926161, 666767, 543338, 605795, 425624, -197890, -814234, -815761, -196353, 461861, 749403, 887227, 1278206, 1830281]
34248A830281J88521m47409p64466n72340j80211J03814K23159J73190m7787k03934
34238C02818O2833O53739Q78190K50121p61065j151891n23449M98462R90192O29858
34228A829808j54049p07318p43045n21190m50647m90307j58244O67296J255180
34219E27484Q19054l11133r39391n33824J36877K04837j05454p3176K36910J44561
34209A06745l63519m57708K13294Q24027M89588m55757r04493m26728L19341N58390
34199i6820K51423j26188k63830k39966k36298k37437o6147K96035N29818L22852
34189A33442j17824k30738R7402L01337M59l42116j26168L74511L91620j29681
34179C52244m68672k67997M1497Q9606Q3373K18768K78290J42378N7650P2781
$$ y = [1830281, 2018802, 1571393, 806927, 234587, 54376, 158190, 381349, 554539, 506752, 302818, 365651, 1019390, 1897580, 2147701, 1386636, 234745, -288704, 209758, 1199950, 1829808, 1675759, 968441, 225396, -295794, -746441, -1236748, -1394992, -727696, 527484, 1346538, 1035405, 96014, -437810, -300933, -96096, -201550, -274726, -37816, 106745, -256774, -714482, -501188, 322839, 812427, 356670, -547823, -974551, -655210, -96820, 154603, 28415, -235415, -475381, -711679, -949116, -1015263, -719228, -189410, 133442, 15618, -215120, -117718, 183619, 184078, -158038, -284206, 90305, 481925, 352244, -116428, -384425, -342928, -253322, -169949, 48819, 327109, 469487, 527137, 599918]
34169E99918j14807m08057k01180M93748O76934j65718j033095p76253J90013
34160g38497O10615K79860J1860Q5086N520k93134k71974J01893K01681j26422
34150a33512l07123j02336N4008j4156N6978L02081K65770m3283n3130K43411
34140B68708J46385m12136n50817K6116L65758j44420o55563k55892M81556M48270
34130b82035k16701m45518P0106N62266M05189j56613m77040k31082K55581K53503
34120b62344m55913r58276k41107J138193J517156M93959n03353n10183l50541
34111a32409p72289q66355K34306J441583J245584J45439k99437m6018k19587
34102G30817p64758n75563K46411L94793k78531m43589L06939O74943r9246r51395
$$ y = [599918, 485111, 77054, -124126, 369622, 1046556, 880838, -152257, -928510, -738497, -127882, 151978, 163838, 248924, 254444, -38690, -310664, -208771, -7090, -133512, -440635, -542971, -488963, -503119, -446141, -144060, 121710, 78427, 25297, 268708, 415093, 2957, -547860, -521744, -155986, -300406, -955969, -1211861, -730305, -282035, -498736, -944254, -874148, -311882, 93307, -63306, -540346, -771428, -515847, -262344, -718257, -1676533, -1917640, -779447, 737709, 1231668, 728315, 218132, -132409, -904698, -1771053, -1536747, -95164, 1150420, 1295859, 996422, 950404, 730817, -33941, -609504, -363093, 31700, -246831, -690420, -383481, 291462, 192216, -759179]
34092g59179p82208o3047K49507J75382J83359K29873J79978L18120O80264O80706
34082A092755R8020l52437j17425K73960R6937m35134o36503l84770l0858K43624
34072a51831L97875K97212J967j25323J1471L6922k05879l23984q3235J67019
34062B2214J68497K04154M23575L90633j36620n94218m24117K2278P1381k06651
34052e8874k33576O5746K06515o077j96867n6503J86969J05599l10503n42875
34042h40446j31607O55620J005672N83594J5425k6140J96341L7625l70057l74512
34032G51515j1998N0885k28627j47050M19681O32922L6466o62474o84544k57363
34022a00587l9548j24328j81361p7713J31501M15371O06487M27711n5955m10391
$$ y = [-759179, -1541387, -1604434, -1354927, -1179545, -996186, -766313, -586335, -268215, 412049, 1092755, 1190775, 838338, 720913, 994873, 1091810, 656676, 20173, -364597, -395455, -151831, 246044, 543256, 545223, 419900, 431371, 468293, 262414, -61570, -144805, 22214, 190711, 394865, 818440, 1209073, 1072453, 478235, 54118, 76396, 147777, -58874, -292450, -226704, -20189, -26266, -223133, -279636, -92667, 12932, -297571, -840446, -972053, -316433, 689239, 1272833, 1288258, 1262118, 1458459, 1496084, 1126027, 751515, 739517, 790402, 561775, 414725, 834406, 1467328, 1503794, 841320, 156776, -100587, -140135, -264463, -445824, -523537, -392036, 23335, 629822, 1057533, 1001578, 591187]
34012E91187m17001k64679j18550O152j1465k01780k02511J63651L04329k37404
34002c88071o80039o7847Q80158O16978o11845r22948J28369P31573j39321r70623
33992a423616k84806Q89909Q10259j84038n34830q1924Q3152k80223l86642j588
33982a394347L38065M59173O21042O86184L60993k1170J226J08204j99297n49427
33972D10646l18490J81606K43516N447J1838N3230l19147o22961j44295N98301
33962I9691N06849k73264o11082k44971P6378J40613M20799P14804K45697p01382
33952C74132q34875N4838N68349j33635r93424p15195L30703Q24208L88316j70674
33942c07257j48466K87733N36164L18416p1567j97510j08138k61579o79876o82574
$$ y = [591187, 174186, -90493, -209043, -202891, -214356, -416136, -618647, -454996, -150667, -388071, -1068110, -1135957, -255799, 361179, -250666, -1173614, -1045245, -313672, -452993, -1423616, -1708422, -818513, -8254, -192292, -727122, -809046, -725894, -1006117, -1392759, -1394347, -1056282, -597109, 23933, 710117, 1071110, 1049940, 1051166, 1159370, 960073, 410646, 92156, 273762, 517278, 522725, 534563, 587793, 268646, -354315, -498610, 99691, 606540, 333276, -277806, -522777, -446399, -305786, 115013, 829817, 1075514, 374132, -460743, -405905, 162444, 28809, -964615, -1679810, -1349107, -524899, -136583, -307257, -455723, -167990, 368174, 686590, 615023, 417513, 309375, 47796, -632080, -1314654]
33932a314654Q6710Q88102Q21214J11152l14841j71395J04532K89086M68075M47662
33922A415643J1873m17561l00149M4879p1650m68730l97281R3962K32179j09890
33912C3275k72234m9803P1169j1429J41720M63671L37746j99494l67830j2483
33902A34308J07435k58330l36124K56140P06788L02735m18728n52575j18692K36359
33892E9316K36490L2021k53799m59736k71364L17115P36983M68617k85650q43966
33882b63973p80711k51334K53181L95377L10031L17816L05671j37757p80565p00278
33872a332542K84198R77144M74353l54192k24926M57416L59190m41689o28699
33863d29747K2254L32754j00169k41981L89670P71640J55899o44771o25012o7823
$$ y = [-1314654, -1227944, -339842, 481372, 592524, 277683, 106288, 210820, 499906, 967981, 1415643, 1427516, 1009955, 709806, 754685, 683035, 214305, -182976, -89014, 143165, 33275, -238959, -288762, -217593, -229022, -87302, 376369, 714115, 514621, 146791, 134308, 241743, -16587, -352711, -96571, 610217, 912952, 494224, -58351, -177043, 59316, 295806, 327827, 74028, -385708, -657072, -339957, 397026, 865643, 579993, -263973, -1044684, -1296018, -1042837, -647460, -337429, -19613, 286058, 148301, -632264, -1332542, -1048344, -71200, 403153, 48961, -175965, 281451, 640641, 198952, -429747, -407493, -74739, -174908, -416889, -27219, 744421, 900320, 255549, -369463, -437286]
33853d37286K01049P5647r1559k03242k20544K9681L76282L53115K8313m0521
33843G0935J38730p701l99918k95362K41979K25720m82487p29599K790O80050
33833e54863M82610P0023J74537L07946p4152l90949o9300K98084J04817o5225
33823B83528L74905O95162Q3736p45564o42046O1409J98349k76631m48842r9681
33813e15675J92945K68678M12073M57239N8415m20619l91428r1953r1134j68025
33803b89484J68008N02335J64139l41343J387Q48094Q38492j80313q32386l90278
33793D88651K06485N6122k91727N4110P79367Q95776K81287k13615m7966L16631
33783B525121J55702m61757o93989n1082P97251P51412k51553j084878q96915
$$ y = [-437286, -236237, -160590, -252149, -455391, -675935, -646254, -269972, 83143, 111456, 70935, 209665, 201964, -197954, -493316, -251337, -25617, -508104, -1237703, -1234913, -554863, -72253, -2230, 172307, 480253, 406101, 15152, -54148, 243936, 348753, 283528, 658433, 1353595, 1437331, 691767, 49721, 111130, 309479, 32848, -415994, -515675, -322730, -54052, 358021, 815260, 873675, 453056, 61628, -30325, -121459, -289484, -121476, 380859, 544998, 203655, 205042, 1053136, 1891628, 1711315, 878929, 488651, 695136, 751258, 459531, 513641, 1293008, 2188784, 2470071, 2256456, 2208490, 2525121, 2680823, 2219066, 1525077, 1473995, 2271246, 3022658, 2771105, 1686227, 789312]
33774G89312r1853M67667N63787M34748J19551l49179n78443l06399J08980K45351
33764A403522K25314K43757N0241m49553o69616k00696L59099K95171k2719J86766
33754A421286O78666N28885l07239q81685o59511o5291L99749O92155P84388M92647
33744C084050o3299m16101l08357Q3546M15894L48299k58425r19494p57797K98578
33734A506894J081272O41249m01274p98682m22101o3806L1959K67157N97792N49615
33724B990075K31410K18104M68403M23512J25162J26029L11117l082p00953q18950
33714C370827j17945M57718K71928j27976j04897P6307o0082l11716k28160J23201
33704C349205L31616J96820j82629n02858l52809K93254P10113K06193p54352
$$ y = [789312, 697459, 1165126, 1728913, 2163661, 2283212, 1934033, 1355590, 1049191, 1158171, 1403522, 1628836, 1872593, 1922834, 1473281, 803665, 602969, 962068, 1257239, 1234520, 1421286, 2099952, 2628837, 2321598, 1439913, 780402, 715111, 1114860, 1807015, 2591403, 3084050, 3020751, 2604650, 2296293, 2379839, 2795733, 3144032, 2885607, 1966113, 1208316, 1506894, 2588166, 3229415, 2828141, 2029459, 1607358, 1543552, 1575511, 1842668, 2440460, 2990075, 3221485, 3439589, 3907992, 4331504, 4456666, 4582695, 4893812, 4890730, 4189777, 3370827, 3252882, 3710600, 3982528, 3854552, 3749655, 3825962, 3765880, 3454164, 3226004, 3349205, 3680821, 3877641, 3695012, 3192154, 2839345, 3132599, 3842712, 4048905, 3294553]
33695C294553j016707l55815K88448L34110K83345N77678P52093L23516l13167
33686D168054n54870n08008n72830o31464l11555K84494O64570N46869M9127m52688
33676B681699m81103J07280O96394M80710l56494p35336k49571J81588k20614
33667B104553p96800m77401M84097Q54854K51309m21145m14467q4793p1796k80119
33657A148292k17499J01901K03814m3651k20818k2220K99564L60517J85827L0548
33647A826275q1984k57159l52351j82934Q03j90730n39802m43295L8291J55487
33637b7399k42812k94689M69405J180123Q83987J0811l76394k04439j53041k27116
33627A018436J65459Q52510Q95786J02361n90059n34808j95143j68023k85649
$$ y = [3294553, 2277846, 1922031, 2210479, 2544589, 2827934, 3405612, 4157705, 4481221, 4168054, 3613184, 3105176, 2532346, 1900882, 1589327, 1873821, 2538391, 3085260, 3134387, 2681699, 2200596, 2307876, 3004270, 3484980, 3128486, 2393150, 2143579, 2325167, 2104553, 1307753, 830352, 1314449, 2169303, 2420612, 1999467, 1585000, 1500207, 1428411, 1148292, 930793, 1032694, 1236508, 1192857, 972039, 949819, 1249383, 1609900, 1795727, 1826275, 1744291, 1487132, 1134781, 951847, 952650, 761920, 222118, -221177, -182886, -27399, -270211, -564900, -95495, 1084628, 1968615, 1979426, 1603032, 1398593, 1245552, 1018436, 1183895, 2036405, 2932191, 3034552, 2444493, 1909685, 1714542, 1546519, 1260870]
33618A260870j79510j28j9774o8077R6064K40244j0559n13689o81941j78252O44107
33607E89355J006819M63334n42812j061965p14012p0876K43207L51440N95708
33598H60198P23829K89791m67667q64739o89188k62610J59799M45292L66328j4373
33588E46660j07222L64117P37383M05677j13498o0076K00724j26237p12918o19865
33578E14745Q869K34794M4119J99797N40363J56535p05955p38035J92440P15093
33568A162765K82462l0298L47365M34558l42840r31577n09473L3199k58322o82435
33558d94596j99261O99903Q67356L31443p2330j46352k06637j87672M7356J20721
33548G59931k14773m96216l74829k19720k16419J23121Q13216R47401K54589j99758
$$ y = [1260870, 1081360, 1081232, 1061458, 993381, 1089445, 1329689, 1319130, 805441, 123500, -54752, 589355, 1596174, 2059508, 1516696, 454731, -259281, -330157, -86950, 264490, 860198, 1584027, 1873818, 1406151, 541412, -147776, -410386, -250587, 194705, 561033, 546660, 439438, 803555, 1540938, 1946615, 1833117, 1773041, 1973765, 1847528, 1134610, 514745, 523614, 758408, 802527, 1002324, 1542687, 1699222, 993267, 255232, 447672, 1162765, 1445227, 1414929, 1762294, 2196852, 1854012, 922435, 412962, 446161, 187839, -494596, -693857, 6046, 873402, 1204845, 1132515, 986163, 779526, 591854, 639210, 759931, 545158, 48942, -325887, -545607, -762026, -638905, 174311, 1121712, 1376301, 1176543]
33538A176543J82224M82776J06199n871O66592R08191J02361j43843J151241K090647
33528F717060J367021J664596N440503Q924486N743705l313556r670570p874972
33520H998273k278065L065j509038k323209r00322J14019o32060j248642m71909
33511b47888L10840n2681m78781J26454Q57032N02072l64171m69328R5475K96312
33501E75336p3090k99467n7530K39497K65858J62603J09503Q7910O8066L3970
33491A112656j19574l96671n33397l35874k7623P4230M1960R5126P3585k96539
33481c12121o98823m71495L06628O75357J17611n92957m55372L23475P17340M27032
33471C6675J49554L10990M46002J27256k79604k75293l6780r463j41622j08263
$$ y = [1176543, 1358767, 1841543, 1947742, 1941871, 2608463, 3516654, 3619015, 3475172, 4626413, 6717060, 8084081, 9748677, 15189180, 24113666, 29857371, 26543815, 16873245, 8998273, 6720208, 6723273, 5214235, 2891026, 1990704, 2104723, 1472663, 224021, -247888, 62952, 10271, -468510, -342056, 514976, 1017048, 652877, 183549, 279024, 575336, 502246, 202779, 145249, 384746, 650604, 813207, 922710, 1010620, 1078686, 1112656, 993082, 596411, 63014, -272860, -300483, -226253, -184293, -89167, -15582, -312121, -1010944, -1482439, -1175811, -500454, -382843, -975800, -1431172, -1107697, -390357, 36675, 186229, 497219, 943221, 1070477, 790873, 515580, 478800, 469337, 327715, 219452]
33461B19452L5278J2856q9042K6652K63204K11129k10131o29955p22444m84392
33451a367393r4528K04359K15510N6458J02759L91649M38590K6712k92203o2495
33441c80582K11868j04399n13982n9586R23609J027065p1559r64779n63883L79685
33431a16543O12921K50096K21878N41280L84149l41460p16225k47241L72099K90067
33421A251021l86228q90838p63956j62435M84787Q17281P21993M03690J78078
33412A653393J01883l5996l01313m39183k61878P406J6223k00913k41399J12035
33402D10258N51809N78339R7629m56106o28860m43231k42364j39559P5147M14848
33392B17910M56795n9166o54333o14954j83L88679J44374j98431m0358L84576
$$ y = [219452, 254730, 267586, 178544, 205196, 468400, 679529, 469398, -160557, -883001, -1367393, -1461921, -1257562, -1042052, -985594, -882835, -491186, -52596, -25884, -318087, -380582, -168714, -273113, -787095, -846681, 76928, 1103993, 1032434, 67655, -496228, -116543, 496378, 746474, 968352, 1509632, 1893781, 1552321, 836096, 588855, 960954, 1251021, 864793, -26045, -790001, -952436, -467649, 349632, 1071625, 1475315, 1653393, 1755276, 1719280, 1417967, 978784, 716906, 724312, 740535, 539622, 298223, 410258, 962067, 1540406, 1638035, 1181929, 553069, 109838, -132526, -272085, -196938, 217910, 674705, 615539, -38794, -653748, -653931, -265252, -120878, -319309, -359667, 24909]
33382B4909M89392L05005K86390L63342N148p06671r13377k42451M86201L78141
33372D76029k70343n15221j66881J60208J85863K63489N17997N58378K84648J81904
33362A676071M23854M20211j95647p77132n78757M2744J97697r4605l3036M63058
33352A544458M71114m00464j181902q96428j8342K66007j91201m49918n8900L10037
33342f05539N4789l67422j89412M66417P92246M52158q0686k99662k44032j99530
33332b20673k35487k44469j98655j71272j94662j81715L1275M78687Q32892O17049
33322E12970j08473n62011j89587M46218L76136k94780m69143K31159P82475K94870
33312A019834o09073p47993j11534L28215K11557J63634N69791R18171O43432
$$ y = [24909, 514301, 819306, 1105696, 1469038, 1474186, 767515, -145862, -388313, 97888, 476029, 205686, -309535, -476416, -316208, -130345, 133144, 651141, 1209519, 1494167, 1676071, 2099925, 2520136, 2324489, 1547357, 968600, 1011344, 1209041, 1114436, 1081400, 1544458, 2015572, 1615108, 433206, -463222, -481564, -215557, -406758, -856676, -915576, -605539, -550750, -918172, -1107584, -641167, 151079, 603237, 522551, 222889, -21143, -220673, -456160, -700629, -899284, -1070556, -1265218, -1446933, -1415658, -936971, -104079, 512970, 404497, -157514, -347101, 99117, 475253, 180473, -288670, -57511, 724964, 1019834, 410761, -337232, -448766, -120551, 91006, 254640, 824431, 1742602, 2386034]
33303B386034n4026n76815o59970m46331j79679n5824j24946j97462n9868J87206
33293B18319K74798K21287K72242L71882J36877n02827j029957r32058l05261
33284a274698L20663N54724L90490N6306k21527l70906m43895m26502j99379K05181
33274a409543M89816M41759K32806J40963J48506P2029r5467k46505l62297l86699
33264i74632j53369K70826M87184L35140J66540J79918J3515m69627o26830n0739
33254h22074M81985J27649m76840j08386Q93619R38536k56551j042430l16718
33245e81210Q21688P79201l02399j063141q74000k04164M57815J024440J327697
33236A385927J042720J81468p51063j139709p15650J56869O32809K08989n85176
$$ y = [2386034, 2332008, 1755193, 1095223, 648892, 469213, 413389, 288443, 90981, 31113, 218319, 493117, 714404, 986646, 1358528, 1495405, 992578, -37379, -969437, -1274698, -954035, -399311, -8821, 47485, -174042, -544948, -988843, -1415345, -1614724, -1409543, -919727, -477968, -245162, -104199, 44307, 116336, 20869, -225636, -587933, -974632, -1128001, -857175, -369991, -34851, 131689, 311607, 325122, -144505, -771335, -822074, -340089, -212440, -689280, -797666, 95953, 1034489, 777938, -264492, -581210, 240478, 1019679, 717280, -345861, -1219861, -1424025, -966210, 58230, 1385927, 2428647, 2610115, 1859052, 719343, 3693, 160562, 793371, 1002360, 417184]
33227D17184p90704k79732K15737L04936L34881M74012L42379j31888l92944k06864
33217B86997p8322k82320l50582k0660J93101l5693j84253J44557M19019Q9920
33207A81764m60783o35152n42395m48907q4690O47980J031201N53965r4687m8192
33197A00104L54187K68156j49170j08740L48721M59773P9785j93408j19657m5961
33187I93790j08301q3702L2478N8756P9494J74227M638n74606r10221m53765J69382
33176f17830N9790l77963j7015J033727J422848N96085m39637o79974l30610o2716
33166E86705k2234l6818o7939o8759L6706M3246k76720n61614k40030M30356N53748
33155C76647k6261m35213j28631L30720K65518j21121k40149J2663L62169O24076
$$ y = [417184, -373520, -653252, -437515, -132579, 202302, 676314, 1018693, 886805, 493861, 286997, 208675, -73645, -424227, -444887, -251786, -287479, -471732, -327175, 91844, 181764, -279019, -914171, -1456566, -1905473, -1990163, -1342183, -310982, 242983, 148296, 100104, 454291, 722447, 573277, 464537, 813258, 1273031, 1352816, 1159408, 1039751, 993790, 885489, 801787, 834265, 893021, 972515, 1146742, 1151380, 576774, -333447, -787212, -617830, -558040, -936003, -953018, 80709, 1503557, 2099642, 1660005, 980031, 649421, 586705, 564471, 527653, 459714, 390955, 427661, 470907, 194187, -367427, -607457, -177101, 376647, 350386, -84827, -213458, 117262, 382780, 261659, 21510, 34173, 396342, 1020418]
33145A020418O44145K25069m79890q90885o81905k03035O3654J18274K26467M14950
33135D57262M86096L18203m5290m06492m34832L1009O20431P01037J34933n33946
33125A328411p59045n61208k95804j29930N8693L82864O60438M77192k96327j042132
33115a76848q70700J87833R59921N91748k23833k18313N74013Q66694O0246q46253
33105I04508o73489L25983Q62716K78682p24467j016991l73105L31306K51713
33096A66856l41115m71489J29749O49236M53521L1719J28874N24819M55490j08272
33086A619388m43344j95950K29705L69788J66217k17453n03783l49655J76931
33077H51844L84202j62224q06184o03943K53999P06076M08939R2159K34745L74816
$$ y = [1020418, 1664563, 1889632, 1409742, 518857, -163048, -366083, -302429, -184155, 42312, 457262, 943358, 1261561, 1216271, 809779, 374947, 405956, 1026387, 1727424, 1862357, 1328411, 569366, 8158, -287646, -417576, -358883, 23981, 684419, 1161611, 865284, -176848, -1047548, -859715, 100206, 691954, 468121, 249808, 823821, 1690515, 1750761, 904508, 231019, 557002, 1419718, 1698400, 973933, -43058, -416163, -84857, 166856, -174259, -645748, -515999, 133237, 586758, 618477, 747351, 1272170, 1727660, 1619388, 1176044, 980094, 1209799, 1579587, 1745804, 1528351, 1024568, 674913, 851844, 1236046, 1073822, 267638, -336305, -82306, 623770, 1032709, 1124868, 1359613, 1734429]
33067A734429O9760l14407k84277n9628j54900m92111m77131J38594Q43158R02302
33057A905789K20917m61637m03604J86714M19900j1492m28795k80837L0726n4681
33047A123000l08161k64221j36692l35657n47495k33380L20222M23735J64683
33038B06034J56359L54255K20377q6051J14947O32984M47990n70807j159373m27542
33028a10827P82211R95638m338j023854r27203J70778J109868R31339q2673p78480
33018A062459n90126j45750j28354k21206J40330N94808L92194k93710o09072
33009B01573l39761o748J61228L51585M19042M5627m29405l51724J30284K91830
32999D73531R7411J57444M46824K45229m98318q77419l91119L82145P46024O43599
$$ y = [1734429, 1804189, 1489782, 1205505, 1145877, 990977, 498866, 21735, 160329, 1003487, 1905789, 2126706, 1665069, 1261465, 1448179, 1868079, 1856587, 1427792, 1146955, 1177681, 1123000, 814839, 550618, 413926, 78269, -469226, -702606, -382384, 41351, 206034, 362393, 716648, 937025, 850974, 965921, 1598905, 2046895, 1476088, 316715, -110827, 671384, 1667022, 1662684, 638830, -288373, -117595, 992273, 1923612, 1840939, 1062459, 472333, 326583, 198229, -22977, 117353, 712161, 1104355, 810645, 201573, -138188, -144936, 16292, 367877, 786919, 832546, 403141, 51417, 181701, 473531, 570942, 728386, 1175210, 1420439, 922121, 44702, -346417, 35728, 781752, 1425351]
32989A425351K60030k46938m52784o476N72888L66206n10250r14911l61409L04241
32979D35948K55878k14085m01896k16213l867P4827R9584K07300N13815Q54789
32969A606080O97937j65118j012675r35842m3821P32127Q38422M28019j95831
32960A949298o79426n18080K63829P07854J41011o42491m94885K66464M19150
32951A412724j79621n63186l62252j36150j40891r8545m4516j39375P1024Q68466
32941F87678J281390L60630r19308q46604K99203P16839P0200j96599M15624O88602
32931B557655P997o57754o14344l66972k33138J25490M25998q3509q92726o53511
32921c84814L89364N65636l01706n29260L83358Q74392K18347k65771J43814K75302
$$ y = [1425351, 1685381, 1438443, 985659, 979183, 1552071, 1918277, 1408027, 493116, 131707, 435948, 691826, 477741, 75845, -140368, -144235, -69408, 30176, 237476, 751291, 1606080, 2304017, 2138899, 1126224, 190382, 146561, 878688, 1717110, 2145129, 1949298, 1269872, 751792, 1015621, 1723475, 1864486, 1221995, 727110, 993574, 1412724, 1233103, 669917, 307665, 171515, 30624, -67921, -112437, -251812, -180788, 687678, 1969068, 2329698, 1410390, 563786, 862989, 1579828, 1650028, 1453429, 1869053, 2557655, 2565652, 1907898, 1293554, 926582, 693444, 818934, 1244932, 1161423, 268697, -384814, 4550, 570186, 268480, -260780, 122578, 996970, 1215317, 949546, 1093360, 1368662]
32911A368662m58938q01791j37022K53215k15293j27251J071001J510395Q0992
32902B543970j320625q69497J99201L9332n55775L57Q77324L42562r35145r69479
32892f47775J57133O89303K46104l9307J20511R818k65317P2322P50108P58953
32882A851853J55731j12871Q8943Q2733k33306l71867k97467k68782q7343L97840
32872A205464O16043J57738l48020k44835N2577m1586j79660J21410N21033O54007
32862B514171Q48496J123664O75987o32976j554599j271758o27602n12807m76219
32853H6357l7778J68203k27010l58820K30554N76820J24344j43936L48562N51728
32843A319024j36367n18659K05041Q64525M77283l6576J41618J35943n81653p90939
$$ y = [1368662, 909724, 107933, -29089, 224126, 8833, -118418, 952583, 2462978, 2543970, 1223345, 353848, 553049, 592381, 36606, 36963, 914287, 1256849, 321704, -647775, -490642, 198661, 444765, 405458, 525969, 535787, 270470, 342792, 1092900, 1851853, 2007584, 1894713, 1983656, 2066389, 1833083, 1461216, 1163749, 894967, 807624, 1205464, 1821507, 1979245, 1631225, 1386390, 1438967, 1397381, 1217721, 1339131, 1860164, 2514171, 3362667, 4486331, 5162318, 4529342, 2974743, 1702985, 1075383, 562576, 86357, 48579, 216782, -10228, -369048, -138494, 438326, 562670, 418734, 767296, 1319024, 1182657, 663998, 869039, 1733564, 2210847, 2174271, 2315889, 2451832, 1870179, 1079240]
32833A079240J05945O26770r6986o11953L8965M49844k20673l49408Q93363J452298
32823C367405R2231r61507P2235J188747K85650j027047o72899J00119k40513
32814B204421j11211J606942K200269j49939j892788M45155L694487K718458j213951
32805I501843k884595j597117q42066j357106r29049K21516L299p61651J03369
32796A458443J245550K26002j053040M72523K621132J504737q52669Q2033K647230
32787H351941J976283m59795N62376L770589L768099K042636M388295Q492349
32779C2892773O995834K899871P049280J8120399K2056621J7961217K7465747
32772A35441742O5341440J11677477J26811272Q9305379J2356929o8614511j16780713
$$ y = [1079240, 1185185, 1811955, 1714969, 1103016, 1141981, 1591825, 1371152, 1021744, 1915107, 3367405, 3459636, 2498129, 2570364, 3759111, 4044761, 3017714, 2344815, 2444934, 2204421, 2093210, 3700152, 5900421, 5750482, 3857694, 4302849, 7997336, 10715794, 9501843, 6617248, 5020131, 4178065, 2820959, 1891910, 2113426, 2116725, 1355074, 1458443, 2703993, 2929995, 1876955, 2349478, 4970610, 6475347, 5622678, 5704711, 8351941, 10328224, 9868429, 10430805, 14201394, 17969493, 20012129, 24400424, 32892773, 39888607, 42788478, 49837758, 67958157, 90014778, 107975995, 135441742, 200783182, 312460659, 439271931, 528577310, 540934239, 472319728, 355539015]
32765C55539015j14083916p5175067l6737220k2551524k3592195j9505601q826962
32758E5066530m447216q409767r808908m898922j720811l804611m660140j255105
32750A6061050N42360k163925l786930j007062J319462l89765k273202r63262
32742G338726N47165m13097j126782L74429R84738j207389k662282p68987J359148
32733D425669O70144p34060l42969J80436q31969j307287J93552J116092k42121
32724C127487j197452K18128J314071j40333j487462j30426J484137L75690j493198
32715B070642r81344N60477K06020j052187n38053R55556Q70822m00680p59705
32706I31548l92653n99543o10636O39968J551371M01788j122199o49133O46157
$$ y = [355539015, 241455099, 166280032, 129542812, 106991288, 83399093, 63893492, 55066530, 50619314, 42209547, 32400639, 27501717, 25780906, 21976295, 17316155, 16061050, 16603410, 14439485, 10652555, 9645493, 10964955, 10575190, 8301988, 7338726, 7885891, 7472794, 6346012, 6720441, 7705179, 6497790, 3835508, 3066521, 4425669, 5095813, 4361753, 4018784, 4199220, 3367251, 2059964, 2253516, 3369608, 3127487, 1930035, 2148163, 3462234, 3321901, 1834439, 1704013, 3188150, 3563840, 2070642, 1089298, 1649775, 1855795, 803608, 265555, 1221111, 2091933, 1691253, 931548, 538895, -60648, -671284, -31316, 1520055, 1921843, 799644, 150511, 796668]
32697G96668L50998o59951q2908J216805P43002q83707r99563L03624O28979k21963
32687A191984k64671O25976O15189l61668m69323M67060P30373N8580p7185M08417
32677B924732N5345j023601j029304J97753P49382j9436n78665j42449K08930
32668A342687j03873k25846R3353o7003p32722p03782J50468N19053R4816R0242
32658D57393P39253O80162l97431q84270m5035O02783n7488q23481l63464N37372
32648D45794N30342m4480j18769J40420l5819m08742l16162p2033l06550n89692
32638g75691j88648L62064J5687p82272m98588J000167J946333J169768k35700
32629B013120o08916p8281l3279p65670j030570q7347J077411J205349N11076
$$ y = [796668, 1147666, 487715, 404807, 1621612, 2364614, 1480907, 481344, 784968, 1413947, 1191984, 927313, 1553289, 2168478, 1806810, 1337487, 1804547, 2534920, 2593500, 2516315, 2924732, 2980077, 1956476, 927172, 1124925, 1874307, 1854871, 1276206, 1133757, 1342687, 1238814, 1012968, 1106321, 1039318, 306596, -397186, -246718, 272335, 367151, 457393, 1196646, 1876808, 1479377, 595107, 550072, 1152855, 1095367, 271886, -91578, 445794, 976136, 931656, 812887, 953307, 917488, 508746, 192584, 120551, -185999, -775691, -964339, -602275, -586588, -1368860, -1867448, -867281, 1079052, 2248820, 2013120, 1404204, 1325923, 1292644, 526974, -503596, -590943, 486468, 1691817, 2202893]
32620B202893N2643J3177k34755o82918o22447p7316J0847n89090q12496L634
32610g35828R11562P21674k43427p35292l49175K37387M22941K25840j10035l62626
32600a6979l40843j28573q0172k30554j35990L35014O15299L04797j76389l21640
32590a76030k84936l05698q5638N20066Q50657L55891l77356m40480L520J14803
32580A74799j81544j90253K61284N33652K62060j08703j07813N8017r6405n50382
32570E4712o95027q3354Q05606Q67052k36490j332837j081541J90645R59378O90066
32560A38210L11847L79482K33841m73168q73622l65238K80129K69828O5196K41407
32550B07912K56280l98902r10778m07490M23715M43640m3547k0352L67716K73294
$$ y = [2202893, 2255536, 2268713, 2033958, 1351040, 728593, 651277, 662124, 73034, -739462, -735828, 175734, 897408, 653981, -81311, -430486, -193099, 229842, 455682, 345647, -16979, -357822, -486395, -566567, -797121, -933111, -598097, 17202, 321999, 145610, -176030, -460966, -766664, -852302, -332236, 518421, 874312, 496956, 56476, 59996, 174799, -6745, -196998, 64286, 597938, 859998, 751295, 643482, 701499, 605094, 54712, -640315, -723669, 81937, 948989, 712499, -620338, -1701879, -1511234, -551856, 138210, 450057, 829539, 1063380, 590212, -283410, -648648, -368519, -98691, -33495, 207912, 464192, 65290, -845488, -1252978, -829263, -385623, -429170, -449522, -81806, 191488]
32540A91488j39458r7204J77992n5480m22143k0884O97362M98234l85566n07537
32530f3196K87308N90846r9892o13149k85792j7311m06502n95659M9888O41243
32520e12216K85198l46242j68678N60892Q16381L98792j14481m42849o46838n58573
32510g28614o0364M22308M74215L92185O19674Q43274M40749m12880q94876p19336
32500C76335m25075m06466l56616K6671L33406q800o91105o93365K83504J129071
32490d32440O87981n01305p57525L65455J301151O22231r58537j633736q75244
32481b181969K86015R05970R27150N65333K2161k24408J58034O49142N06481o317
32471A607592n2122K51494p666q09789j039730l59860J65058j30109m45847m1575
$$ y = [191488, 52030, -45174, 132818, 77338, -344805, -365689, 331673, 829907, 444341, -63196, 224112, 814958, 715066, 101917, -183875, -201186, -607688, -1203347, -1153459, -512216, -227018, -573260, -741938, -181046, 635335, 1034127, 919646, 476797, -170041, -728614, -788978, -366670, 107545, 499730, 1119404, 1962678, 2403427, 1990547, 1095671, 376335, -48740, -455206, -811822, -785151, -451745, -460545, -1151650, -1845015, -1561511, -432440, 255541, -245764, -1003289, -637834, 663317, 1285548, 327011, -1306725, -2181969, -1895954, -989984, -62834, 502499, 524660, 300252, 458286, 1107428, 1613909, 1607592, 1555470, 1806964, 1799298, 989509, -50221, -410081, -245023, -375132, -820979, -862554]
32461h62554M44152K26078j61105J44192P00694M71118l78093p37854l40932J9381
32451d74923j4289P9758M70695M82782k05560q19351n80629J20764L46920j0587
32441f04420j94216K12855P00270N94286m2472n64734n77611k91522o9245P2739
32431g64070L26477O15056N37386j29471j014280j382976q40871J97533Q33250
32422a621966O16146Q7875J13854O71798P89645l6246r02829o31991M81620R53857
32412E21763J86388o87633m62545M48749P51050J82785k81795n3854K36279j21777
32402G19410p13591o10291J95964P32287M13821k11036l50696o9362j0759l28353
32392b32606m99573k06489J49662N8361l31942m02286J00206P07940P74749K38164
$$ y = [-862554, -418402, -192324, -353429, -209237, 491457, 962575, 584482, -153372, -494304, -474923, -489212, -409454, 61241, 544023, 338463, -480888, -1061517, -940753, -593833, -604420, -798636, -585781, 114489, 708775, 666303, 101569, -476042, -767564, -836809, -764070, -437593, 177463, 714849, 585378, -428902, -1811878, -2652749, -2455216, -1621966, -1005820, -917945, -804091, -132293, 657352, 621106, -281723, -913714, -432094, 521763, 708151, 20518, -442027, 6722, 757772, 940557, 658762, 604908, 841187, 719410, 5819, -604472, -408508, 323779, 737600, 526564, 175868, 106506, 95747, -232606, -732179, -938668, -789006, -730645, -1062587, -1464873, -1364667, -656727, 118022, 356186]
32382C56186k87584k29989K33782M13648N6967l10353j98157J18138J20204p4395
32372A98447n514J95762j9852n45262o06191k5999L64755j6280o11716o25599
32362a697449j52626K26054M19530O71114Q24452N25520k3574k10636J14388M51765
32352A148538L49236j12965n27224n55020j79257K21453J89999k36408m94810
32343a96458k20205K93346N51824M22375J6781n36695q93581n53619M27405J180179
32333D91352R56552L1694p14467p99669l84105J00059K09209k07641o32085k91065
32323a240166P21868J347443R77894K57098l8509r0571l12618m00285n5391J08758
32313A275521m83053j123648p62777K56302O75400K32355j85813j03872J03433
$$ y = [356186, 68602, -161387, 72395, 486043, 543010, 232657, 34500, 152638, 272842, 198447, 192933, 388695, 368843, -176419, -782610, -808609, -443854, -460134, -1071850, -1697449, -1850075, -1624021, -1204491, -533377, 291075, 816595, 793021, 582385, 696773, 1148538, 1497774, 1384809, 857585, 302565, 123308, 344761, 534760, 298352, -196458, -416663, -123317, 428507, 850882, 867663, 330968, -562613, -1116232, -688827, 491352, 1447904, 1479598, 765131, -34538, -418643, -318584, -109375, -317016, -949101, -1240166, -518298, 829145, 1807039, 2064137, 2025628, 1935057, 1622439, 1222154, 1166763, 1275521, 792468, -331180, -1093957, -837655, -162255, 70100, -115713, -219585, -116152]
32304a16152K24729L98571L46215k92477q71952l65140Q27813J150292K41038
32295A542937m86620j18916M03012J4827p19121o84436n5008J51718k50294n04445
32285g06346j74837L83826O84347N72167J35754l63556n76343m03214j09539N3821
32275e03920Q2618O912j44560j23558K53789N52037J38180p13578r58297k85145
32265a695522M00689M01280J81616L12742M29097Q3991k26489M0505K68497l59219
32255a62813j179023p92101O20098J252845K82023q90681p20086L09156O50014
32246f30568N1923l41387L0624L94500R7170l23120j32492L57724L77192J4325
32236a04109Q927M34719N48131K8850n02093m69907j04712J31115K02890K04282
$$ y = [-116152, 108577, 507148, 853363, 560886, -311066, -676206, 151607, 1301899, 1542937, 1056317, 937401, 1340413, 1355240, 636119, -48317, -103325, 48393, -201901, -706346, -881183, -497357, 186990, 759157, 894911, 531355, -44988, -448202, -557741, -503920, -421302, -414390, -558950, -682508, -428719, 123318, 261498, -452080, -1410377, -1695522, -1294833, -893553, -711937, -399195, 29902, 113893, -112596, -72091, 196406, -162813, -1341836, -2133937, -1513839, -260994, 21029, -869652, -1589738, -1280582, -630568, -578645, -920032, -889408, -494908, -397738, -720858, -853350, -495626, -118434, -104109, -95182, 339537, 887668, 916518, 414425, -55482, -160194, -29079, 173811, 378093]
32226C78093L7316j83382m1170M13096M85989l9857l83174m3454K30570l06913
32216E47114r56143o01935L86187O84527J34174j53681K33510M35938l1280m47497
32206B30914k00384K35805K31598l4251j21009m2235O5867K63302L73613j2972
32196I90248o96274q25404j65903L98154J72922l17182k58329J98308L63199J57196
32186A6935N9256K25787L27238J02343l69216p88094p88331k62154L12622L14797
32176h48817r9504j17492M56564P81439K69906m21403l41177L71537P88742N28432
32166A368227O6876j18226q4938j04369k40607l33170k15244M3055J10428j90541
32156C01491m89759k59574L91472P73573N43112P8157k01952l54193n23921n48258
$$ y = [378093, 415409, 232027, 190857, 603953, 1089942, 1050085, 666911, 623457, 854027, 547114, -409029, -1010964, -624777, 59750, 193924, 40243, 273753, 709691, 678411, 230914, 30530, 266335, 497933, 463682, 342673, 300438, 366305, 629607, 1003220, 990248, 293974, -531430, -697333, -299179, -126257, -443439, -701768, -503460, -140261, 16935, 76191, 301978, 629216, 731559, 362343, -425751, -1214082, -1476236, -1163614, -848817, -948321, -1065813, -609249, 172190, 442096, 20693, -320484, 51053, 839795, 1368227, 1435103, 1316877, 1231939, 1127570, 886963, 553793, 338549, 381604, 492032, 301491, -188268, -447842, -56370, 717203, 1260315, 1338472, 1136520, 782327, 258406, -289852]
32146b89852k75290P2803J47353j10777m15056l46819K52328Q73498O71754l56633
32136B23309j006803l94209O45719O93132j37979m97058J6375M43854K78014J21784
32126C86138K60499J30398l25075l02735K61032K87508n01071q19229L2831Q16336
32116B26632L70360m58358l42157L24955L57467j11137j46882J29646p7736n44674
32106b71884l72893L00304M82517J0248l48198k98264k12223r3099L52937P38373
32096B87818L74936m17397o07062o1723K94840j2867m28372l83344K9828M66184
32086d57159O29679K68097l99716n55167J11536O45250J72020n89343m33264K79186
32076c28881K45351m75936n78634J53409M93625k6674m07067j26441j2358m59452
$$ y = [-289852, -565142, -492339, -344986, -455763, -870819, -1217638, -965310, -91812, 579942, 223309, -783494, -1177703, -531984, 161148, 23169, -473889, -457514, -13660, 264354, 386138, 646637, 777035, 451960, 149225, 410257, 697765, 196694, -622535, -589704, 226632, 596992, 138634, -203523, 121432, 478899, 367762, 220880, 350526, 272790, -271884, -644777, -344473, 138044, 148292, -199906, -498170, -710393, -803492, -450555, 287818, 662754, 245357, -361705, -423428, -128588, -141455, -569827, -953171, -923343, -457159, 172520, 440617, 40901, -514266, -402730, 242520, 414540, -174803, -608067, -328881, -83530, -559466, -1138100, -984691, -491066, -517740, -924807, -1051248, -1063606, -1523058]
32066a523058m74674N24274J429310J104379J34143k57445l5365Q0550K8036J53055
32056A163205J95129k58652p46408n04417K16761M63062K9370l77520l46256j93247
32046c58973j36411Q5722N33545P20718L21435k56072l95147q7541J41617K430
32036E71323k09612r6056K61104M21980K14377m2973j5584K08983L15094J52710
32026A781346k51161q04385j216646j051888k87204M17910M36971j0349j89057
32017a174463J50016N47025N28266J09441l60212n34994l19812r185j1099k63110
32007a338127k68633Q0583K55639J5833q1991L37666O81385L55605j39041m2009
31997a43090L27671J86355k53594k11581J34954l4780n24619k91977O62027J090959
$$ y = [-1523058, -1997732, -1473458, -44148, 1060231, 1194374, 936929, 901564, 982114, 1010150, 1163205, 1358334, 1099682, 353274, -151143, 65618, 528680, 558050, 180530, -165726, -358973, -495384, -409662, 123883, 844601, 1166036, 909964, 514817, 427276, 568893, 571323, 361711, 265655, 526759, 948739, 1163116, 1120143, 1104559, 1313542, 1628636, 1781346, 1530185, 725800, -490846, -1542734, -1829938, -1412028, -975057, -985406, -1174463, -1024447, -477422, 50844, 160285, -199927, -734921, -1054733, -1063918, -1075017, -1338127, -1606760, -1526177, -1270538, -1254705, -1336696, -999030, -317645, 37960, -101081, -143090, 184581, 370936, 117342, -94239, 40715, 5935, -518684, -810661, -148634, 942325]
31987I42325M69482k79949m36315m50081o93595n87130K40459J038495J021538
31978A265229M71243K2997k87065n67845n24580r2581J65823j7420q2659L15468
31968F68610N86086K43838k03721k15213j75399m85335n89568r114M69138o2613
31958B26709r11052o47810O17507J285916N85166m95301q09382m31474k6515K00674
31948d05562L76060M27946K36273m3889j84041j78778j22853l635K20366M76843
31938G98730N96198L96057j75597q43680j089009o57154Q3398M78554K39501l31383
31928e04385o48948l39053L74205P52678L06179n10941p66000k64753K22658J12628
31918a265732k32136k38018j5246J3026q1877Q5649M94488P41937O49964L93404
$$ y = [942325, 1411807, 1131858, 695543, 245462, -448133, -1035263, -794804, 243691, 1265229, 1736472, 1759469, 1472404, 904559, 379979, 287398, 453221, 435801, 353142, 668610, 1254696, 1498534, 1294813, 1079600, 904201, 418866, -170702, -179816, 289322, 226709, -684343, -1332153, -714646, 571270, 1156436, 661135, -148247, -579721, -606236, -405562, -29502, 398444, 634717, 590828, 406787, 228009, 105156, 101521, 321887, 798730, 1394928, 1790985, 1615388, 771708, -317301, -974455, -891057, -412503, -173002, -504385, -1153333, -1492386, -1118181, -365503, -59324, -570265, -1336265, -1601018, -1378360, -1265732, -1497868, -1735886, -1751132, -1738106, -1819983, -1734334, -1239846, -497909, 152055, 545459]
31908E45459J27282j44630m06205n93347o34752m15029R0412N84610O96442N15965
31898C66207M33295M10145N9845m22732k65399N67099R58222J85303r13864j133901
31888B44220n82244k15223k38555o9202M03794O40379M85521L79962M44083K54220
31878A746955k62758n15504j63516K79520J62875l88432o73413l49177J33449
31869c0001P5990n53451r23317l13331Q09410J205301M64864m32240m82858O8607
31859a11026L51791J72925j776N2339J53243J82956J15383j62755n38703n39052
31849c24675l0860L88828K56750n9031j40800k74198o02210l78984P65015J607841
31839A207676Q93282m91348o62024K81024M38171o88089j361545n39577M84241
$$ y = [545459, 672741, 528111, 121906, -471441, -1106193, -1521222, -1430810, -846200, -149758, 366207, 799502, 1209647, 1269492, 846760, 581361, 1148460, 2106682, 2291985, 1378121, 244220, -338024, -553247, -791802, -861004, -457210, 183169, 668690, 1048652, 1492735, 1746955, 1484197, 968693, 805177, 1084697, 1247572, 859140, 185727, -163450, -30001, 45989, -507462, -1430779, -1744110, -934700, 270601, 735465, 303225, -179633, -111026, 240765, 413690, 411914, 464253, 617496, 800452, 915835, 753080, 214377, -324675, -355535, 33293, 290043, 231012, 90212, -183986, -786196, -1165180, -400165, 1207676, 2100958, 1609610, 947586, 1228610, 1666781, 978692, -382853, -922430, -438189]
31830d38189M04315j5308L79707R16009L13489r09079j101882o2042P33221L47420
31820E67661n44029q62180l32423N80533J118932O82229m38493j014479l47834
31811e90083N88998M46278m75697p33613l5970M35983Q4597k60680J3595K82612
31801b43980L3116r4529L95621O66873j02828j081391r10990J20396N61037J37514
31791e19161j8615M68665N30763l38834r32829j80969J014592J048484k5087p28867
31781C18142l89114K03468L32295K96242M86802N64953J41614m27825n55940k86081
31771F84556q4660q0412l6997R9999J18957m3846j99004k39531k78021l67757
31761d26716l15626N7824N51179O83495K89620j32587O396M69683L49832n84250
$$ y = [-438189, -33874, -49182, 330525, 1246534, 1560023, 650944, -450938, -512980, 220241, 567661, 23632, -838548, -1170971, -590438, 528494, 1210723, 772230, -242249, -590083, -1085, 445193, -30504, -764117, -800087, -364104, -279507, -540187, -526592, -243980, -210864, -305393, 90228, 757101, 654273, -427118, -1338108, -1217712, -656675, -519161, -537776, -69111, 461652, 122818, -810011, -990980, 23612, 1072096, 1047009, 318142, -70972, 132496, 464791, 761033, 1247835, 1812788, 1954402, 1526577, 970637, 684556, 599896, 519484, 482487, 582486, 701443, 657597, 458593, 219062, -58959, -426716, -742342, -684518, -133339, 550156, 839776, 707189, 713585, 1183268, 1533100, 948850]
31751I48850j263890o78790N58238R15802Q1522o47372l06117M41366M72286j96876
31741C25019p28904p68916n99450l57821Q2863N70708O92093L64707l9451j76973
31731f36125l5859J76597K18518K1729j30036J09742N47076N47529l5285n28193
31721B55693l73465J13370L30991K20072L8185j55126k66742N378N31964N73909
31711A274229o1888m12863J79172P45887P2347j176962j242515L8794R54422M94808
31701H65431l43783l31532K76856N27700K11566k65010o47820p58682l15272N21208
31691b59338R78050O11687q5197m47970m40405k93676j2168K87816K19042j79508
31681C78333k64740J51720L20712k06031o49843j93596O09170O71200P7723k23925
$$ y = [948850, -315040, -993830, -435592, 480210, 561732, -85640, -391757, 49609, 521895, 325019, -403885, -1172801, -1772251, -2130072, -2047209, -1476501, -784408, -419701, -459152, -636125, -671984, -495387, -276869, -255140, -385176, -275434, 271642, 819171, 783886, 255693, -117772, -4402, 326589, 546661, 584846, 429720, 162978, 168356, 700320, 1274229, 1212341, 799478, 978650, 1724537, 1796884, 619922, -622593, -583799, 370623, 865431, 521648, 190116, 466972, 994672, 1206238, 941228, 293408, -465274, -780546, -259338, 718712, 1330399, 1245202, 797232, 356827, 63151, 50983, 338799, 557841, 378333, 113593, 265313, 586025, 379994, -269849, -463445, 145725, 816925, 894648, 670723]
31671F70723q2188j89283n71412m00385M25979P88852L3915q71880o92501K84046
31661f04134P44539K50292l36343k75772J05106J82511L7025J21665L37358J53216
31651G15463m03131n86550l5131N58597L85701k80205m95201n0630L14714J43086
31641B66713j08107M9265L36242K78725Q608r3568j22334l50777n09790j03112
31631c48135O54690R39167M49687j82794l33548j92159k94157o38524p11492k37427
31621h94692M60046Q39457O58190J16718l33212l39536N706J76204k07676p67439
31611b86234o58002L08716J156384Q31691l53251r99744m45333L85605L51756
31602B91588l14534m94074J14102O42049L88040k88434o34031m61152j06144J63545
$$ y = [670723, 588535, 399252, -172160, -572545, -146566, 642286, 676201, -195679, -888180, -604134, 140405, 390697, 54354, -221418, -116312, 66199, 103224, 224889, 562247, 715463, 312332, -274218, -309349, 249248, 634949, 354744, -140457, -191087, 123627, 266713, 158606, 207871, 544113, 822838, 831446, 737878, 615544, 264767, -245023, -348135, 306555, 1245722, 1695409, 1512615, 1179067, 986908, 692751, 54227, -657265, -894692, -434646, 404811, 1063001, 1179719, 846507, 506971, 512677, 688881, 481205, -286234, -944236, -635520, 520864, 1352555, 999304, -440, -445773, -60168, 291588, -22946, -517020, -402918, 239131, 627171, 338737, -295294, -756446, -862590, -699045]
31592f99045L42614M79214N21400L46346n7317l88406k39625K80019M65232k8750
31582A021682n25058k69003K98091J25114p14921r77950j38363P67894O88360
31573B75846r155l35541j44229K2079j460N7145K12702K32401J65640K31208L09678
31562A016314J07373k73616m25736k32624L4155J47022J04951l4674k03000k67307
31552b7142j58162K7699J70394K27670J59691L55k5518J72847K00916k79684p47012
31541b77946l84910M91030O28272k19894p30085n2938P60955M28692m71760m51775
31531b80359M84989R05837J93134p06652q73301n16665k01198K1843K97133N08015
31521a67224N22310M24842K89543Q4075j41619k97043l99021l76803j649N97857
$$ y = [-699045, -356431, 122783, 644183, 990529, 933212, 544806, 305181, 585200, 1050432, 1021682, 496624, 227621, 525712, 650826, -64095, -1042045, -1180408, -412514, 275846, 266691, -68850, -213079, -191000, -192460, -135315, 77387, 309788, 475428, 706636, 1016314, 1123687, 850071, 424335, 191711, 225866, 372888, 477839, 443165, 240165, -27142, -185304, -157605, 12789, 240459, 400150, 400505, 374987, 547834, 748750, 469066, -277946, -662856, -171826, 456446, 236552, -493533, -546471, 214484, 643176, 171416, -280359, 204630, 1110467, 1303601, 596949, -276352, -793017, -994215, -972372, -675239, -167224, 355086, 779928, 1069471, 1153546, 1011927, 714884, 315863, -60940, -62589, 535268]
31511E35268P56122J52622n55390o23007k73194j20731p1148K67569N57574K31913
31501H57598l20890k63013K27871K26016l40374o00055k14314K67667M96793N63168
31491I00467K56209n77151j065118k59301R86647Q67826m93672j018715L0458
31482c72350Q81851K74426n06871o762Q93200O16373m44009q19711m35710k79687
31472a99250m12826j68494K32493L4741m68477l39546L08544N39714K37994N3969
31462a81138P519l38135n76505M2440R48690P79453l72161r14107k07004N60534
31452b50414L77860k12794l46389j28865j9323N615M3702o5980j88078J09551
31442f75115O38110O30874L8291k71255K8714K07605j16919k79348R9499K97472
$$ y = [535268, 1291390, 1444012, 888622, 265615, -7579, -128310, -199458, 68111, 625685, 857598, 536708, 273695, 501566, 727582, 387208, -212847, -427161, -159494, 337299, 900467, 1156676, 579525, -485593, -744894, 241753, 1109579, 615907, -402808, -372350, 509501, 783927, 277056, 270294, 1163494, 1779867, 1335858, 516147, 80437, -199250, -612076, -780570, -548077, -513336, -981813, -1321359, -1012815, -473101, -235107, -181138, -173619, -511754, -1088259, -1045819, -97129, 682324, 310163, -603944, -810948, -250414, 127446, -85348, -431737, -560602, -579925, -574310, -530608, -596588, -784666, -675115, -37005, 593869, 632160, 360905, 389619, 597224, 480305, 200957, 300456, 597928]
31432E97928j76988n70500j58324M70548M41141K0154q4962o1710m21926p35753
31422f80392k43205O49157P62998p7567p76604n12726L23193Q07603M49474m94808
31412B07123j162834p53946M43995J078608L83427o95473q01122o0099L45596
31403a014725Q8995m4548L20943O09579M08027M8156j52359k98798l54300n8920
31393d47950L65129L12925j52764k51846K11883M34552p2784o51262n45099o174
31383h03390K89284K69370K42185J86420m9345k42871j23173J06690J03684m1930
31373f3076l4894R7607J20304k5288k56528m49075k99476L97160J093114Q27300
31363A407148l54179j117675o20777K52381L02643j49802l4154M96232L47043
$$ y = [597928, 420940, -149560, -307884, 162664, 603805, 623959, 538997, 477287, 55361, -680392, -923597, -274440, 488558, 410991, -365613, -878339, -555146, 252457, 701931, 207123, -955711, -1709657, -1265662, -187054, 196373, -499100, -1300222, -1360321, -1014725, -925730, -970278, -649335, -39756, 368271, 416427, 264068, -34730, -389030, -447950, -82821, 230104, 77340, -174506, 37377, 471929, 399145, -252117, -797216, -803390, -514106, -244736, -2551, 183869, 134524, -108347, -231520, -124830, -21146, -63076, -97970, -363, 119941, 94653, -161875, -610950, -910426, -513266, 579848, 1407148, 1052969, -64706, -685483, -433102, -130459, -280261, -314415, 181817, 528860]
31354E28860m99485q19599j56277M72429L04187n6145R2542L33309M6411l83698
31344a37466k39280L05053N55737M18550K77657J55208j49811l93515k17229P3237
31334F48141q9851n01333m30851J29483L68191o1051n07635l63260J04917L44681
31324c58568L24652L00513K63515R8874n7275n7864o5730k40466l61090j67442
31314c20881J36608J51977q5204j76553o166J07248n8368l05666l45589j87203
31304a089797m9298m1244q3320r0233j04197j63607o6413N13934J437863J808906
31294B072594Q17398j002933j975190j180587L33392Q83231K96886j51900K05459
31285B98350N70394J81722l81211j76356N38267P02626P6377n24775n52094l39989
$$ y = [528860, 29375, -790224, -946501, -474072, -169885, -226030, -133488, 199821, 246232, -137466, -376746, -71693, 484044, 902594, 1180251, 1335459, 1185648, 792133, 574904, 648141, 558290, 56957, -373894, -244411, 123780, 62729, -444906, -808166, -703249, -358568, -33916, 266597, 530112, 628986, 571711, 513847, 448117, 207651, -153439, -320881, -184273, -32296, -117500, -294053, -300219, -192971, -251339, -557005, -902594, -1089797, -1139095, -1180339, -1263659, -1353892, -1458089, -1621696, -1688109, -1174175, 263688, 2072594, 2889992, 1887059, -88131, -1268718, -935326, -52095, 244791, 92891, 298350, 868744, 1050466, 669255, 492899, 1031166, 1733792, 1810169, 1285394, 733300, 393311]
31275C93311k32301K0395N60212Q31283L18422n52279q94004n23277o6423j2033
31265a56694k04929k83515j23427K31510O38614P49925K82630m26740n92670l636
31255A11068N43786K71615m50756n95805N5067O22900M14579j74112l94865k36847
31245A66630k12882l95471l57820J020K57394K10657J88335L28876J86525m52890
31235g9626q95641m13778N07607O71648r7761o31347j03055P92963R11839K50254
31225I13103k82928k73568j28606j50456j35690J8649O1730l3666R9986N05262
31215E93816O13538J07538m49512l88233N7325J34578k74655n44091k82963J87913
31205b44746M18043L66242K04992J3889j36793j23981K5400J17953Q5164L4945
$$ y = [393311, 161010, 181405, 741617, 1572900, 1891322, 1339043, 445039, -78238, -144661, -156694, -361623, -645138, -768565, -537055, 101559, 851484, 1134114, 707374, 114704, 111068, 654854, 926469, 475713, -120092, -65025, 557875, 972454, 798342, 403477, 166630, -46252, -441723, -799543, -798523, -541129, -330472, -142137, 186739, 373264, -79626, -975267, -1389045, -881438, -209790, -307551, -938898, -1041953, -248990, 662849, 913103, 630175, 356607, 228001, 77545, -58145, -39496, 22234, -11432, 88554, 593816, 1207354, 1314892, 865380, 477147, 534472, 669050, 394395, -149696, -432659, -244746, 173297, 539539, 744531, 758420, 621627, 497646, 523046, 640999, 726163, 761108]
31195G61108k8252j92214k96354m7325L89252M27204m2941l34443K9883N00442
31185A166360K92571m00497p20426m27107o2924O7103K04371L47317O8621n70387
31175c4998p80752k24145L15940Q5086m49560l34833M07608R11859P66950L18811
31165I81966j52736o52622q97285m62618L26375N34470l3938m23260Q4885Q80704
31155A85941R18567J61715n38044o69931m99494l95729l09709j8923M38635P12781
31145a4191M88960p6848l83392j00610K90179J51423k48197q3182N79053O72331
31135A275526j54093p74007k68881N76505M82313l64871p58388l78456K7187R1561
31125b45604J62820K78086O7686k58973n0031N22268N37629j04430m22488n627
$$ y = [761108, 732856, 540642, 244288, 196963, 586215, 1013419, 970478, 636035, 665918, 1166360, 1458931, 1058434, 338008, -89099, -152023, -84920, 119451, 466768, 535389, -34998, -815750, -1039895, -723955, -638869, -1088429, -1423262, -1015654, -103795, 663155, 981966, 829230, 176608, -720677, -1183295, -856920, -322450, -356388, -779648, -694763, 185941, 1104508, 1266223, 728179, 58248, -441246, -836975, -1146684, -1165607, -726972, -14191, 474769, 397921, 14529, -86081, 204098, 355521, 107324, 24142, 603195, 1275526, 1121433, 347426, 78545, 655050, 1137363, 772492, 14104, -364352, -337165, -245604, -82784, 195302, 262988, 4015, -46016, 476252, 1013881, 909451, 486963, 481336]
31115D81336L17221k9772m14803k14764J18585M689k31900j29555j9261k93366
31105d11590n22124k08604K68210L45843K33465K97792K15233l00191o37068k19744
31095i38778L67095L24357M8605L23918P26525L16567n29532o04824L8311J83644
31085B55888l63999m44075L19300P60172J55912n73223m69249j5504m7606k85273
31075g07657k7898M94053N45079J45413n6469J22899K17857j06459o12219p58001
31065g43402k11949O93881J053666M02166m68955m43249K67507M21511k65076
31056G06100p12005l65977n8500l22535l30643M52894R38048J28719r43810o69920
31046a177629N34274Q71356l860o30186j85627M52015L96415j3534j99455l04836
$$ y = [481336, 798557, 768785, 353982, 139218, 257803, 262492, 30592, -98963, -118224, -411590, -933714, -1142318, -874108, -528265, -294800, 2992, 218225, -81966, -719034, -938778, -571683, -247326, -198721, 125197, 851722, 1168289, 638757, 33933, 72244, 255888, -108111, -552186, -232886, 527286, 683198, 109975, -359274, -374778, -422384, -707657, -735555, -241502, 303577, 448990, 392521, 515420, 733277, 626818, 14599, -743402, -955351, -261470, 792196, 1194362, 725407, 282158, 549665, 971176, 706100, -5905, -371882, -430382, -752917, -1083560, -630666, 307382, 436101, -507709, -1177629, -643355, 228001, 224141, -406045, -591672, -139657, 256758, 243224, 43769, -261067]
31036b61067n27969m96697J1101M77999L91903k302j89190r5434J05050L85196
31026b01410O46718N72676J06987l20551m12178m41747o92188q41052l92847M89867
31016a485725J044774P71372m1957o51188n69181L7846N90144P11332N25218K98631
31006A231266K6874l83460p30246o92454l03789J00416L35497M22550L00268q9772
30996B17150m68479m16012M4382M27076L98519R6294j75935k64616j78793n8906
30986c79320r0258k21577j34349K37027M36081J39609k29769q9262L86770N84580
30976F39532M47411L92672L92535J0418o44866q91958n45959j82233j40556j02984
30966f25988P0585m1401n37083p20453j09524O86475P28192k544o46336n14818
$$ y = [-261067, -789036, -1285733, -1274632, -796633, -404730, -407032, -596222, -691656, -586606, -201410, 445308, 1017984, 1124971, 804420, 392242, -49505, -741693, -1582745, -1975592, -1485725, -440951, 330421, 288464, -362724, -931905, -894059, -303915, 407417, 932635, 1231266, 1258140, 874680, 144434, -548020, -851809, -751393, -415896, 6654, 306922, 217150, -251329, -667341, -622959, -195883, 202636, 298930, 122995, -141621, -320414, -379320, -469578, -691155, -825504, -588477, -152396, -12787, -242556, -331818, 54952, 639532, 1086943, 1479615, 1872150, 1882568, 1237702, 345744, -200215, -382448, -523004, -625988, -555403, -596804, -1133887, -1854340, -1963864, -1277389, -549197, -551741, -1198077, -1712895]
30956a712895K69834R73237Q98552J05511m92938j78342N00288L96762m79587
30947B80422q37028k9900Q99351P40388j73307o09754k03939L04666K76167j59047
30937D88019m98030l99508N3167L20234o4665p12378o51472K95807J064704P63464
30927F59342j23667n66214l87418j03503O9024K20142K10595l9811j06141K93630
30917A25979N88541J50868n54196n62274R0137M36651N4245m51962m53197j0612
30907e85820M38831M86997m8525p52139p22572K53279J037510N34805o45984r96769
30897a000387k66014M28059M74078L83120M62664K78270k40863m36941j02515
30888b0529J16009p8215j47833J18906J28805l09566m79794p7226J59773j40437
$$ y = [-1712895, -1443061, -469824, 428728, 534239, 41301, -137041, 363247, 760009, 280422, -556606, -586506, 312845, 1053233, 879926, 270172, 66233, 370899, 647066, 488019, -10011, -409519, -356352, -36118, -100783, -813161, -1464633, -1168826, -104122, 659342, 535675, -30539, -417957, -521460, -452436, -232294, -21699, -61510, -167651, 125979, 714520, 865388, 311192, -251082, -160945, 275706, 329951, -122011, -575208, -585820, -146989, 340008, 291483, -460656, -1183228, -929949, 107561, 642366, -3618, -1000387, -1266401, -838342, -364264, 18856, 481520, 759790, 518927, 81986, -20529, 95480, 17265, -130568, -11662, 117143, -192423, -672217, -749443, -589670, -730107]
30878g30107j80609M91220Q93206J85090p52522o32144K42951O82168N35379M42216
30868A176848L17542k98603q57471m80794K59856L5792q55942p31576O23589J337319
30858E26560L67500q30002o29722L60990O02920P7912j33021J19105O7098l73785
30848A55555n46165m05900n36165q23441m66391N08660J008940N45607J2080K29583
30838c17637O94086N03745k21250o56351m91087n8326L68888O55415M69024l39271
30828F07236j136257j040102r5854P07909O83079J50613j94421q9777K88820O56957
30818E38203P48147M80007J39997O4915J00426j56807n51900m55331J60322M64493
30808A532472k130n54683m28646J5832l9058m70379m51646J30626N02952K77979
$$ y = [-730107, -910716, -419496, 473710, 658800, -93722, -725866, -482915, 199253, 734632, 1176848, 1494390, 1195787, 338316, -142478, 117378, 153170, -702772, -1434348, -810759, 526560, 894060, 64058, -565664, -204674, 398246, 476158, 343137, 462242, 529340, 155555, -390610, -796510, -1332675, -2156116, -2622507, -2113847, -1104907, -559300, -547220, -317637, 376449, 880194, 658944, 2593, -488494, -546820, -177932, 477483, 946507, 607236, -529021, -1569123, -1664977, -957068, -273989, -123376, -317797, -407574, -118754, 538203, 1286350, 1766357, 1906354, 1971269, 2071695, 1914888, 1362988, 907657, 1067979, 1532472, 1530342, 975659, 547013, 562845, 523787, 53408, -398238, -267612, 235340, 513319]
30798E13319l3652R964J43878O0188k6396Q4880R5851k29046n05707k86833J76113
30787B559K80399l8709k82104j46104J36785K10904L2268j41774l8204L16602
30777C32622N18559K16532l29033m65070o7888K11511o5387l94841j32588L87527
30767B11944K96698m25871q49949m49310K29320N08950M65199M32740K66042k69495
30757D16268p85585o76134o3187L33577K31993N7116J31480K47668K30684K89059
30747D12939M72486L62275k19929o77848l99697L02067O27489L83771k911k94023
30737I66619m93193l28241L81213R35969M29837o96960r90731j78680L21767k90140
30727E7460q39175k11605O24380K35558p03638m63660P07976Q64673l62431j086090
$$ y = [513319, 479667, 489631, 633509, 693697, 667301, 752181, 848032, 618986, 113279, -173554, 2559, 282958, 244249, -37855, -183959, -47174, 163730, 195998, 54224, 16020, 332622, 851181, 1067713, 738680, 273610, 205722, 417233, 351846, -42995, -175583, 211944, 508642, 82771, -767178, -1216488, -987168, -478218, -13019, 419721, 685763, 416268, -369317, -1045451, -1108638, -775061, -543068, -485952, -354472, -106804, 123880, 412939, 885425, 1247700, 1027771, 349923, -49774, 252293, 879782, 1263553, 1260642, 966619, 473426, 145185, 526398, 1462367, 1892204, 1195244, 204513, 25833, 347600, 57460, -781715, -993320, -368940, -133382, -837020, -1300680, -592704, 271969, -90462, -1176552]
30717a176552k98907N24063K8477p66090l47459O96958Q15974J66503J43775P94334
30707E81076P39537l37095j010308l58735O61155P88202J97340j67820j07129
30698I86223r3309k48068k65396j01052k3516o8819j698J94117K35450n14k77995
30687C35423l48769k42690j16658j9649N6987M5507r3956j98683n3825K42099
30677c94214K90312p0436m26495k56975L46028P26829M53357k05514o36915m93178
30667f67201Q6321O28442O70489J89093k88184k32835K33432M99840K34117l28212
30657A025302p97358r41461o41864K427N41502O15854M74775N23624N07515q0368
30647A229948q51141p88442J61771Q29190N21373o5369j51792j0509r3837r0020
$$ y = [-1176552, -1475459, -951396, -922919, -1689009, -2036468, -1339510, -523536, -357033, -213258, 581076, 1320613, 983518, -26790, -385525, 275630, 1063832, 1261172, 1093352, 986223, 892914, 644846, 379450, 278398, 254882, 186063, 184365, 378482, 613932, 613418, 335423, -13346, -256036, -372694, -392343, -335356, -289849, -383805, -582488, -636313, -394214, -103902, -174338, -600833, -857808, -511780, 215049, 668406, 462892, -174023, -667201, -580880, 47562, 718051, 907144, 618960, 386125, 619557, 1119397, 1353514, 1025302, 227944, -713517, -1355381, -1352954, -811452, -195598, 279177, 802801, 1310316, 1229948, 378807, -409635, -247864, 581326, 1102699, 1037330, 885538, 875029, 781192, 691172]
30637F91172K49124L07808l29314q83870n77415J620n5148l71221j23667K68275
30627h22636p8790o46799k67726O35792N71654l63644m98648N06079R98411K25779
30617B59472l36062L46811R38736P2557j102764p10426O93462R37333l45294j257623
30607e03798o27943M33427M65002l17717p02436k42931M68952P98317O56656K71642
30597F99171j44706m30092m09975j5979M63575M62168k05095q63247o61754K28761
30587h77173P23132L18938k10566l2529N06836M96195j75902p89664q45121m80511
30577a366365r801L64710M66239K58639r681j18053j63435k29655p0751M43660
30567d34493Q58190O36158m3098m88104l75975K668K53311K29328q191k37658
$$ y = [691172, 940296, 1248104, 918790, 34920, -542495, -540875, -596023, -967244, -1090911, -822636, -901426, -1548225, -1815951, -1180159, -608505, -972149, -1470797, -964718, 33693, 259472, -76590, 270221, 1208957, 1281514, 178750, -531676, 161786, 1099119, 753825, -503798, -1131741, -698314, -233312, -551029, -1253465, -1496396, -1027444, -229127, 427529, 699171, 554465, 124373, -285602, -301581, 161994, 624162, 419067, -444180, -1105934, -877173, -154041, 164897, -45669, -78198, 428638, 924833, 748931, -40733, -885854, -1366365, -1376166, -1011456, -545217, -286578, -296259, -414312, -577747, -807402, -878153, -434493, 423697, 1059855, 1016757, 528653, 152678, 155346, 408657, 637985, 629794, 392136]
30557C92136k24955q2610k08673n95799o31454j5042N97688M72106r1417k53947
30547f41967N3506J46933k25688n59519m75886j68598J24010L90492M69301J03897
30537g83519m20238l72164L74557R82639P38072N46l92663k73894j35667j93287
30527d75618r8167L17890N56998J14522o35809p63681n9498N61210K97143l74434
30517e59444m22183J65840M26906l044l82861j91128P3583n3519j19282L07397
30507g57735O51907K52834l85975l28765K63746M38578l978l58031k67389r6797
30497e91605o8424K8446K18709K54981J68825J73118J04445k69265n55229k24534
30487g60533L74805M58772J13472R1463L92431K35974m81554r02816n85439m8633
$$ y = [392136, 167181, 84571, -124102, -719901, -1351355, -1366397, -768709, -296603, -388020, -641967, -588461, -441528, -667216, -1226735, -1702621, -1871219, -1747209, -1356717, -887416, -783519, -1203757, -1575921, -1201364, -218725, 519347, 519893, 127230, -146664, -282331, -475618, -573785, -255895, 301103, 415625, -220184, -983865, -1043363, -482153, -185010, -559444, -981627, -815787, -388881, -391925, -774786, -965914, -892331, -945850, -1065132, -757735, -105828, 147006, -238969, -567734, -303988, 134590, 130612, -227419, -494808, -591605, -660029, -631583, -412874, -157893, 10932, 184050, 288495, 19230, -535999, -760533, -385728, 73044, 186516, 277979, 670410, 906384, 424830, -477986, -1063425, -1112058]
30477a112058K59149M36922M03868j20757p01836n03578K41140M26531m538Q9514
30467e85643Q44217Q45207l78784j155722k35229J080290R45294k43862q27146
30458B88622n57842m14264n09417j24159N92476P53644L52712J50809J48648k65698
30448D15531q07074n37257L97069Q18457L96114o57N8367L6424k67406l27188
30438A82380o7890n2830k35944N1372N91961L25750o58450q41642K87159J153239
30428G35105M98315o25446n89000K95240N20904j65049o38612l28021J43347J64399
30418A1182j20165l15693k28851J68161O21445O02566j6486n61818m06778R7570
30408a48867J72950k24964m88887l38058K083L90091P97973Q72070K25341p76393
$$ y = [-1112058, -852909, -415987, -12119, -132876, -834712, -1338290, -1097150, -670619, -675157, -585643, 258574, 1103781, 724997, -430725, -665954, 414336, 1359630, 1115768, 288622, -269220, -683484, -1192901, -1317060, -724584, 29060, 381772, 532581, 681229, 415531, -391543, -928800, -531731, 286726, 682840, 682183, 740550, 776974, 509568, 182380, 114490, 61660, -174284, -122912, 469049, 794799, 136349, -705293, -418134, 735105, 1233420, 607974, 18974, 314214, 835118, 670069, 31457, -296564, -153217, 11182, -108983, -424676, -653527, -485366, 136079, 738645, 722159, 160341, -246437, -148867, 24083, -200881, -689768, -1027826, -1025743, -635652, 162321, 1034391, 1259732, 483339]
30398D83339j165034n00823N49890R37287L38286n14525n93661K22894Q51749
30389F09402L21382p75385r48583L0330P34191K43217n18771m19086Q8555o46
30379f35394l85664j22419N32661N65864Q9525R0875M77989J63182p90988r41777
30369i56146J42262R85030M89064m06937l84295K23958K70608l00791o57826n34053
30359a129126k87000M6287O25707J021730O08745l44827q68891n72652m401K69382
30349f35046K77400K64746K58425J63107m4804k88193l73073j11743L50629N46917
30339D08365K60060j57178k69826q3929J54586L35312L78159J36840k65931l95655
30329E00803j35548O7161o2524j55016R0078K72865k5659m37258l87104o0347
$$ y = [483339, -681695, -1182518, -632628, 304659, 642945, 128420, -465241, -242347, 609402, 930784, 155399, -793184, -762854, -28663, 214554, -304217, -723303, -634748, -635394, -1021058, -1143477, -610816, -44952, 44573, 135448, 613437, 776619, -14369, -956146, -813884, 171146, 660210, 253273, -131022, 92936, 363544, 62753, -595073, -1129126, -1416126, -1369839, -744132, 277598, 886343, 541516, -327375, -900027, -904428, -635046, -357646, -92900, 165525, 328632, 283828, -4365, -377438, -489181, -138552, 408365, 668425, 511247, 241421, 157492, 312078, 647390, 1025549, 1162389, 896458, 500803, 365255, 432416, 369892, 214876, 304954, 577819, 552160, 114902, -272202, -332549]
30319c32549k3959k24364j73757J12828J96072O5893R4859K29755M5593l97968
30309d07597n31013j74601K26512L61488M12344N51565O30955M69499M2573n58057
30299A023668r80459p13985J40536O02818M6731p12123m91917M63265Q93821M62807
30289G35162j9092j94846n18750q91179n09475M88180P67846j26167q71890m08586
30279a548797M55806N10846O065j49004j072o3785q7736L13205N39434o9147p96608
30268h90793n32658K97627L89658j75996q7734P77985R28839k81898j410672j000198
30258a985840L51141J024396O29760J54653L13762P19092O48778O501o28432o70678
30248E63133j69799K43484J11781l33255o15620o67555o31319l55580K75565P62073
$$ y = [-332549, -356508, -580872, -754629, -641801, -445729, -379836, -284977, -55222, -9629, -407597, -938610, -1113211, -886699, -525211, -112867, 438698, 1069653, 1539152, 1581725, 1023668, 43209, -670776, -530240, 72578, 119309, -592814, -1084731, -621466, 272355, 735162, 716070, 521224, 2474, -888705, -1398180, -910000, -142154, -268321, -1140211, -1548797, -1092991, -582145, -576080, -725084, -726156, -789941, -877677, -564472, -25038, -94185, -890793, -1423451, -1125824, -736166, -912162, -999896, -221911, 706928, 425030, -985642, -1985840, -1634699, -610303, 19457, 174110, 487872, 1206964, 1855742, 1862243, 1233811, 563133, 393334, 636818, 748599, 415344, -200276, -867831, -1499150, -1854730, -1579165, -817092]
30238h17092N08289j93710m99427k54255k5485O1338M57669J014565Q43229j85426
30228I09695q92409m41145L91489M42664j08319k41099K06904M35517P9155k91871
30218D90581j53245K51660L81609R0716l33667n19313l02144J30728L96427L44367
30208G77719K03314J77201J34992r5839l89582n26359m94169l54714q0887K33918
30198d14406L14718J11418o4960n6116q6121j94977R885N91683Q55690L16568
30188A383382m20669n08566j36179o9140k84732j33015L30666L58726r7793k21537
30178B01143J86843K74014l11272o09806J01534R66908P90238j40473o22469m06504
30168D30156k46699l59062j55365M27686N97659N7238m01607j75015K20048J41729
$$ y = [-817092, -308803, -502513, -1001940, -1256195, -1281680, -1220342, -762673, 251892, 1095121, 909695, 17286, -423859, -32370, 410294, 301975, 60876, 267780, 703297, 782452, 490581, 337336, 588996, 970605, 1061321, 727654, 208341, -93803, 36925, 433352, 777719, 981033, 1158234, 1293226, 1197387, 807805, 281446, -212723, -567437, -648324, -414406, -99688, 11730, -53230, -109346, -195467, -390444, -380559, 211124, 1066814, 1383382, 962713, 454147, 317968, 248828, -35904, -168919, 161747, 520473, 422680, 201143, 387986, 662000, 350728, -259078, -157544, 809364, 1599602, 1459129, 836660, 430156, 183457, -175605, -330970, 96716, 694375, 751613, 350006, 174991, 395039, 536768]
30158E36768p1587J85558O04464M50753j55211m31993k27304j28351k92873j83244
30148B86980L07541M45848j33489o42788k78507M71193N12722k07678o62990k92415
30138a93583K83692L07333r1595l35410l36522m25066n90130l99947K55139Q02974
30128g23115O44945n9673n80588n17043j74095K8053J41950M03822O61195N68929
30118C94380K28248P4140J11849j14498o24337p50639j79159L94097K41788k63393
30108d87524k39294L28191O39685L68966L4909L5578J04435p1107l56160n34423
30098a76744o02398m93117o9842L99941L68553j24626l25204J45528O76483N86982
30088C85556Q9163k10376k49279k91592j98884K86899P58459M88096m12508r37649
$$ y = [536768, 465181, 650739, 1255203, 1705956, 1550745, 1118752, 891448, 763097, 470224, 286980, 594521, 1040369, 906880, 264092, -14415, 456778, 969500, 761822, 98832, -193583, 90109, 397442, 305847, -29563, -366085, -791151, -1381281, -1781228, -1526089, -723115, -78170, -137843, -718431, -1235474, -1409569, -1381516, -1239566, -835744, -174549, 394380, 622628, 696768, 808617, 694119, 69782, -680857, -860016, -465919, -224131, -487524, -726818, -398627, 241058, 610024, 644933, 680511, 784946, 713839, 357679, -176744, -779142, -1272259, -1342101, -942160, -573607, -698233, -1023437, -877909, -201426, 385556, 474719, 264343, 15064, -276528, -475412, -188513, 569946, 1058042, 645534, -292115]
30078b92115n15048K29678L87380k6556k61403K1583L53929K70143J2593O3538
30068B43722K68206K5258o12303p29334J13265R24892M73699q65866j437155n26247
30058b121863P24922R77335L67766p0106O2962L40906L99029K56752l841k58161
30048F75701k25777J33640L23989o6610o61975p46436k29374L57203O29484N80120
30038G69965K30532l40492p27672n46017j7381K74314J38120j55722l82133m21955
30028a178441m8981O98633J122229N91367m08821p47129j83406L62811J94317
30019D02579l14359m88331k48143Q3393K76198K15184n5376j45961K47001O43621
30009F15806K62116o57288r21403j15171O99850N64572m6030k26352r3987k45197
$$ y = [-292115, -807163, -577485, -190105, -216661, -478064, -456481, -102552, 167591, 180184, 243722, 511928, 537186, -75117, -804451, -691186, 233706, 707405, -158461, -1595616, -2121863, -1396941, -419606, -51840, -121946, -58984, 281922, 680951, 937703, 933862, 675701, 449924, 583564, 907553, 840943, 178968, -567468, -796842, -439639, 189845, 769965, 1000497, 660005, -67667, -613684, -631065, -356751, -218631, -374353, -756486, -1178441, -1227422, -528789, 593440, 1184807, 775986, 28857, -154549, 208262, 402579, 88220, -400111, -648254, -564861, -288663, -73479, -128855, -274816, -27815, 615806, 877922, 220634, -700769, -815940, -116090, 448482, 402452, 176100, 82113, -163084]
29999a63084m60295j43485L65690J83749n42075o86135Q3822P21568L85464l36499
29989e91280l71631L34898R13769P86409K01289k78376l64898j40504J42329K78520
29979I10525K15906L433k66386m08278k32903J32033K36746q6762l68029j54100
29969a7815K37505J92239j73843j93990K01893L73278J24834M7044L57234L57256
29959A505635l30753q66258m19740L88450L71655l44013n57757L7307M32519O2150
29949B79195k69935J91400Q27452N96929l41492q79809n21926J30494L62871J28286
29939E03465k16257m21770m34311k88947o4317J66841L34068K98402R25k49164
29929c71065r066N77463P57391K17446l55495l01161n1710l76918r69442q33588
$$ y = [-163084, -623379, -766864, -401174, -217425, -759500, -1445635, -1361813, -640245, -254781, -591280, -962911, -628013, 285756, 1072165, 1273454, 995078, 630180, 489676, 632005, 910525, 1126431, 1129864, 863478, 455200, 222297, 354330, 591076, 504314, 136285, -17815, 219690, 411929, 238086, 44096, 245989, 619267, 744101, 791145, 1148379, 1505635, 1174882, 308624, -111116, 277334, 648989, 304976, -252781, -215474, 217045, 279195, 9260, 200660, 1028112, 1625041, 1283549, 403740, -118186, 12308, 375179, 503465, 287208, -134562, -568873, -857820, -922137, -755296, -421228, -122826, -121901, -371065, -380131, 197332, 954723, 1172169, 816674, 515513, 463803, 86885, -882557, -1716145]
29919a716145L7527N31399J47687k80729n5133K77519K3130l63133q2017N32330
29909i47565M82318k31067n57816l7377N48127M36722o2855k48474j03235j05340
29899h26562l36579l89598p3159K72835K65715m126j15189J34719M87006N71049
29889a3889L71828J88118J62624J04594j27763l33859k75749o6601K5202J537
29879C6042L5847N6068j77249n57234n89165l9673O29113P06776M1824p39361
29869e97012q37951j00577P76285R42952L13331l85165n34263k97018j50341j02176
29859i71935J48208M79920M19516k9169k72276p2083J2024m31555q09097k96964
29849a823411P92938J232416N24040m32509o44111l20752k74341n14578l16750
$$ y = [-1716145, -1678618, -1147219, -999532, -1280261, -1335394, -1057875, -1034745, -1397878, -1479895, -947565, -465247, -696314, -1254130, -1291507, -743380, -306658, -369513, -617987, -721222, -826562, -1163141, -1552739, -1625898, -1353063, -1087348, -1091474, -1206663, -1071944, -584938, -13889, 357939, 546057, 708681, 813275, 685512, 351653, 75904, 9303, 34505, 36042, 71889, 127957, -49292, -606526, -1195691, -1235364, -606251, 100525, 142349, -597012, -1434963, -1535540, -759255, 183697, 497028, 111863, -422400, -719418, -869759, -971935, -823727, -343807, 75709, 46540, -225736, -297819, -285795, -717350, -1526447, -1823411, -1030473, 201943, 725983, 293474, -350637, -671389, -945730, -1460308, -1777058]
29840a777058M17655Q05355K89077m64063n14336N4845M48110L72147J89403Q1870
29830i6995j21583l05725o9327M70790O06261N0992n92546o93624l48516N5173
$$ y = [-1777058, -1359403, -554048, -264971, -729034, -1243370, -1188525, -740415, -368268, -178865, -96995, -218578, -524303, -593630, -122840, 483421, 534413, -58133, -751757, -1100273, -1045100]
$$ [...]
##END NTUPLES=NMR SPECTRUM
##END=
