##TITLE=31Pdec_LY-17Dix.5.B
 CD3CN, 24 sc
 4.06.2021
##JCAMPDX= 6.0         $$ Bruker NMR JCAMP-DX V2.0
##DATA TYPE= NMR SPECTRUM
##DATA CLASS= NTUPLES
##ORIGIN= UXNMR, Bruker Analytische Messtechnik GmbH
##OWNER= root
$$ XWIN-NMR		Version 3.5
$$ Fri Jun  4 12:09:03 2021 Russian Standard Time (UT+4h)  she@DPX200
##.OBSERVE FREQUENCY= 81.013821
##.OBSERVE NUCLEUS= ^31P
##.ACQUISITION MODE= SIMULTANEOUS
##.ACQUISITION SCHEME= undefined
##.AVERAGES= 24
##.DIGITISER RES= 16
##SPECTROMETER/DATA SYSTEM= spect
##.PULSE SEQUENCE= zgpg30
##.SOLVENT NAME= CD3CN
##.SHIFT REFERENCE= (INTERNAL, CD3CN, 0, 248.564)
##AUDIT TRAIL= $$ (NUMBER, WHEN, WHO, WHERE, WHAT)
$$ ##TITLE= Audit trail, XWIN-NMR		Version 3.5
$$ ##JCAMPDX= 5.01
$$ ##ORIGIN= Bruker BioSpin GmbH
$$ ##OWNER= she
$$ F:/spectra/data/she/nmr/P31/1/pdata/1/auditp.txt
$$ ##AUDIT TRAIL=  $$ (NUMBER, WHEN, WHO, WHERE, WHAT)
(   1,<2021-06-04 12:07:18.65 +0400>,<she>,<DPX200>,
      <created by zg, POWCHK disabled, PULCHK disabled
       configuration hash MD5:
       00 E9 B6 7A A2 85 ED C7 34 08 36 98 17 FE 4E 26
       data hash MD5: 32K
       3E 38 07 21 A6 41 0B 9E 63 03 E0 CD A4 F9 03 EE>)
(   2,<2021-06-04 12:07:23.39 +0400>,<she>,<DPX200>,
      <Start of raw data processing
       efp BC_mod = 2 LB = 1 FT_mod = 6 PKNL = 1 PHC0 = -6395.131 PHC1 = 1111.475 SI = 64K 
       data hash MD5: 64K
       71 99 0C C6 A7 17 E6 ED A8 09 25 4C 32 58 A5 6A>)
(   3,<2021-06-04 12:07:43.09 +0400>,<she>,<DPX200>,
      <pk PHC0 = 324.0255 PHC1 = -677.0001 
       data hash MD5: 64K
       40 AF ED D8 0D 49 5F 22 6B F4 34 33 C4 E4 81 64>)
(   4,<2021-06-04 12:07:55.07 +0400>,<she>,<DPX200>,
      <abs ABSG = 5 
       data hash MD5: 64K
       BF 49 A0 D3 BC CD 45 8B BA D5 75 6E 2A AA 70 5E>)
$$ ##END=
$$ 
$$ hash MD5
$$ 4A D3 05 0C BA B9 6C A4 E7 BE 19 36 49 EF 4D AE
##$RELAX= 
##$RELAX= 
##$RELAX= 
##$RELAX= 
##$RELAX= 
##$RELAX= 
##$RELAX= 
##$RELAX= 
$$ Bruker specific parameters
$$ --------------------------
##$DU= <F:/spectra>
##$EXPNO= 1
##$NAME= <P31>
##$PROCNO= 1
##$TYPE= <nmr>
##$USER= <she>
##$AMP= (0..31)
100 100 100 100 100 100 100 100 100 100 100 100 100 100 100 100 100 100 
100 100 100 100 100 100 100 100 100 100 100 100 100 100 
##$AQSEQ= 0
##$AQ_mod= 1
##$AUNM= <au_zg>
##$AUTOPOS= <>
##$BF1= 81.014009
##$BF2= 200.13
##$BF3= 200.13
##$BF4= 200.13
##$BF5= 200.13
##$BF6= 200.13
##$BF7= 200.13
##$BF8= 200.13
##$BYTORDA= 1
##$CFDGTYP= 0
##$CFRGTYP= 5
##$CHEMSTR= <none>
##$CNST= (0..31)
1 1 145 1 1 1 1 1 1 1 1 1 1 1 1 1 1 1 1 1 1 1 1 1 1 1 1 1 1 1 1 1 
##$CPDPRG= <waltz16>
##$CPDPRG1= <>
##$CPDPRG2= <waltz16>
##$CPDPRG3= <>
##$CPDPRG4= <mlev>
##$CPDPRG5= <mlev>
##$CPDPRG6= <mlev>
##$CPDPRG7= <mlev>
##$CPDPRG8= <mlev>
##$CPDPRGB= <>
##$CPDPRGT= <>
##$D= (0..31)
0 1 0 0 0 0 0 0 0 0 0 0.03 2e-05 3e-06 0 0 0 0 0 0 0 0 0 0 0 0 0 0 0 0 
0 0 
##$DATE= 1622794038
##$DBL= (0..7)
120 120 120 11 120 120 24 19 
##$DBP= (0..7)
150 150 150 150 150 150 150 150 
##$DBP07= 0
##$DBPNAM0= <>
##$DBPNAM1= <>
$$ [...]
##$SUBNAM3= <"">
##$SUBNAM4= <"">
##$SUBNAM5= <"">
##$SUBNAM6= <"">
##$SUBNAM7= <"">
##$SUBNAM8= <"">
##$SUBNAM9= <"">
##$SW= 501.771253377433
##$SWIBOX= (0..15)
0 1 3 0 0 0 0 0 0 0 0 0 0 0 0 0 
##$SW_h= 40650.406504065
##$TD= 32768
##$TD0= 1
##$TE= 0
##$TE2= 300
##$TE3= 300
##$TEG= 300
##$TL= (0..7)
0 120 53 12 22 120 120 120 
##$TP= (0..7)
150 150 150 150 150 150 150 150 
##$TP07= 0
##$TPNAME0= <>
##$TPNAME1= <>
##$TPNAME2= <>
##$TPNAME3= <>
##$TPNAME4= <>
##$TPNAME5= <>
##$TPNAME6= <>
##$TPNAME7= <>
##$TPOAL= (0..7)
0.5 0.5 0.5 0.5 0.5 0.5 0.5 0.5 
##$TPOFFS= (0..7)
0 0 0 0 0 0 0 0 
##$TUNHIN= 0
##$TUNHOUT= 0
##$TUNXOUT= 0
##$USERA1= <user>
##$USERA2= <user>
##$USERA3= <user>
##$USERA4= <user>
##$USERA5= <user>
##$V9= 5
##$VALIST= <valist>
##$VCLIST= <CCCCCCCCCCCCCCC>
##$VD= 0
##$VDLIST= <DDDDDDDDDDDDDDD>
##$VPLIST= <PPPPPPPPPPPPPPP>
##$VTLIST= <TTTTTTTTTTTTTTT>
##$WBST= 1024
##$WBSW= 4
##$XGAIN= (0..3)
0 0 0 0 
##$XL= 0
##$YL= 0
##$YMAX_a= 1516
##$YMIN_a= -5063
##$ZGOPTNS= <>
##$ZL1= 120
##$ZL2= 120
##$ZL3= 120
##$ZL4= 120
##$ABSF1= 248.5645
##$ABSF2= -253.2056
##$ABSG= 5
##$ABSL= 3
##$ALPHA= 0
##$AQORDER= 0
##$ASSFAC= 0
##$ASSFACI= 0
##$ASSFACX= 0
##$ASSWID= 0
##$AUNMP= <proc_1d>
##$AZFE= 0.1
##$AZFW= 0.5
##$BCFW= 0
##$BC_mod= 2
##$BYTORDP= 0
##$COROFFS= 0
##$CY= -3
##$DATMOD= 1
##$DC= 0
##$DFILT= <>
##$DTYPP= 0
##$F1P= 0
##$F2P= 0
##$FCOR= 1
##$FTSIZE= 65536
##$FT_mod= 6
##$GAMMA= 0
##$GB= 0
##$INTBC= 1
##$INTSCL= 5.30512e-09
##$ISEN= 30
##$LB= 1
##$LEV0= 0
##$LPBIN= 0
##$MAXI= 10000
##$MC2= 0
##$MEAN= 0
##$ME_mod= 0
##$MI= 50
##$NCOEF= 0
##$NC_proc= -5
##$NLEV= 6
##$NOISF1= 182.463
##$NOISF2= 159.3651
##$NSP= 0
##$NTH_PI= 0
##$NZP= 0
##$OFFSET= 248.5645
##$PC= 4
##$PHC0= -6071.105
##$PHC1= 434.4749
##$PH_mod= 1
##$PKNL= yes
##$PPARMOD= 0
##$PSCAL= 0
##$PSIGN= 0
##$REVERSE= no
##$SF= 81.014009
##$SI= 65536
##$SIGF1= 159.3651
##$SIGF2= -187.1042
##$SINO= 113.3802
##$SIOLD= 16384
##$SREGLST= <1H.CDCl3>
##$SSB= 0
##$STSI= 65536
##$STSR= 0
##$SW_p= 40650.406504065
##$SYMM= 0
##$S_DEV= 0
##$TDeff= 32768
##$TDoff= 0
##$TI= <>
##$TILT= no
##$TM1= 0
##$TM2= 0
##$TOPLEV= 0
##$USERP1= <user>
##$USERP2= <user>
##$USERP3= <user>
##$USERP4= <user>
##$USERP5= <user>
##$WDW= 1
##$XDIM= 65536
##$YMAX_p= 289077076
##$YMIN_p= -19192559
$$ End of Bruker specific parameters
$$ ---------------------------------
##NTUPLES= NMR SPECTRUM
##VAR_NAME=  FREQUENCY,     SPECTRUM/REAL,   SPECTRUM/IMAG
##SYMBOL=    X,             R,               I
##VAR_TYPE=  INDEPENDENT,   DEPENDENT,       DEPENDENT
##VAR_FORM=  AFFN,          ASDF,            ASDF
##VAR_DIM=   65536,         65536,           65536
##UNITS=     HZ,            ARBITRARY UNITS, ARBITRARY UNITS
##FACTOR=    0.620285442955139, 1,           1
##FIRST=     20137.2065510759, 0,            0
##LAST=      -20513.1999529892, 0,           0
##MIN=       -20513.1999529892, -19192559,   0
##MAX=       20137.2065510759, 289077076,    0
$$ Real data points
##PAGE= N=1
##DATA TABLE= (X++(R..R)), XYDATA
$$ [...]
35731a91784O99939J79508l83152l10933L0397q094k84522j97727K55441M38605
35721B27678M7479m28581l72567J67511N63851L56273k36718n55747k25000L95255
35711f0566N91363J60188l21540k66684J15823J61349k14466l56657J12336O54595
35701E75741N76458J6059l49150l10218k27216k44841r0382K67346M02079J07661
35691G23537k35210k44836m3622Q3851J05892O3865p5383j43237J41117N35049
35681I11023L53155m26978q46730l25571L85056L77279J2820J51603N37182K40388
35671A369227n82974p94149j54840K97534M3438j20290L67594P54394K87184m41744
35661A025374m83696q4286j34792n98521o39537q8901L12542J66575l0508J88148
$$ plain form
35731 -191784 508155 687663 304511 -6422 23975 15881 -268641 -466368 -210927 227678
35721 227678 275157 -153424 -525991 -358480 205371 561644 324926 -230821 -455821 -60566
35711 -60566 530797 690985 369445 102761 218584 379933 165467 -191190 -78854 575741
35701 575741 1152199 1168258 819108 508890 281674 36833 -53549 213797 615876 723537
35691 723537 488327 243491 199869 283720 389612 453477 378094 234857 375974 911023
35681 911023 1264178 837200 -9530 -335101 49955 427234 440054 591657 1128839 1369227
35671 1369227 786253 -7896 -162736 134798 178236 57946 425540 1179934 1467118 1025374
35661 1025374 541678 457392 322600 -275921 -915458 -1004359 -691817 -525242 -555750 -367602
35651c67602N24353M51912L210l34905k60023O0167K34448P0451k13744k41497
35641g3230J9613J84700r51k94104l58307k69845k85911l32373j47854J89922
35631a368340L39747K67546K84711M56620M20667k0898m99675n60647k97914j71086
35621a149269k91533k64017J68598O34581N75736N4587k56906K0067M45211M00873
35611C37928l7634k88328j40252O8354J13976J68082K91589K01451j80608m15822
35601A18736j59944K70477L44908N5036k03559k60702k46275j83726L6755L05399
35591G7105L09550k6019l82589m05227o2951L57252N05972K67183j09898k53774
35581B76604r3487J12113J86885K07527J95652J5931k48839k48449L1349P7091
$$ plain form
35651 -367602 156751 608663 611873 276968 16945 77112 311560 382011 168267 -73230
35641 -73230 -53617 131083 130132 -163972 -522279 -792124 -1078035 -1410408 -1558262 -1368340
35631 -1368340 -1028593 -761047 -476336 -19716 400951 380053 -119622 -680269 -978183 -1149269
35621 -1149269 -1440802 -1704819 -1536221 -901640 -325904 -271317 -528223 -508156 -62945 337928
35611 337928 300294 11966 -128286 -59932 54044 222126 513715 715166 534558 118736
35601 118736 -41208 229269 574177 629213 425654 164952 -81323 -265049 -228294 77105
35591 77105 386655 360636 -21953 -427180 -490131 -132879 373093 640276 530378 276604
35581 276604 183117 295230 482115 689642 885294 901225 652386 403937 435286 512377
35571E12377l32819n91205j38451N19381M41353l08683p13048k99451K65211K87656
35561c57679l3891j84805j53361j56709o0205L25116O80777N24359j6858l09364
35551B57380p9476K70136K75775k3857k78515l12398k27553j56679j00754j5426
35541c91367N2586P807j05377n9273K86872P07969P71405L18839l37686p43158
35531E08617p01965l34383R7068L51319L58615K84585L08528L25476J04871k23872
35521A078859k23155J29762K12482l34076q50371m73158M72458P32593p6679p94938
35511a26223l57947O09186O90984k26779q12108k66123N77303N70697j39944n43611
35501b4565k94871K7540J3746o1093O6633J37150j17750m31338l72524K2802L44564
$$ plain form
35571 512377 179558 -411647 -550098 -30717 410636 101953 -611095 -910546 -645335 -357679
35561 -357679 -391570 -576375 -729736 -886445 -946650 -621534 59243 583602 566744 257380
35551 257380 177904 448040 723815 699958 421443 109045 -118508 -275187 -375941 -391367
35541 -391367 -338781 -330974 -436351 -495624 -208752 499217 1270622 1589461 1251775 508617
35531 508617 -193348 -527731 -430663 -79344 279271 563856 872384 1197860 1302731 1078859
35521 1078859 855704 985466 1197948 863872 13501 -459657 12801 745394 668715 -126223
35511 -126223 -484170 125016 816000 589221 -222887 -489010 88293 658990 519046 -24565
35501 -24565 -319436 -291896 -278150 -339243 -272610 -135460 -253210 -684548 -1057072 -1034270 -689706
35490f89706L53734J37114j38214l34248l00995r327L02274L39198R7399j70979
35480d13750k78215j93214R7480N33601Q02781N58641o8454m76307l03978R8964
35470C57549J65482j29919l42583k67849j54969j77570j32555J25855L26744J93765
35460c6050m6981K4183L52645M80553K33068r5788k60398l34447l79093k68627
35450c30935j0656J40719P8695K978K0006l3501j90872k16603q4269r5412k44322
35439i64172n2968N48252Q23117L19505k70419j38242L16776J97320k95916k03403
35429B79850M45558N84516n7175m40244J7733M40447o7o65970n27830J46903K92329
35418E16050k39374n64536k13279K87828L57050J09030n1904m0124j2593o574
$$ plain form
35490 -689706 -335972 -198858 -337072 -671320 -972315 -981642 -679368 -340170 -242771 -413750
35480 -413750 -691965 -885179 -787699 -254098 548683 1107324 1038870 562563 258585 357549
35470 357549 523031 393112 50529 -217320 -372289 -549859 -682414 -556559 -229815 -36050
35460 -36050 -83031 -58848 293797 774350 1007418 911630 651232 316785 -62308 -330935
35450 -330935 -341591 -200872 -122177 -119199 -99193 -132694 -323566 -540169 -624438 -719850 -964172
35439 -964172 -1017140 -468888 354229 673734 403315 265073 581849 779169 483253 279850
35429 279850 725408 1309924 1252749 812505 830238 1270685 1270618 604648 76818 223721 516050
35418 516050 276676 -287860 -501139 -213311 143739 252769 200865 160741 148148 141574
35408A41574P8392K36142K72479N6290j82845m1221M11095M91943j64438q50454
35398D48957o32916K32162O07537J79832j70722Q6540L39119P3363j74866J34720
35388A123726M87636K14794l04048l14709L8251J02608j04649q7291J54293K54736
35378A565347K39360L19142L58941L51371P99785J643034J548037l49367k571985
35369C903665k820913j115451L11757K39940k65800j29224R4982k95267o45231
35360g21542j39881O34248N96778j00100m37916j54558Q3398q6291k48507l166
35350e77537M19247M99307R1630l67923l23703J80630M62462J48439k08575k1083
35340C02894K53075j53965q07230n37036N72934J048441K27974p34414o72430
$$ plain form
35408 141574 219966 456108 728587 784877 602032 560811 971906 1463849 1299411 448957
35398 448957 -183959 48203 655740 835572 664850 751390 1090509 1163872 989006 1123726
35388 1123726 1611362 1826156 1522108 1207399 1245650 1348258 1243609 1156318 1310611 1565347
35378 1565347 1804707 2123849 2482790 2834161 3633946 5276980 6825017 6475650 3903665
35369 3903665 1082752 -32699 279058 518998 253198 123974 218956 -76311 -721542
35360 -721542 -861423 -227175 369603 269503 -168413 -322971 -239573 -325864 -574371 -577537
35350 -577537 -158290 341017 432647 64724 -258979 -78349 384113 532552 323977 302894
35340 302894 555969 402004 -405226 -942262 -369328 679113 907087 172673 -499757
35331d99757J2719L43641K26538L1255k94437p10277n57458M07445J199478Q88341
35321A047488L0890k56860k5113r5435m57714l80073J33909K81194j59066m93578
35311c74358k75047J34648L04247K65618J76404P6732N2311J36930J08246j66540
35301D39191l82472k73504j15242j97619k13943J41307M22608J17602l40972k09304
35291f12348K72747K84433j38591k28017Q1905O2100m11989n64803n8721M43497
35281h69787L75624J1054j88883j58307N1998L56260L48867k06072o15985m8021
35271i43252R17288Q24969l63439r92978k28539O71203M26532l40786l99784Q9019
35261c39767K34148J37044M51436Q44724M39509n13001q46496k89701K37480J79670
$$ plain form
35331 -499757 -487038 -143397 83141 114396 -180041 -890318 -1447776 -1040331 159147 1047488
35321 1047488 1078378 821518 796405 700970 243256 -136817 -2908 278286 119220 -374358
35311 -374358 -649405 -514757 -210510 55108 231512 308244 360555 497485 605731 439191
35301 439191 56719 -216785 -332027 -529646 -743589 -602282 -179674 -62072 -403044 -612348
35291 -612348 -339601 -55168 -193759 -421776 -339871 -277771 -689760 -1254563 -1313284 -869787
35281 -869787 -494163 -483109 -671992 -830299 -778301 -422041 -73174 -279246 -895231 -943252
35271 -943252 -25964 799005 435566 -557412 -785951 -114748 311784 -29002 -428786 -339767
35261 -339767 -105619 31425 482861 1327585 1767094 1254093 407597 117896 355376 535046
35251E35046j8638J772o2965l49523m10972m8019K58244J55710n3421r0208k01162
35240b84136n21819n92843q7926M95212N04220J15630k403K41596L21449M9155
35230B38135j08747J72488N11380L75621j38641m60157l27610o0175k9567j66573
35220F154j54845O2313K07306Q4824j34016j47831O5994K24838J16180j27966
35210B02951k13368p9627K5259q9499k62401k12671K0346J28189L4596K9270K54506
35199a62449L77089P2271l90993m34955N0488N86935P37500N12886J50514j54439
35189A344847k48471r5699N6427r6582m35166m94909j45990J70042Q6766j48640
35179g375q8753K16199L04982j3529m05520m62802j71063J49810K33661R7337
$$ plain form
35251 535046 516408 518180 455215 105692 -305280 -353299 -95055 60655 7234 -82974 -284136
35240 -284136 -805955 -1398798 -1486724 -991512 -487292 -371662 -374065 -132469 188980 238135
35230 238135 129388 301876 813256 1188877 1050236 590079 262469 202294 172727 6154
35220 6154 -148691 -86378 120928 205752 71736 -76095 -10101 214737 330917 202951
35210 202951 -10417 -90044 -64785 -154284 -416685 -629356 -609010 -480821 -446225 -416955 -162449
35199 -162449 214640 286911 -104082 -539037 -488549 98386 835886 1348772 1499286 1344847
35189 1344847 1096376 1000677 1057104 960522 525356 30447 -115543 54499 141265 -7375
35179 -7375 -96128 120071 425053 411524 6004 -456798 -627861 -478051 -244390 -147053
35169a47053p0623j44331j20378r745J72342K97102K11370J6717J0520K03089
35159D19010J99752j82514n14976l61198K4415J06512p4284o6656J40357J41541
35149a68041n9545j6833K81660K86071j44773m02769j05202K85850K53435J4257
35139B24110J4546J65980J23457r0164k33987k63267j72931J71828O36293P03943
35129A279808K24327k05125j13659J04355p1508l53274k13223Q8964m2112m00059
35119B98494k97680J54901J65463l29947m59867J27454O14577K99325l04266k82503
35109a4049L43971P69181N41804l5217m63996n21536k46553J55011L80071K57439
35099A166126n9665k61003k34442j67383k88249n37911n51990q8629N33241O87924
$$ plain form
35169 -147053 -217676 -362007 -482385 -492130 -319788 -22686 188684 205401 215921 419010
35159 419010 618762 436248 -78728 -439926 -415511 -308999 -383283 -449939 -309582 -168041
35149 -168041 -227586 -244419 37241 323312 178539 -224230 -329432 -43582 209853 224110
35139 224110 238656 404636 528093 437929 203942 -59325 -232256 -60428 575865 1279808
35129 1279808 1504135 1299010 1185351 1289706 1218198 864924 651701 740665 698553 298494
35119 298494 814 155715 321178 -8769 -468636 -341182 273395 572720 268454 -14049
35109 -14049 329922 1099103 1640907 1605690 1141694 620158 373605 528616 908687 1166126
35099 1166126 1106461 845458 611016 443633 155384 -382527 -934517 -1023146 -489905 198019
35089A98019K66936r0293J09063M39347J84972n15744q26460m49062K1985J12994
35079e48243J21103M04833O32313K81160m52036p91701l44430M59084Q74904N75860
35069A212847j04884n28956l95262n3201l7153l20585l47327J12244N32453L43281
35059D13457k31108m55809q9027L23100K32427j66962k27300K55607P39826O34537
35049A428748O7180l28219k88673j77131k81396l38864o6621K66458K75051J28657
35039F85190K01958L14997L3676m17777l75435J12166K52593j62071l47439J08839
35029D06697M23748r5364p49362m54905M70189P14977k851n37848j34580M65600
35019E06301K76072m24037n99786n235N78206N08705J9579k90478k12885J6851
$$ plain form
35089 198019 464955 374662 483725 923072 1108044 592300 -234160 -683222 -661237 -548243
35079 -548243 -427140 -22307 610006 891166 439130 -352571 -697001 -237917 636987 1212847
35069 1212847 1107963 579007 183745 130544 93391 -227194 -574521 -462277 70176 413457
35059 413457 182349 -273460 -362487 -39387 193040 26078 -201222 54385 794211 1428748
35049 1428748 1495928 1167709 879036 701905 420509 81645 15024 281482 556533 685190
35039 685190 887148 1202145 1235821 818044 442609 554775 807368 645297 297858 406697
35029 406697 830445 735081 -14281 -469186 1003 715980 713129 175281 40701 506301
35019 506301 782373 358336 -241450 -246685 331521 840226 859805 569327 356442 373293
35009C73293J20588K8236j27123j29291J12983L97727L75587l8940m91192n44355
34999G7513j67751K54903L78466K09879m6815k74786m42668m40692j33503L90889
34989a94565P69638O68289J27315m24774n33706j57020K46972J75479l08514n72250
34979b03136j83738M61656N93562J12982k23723J43643P18800N72162l35145r98780
34969F58283o80616J18857L87501k6734l54305j37710J60594L1086k36886j24810
34959b04740J55608J9270l96179l49442K53177O07833K86143r4527M3234K78951
34949E99328K8700l43468j67285K61851J17873m84861n85468L8965M96642K35826
34939A98103j67305j08365J13312O2984K4063L22199M94893L9681n13354k81077
$$ plain form
35009 373293 493881 522117 394994 265703 378686 776413 1152000 1113060 621868 77513
34999 77513 -90238 164665 543131 753010 706195 431409 -11259 -451951 -585454 -194565
34989 -194565 575073 1243362 1370677 945903 412197 255177 502149 677628 369114 -203136
34979 -203136 -386874 74782 668344 781326 557603 701246 1420046 1992208 1657063 658283
34969 658283 -22333 96524 484025 457291 102986 -34724 125870 156956 -79930 -204740
34959 -204740 -49132 -29862 -426041 -775483 -522306 85527 371670 277143 320377 599328
34949 599328 628028 284560 117275 379126 496999 12138 -573330 -534365 -37723 198103
34939 198103 30798 -77567 35745 98729 122792 444991 939884 979565 466211 185134
34929A85134M92525O78053l1731o57184m11619K29612L85080J1878k85357k42160
34919C54231j05605l4827Q3663K44592K26733j8668k32954k27841j23194p7672
34909H8458m3045L2070n44k12864l03350N1112N92352O45214R641o69276o71360
34898d81592q8852L59550K48076j54818l65595k53528m4599M1978K4680O7685
34888f47015K20482L08313J59293j13693k39054j77041j27589j28249P439K50547
34878d86567K72317O237j45860L3222J81433N208j81135q5527p9789m97913p76951
34867a755325k33591O27720O81597m6730l58998K19915P17040L11258m16707m90123
34857g43944M8246M55499M09446J34824j18426j60985J32609M54148K09923n32030
$$ plain form
34929 185134 677659 1355712 1323981 666797 255178 484790 869870 881748 596391 354231
34919 354231 248626 213799 297462 542054 768787 750119 517165 289324 166130 88458
34909 88458 45413 77483 76939 -135925 -439275 -388163 204189 849403 859044 189768 -481592
34898 -481592 -570444 -210894 37182 -117636 -483231 -736759 -781358 -739380 -714700 -647015
34888 -647015 -426533 -118220 41073 -72620 -311674 -488715 -616304 -744553 -737114 -486567
34878 -486567 -214250 -208013 -353873 -320651 -139218 -134010 -315145 -400672 -480461 -978374 -1755325
34867 -1755325 -1988916 -1361196 -679599 -726329 -1085327 -865412 -148372 162886 -253821 -743944
34857 -743944 -695698 -240199 169247 304071 185645 24660 157269 611417 821340 289310
34847B89310q73029l77012J74981k516m46340k83825K79226L64929o7869k34708
34837a176853J08497L76919K60713J47942K86685L66065J68406n7518j09890j27586
34827B43380j72577o9143J50731J61240r2716k12297N4623M16708M45180Q3296
34817A008425l76450n88615m06561n9520J7811k23302k71644J57111N18986K27737
34807C978k87100j35135N88559Q66469L09014l39568m68075l93489m74117l57208
34797f86672K38112P23960M17879l52470o72504k92288K07352L30930J60421n521
34787F9199k3462R3782K24052J98933K1979q9999n7570j17978m11608o11736k96593
34776a001001M20722R29785P75208J13599m42124l81954J80934N55234K44875
$$ plain form
34847 289310 -583719 -960731 -785750 -788266 -1234606 -1518431 -1239205 -874276 -942145 -1176853
34837 -1176853 -1068356 -691437 -430724 -282782 3903 369968 538374 480856 370966 243380
34827 243380 70803 1660 152391 313631 220915 8618 63241 479949 925129 1008425
34817 1008425 631975 43360 -363201 -422721 -404910 -628212 -899856 -742745 -223759 3978
34807 3978 -283122 -418257 170302 1036771 1345785 1006217 538142 144653 -329464 -686672
34797 -686672 -448560 275400 693279 340809 -331695 -623983 -416631 -85701 74720 69199
34787 69199 45737 139519 363571 562504 584483 494484 436914 318936 -92672 -704408 -1001001
34776 -1001001 -580279 349506 1124714 1238313 796189 414235 595169 1150403 1395278
34767A395278l74888n08717m4457L11204J14689k05398j36310J11984R4509m9603
34757G08291R5454L92924L08700k14531o46897o30363l25715K4126L71444O01244
34747F84677M58506m6500m90029n22070k84491j42633j65755j02422J78702M40440
34737H425L75743N9341r5873J03076L29291K07334j02429j47180R8983K24939
34727A061650Q6584k6320l7125k70448p11908p26800j3935P06576N97828r7935
34717E68167m55293j78704J91393K15534m601k46235l78334k14674K25007M08659
34707A30919o4106o21783l51035N54850R30468L66431k23775j21635J52324q0847
34697F71811m84499m39915j78247k23170l09110R2485O05193M39731j88568l02482
$$ plain form
34767 1395278 1020390 511673 467216 778420 893109 687711 551401 663385 757894 708291
34757 708291 803745 1196669 1505369 1290838 643941 13578 -312137 -288011 83433 684677
34747 684677 1143183 1096683 606654 84584 -199907 -342540 -508295 -610717 -432015 8425
34737 8425 384168 443509 347636 450712 780003 987337 884908 737728 836711 1061650
34727 1061650 1148234 1121914 1084789 814341 102433 -624367 -638302 68274 666102 568167
34717 568167 112874 -65830 125563 341097 336496 90261 -288073 -502747 -277740 130919
34707 130919 66813 -554970 -906005 -351155 579313 945744 721969 600334 752658 671811
34697 671811 187312 -252603 -430850 -654020 -963130 -870645 -265452 174279 -14289 -316771
34687c16771K27699M92340R9011k44372n0231J57004p0664k32994J39754M81859
34677F82635R8513n45952m79028K16387N43154J49314k75631k28869o3798j57083
34667f0358k22644R2750N15637N42556J62344k38037m28616m41942l22737r1914
34657d92961J45857K68240K20806l4745m45081o68168k92718N35490J033212O55549
34647I25481j68553n36885j78789L13776L29629n3808l21325k15679L8930J29030
34637B61807M5736j2066O951k5146r7728j2233K12467K17105j33594l98363k05041
34626a40105O7107j32181n00091k60855M72742O75693k4091p16986o06278j21208
34616a286253K5524M5348M31689P82074L75285m46399o26120k3363L94152Q2159
$$ plain form
34687 -316771 -89072 403268 502279 257907 207676 364680 294016 61022 200776 682635
34677 682635 781148 235196 -243832 -27445 515709 665023 389392 160523 96725 -60358
34667 -60358 -283002 -190252 325385 867941 1030285 792248 363632 -78310 -401047 -492961
34657 -492961 -347104 -78864 141942 107197 -337884 -1006052 -1298770 -763280 269932 925481
34647 925481 756928 220043 41254 355030 684659 630851 309526 93847 132777 261807
34637 261807 307543 295477 302428 277282 179554 167321 379788 596893 463299 64936 -140105
34626 -140105 -72998 -205179 -705270 -966125 -493383 182310 158219 -558767 -1165045 -1286253
34616 -1286253 -1260729 -1215381 -783692 -1618 373667 -72732 -698852 -722215 -328063 -245904
34606b45904l69799l22988J9830K15089L05346M30995L22729k11005o81923m33733
34596i71363L90892R19136O13755j06467m51151k24083N6735k5879j97892m070
34586c87L51596K55659k40423l36589K48467P00959L53661k25677j90528J57466
34576A074204o0954p07037p92040j23453M08120K92041K4429K5130m012k51736
34566a15308l05597J8007K04531o7089l21790j16622K23556K40808O2912n1325
34556b27917k39417n31053m47582K39229Q88364Q02057K07949j98005k51994k30968
34546A0663j76479K0285J86798J42524R7969K18984J65933l07719o77915l11760
34536f30717M55677O78326J20402m87241n02872p9419K45833K00947n6862j44562
$$ plain form
34606 -245904 -615703 -938691 -918861 -703772 -398426 32569 355298 144293 -537630 -971363
34596 -971363 -580471 338665 952420 845953 394802 170719 227454 201575 3683 -387
34586 -387 351209 606868 366445 29856 278323 979282 1332943 1107266 916738 1074204
34576 1074204 1013250 306213 -485827 -609280 -201160 90881 115310 140440 136428 -115308
34566 -115308 -420905 -402898 -198367 -265456 -587246 -703868 -480312 -239504 -176592 -227917
34556 -227917 -467334 -998387 -1445969 -1206740 -318376 483681 691630 493625 241631 10663
34546 10663 -165816 -145531 41267 183791 281760 500744 666677 358958 -318957 -630717
34536 -630717 -175040 503286 623688 136447 -366425 -445844 -200011 936 -55926 -200488
34526b00488J46792M99161L53942k66309o26694k71513L22055M87929K67450N0525
34516G62850j62687m92273o22682k61772J80082J19563k53964k88671J09815M82923
34506d26816O15130O10430M04992n9310l96292k54309M006j39005m19450k79089
34496c39713M0414p6077l62115m4363O43968O55445p1422l97358J01023M02644
34486E52446j59959o94341k47440N76972O07141o8001m29705k02838l2097j78219
34476b76041j25340L94982Q45119O53441n231n21200o06658m38444k18518P6289
34466b21601M24058M90818j3179p14051p83827l5652O53926M86927j24491k35963
34456g3035J79155L30536k5942l17539k58020k01467k29891P3605O23421O39697
$$ plain form
34526 -200488 -53696 445465 799407 533098 -93596 -365109 -43054 444875 712325 762850
34516 762850 600163 107890 -514792 -776564 -596482 -476919 -730883 -1019554 -909739 -426816
34506 -426816 188314 798744 1203736 1144426 748134 493825 497831 358826 -60624 -339713
34496 -339713 -299299 -375376 -737491 -781854 -137886 517559 446137 48779 149802 552446
34486 552446 392487 -301854 -549294 27678 634819 566818 137113 -65725 -97822 -276041
34476 -276041 -401381 -6399 838720 1492161 1486930 965730 359072 -79372 -297890 -221601
34466 -221601 202457 693275 680096 -33955 -817782 -853434 -199508 287419 162928 -73035
34456 -73035 106120 436656 410714 93175 -164845 -366312 -596203 -522598 100823 740520
34446G40520o1389n64719k49003K37165J12175k84429k34497R8674J22843l4553
34436a17213J63126N91124O67562L60151J00907p0361m05067o89883m90912m0368
34426F9066J0988l01187k68453L07448P70765O11037Q3758l48955n47194m83441
34416i6168j22208K84387L32841Q1787K681J79630J50356k57044n51941l62295
34406c57974k8675k3327k39250k85010j17158M9786J67150K67000J96518j36043
34396e06983m19315k64640K05747M75380L20202L9191m0340K1095j0681j26815
34386c07159q3131K20217N35565N23562J50732k72262m48839l74342k16718p2487
34376c44862L8562O9397J4849J333J27110K81480L06609K59178K85988L03524
$$ plain form
34446 740520 679131 114412 -134591 102574 214749 -69680 -304177 -205503 -82660 -117213
34436 -117213 45913 637037 1304599 1664750 1765657 1695296 1290229 600346 109434 69066
34426 69066 80054 -221133 -489586 -182138 588627 1199664 1283422 934467 387273 -96168
34416 -96168 -218376 66011 398852 480639 483320 662950 813306 556262 4321 -357974
34406 -357974 -386649 -409976 -649226 -934236 -1051394 -1001608 -834458 -567458 -370940 -506983
34396 -506983 -926298 -1190938 -985191 -509811 -189609 -150418 -190758 -169663 -180344 -307159
34386 -307159 -390290 -170073 365492 889054 1039786 767524 318685 -55657 -272375 -344862
34376 -344862 -306300 -236903 -222054 -220721 -93611 187869 494478 753656 1039644 1343168
34366A343168Q0501l52195o47686n70140k55788K6616J77003K41111K58233K27697
34356E28520J21684r6311l60677m61170k90535p0397p5934j83663l1352L60606
34346e59229N37105K98195J5149K3168J07624n2403k83648k25820J2916M2791
34336h4152j03733m0151K14450J69628k81968n44003j88511L46200L91370K0246
34326a00624j49979R2125L66242L78763K30211K0862l10124o23859n67371j43620
34316h07374J49407K6063j52427R255K81610K14114r7096j74751O2372K26524
34306b62303J33302L7269J20915J97787Q6611p0508o0866P3555J40360O5416o2812
34295C98726j08973j3396J03990K4580k35491l15421O426L76298K98893r6403
$$ plain form
34366 1343168 1423669 1071474 423788 -146352 -402140 -375524 -198521 42590 300823 528520
34356 528520 650204 553893 193216 -267954 -558489 -628886 -704820 -888483 -919835 -559229
34346 -559229 -22124 276071 291220 314388 422012 369609 85961 -139859 -126943 -84152
34336 -84152 -187885 -228036 -13586 156042 -125926 -669929 -858440 -512240 -120870 -100624
34326 -100624 -250603 -158478 207764 586527 816738 837600 527476 -96383 -663754 -807374
34316 -807374 -657967 -631904 -784331 -775076 -493466 -279352 -376448 -551199 -488827 -262303
34306 -262303 -129001 -91732 29183 226970 313581 243073 182207 255762 396122 461538 398726
34295 398726 289753 276357 380347 404927 169436 -145985 -139559 236739 535632 439229
34285D39229k08997J18244L79852K17883r7763k23876k47391l02579j80046K25957
34275A20513M77022J45704m38290n62379j30658K60328K31802P0845J37823K95569
34265F08279K14399n2087j44381M9061K22764R1386k25062m02195l62844l00553
34255c01233k91144j79150N6748J50244j4770j20868R3275L46977K64618M3652
34245D8349R9771K61153N4915l07642j36889M50971M76990l07559q16769k87012
34235d63722M34925K40377l93703j87631P48151R63159m3452r72488o49754L14900
34225i238N61343q7463o23218m11755J13636L05994J68007J20792L03775M28402
34215H70275K26030j91172m65509l81240m4891K51440K56690o4012m24525l79078
$$ plain form
34285 439229 230232 348476 728328 946211 848448 624572 377181 74602 -105444 120513
34275 120513 597535 743239 304949 -257430 -388088 -127760 104042 174887 312710 608279
34265 608279 822678 770591 626210 675271 898035 989421 764359 362164 -680 -301233
34255 -301233 -592377 -771527 -714779 -564535 -579305 -700173 -606898 -259921 4697 48349
34245 48349 148120 409273 464188 156546 19657 470628 947618 640059 -176710 -463722
34235 -463722 -28797 211580 -182123 -369754 378397 1341556 1298104 325616 -324138 -9238
34225 -9238 552105 464642 -158576 -570331 -456695 -150701 17306 138098 441873 870275
34215 870275 1096305 905133 439624 58384 13493 264933 521623 457611 33086 -345992
34205c45992J60024O35256M36706k28222n35641k07552J21231l0649k22323P7136
34195a40026M77131K60230l89213o25907k53441Q1837J3905p6536J11746K81658
34185b58616J50537n0940m4505L4491j9144q7484J2037K06593L37338L53262K16393
34174H49962m0153j23997J79936M66640J26838o04630p78290j48819L81580J67823
34164D76890k14588p0249K05521n7496m81428k78291K59310J88036l78206l61637
34154g12138L93614P23049N4181n83324k07782N50748N42448n9745j90038L00164
34144H11177M89709m4157o05767n08655M8585M98430N89202K91930l17918p80446
34134D72090m90084L90583Q39922K82353n43994o12521m3770K24739q5420l15587
$$ plain form
34205 -345992 -185968 449288 885994 657772 122131 -85421 35810 5161 -217162 -140026
34195 -140026 337105 597335 208122 -417785 -671226 -589389 -575484 -652020 -540274 -258616
34185 -258616 -108079 -159019 -203524 -169033 -188177 -275661 -263624 -57031 280307 633569 849962
34174 849962 809809 685812 865748 1332388 1459226 854596 76306 -72513 309067 476890
34164 476890 262302 192053 397574 340078 -141350 -419641 -160331 27705 -350501 -712138
34154 -712138 -318524 404525 458706 -124618 -332400 218348 760796 701051 511013 811177
34144 811177 1300886 1256729 650962 142307 190892 689322 1278524 1570454 1252536 472090
34134 472090 -17994 372589 1212511 1494864 950870 338349 294579 519318 433898 118311
34124A18311o5009J86526m9742m38432l47415J79478M99721K85701q5225j02534
34114A81380K26511M62870L28293K043j97331k26356k28631j73003Q0174L57709
34104H13659K54624k05464m55914k36461p0071m06524p53571l75581M49135P33936
34094b52232K61440j42586P0343M40121L75303o48k67818l35376k55620J4811
34084i2262K99951K18378j39499j69104K41855L84850r7740m95139j74395L08199
34074B85094J41880l29493k20140L13366L15343l12031o28873k33094J44581m6093
34064e69460k89871K4031N43378N32983J4940l14110o8299M20346N91798K41803
34054A127539l33856o09932l18533K51678N41145L26693q9759k91403j71757P1197
$$ plain form
34124 118311 53302 239828 190086 -248346 -595761 -416283 83438 369139 283914 181380
34114 181380 407891 870761 1199054 1201097 1003766 777410 548779 375776 455950 813659
34104 813659 1068283 862819 406905 170444 100373 -306151 -1059722 -1435303 -986168 -252232
34094 -252232 9208 -133378 -63035 377086 752389 751741 483923 148547 -107073 -92262
34084 -92262 207689 426067 286568 117464 359319 744169 646429 151290 -23105 285094
34074 285094 426974 97481 -122659 190707 506050 194019 -434854 -667948 -523367 -569460
34064 -569460 -859331 -835300 -291922 241061 256001 -58109 -126408 293938 885736 1127539
34054 1127539 793683 183751 -134782 116896 658041 984734 894975 603572 431815 503012
34044E03012K14287K19577J92404J37088j16491n45603o73946j44486N25094M40602
34034G51538l13496o46385j04454L95118O8235m52134k34654L84824M87953J66644
34024E03189J56714L61975J17455l80100l31624J27856J02774l92823m36876N2941
34014a18519J42416l18447l48039K93811N46030p527k89850L01175O84840m905
34004H80985p77503m16849M71244N59015k4764j94952J29279J43704k29540l36883
33994B03736j16567r6208k79267k29610m4156j12412j76077K25269O56405L40094
33984C71207m36137p02551l78389j73535j24305L46124R80911Q36361J0185l04750
33974D25121K02417M41370j48165o32515k41278L75788L96259J15424N2952j12711
$$ plain form
34044 503012 717299 936876 1129280 1266368 1149877 604274 -69672 -214158 310936 751538
34034 751538 438042 -208343 -312797 82321 150556 -301578 -536232 -151408 336545 503189
34024 503189 659903 1021878 1139333 759233 427609 555465 658239 265416 -171460 -118519
34014 -118519 23897 -294550 -642589 -348778 197252 189725 -100125 201050 885890 880985
34004 880985 103482 -313367 157877 716892 692128 497176 626455 770159 540619 203736
33994 203736 87169 -9039 -288306 -517916 -562072 -674484 -850561 -625292 31113 371207
33984 371207 -64930 -767481 -1145870 -1319405 -1443710 -1097586 -116675 719686 729871 425121
33974 425121 627538 1068908 920743 288228 46950 422738 818997 934421 987373 874662
33964H74662o45768p79454J15695J134024R26833k69145r75745n93091N7749K51791
33954I7551K22032K97309K20749k14775n81889l94050J55781M58815K49948j98703
33944C12768m71747l62916M8797M68796N65181K32550k67638m97668k71589J09389
33934a34077J88777l6707q5668K61302N18204J97250l41664l68178N4114J72576
33924D25929j56342j94080L53874O81804J65396n10649l53023M00110P02829K94836
33914A810684j45589k73891m52489p71944o96189j8449O26302O38915K36662o6075
33904H87937k12485l57156l28564P6504N30697M91283k927l39604j73093J34503
33894G07095M8486m10898o71563l00053M24558P37373K55845m99856o76443j23647
$$ plain form
33964 874662 228894 -550560 -434865 699159 1625992 1356847 381102 -211989 -154240 97551
33954 97551 319583 616892 837641 622866 40977 -353073 -197292 261523 511471 312768
33944 312768 -158979 -521895 -473098 -4302 560879 793429 525791 28123 -243466 -134077
33934 -134077 54700 17993 -67675 193627 711831 909081 567417 199239 253353 425929
33924 425929 269587 75507 429381 1111185 1276581 765932 412909 813019 1515848 1810684
33914 1810684 1665095 1391204 938715 166771 -529418 -547867 78435 717350 954012 887937
33904 887937 675452 318296 -10268 66236 596933 1088216 1085289 745685 572592 707095
33894 707095 755581 344683 -326880 -626933 -202375 534998 790843 290987 -385456 -509103
33884e09103M66171N02254J76949l905K7456N887q6763l3325J32198J23080r4832
33873G06067k07934n1675J48850J56004L7694k7313q889L8957Q3656N9057p6899
33862H57575j77392p0073Q1680n1740l61986l46617N1994K11206j89054n09813
33852e04220p9765O75894Q08116K62169j58375j40661k01665n45914n84141j7927
33842d86489M75553K84616j11374O3983N79137N75090k1896l88696r3788L38830
33832A214966L37500N2410r7042q8457j05906q0187J23955K85065N5236m23220
33822A274320n44073k8439N88762N46552j49007o50827l24320M13738O41086J53412
33812A921204l30207k16361K26206M14014K65049O7155j17642m03922o12217l69420
$$ plain form
33884 -509103 -42932 459322 636271 632366 659822 665709 578946 545621 677819 800899 706067
33873 706067 498133 446458 595308 751312 789006 761693 752804 791761 875417 934474 857575
33862 857575 680183 610110 691790 640050 278064 -68553 -16559 194647 5593 -504220
33852 -504220 -583985 91909 900025 1162194 1003819 863158 661493 115579 -468562 -486489
33842 -486489 -10936 273680 162306 226289 805426 1380516 1358620 969924 876136 1214966
33832 1214966 1552466 1604876 1507834 1419377 1313471 1233284 1357239 1642304 1697540 1274320
33822 1274320 730247 701808 1290570 1837122 1688115 1037288 712968 1126706 1767792 1921204
33812 1921204 1590997 1374636 1600842 2014856 2279905 2347060 2229418 1825496 1213279 843859
33802H43859L07597R09980R75905N05101j17809m08116j32119L64477L67611l27288
33792C289198r53801o42234L91298J049629P23132o6719m57966k06071K81136
33783C407602M79553J87709k82967l31804K27228P86234O80535J55585K638L15612
33773E627925L89590l3108k77038J39955O77609O25848J57212j12018j12099j73459
33763F910417k59540q6359J89553J03064l54283o88300o16981l39464j01821N0371
33753D806657Q2057m8916j89363j15855J32295L26488L80667L26698J11391k38151
33743E573968m30078k92454j37562k69479l66564L0900O15456O65684K37756J26445
33733E754072N25936O73283J71835k53644P4849O36724N10149k19412o76928m81683
$$ plain form
33802 843859 1151456 2061436 3037341 3542442 3424633 3016517 2884398 3248875 3616486 3289198
33792 3289198 2335397 1693163 2084461 3134090 3857222 3790503 3332537 3126466 3407602
33783 3407602 3887155 4074864 3791897 3460093 3687321 4473555 5154090 5309675 5312313 5627925
33773 5627925 6017515 5984407 5707369 5847324 6524933 7150781 7307993 7195975 7083876 6910417
33763 6910417 6650877 6564518 6754071 6857135 6502852 5814552 5197571 4858107 4756286 4806657
33753 4806657 4888714 4839798 4650435 4534580 4666875 4993363 5374030 5700728 5812119 5573968
33743 5573968 5143890 4851436 4713874 4444395 4077831 4108731 4724187 5389871 5627627 5754072
33733 5754072 6280008 6953291 7125126 6871482 6946331 7583055 8093204 7873792 7196864 6715181
33723F715181k0581L30950M92801L47407r5353k91169K59746J023170R08937r5737
33713I575352p06758j65992O09468L96724n19163q33328j46297O04901O08711
33704I423618J43759j61024k56641m06271n30305l86738j23598j09977l14571
33695G278252l23447P962L28482L18975J03079m3651j14801k57627m28760m57677
33685F410787l67265l40016l79372l01328j19121j20530l93632n69343l32346
33676C487834K7032k1408m16358n23534q2653L51835K16366k13650k50450J62281
33666B737295L98193J15020k97791l96753k91072k63271k28322k0752J11520j31432
33656A732635m32148j99931M27608O27592J24148l25196q4829L60882K11832l31734
$$ plain form
33723 6715181 6694600 7025550 7518351 7865758 7770405 7479236 7738982 8762152 9671089 9575352
33713 9575352 8868594 8702602 9312070 9708794 9189631 8356303 8210006 8814907 9423618
33704 9423618 9567377 9406353 9149712 8743441 8213136 7826398 7702800 7592823 7278252
33695 7278252 6954805 6962767 7291249 7610224 7713303 7669652 7554851 7297224 6868464 6410787
33685 6410787 6043522 5703506 5324134 5022806 4903685 4783155 4389523 3820180 3487834
33676 3487834 3514866 3493458 3077100 2553566 2470913 2822748 3039114 2825464 2575014 2737295
33666 2737295 3135488 3250508 2952717 2555964 2264892 2001621 1773299 1752547 1864067 1732635
33656 1732635 1300487 1100556 1528164 2155756 2279904 1954708 1869879 2230761 2442593 2110859
33646B110859m03877J07209M05718R5589k67381j94663J255o1029j05030J93931
33636A882581M71108K49393j92718k65717l7058K502j43396j08558k623k19112
33626A636402n05185k03700N08486O41712p9273o81632l80386L25255N57051K94908
33616B113638M5803q7824k71145l31936k1398M13332N24330K93759j506k53784
33606B423269m16619k99545O6499K31168n8058m37944n33102m67213l46994R3431
33596B54892P61331Q78116J46152n20181l45632J6044l25215q03978l55182N43272
33586B49619N02311l92794o60830Q2143N66071J42060k00143K58193P00484L27051
33576A574165k50659k10006O8444j24616n01946m07838p166J38212L7302l6323
$$ plain form
33646 2110859 1706982 1814191 2219909 2315498 2048117 1853454 1854709 1793680 1688650 1882581
33636 1882581 2353689 2603082 2410364 2144647 2107589 2110091 1966695 1858137 1855514 1636402
33626 1636402 1131217 927517 1436003 2077715 1998442 1316810 936424 1261679 1818730 2113638
33616 2113638 2159441 2071617 1800472 1468536 1447138 1860470 2384800 2678559 2677053 2423269
33606 2423269 2006650 1707105 1773604 2004772 1946714 1508770 975668 508455 161461 254892
33596 254892 1016223 1894339 2040491 1520310 1174678 1190722 865507 61529 -293653 249619
33586 249619 751930 359136 -301694 -219551 346520 488580 288437 546630 1247114 1574165
33576 1574165 1323506 1113500 1181944 1057328 555382 147544 140378 278590 315892 279569
33566B79569j71950l64502j38713N57931Q23710P7829q08285o60846K47668O33757
33556D76168M5375o86299o78607O5689Q65466J024805M50712j56469r0988L21556
33546A637408J65912n26044p08868m1606N38438M04372J03245O1179j49495n32224
33536I52317k29112P18826Q72547j98971q37992k6515P91147L81223O7902J118236
33526C609608K013372J332776J195569L813438O189249L275708l799148p905203
33518I725369n448864r14018K10061j361561j668930j31701P15311L4576n93267
33509E66976l85216j71287l29341l29397j35257j64770j67367K56753N26945Q063
33499c23898n69087k00623N38110M11375l06850l51019L05958N46609J56403O941
$$ plain form
33566 279569 107619 -256883 -395596 162335 986045 1063874 255589 -405257 -157589 476168
33556 476168 521543 -164756 -843363 -777674 87792 1112597 1563309 1406840 1315852 1637408
33546 1637408 1803320 1277276 568408 526802 1065240 1469612 1572857 1634036 1484541 952317
33536 952317 723205 1442031 2314578 2115607 1277615 1251100 2042247 2423470 2491372 3609608
33526 3609608 5622980 6955756 8151325 11964763 18154012 21429720 17630572 9725369
33518 9725369 4276505 3362487 3572548 2210987 542057 410356 1125667 1160243 566976
33509 566976 181760 10473 -318868 -648265 -783522 -948292 -1115659 -858906 -331961 -323898
33499 -323898 -892985 -1093608 -555498 -144123 -450973 -801992 -496034 50575 206978 213919
33489B13919K98906L07266q2516j52686J93500J97858l16271n77730k16710J55906
33479B1442J5694l67275n18962l08880J54128N30739L40761k85198l80830M73503
33469c24878J145443M83686p47771r36776j61812Q0817m99818n78760L40603R92702
33459b06564N02980k22162j53962K47535J32593j99806k2518M12936L41549j84223
33449F48358m44257k06736R7139J49519L8713q7006j64949j28171m314L3546p3662
33438a41820j54132q7813K4552N8692n291j40871j93201J11409O83445Q44138
33428I99108J72779o47956o06714J46187M85008o287n22482m07419m7597Q74r6113
33417e30612M2905L05756M05587L73284L11712J48626m2998K602K02327J12772
$$ plain form
33489 213919 512825 820091 737575 584889 778389 976247 659976 82246 -134464 21442
33479 21442 37136 -330139 -849101 -1157981 -1003853 -473114 -132353 -417551 -798381 -324878
33469 -324878 820565 1304251 556480 -380296 -542108 -461291 -961109 -1539869 -1199266 -206564
33459 -206564 296416 74254 -79708 167827 300420 100614 78096 491032 832581 648358
33449 648358 204101 -2635 94504 244023 282736 195730 30781 -97390 -101704 -68158 -141820
33438 -141820 -295952 -383765 -359213 -300521 -305812 -446683 -639884 -528475 154970 999108
33428 999108 1171887 523931 -82783 63404 548412 542125 19643 -387776 -435373 -434499 -530612
33417 -530612 -487707 -181951 223636 596920 908632 1057258 1014260 1016862 1219189 1331961
33407A331961k78575l95811j7759K95848R6588k90894m09112l28421k34801L783
33397b27193L84994M98722K01334j9339J66779L84682K87079J66537K62309J63305
33387B269209l75834o95454j94574N08235L82333l99521p07909j78538L55548
33378I63495K48638q4327r225L28722L25485j52272o03119n57309j34510J37152
33368D62730j1457k70804k46974p3577j28032k62039M6232O92843Q62041K59352
33358A330315l33713k55117K5178j90171n63782l14876L55601M87778j39125p29267
33348c27179p14618l58913R995M75418R38694Q53574M4355p76690q35020k80707
33338i71091J15398J0560k10621r3503L10881N94578N00709J56150j47081k74757
$$ plain form
33407 1331961 1053386 657575 639816 935664 1032252 741358 332246 3825 -230976 -227193
33397 -227193 157801 656523 857857 838518 1005297 1389979 1677058 1843595 2105904 2269209
33387 2269209 1893375 1197921 1003347 1511582 1893915 1494394 786485 607947 963495
33378 963495 1212133 1127806 1118581 1447303 1772788 1620516 1017397 460088 325578 462730
33368 462730 451273 180469 -66505 -140082 -268114 -530153 -483921 208922 1070963 1330315
33358 1330315 996602 741485 766663 576492 12710 -302166 53435 541213 402088 -327179
33348 -327179 -1041797 -1400710 -1390715 -915297 23397 876971 921326 144636 -690384 -971091
33338 -971091 -855693 -845133 -1055754 -1149257 -838376 -243798 256911 413061 265980 -8777
33328h777k68249j33874J49354L86095K40237k67745o19228m19151O7274K94470
33318e79594J43372q9472k16993k69188j99793O7549L21869K19001j84937m18106
33308a206292k15967J42225K50770R2654j9440J22345L85157M69796K69968M014
33298B95230r6325j49519m13942p15911n16310K41677P99252N20512j68386l21584
33288e25306K30993P24445N68436L3690l04840l15487k37140j96217j14987L0405
33278a06008J10881K8364j00790l6359K48292M04691J03656m24270n79453k18472
33268e69468J19208K1690k16814j85842n5494j50165k35528P3443M72228L41053
33258c85689j56659k18934K81222N13137J0434n43581l67159K21725L27352j74275
$$ plain form
33328 -8777 -277026 -410900 -261546 124549 364786 97041 -522187 -941338 -874064 -579594
33318 -579594 -436222 -525694 -742687 -1011875 -1211668 -1144119 -822250 -603249 -788186 -1206292
33308 -1206292 -1422259 -1280034 -1029264 -936610 -956050 -833705 -448548 21248 291216 295230
33298 295230 198905 49386 -364556 -1080467 -1596777 -1355100 -555848 -35336 -203722 -525306
33288 -525306 -294313 430132 998568 1032258 727418 411931 174791 -21426 -136413 -106008
33278 -106008 4873 33237 -67553 -103912 144380 549071 652727 228457 -350996 -569468
33268 -569468 -450260 -428570 -645384 -831226 -886720 -1036885 -1272413 -1198970 -726742 -385689
33258 -385689 -542348 -761282 -480060 33077 43511 -500070 -867229 -645504 -318152 -492427
33248d92427n05499j30559N38144P22173K45462k98789k96194J30646K86157j45763
33238E3351o03225l86426L35194P22933L92447j89351m68703m19137k41658J1568
33228g93007K51061K55431P4026J12456M88004P00251L32933k72987m93129k81807
33218C73232q2204q0523n8171R0796J63966J2291k42521m09734m18546k89086
33208i40500q6050J14417L05814M95534N23025K00261k46687k67916J96700M16959
33198G11557j50377r45537r82997k08632N23294P16256O85012O87546M54873r5495
33188A395500m34537k19899P2395r5366m14428k66583J80769K17798k09598l86869
33178a60818j2143L13747J01921k15390j5099M89796O07089K49235m5827p1792
$$ plain form
33248 -492427 -997926 -1128485 -590341 131832 377294 78505 -217689 -87043 199114 53351
33238 53351 -549874 -936300 -601106 121827 514274 324923 -143780 -562917 -804575 -793007
33228 -793007 -541946 -286515 -212489 -100033 387971 1088222 1421155 1148168 655039 373232
33218 373232 291028 210505 152334 243130 407096 419387 176866 -232868 -651414 -940500
33208 -940500 -1026550 -912133 -606319 -110785 412240 612501 365814 97898 294598 711557
33198 711557 561180 -384357 -1367354 -1575986 -1052692 -336436 348576 1036122 1490995 1395500
33188 1395500 960963 741064 813459 718093 303665 37082 217851 435649 226051 -160818
33178 -160818 -172961 140786 242707 27317 12218 502014 1109103 1358338 1312511 1240719
33168A240719j94287n20380n43872J2913N69355M34409j73105m40871j15380K58186
33158E27687K13673q6883k74387k44083m4801K65379M62420K62774k01451m12557
33148D67771k00143p514j36396k17785J16392M87552L05562k57994m98750k13381
33138a54686J47328K60342K13505O0511k28123l69398l9111M03624K35769m47043
33128H2718p14659k38800J70900o4209l22363Q4130O36972M61322j54639k19058
33118b77686L18742N49769J49245j93854l5823J64370k7627l03839k40403M6165
33108A49059K63046L74015L42820L8195l01736j67078L13252K99304m30489q61701
33098A8687j85611Q29341Q60269m7114o56748m22712m9806j01608j64717J87532
$$ plain form
33168 1240719 1046432 526052 -17820 -4907 564448 998857 825752 384881 269501 527687
33158 527687 741360 654477 380090 136007 91206 356585 819005 1081779 880328 467771
33148 467771 267628 260114 123718 -94067 22325 509877 815439 557445 58695 -154686
33138 -154686 -7358 252984 466489 527000 298877 -70521 -109632 293992 529761 82718
33128 82718 -631941 -870741 -699841 -764050 -1086413 -1002283 -365311 96011 -58628 -277686
33118 -277686 41056 590825 740070 546216 510393 674763 647136 343297 102894 149059
33108 149059 412105 786120 1128940 1167135 865399 698321 1011573 1310877 880388 18687
33098 18687 -166924 662417 1522686 1475572 818824 396112 346306 244698 79981 267513
33088B67513N13530K35884l44657m74231o5524K61134J40702j00861k7429L22497
33078G28558N85382N26922J71638l43428q40689j085000q92479l41605K11239
33069a279462M42271L76272K91189L07428K29882j08239m95478n44854k15695
33060i96686Q8391L5083j83568j02810L47205O65681M26198p7375j61272K67369
33050C08216M87512j7630p03205o31192J92636P75641M72869k52266o15373m88078
33040d70870k23006J4244K43020L21271J22958j20057j14981J39q9419k64827
33030e81528j24903K96628M92688K48617k6881P0288L54478L60529Q964l16172
33020G82708k85954k4835O1064k00045m92852l86619Q1008M22287L64254J96456
$$ plain form
33088 267513 781043 1016927 672270 198039 132515 393649 534351 433490 406061 728558
33078 728558 1313940 1840862 2012500 1669072 828383 -256617 -1149096 -1490701 -1279462
33069 -1279462 -837191 -460919 -169730 137698 367580 259341 -236137 -780991 -996686
33060 -996686 -908295 -873212 -1056780 -1159590 -812385 -146704 279494 202119 40847 308216
33050 308216 795728 778098 74893 -556299 -363663 411978 884847 632581 17208 -470870
33040 -470870 -693876 -679632 -436612 -115341 7617 -112440 -227421 -227282 -316701 -581528
33030 -581528 -706431 -409803 82885 331502 304621 374909 729387 1089916 1098880 782708
33020 782708 496754 471919 532983 332938 -159914 -546533 -465525 -43238 321016 517472
33010E17472K59096L88652K14348k07695m65411l91402j97416n8949M4795Q0157
33000A83647o0967k66374k38288P0988L47242L38068J25368j09853l08012l90245
32990c08426j94254K27180M71332K42938j66513j80110K65477N54535K22412l24673
32980H09898l30425J67682K98015l35861r25031n85519K70892N26064N5890j83251
32970b31646J96690M06244q9883n98670l62890J75880J75015k08726k17840J53951
32960f01875K57633J1386M370L95710O22566L39330r6968k64563k16621k06986
32950B43982l04130l83282k26805K78287P91124O80499p5891n95145k61898K82724
32940D29465R7867n48198o08683O8329N85441M61733J80496J58852J69295K2297
$$ plain form
33010 517472 776568 1165220 1379568 1171873 706462 315060 117644 58695 103490 183647
33000 183647 122680 -143694 -381982 -310994 36248 374316 499684 389831 81819 -308426
32990 -308426 -502680 -275500 195832 438770 272257 92147 357624 912159 1134571 809898
32980 809898 479473 647155 945170 609309 -315722 -901241 -630349 -104285 -48395 -231646
32970 -231646 -34956 371288 281405 -317265 -680155 -504275 -329260 -537986 -755826 -601875
32960 -601875 -344242 -332856 -328486 67224 689790 1029120 932152 667589 450968 243982
32950 243982 -60148 -443430 -670235 -391948 399176 1079675 1003784 408639 146741 429465
32940 429465 527332 -20866 -629549 -561220 24221 485954 666450 825302 994597 1016894
32930A016894n5959o873j36244m69706n92493l39205j4327J91608L57787L66393
32920C17875J2213l82502k53930K43437L88259O3871j10079R2153J94436J642
32910E67375q9391J2287j32421n40087o09143j95099R1966l026K4958L70167M83492
32899a8922J53147k8448K18021L23142J0080j01522L03571M93459n9521o62385
32889F30622n16536J7514J86579J01930K72558N27284L66465q6677l42828l60407
32879G96504l68771k64207J34290N43626N12928L5102m85775o10475j12827O89526
32869H69921R19099J55764o90808n06779K49884K65943k84248M8382J228100J362095
32859C617353j53469j328592o91971L58630N717j009092q98296J00501L84942
$$ plain form
32930 1016894 960935 954062 817818 348112 -244381 -583586 -597913 -406305 -48518 317875
32920 317875 330088 -52414 -306344 -62907 325352 389223 279144 371297 565733 567375
32910 567375 477984 490271 357850 -182237 -791380 -986479 -894513 -897539 -872581 -502414 -18922
32899 -18922 134225 105777 323798 646940 657020 555498 859069 1352528 1293007 630622
32889 630622 114086 131600 318179 420109 692667 1219951 1586416 1499739 1156911 796504
32879 796504 427733 163526 297816 841442 1354370 1389472 903697 293222 180395 869921
32869 869921 1789020 1944784 1253976 747197 997081 1263024 978776 1027158 2255258 3617353
32859 3617353 3463884 2135292 1443321 1801951 1807668 798576 -99720 781 385723
32850C85723k40992o06119l61123j61040q8674L28781Q46797Q01166L49616P4040
32840A328175j50894n85522o21427K01415R11755M25662n42817n50187K41627
32831F57787N28320Q8732k21272k13574l51620m22483O5251N88641L71029q2890
32821A007921J22159N03767J25948m49075j37640M77882J53613n20815q6390R08599
32811B105969P20483k37305J85420K007800K656732R51411j159472j678728j011880
32802D540430m44248k55599k62131n01372o62036k84091J92150L9512k47399K20529
32792B335745Q22670M36125k11688L45571J446627J362243O09114J002786K030064
32783A0179257J873478J457079L065978N308290M738943K717959M423045R734350
$$ plain form
32850 385723 144731 -461388 -822511 -983551 -1072225 -743444 103353 904519 1254135 1328175
32840 1328175 1177281 591759 -29668 171747 1083502 1509164 966347 416160 657787
32831 657787 1186107 1274839 1053567 839993 488373 65890 131141 719782 1090811 1007921
32821 1007921 1130080 1633847 1759795 1310720 1173080 1650962 1804575 1283760 1197370 2105969
32811 2105969 2826452 2589147 2774567 4782367 7439099 8390510 7231038 5552310 4540430
32802 4540430 4096182 3840583 3578452 3077080 2415044 2130953 2323103 2362615 2115216 2335745
32792 2335745 3158415 3594540 3382852 3728423 5175050 6537293 7146407 8149193 10179257
32783 10179257 12052735 13509814 16575792 21884082 26623025 29340984 33764029 43498379
32775D3498379J2264939J0863006J4954745L2077193N4230442O3041189M7117752
32768B78047645J1029431k9343390n6207486n9270024m3080218k4005887j4822818
32761F2347253j3470081j0716250m912336k117217m191943n761392l663430j417791
32753A6096813j991883k860445j423164K24728m59575j861926j473656k52235
32745E998657k86880r64239o81889l4900l18767q22506l30222L77632O229p75078
32735B168037o10610J36504L32655J59079L16870L57467l39478j021577p32190
32726G66757j0628J45990j6324J52927K41903l06927p97075l37441N33396P08788
32716A081366K41187p9943j19361j69352r3429J93062J62326l93022p10540k89690
$$ plain form
32775 43498379 55763318 66626324 81581069 113658262 167888704 230929893 278047645
32768 278047645 289077076 259733686 203526200 144256176 101175958 77170071 62347253
32761 62347253 48877172 38160922 33248586 31131369 26939426 21178034 17514604 16096813
32753 16096813 14104930 11244485 9821321 10046049 9586474 7724548 6250892 5998657
32745 5998657 5711777 4747538 4065649 4030749 3711982 2889476 2559254 2936886 2943115 2168037
32735 2168037 1557427 1693931 2026586 2185665 2502535 2860002 2520524 1498947 766757
32726 766757 756129 902119 885795 1038722 1280625 973698 176623 -160818 372578 1081366
32716 1081366 1322553 1242610 1123249 953897 860468 1053530 1215856 822834 112294 -177396
32706a77396J81222Q2157k4972M17009P75801L88504j75078k12197j74234n88237
32696D92579p77159n5106P93235O98192Q6023k658K58875P0493l24343j44005
32686A096126L48105L16889p7646p5828J64992q1038o23006o55111k33550p8067
32676A01866j82679M1581M93918N39974K00149k3578j94960o09794q12209k52299
32666f98031M65371L84185j25749J0941O03010M98463l00768n78229j9999L38399
32656E77593L4184j31017K53352M50223N5092k28440K1747J24367l58523o76238
32646A22340j79118M89659M31043j26135l91061k64299j50878q8780J07296K69210
32636B19277J73708M9715J56968K27365o5328m26458l51822M9812K35751M1254
$$ plain form
32706 -177396 3826 85983 61011 478020 1253821 1642325 1467247 1255050 1080816 492579
32696 492579 -284580 -339686 453549 1151741 1237764 1235106 1493981 1564474 1240131 1096126
32686 1096126 1444231 1761120 1683474 1607646 1772638 1691600 1068594 413483 179933 101866
32676 101866 -80813 -39232 454686 994660 1194809 1171231 976271 366477 -445732 -698031
32666 -698031 -232660 151525 25776 36717 639727 1138190 837422 259193 239194 577593
32656 577593 611777 480760 734112 1184335 1239427 1010987 1032734 1157101 798578 122340
32646 122340 -56778 432881 863924 737789 346728 82429 -68449 -157229 -49933 219277
32636 219277 392985 442700 599668 827033 761705 335247 -16575 33237 268988 310242
32626C10242k22256l42444l80090l26364k9338M76222Q45723P34002J67852l82110
32616H51439l74229J80805N68836J83455n73190o97373L4373O78887M08642l67960
32606H93685o54675k47572J39673j8575m28427n45726l19452j06470q1689m4558
32596a413786J90146M53007M45875K05042P7416J87712K18897p9673m19434l34594
32586d69392J30104M69587M14377J99532R6320M3484j00793k27112j30942J33641
32576E58806K68396R7943j96401k83691j11292M114j57153l09280m8861M03224
32566B25805L57262k89705p26528l51464L06207L89334J3481k8512L64338M46728
32556G06946r6750o00279m45205Q3512L81291L70271K82301Q4592l17043o26454
$$ plain form
32626 310242 87986 -254458 -634548 -960912 -990250 -514028 331695 1065697 1233549 851439
32616 851439 477210 658015 1226851 1410306 837116 139743 174116 853003 1261645 893685
32606 893685 239010 -8562 131111 112536 -315891 -861617 -1181069 -1287539 -1369228 -1413786
32596 -1413786 -1223640 -770633 -324758 -119716 -42300 145412 364309 284636 -134798 -469392
32586 -469392 -339288 130299 544676 744208 840528 884012 783219 556107 425165 558806
32576 558806 827202 925145 728744 445053 333761 337875 180722 -128558 -177419 225805
32566 225805 583067 293362 -433166 -784630 -478423 -89089 -75608 -104120 260218 706946
32556 706946 610196 9917 -435288 -351776 29515 399786 682087 766679 449636 -176818
32546a76818m74868k1886K45010J98873J21445J47559J06892q0977k48106k59780
32536d42656j35655J11754M20466M83301M7708n31125n45779O4817N06926K62089
32526B41846j20214Q4413N63791M56685k02439m96735j30860R2018l41336p26974
32516e79805k57457O60888J003693N50219q8206m78920n94089l48222K10372M74947
32506E53420k4916o58469m25483M22604O31533p4292n03216R6295Q40435O43584
32496A501495j51261m89612k18837K43p7982j04035M6703R7972n5574k18563k76589
32485E3960k48761r2944J47791K05796l0398k45663j68522l716j9210o5319O7513
32474c99473K00065J52287J74111M42237N33561M9328n72202n81728l6270L13639
$$ plain form
32546 -176818 -651686 -673572 -428562 -229689 -108244 39315 146207 65230 -182876 -442656
32536 -442656 -578311 -466557 -46091 437210 484918 -46207 -591986 -527169 -20243 241846
32526 241846 121632 206045 769836 1226521 1024082 527347 396487 488505 147169 -579805
32516 -579805 -837262 -176374 827319 1377538 1289332 810412 216323 -131899 78473 553420
32506 553420 528504 -129965 -555448 -132844 498689 424397 -78819 17476 857911 1501495
32496 1501495 1350234 860622 641785 642028 564046 460011 506714 604686 549112 330549 53960
32485 53960 -194801 -287745 -139954 65842 35444 -210219 -378741 -382457 -401667 -466986 -399473
32474 -399473 -199408 -47121 126990 569227 1102788 1152116 579914 -1814 -38084 275555
32464B75555J24697k08821k64287n1012K10639L06508J06622j94528j27149L70367
32454E48591O54046K58249l22262l70499o9131r2440l94175l32079J36905L43983
32444C61188L3662k81035k39764j19138j72780j78261P7971L99464N03861L48162
32434G33330K3965l01168l55108p9940J25252o4459l24420k01037N0671j10381
32424e03295m66674l22601K47753M20368j8955l24428m4411L12864K32500m2486
32414e09365j44748k17086m04867l69215J36169O94406P44942L25203q6208j65487
32404C744O8803L55637L40706l6386l04778o4076K90791J15890l20707j46772
32394C02852N85373P62938o1405q82405p42708n4061K80495K08834J79102J55149
$$ plain form
32464 275555 400252 191431 -72856 -123868 86771 393279 499901 305373 178224 548591
32454 548591 1202637 1460886 1138624 768125 698994 606554 212379 -119700 17205 361188
32444 361188 394850 113815 -125949 -245087 -417867 -596128 -518157 -118693 385168 733330
32434 733330 757295 456127 101019 21079 146331 81872 -242548 -443585 -392914 -503295
32424 -503295 -969969 -1292570 -1044817 -624449 -643404 -967832 -1012243 -699379 -466879 -509365
32414 -509365 -654113 -871199 -1276066 -1645281 -1509112 -814706 -69764 255439 169231 3744
32404 3744 72547 428184 768890 732504 427726 363650 654441 770331 449624 302852
32394 302852 888225 1651163 1589758 707353 -35355 -89416 191079 399913 579015 734164
32384G34164j28756m30599l44982j9529J54233J81301J84780m0091n27732o95000
32374i32211j51064M91503M30759q7815k14089J48228L52458J74109K1158N2525
32364B85561q646j57112n6058K02574J06929l42058m96726j16929J94052p939
32354c96352k38353J36522Q19909R32507K67491l97358l46491J37848K04231l61023
32344G58931p94222m22042L04445L73908l17268p74179l58573L06989L64210j490
32334e59291l3894K81763K62214k60043o24137l55310J99025M66537L51486R9665
32324a71985j15823k18265j36761P9342K34166K02314M1362j32186k19351j23859
32314e61046J39296L56981L44017K08203J85887K77365K58661J840l93468p05796
$$ plain form
32384 734164 605408 174809 -170173 -189702 -35469 145832 330612 290521 -237211 -932211
32374 -932211 -1083275 -591772 -161013 -248828 -462917 -314689 37769 211878 233036 285561
32364 285561 276915 119803 63745 266319 373248 31190 -465536 -582465 -388413 -396352
32354 -396352 -634705 -498183 321726 1254233 1521724 1124366 777875 915723 1119954 758931
32344 758931 -35291 -457333 -152888 221020 -96248 -870427 -1229000 -922011 -557801 -559291
32334 -559291 -593185 -311422 -49208 -309251 -933388 -1288698 -1089673 -623136 -271650 -171985
32324 -171985 -287808 -506073 -642834 -563492 -329326 -127012 -85650 -217836 -437187 -561046
32314 -561046 -421750 -64769 279248 487451 673338 950703 1209364 1211204 817736 111940
32304A11940o99005k98957J86515K77076n1921k65377m4656K30478J47139l6065
32294d42833J14189M03648L74444J51727J57303K15994j66046p32851o66486N8786
32284e32125M90439J51368k51494l0162M14177L49435j26097l90035k89555j28427
32274c42476R113K53163M70265L82633M7097k53392m42725n48042l91930R8171
32264g18123M73062K51211k75112l42704J78668O11574M97145J74425J04884J78191
32254A133221M5837k75958n19426n73483m43898j02043K89896L25008o6734l01997
32244d89577P1139N61296L86407k44198l60829K07916M83661q8156o78559l99312
32234e50212K31865J63583m13529m05304K83134N35609r0891n75048r4720O35159
$$ plain form
32304 111940 -587065 -886022 -699507 -422431 -474352 -739729 -784385 -553907 -406768 -442833
32294 -442833 -328644 75004 449448 601175 758478 974472 808426 75575 -590911 -532125
32284 -532125 -41686 109682 -141812 -171974 242203 591638 465541 75506 -214049 -342476
32274 -342476 -333363 -80200 390065 772698 819795 566403 123678 -424364 -816294 -718123
32264 -718123 -245061 6150 -268962 -611666 -432998 178576 675721 850146 955030 1133221
32254 1133221 1179058 903100 383674 -189809 -633707 -735750 -445854 -120846 -187580 -489577
32244 -489577 -418438 142858 529265 285067 -75762 132154 615815 527659 -150900 -550212
32234 -550212 -318347 -154764 -568293 -973597 -690463 -154854 -245745 -820793 -915513 -280354
32224b80354N43313j21925l21732J01852L59225Q7320k20947j75835j3735R649
32214c3169N4798K69537M24176K35230k46531p03163p96215l86305K42809N15431
32204d23402K31616j02934k762K34947N7610l31715k54220K75864N12519J60411
32194C57934k44159k97572k42588k60582q4332L05220L93190J6629k13133Q1297
32184a88096L47187O2539l18331j80108J20049j10144n98630n21078M6903K15301
32174a124408k04012l71649J61581O99896N08847r0062k75756J32494O02093O44885
32164F83909K63803j54982j76825K42230N64888K36810n10964q56669m74085R1189
32154i0696K91039K30867J74489J3851l15158m34989j05332K45889J64997o5945
$$ plain form
32224 -280354 262959 141034 -180698 -78846 280379 367699 146752 -29083 -42818 -33169
32214 -33169 21629 291166 715342 950572 704041 878 -795337 -1181642 -938833 -423402
32204 -423402 -191786 -294720 -297482 -62535 -4925 -336640 -590860 -314996 197523 357934
32194 357934 113775 -183797 -426385 -686967 -771299 -466079 -72889 -56260 -269393 -188096
32184 -188096 159091 221630 -96701 -276809 -156760 -266904 -865534 -1386612 -1339709 -1124408
32174 -1124408 -1328420 -1700069 -1538488 -838592 -329745 -419807 -695563 -563069 39024 683909
32164 683909 947712 792730 615905 858135 1423023 1659833 1148869 292200 -181885 -90696
32154 -90696 200343 431210 605699 619550 304392 -130597 -235929 9960 174957 109012
32144A09012K1161J59820j91120p25000n97074J63705N53447J25645l23843n1154
32134g55401M85855M26234j56706m79698k60979L5635L8078q6994m2886K01845
32124e95017M70963N32851K45418j96760l17184L6251L54870J36155l36794m03440
32114g2687n7343O3036k83987n63398k98795K74442O48622O69345M39722J5736
32104H34693m66840o78857m49724k9835K32402K62992J44072q2864k84465k17962
32094g36388R4736K68190J00204q8495K3407K08034O2857l08390m34186j53121
32084i63152K48265M69212M10611Q6790l08938l82839J5556M42353L71723m9955
32074C39626k34349n1138O6440n8672m3734L22159N97173L15854k83569n86288
$$ plain form
32144 109012 130173 289993 98873 -626127 -1223201 -1059496 -506049 -380404 -704247 -755401
32134 -755401 -269546 156688 -18 -479716 -740695 -705060 -666982 -753976 -796862 -595017
32124 -595017 -124054 408797 654215 457455 140271 176522 531392 667547 330753 -72687
32114 -72687 -130030 -66994 -350981 -914379 -1213174 -938732 -290110 379235 818957 834693
32104 834693 367853 -311004 -760728 -790563 -558161 -295169 -151097 -233961 -518426 -736388
32094 -736388 -641652 -373462 -273258 -361753 -338346 -130312 -67455 -375845 -810031 -963152
32084 -963152 -714887 -245675 164936 251726 -57212 -440051 -424495 17858 389581 339626
32074 339626 105277 54139 120579 61907 18173 340332 937505 1253359 969790 383502
32064C83502m34066k19886k32064k77145m3502L83181N50160J90287l67623n07917
32054e75073q6545L41728K40128j86646l17809j1032K83176K76469J96413K53885
32044D14694K60379N3718j24715n0035L8490j44079l29728n5425N00658O23645
32034A187602P5688n20249n31472j22337J14783J0062j26289j20163j26623k00813
32024c59811j33607J18594K24927j5241k54554o3770L71628M73214J34458j25072
32014C70766L0047K60010J27060k21235l20947j02404P9432K4368q8886p5207
32004H3004k6536j18675l21626m15912k38797J22852L84780L58255J77510J15097
31994A19952J90162J71366j0581j40449j06728j02035k66513m27517l94006k23492
$$ plain form
32064 383502 -50564 -270450 -502514 -779659 -823161 -439980 110180 300467 -67156 -575073
32054 -575073 -661618 -319890 -79762 -266408 -584217 -595249 -312073 -35604 160809 414694
32044 414694 675073 728791 604076 554041 592531 448452 118724 63299 563957 1187602
32034 1187602 1263290 743041 211569 89232 204015 214077 87788 -32375 -158998 -359811
32024 -359811 -493418 -374824 -149897 -165138 -419692 -483462 -111834 361380 495838 370766
32014 370766 400813 660823 787883 566648 245701 143297 222729 247097 158211 83004
32004 83004 56468 -62207 -383833 -799745 -1038542 -915690 -530910 -172655 4855 119952
31994 119952 310114 481480 470899 330450 223722 121687 -144826 -572343 -966349 -1189841
31984a189841q122K67821M57871K72273j53473k15503K29210M47402q0833p08959
31974f82154n39051J64950M23885R6199q2525J18009J58000o6710O1284O28498
31964B80385P72458O4259o67062n73304k1707J68880J8263N6874K46856J39524
31954D85426k12001l46858k30124k39020m03905l43326M1842L78495L72132J13851
31944c83488j67959k98443j48078K13281M17233J92848j97338k36916J71692N88743
31934A51575N66368J13025l16937k30220L42421P03422K64371n38097o74905q07
31924C80216M50107R472o00519m39353J87535L26328j00172l70616k44587j46651
31914e48240k18286j46223R1527J68593Q7076J21907J65479m5943j84794K22264
$$ plain form
31984 -1189841 -1197963 -930142 -472271 -199998 -353471 -568974 -339764 107638 26805 -682154
31974 -682154 -1221205 -1056255 -632370 -536171 -618696 -500687 -342687 -409397 -348113 280385
31964 280385 1052843 1117102 450040 -123264 -144971 23909 42172 99046 345902 485426
31954 485426 273425 -73433 -303557 -542577 -946482 -1289808 -1247966 -869471 -497339 -383488
31944 -383488 -551447 -849890 -997968 -784687 -367454 -174606 -371944 -608860 -437168 151575
31934 151575 717943 830968 514031 283811 626232 1329654 1594025 1055928 381023 380216
31924 380216 830323 839795 239276 -200077 -12542 313786 213614 -157002 -401589 -548240
31914 -548240 -766526 -912749 -821222 -652629 -565553 -443646 -278167 -324110 -508904 -286640
31904b86640O99488L15129o68447q98407J4272Q20182N47903j33429k38037k3130
31894A48884k03754n11360k36655L65623M20132j21407m74176l19904j03611n8203
31884a094431J10350M37668M56483Q884l75988k47329J33539K58649R5158k951
31874b19968J08839J73003p6374m90164n97983j90930L21029M04873J82179K46623
31864a38873O51300P16157J35741m14244l15011M037j37932m62891k97951P1727
31854a87940j93613q78822q10753K49397J074229P91968Q3096j12608j8298k34282
31844b37626m29296J6627O50692N09117k22408l93597K41216N91366k525p02208
31834B1358m99150K83057O28383L59602J18990J41368j5113n13055q32909n77724
$$ plain form
31904 -286640 412848 727977 59530 -838877 -824605 -4423 543480 410051 172014 148884
31894 148884 -54870 -566230 -802885 -437262 -17130 -138537 -612713 -932617 -1036228 -1094431
31884 -1094431 -984081 -546413 -89930 -81046 -457034 -704363 -570824 -312175 -217017 -219968
31874 -219968 -111129 61874 -14500 -504664 -1102647 -1293577 -972548 -567675 -385496 -138873
31864 -138873 512427 1228584 1364325 950081 635070 639107 501175 38284 -259667 -187940
31854 -187940 -381553 -1260375 -2071128 -1821731 -747502 44466 127562 14954 -3344 -237626
31844 -237626 -666922 -650295 397 509514 287106 -106491 134725 726091 723566 21358
31834 21358 -477792 -194735 433648 793250 912240 1053608 1038495 525440 -307469 -885193
31824h85193q8661Q4453p3049j78504o5978R3710J56958J81468K51353L30203
31814a93240L12392J38551j11774k20968m3406K48998L04859M7183k20394k56150
31804F051j58371m8687J74881M81026M69895m4118n13289l23607K07707K22394
31794D73882l37226o04395j70472K77789J23420j86253K7092M89625M62187p761
31784E47888k25422l5841L6828j79842k17676J21740L62956J78628n2417Q5685
31774F22527L59158L27668O4097n4354m29o9936l36598n31456m30533r1188K66774
31763A25730M23975K61521j31229m69405m87394j38769L68939O38210L21542m27105
31753D86015q58848m09388M59365P15191J21040m60424l36587J05433J72648p4171
$$ plain form
31824 -885193 -973854 -889401 -962450 -1140954 -1206932 -1113222 -956264 -774796 -523443 -193240
31814 -193240 119152 257703 145929 -75039 -118445 130553 435412 482595 262201 6051
31804 6051 -152320 -201007 -26126 454900 924795 880677 367388 43781 251488 473882
31794 473882 136656 -467739 -638211 -360422 -237002 -423255 -396163 93462 555649 547888
31784 547888 322466 286625 323453 143611 -74065 47675 410631 589259 536842 622527
31774 622527 981685 1309353 1373450 1319096 1318667 1248731 912133 380677 -49856 -141044 125730
31763 125730 549705 811226 679997 210592 -276802 -415571 -46632 591578 913120 486015
31753 486015 -372833 -782221 -322856 392335 513375 52951 -283636 -178203 -5555 -79726
31743g9726j45017k3398k3527n6491K10546O19136O55725K63072j29355l37179
31733I53786n37463o87047n15694j37822K3169k742K27944O55427O52996J17435
31723G49989k41181r0420n7214n19453p08082P8250J064107R49401j05015o65294
31713D55088j43596M70144K55005l42445m15584Q761K11812n5290l56977l20271
31703b33353l1676K55577L98251L45072J19033j69326m20745n77530m95734l4522
31693h44953N71932P46490K71731l07266l61660l5740M4326k38385l79394j40616
31683f73535Q4171M824n5849K09747M41353J52675l81572m42664K7278L18041
31673c15531M7604k81781j12195L36215M96293L05772J05485l5435l07803n96926
$$ plain form
31743 -79726 -224743 -248141 -271668 -328159 -117613 501523 1157248 1420320 1290965 953786
31733 953786 416323 -270724 -786418 -924240 -901071 -903813 -675869 -20442 632554 749989
31723 749989 508808 418388 361174 -158279 -866361 -788111 275996 1225397 1120382 455088
31713 455088 311492 781636 1036641 694196 278612 287373 499185 443895 86918 -233353
31703 -233353 -265029 -9452 388799 733871 852904 683578 262833 -314697 -810431 -844953
31693 -844953 -273021 473469 745200 437934 76274 40534 84860 -153525 -532919 -673535
31683 -673535 -589364 -584540 -640389 -430642 10711 163386 -218186 -660850 -633572 -315531
31673 -315531 -267927 -549708 -661903 -325688 170605 476377 581862 546427 238624 -358302
31663c58302n19257o0390L31498L82371K71090J82287O2255l7156J13462M13980
31653G81838L69250j40464n20998l20260N2432L881k71266j79968K05219K56995
31643B36659j45232m57121m03989k96632k59637P7533P79350J173166P10735k09235
31633A205597p48465o01759o2645N09675Q32870O30817o0128o88337p36252l46626
31623f5253l6350L2872Q8334K13542K44164J32335j985j52453l82401n32778l53462
31612h13435P2449L80416M01365K69583R5023j06837j83057M0568L60060L22087
31602H38222j24662m71610l11021J41412L56637R7835m14811p46659n70297N6577
31592a148377O73061Q49171O21338K95112m9357m79074p48294m69335J89776N35205
$$ plain form
31663 -358302 -877559 -937949 -606451 -224080 47010 229297 291552 254396 367858 781838
31653 781838 1151088 1010624 489626 169366 221798 225679 -45587 -225555 -20336 236659
31643 236659 91427 -365694 -769683 -1066315 -1325952 -1248419 -469069 704097 1414832 1205597
31633 1205597 457132 -144627 -207272 302403 1135273 1766090 1705962 1017625 281373 -65253
31623 -65253 -101603 -68731 19603 233145 477309 609644 607659 455206 72805 -459973 -813435
31612 -813435 -740986 -360570 40795 310378 405401 298564 115507 156075 516135 838222
31602 838222 713560 241950 -69071 72341 428978 526813 112002 -634657 -1204954 -1148377
31592 -1148377 -475316 373855 995193 1290305 1240948 761874 13580 -455755 -265979 269226
31582B69226K57842j92730l44531k71831j71760K9419K70448J63960k87085l85947
31572f62989J96854O45924J39003p26158p23105O5507L71244j63964l93478L69628
31562h81534J094452O36239m07237o24868M5533L98800k1594l28724Q9982N59830
31552E60879K91398l34890m32753M946K24961l8655k48961k5096K71435J56101
31542D29365k47477m33744k12409J35147K77876J60792m8303j43211j8453K18868
31532A18451K68408p6249o00024p63288k65107N38119R36025O29797N5129j74842
31522F66419k3736R152l30422o36738m11322J94540N46080L54624k5743j76463
31512A66391j23774r2754o6644J03761L26815L41209J21366o4927k8668J20457
$$ plain form
31582 269226 527068 334338 -10193 -282024 -453784 -424365 -153917 10043 -277042 -662989
31572 -662989 -466135 179789 318792 -407366 -1130471 -1064964 -693720 -857684 -1251162 -881534
31562 -881534 212918 849157 441920 -182948 -137415 261385 239791 -88933 1049 560879
31552 560879 852277 517387 84634 89580 314541 275886 26925 1829 273264 429365
31542 429365 181888 -251856 -464265 -329118 -51242 109550 61247 -81964 -100417 118451
31532 118451 386859 310610 -289414 -1052702 -1317809 -779690 156335 786132 841261 666419
31522 666419 642683 651835 321413 -315325 -726647 -532107 13973 368597 342854 166391
31512 166391 42617 -50137 -116781 -13020 313795 655004 776370 711443 682775 803232
31502H03232J59495j2866l46006o69991p31318l81190J93450N68264N00896J60175
31492B44141j18611j97781j74844j48644q5657N6283J59078L2423k60797l06183
31482h00592J83746Q16219Q16242M1853o92028o40623j01056J65758J51432M43982
31472C84933R56114Q00174k59088j149616r18683q9676K17877l1718J925M47634
31462C59876N03292j02416n23710j03459O05468P15426K36166k25715m67064o39104
31452C58760n83406p0092M63370K86312m51069p41500j61379M70098K98680l48214
31442d78440n59329j88217J26518O4964m287K18530M93206N11454L36629J46399
31432F67427n3353k22444j60891J45262L61291K49403l260j48921k59483m45427
$$ plain form
31502 803232 962727 949861 603855 -66136 -797454 -1178644 -985194 -416930 83966 244141
31492 244141 125530 -72251 -247095 -395739 -481396 -425113 -266035 -233612 -494409 -800592
31482 -800592 -616846 199373 1015615 1057468 365440 -275183 -376239 -210481 -59049 384933
31472 384933 1341047 2141221 1882133 732517 -186166 -275842 -57965 -89683 -87758 359876
31462 359876 863168 760752 237042 133583 739051 1454477 1690643 1464928 997864 358760
31452 358760 -224646 -294738 168632 454944 3875 -737625 -899004 -428906 -130226 -478440
31442 -478440 -1037769 -1225986 -1099468 -1034504 -1038791 -820261 -327055 184399 521028 667427
31432 667427 614074 391630 230739 376001 737292 986695 983435 834514 575031 129604
31422A29604n11001k67647O2827J47372J7469j26062k96644m66515k72263M08914
31412a173946Q86625M49779m32939o16208J9691L85994p0621n12198j31134N42606
31402f52351N60504M7631j61210J05667L05949K32370J91502K37034O8504k78199
31392F57401l71079j03671J34037Q5391j06542k83537l86994k12777L39167P67950
31382E19346M17518m70216q61067l20219L86469M25178j2611k30022j09640o3684
31372c18948j97203j51921K35170N81787M20276j87031o39785m45777J56376M11133
31362a35923J2903m24065k09721L77957M66068j13907n92671m12161Q2735L44202
31352f04583L78383M30648M36223K30613m7568j55375r3019J4389J12033J03953
$$ plain form
31422 129604 -381397 -649044 -586217 -438845 -421376 -547438 -844082 -1310597 -1582860 -1173946
31412 -1173946 -287321 162458 -270481 -886689 -866998 -481004 -551625 -1063823 -1194957 -652351
31402 -652351 -91847 -44216 -205426 -99759 206190 438560 630062 867096 935600 657401
31392 657401 286322 182651 316688 402079 295537 12000 -374994 -587771 -248604 519346
31382 519346 936864 466648 -394419 -714638 -328169 97009 84398 -145624 -255264 -318948
31372 -318948 -516151 -668072 -432902 148885 569161 382130 -257655 -703432 -547056 -135923
31362 -135923 -123020 -547085 -756806 -378849 87219 -26688 -619359 -1031520 -948785 -604583
31352 -604583 -226200 204448 640671 871284 823716 668341 575322 589711 701744 805697
31342H05697j23222m03191l99490j53383o8813k12542j82971J32859L04423J28180
31332a72453k6882K3519p4907l83972l17875K87752O08171J20195l60159P4404
31322b22207Q46905P45436j70404p76970o60711l78724j41190L85736R34622O74983
31312A237476l24600r05889m93561J34236J86268o1999m6630J61027K80539L65020
31302E31887L83751K4413n86760p41848k37300J93425O2284j25285P0333J54178
31292b70922k77600n40534M4433P92938O22316j40123k50363M05331O44572n6264
31282I73784p46000n36507J02900J99778k89346n55820r2310P22230J066976N03433
31272A349118n18241r73681l33177P34295J067359L76909n03878p25448l16342
$$ plain form
31342 805697 682475 279284 -120206 -273589 -342402 -554944 -737915 -605056 -300633 -172453
31332 -172453 -199335 -175816 -250723 -634695 -952570 -664818 -56647 63548 -296611 -222207
31322 -222207 624698 1370134 1199730 422760 -237951 -616675 -757865 -372129 562493 1237476
31312 1237476 912876 6987 -486574 -352338 -166070 -228069 -274699 -113672 166867 531887
31302 531887 915638 940051 353291 -388557 -625857 -432432 -370148 -495433 -425100 -270922
31292 -270922 -548522 -1089056 -1044623 -251685 370631 230508 -19855 385476 1030048 973784
31282 973784 227784 -308723 -205823 -6045 -295391 -851211 -943521 -221291 845685 1349118
31272 1349118 830877 -142804 -475981 258314 1325673 1702582 1198704 473256 156914
31263A56914J17439J58653j36661m28691m14975j27357Q0863o717j65129j10656
31253h76317N4227J28530K42809M96954M88911q9152o32060l00184N64902P39646
31243H18266l5653o28674l14459J44929q9847n09608k44965L54144L48344j20827
31233b78350j19288L63098L61193l15681o15164N1968P80321N22027l86922q28932
31223d65730m48290J66963M62988L87750J20026q7229K7923L64488L90781j07965
31213H11705n48437l68975L0415r4063n38091l97303M18275Q95136L98976m21619
31203A86019o49387k95589M7063J57344J91432J72790O9313O9170K70584L96912
31193F15651K73588K02889L49187K25456m91212j062975n64935N51113Q37598
$$ plain form
31263 156914 274353 433006 296345 -132346 -547321 -674678 -593815 -600532 -765661 -876317
31253 -876317 -822090 -693560 -450751 46203 535114 445962 -186098 -486282 78620 818266
31243 818266 782613 153939 -160520 -15591 -105438 -615046 -860011 -505867 -157523 -278350
31233 -278350 -397638 -34540 326653 10972 -604192 -552224 228097 750124 363202 -465730
31223 -465730 -914020 -747057 -284069 103681 223707 136478 164401 528889 919670 811705
31213 811705 263268 -105707 -75292 -169355 -707446 -1104749 -686474 208662 607638 186019
31203 186019 -463368 -758957 -711894 -554550 -363118 -190328 -121015 -51845 218739 615651
31193 615651 889239 1092128 1441315 1666771 1175559 112584 -452351 98762 936360
31184I36360j16904j067029q55020J26708P27581N63581J21069j53753k15042
31175F7551j41785m1213q6404k84617l60681j39572J58375K40737J25899j2890
31165d74600j16387j43062q813J65729R3664j72056j86576J51027K87267j46447
31155e50254o40022m96970J29157N02178L81842K08193K98030M40837L42907L6205
31145F52103k38573k88816j12606M9760m9675k40705n9577M77131O73012J31172
31135I93226n27331m94375O5841L59409J52999j22947k34047l04207k48218J31189
31125b28461N16940L71867j22610k59544P768q781m50865n47100Q2481O78815
31115D0510M77760j67709m47517k58504l7371N9553J24091N0152k09917k78839
$$ plain form
31184 936360 819456 -247573 -1102593 -975885 -248304 315277 436346 282593 67551
31175 67551 -74234 -115447 -201851 -486468 -847149 -986721 -828346 -587609 -461710 -474600
31165 -474600 -590987 -734049 -742862 -577133 -483469 -655525 -842101 -691074 -403807 -550254
31155 -550254 -1190276 -1687246 -1558089 -1055911 -674069 -465876 -167846 272991 615898 652103
31145 652103 413530 124714 12108 61868 12193 -228512 -288089 189042 862054 993226
31135 993226 465895 -28480 37361 396770 549769 426822 192775 -111432 -359650 -228461
31125 -228461 288479 660346 537736 278192 285960 277179 -173686 -720786 -638305 40510
31115 40510 518270 350561 -96956 -355460 -392831 -333278 -209187 -159035 -368952 -647791
31105f47791J00253M53031J96170l71419m40941P6959M72895L96534K98324N00557
31095A034572N55510j4397q26972j049701m97460J66123L05392P548j97526l4665
31085e51576K87916M10002J87758k22109m83813l21238J75620M96486K15294m05217
31075b10877o24740j76967L48182L34376k1491j19399J07337K33327J43073J47600
31065A60421L07150K68654q6808l82658l31746j26558n0306j02605j80925k45619
31055g71000j69166J63822M83290L29385k19389n13433k41975J28633R8575j66990
31045h78248k07989P8331M63748O95900N47640j6257n27028l91857J90026L20610
31035B74876k76738p52911m19503K06973L08852L3575K7950K53481K09881k1455
$$ plain form
31105 -647791 -547538 -94507 101663 -269756 -710697 -633738 -160843 235691 534015 1034572
31095 1034572 1590082 1575685 748713 -300988 -798448 -632325 -326933 -319385 -516911 -551576
31085 -551576 -263660 146342 334100 111991 -371822 -693060 -517440 -20954 194340 -210877
31075 -210877 -835617 -1012584 -664402 -330026 -351517 -470916 -363579 -130252 12821 160421
31065 160421 467571 736225 649417 266759 -64987 -191545 -241851 -344456 -525381 -771000
31055 -771000 -940166 -776344 -293054 36331 -183058 -696491 -938466 -809833 -711258 -878248
31045 -878248 -1086237 -1007906 -544158 151742 699382 683125 156097 -235760 -45734 274876
31035 274876 -1862 -754773 -1174276 -967303 -658451 -624876 -596926 -343445 -133564 -155019
31025a55019P3012M33475M84961J27147j61860j68159j02418L7243M39432P95863
31015A803677M93509l65862r28795p80065m29346l62394l46440m9284L04735L64888
31005b95377K44024K15700J99375j4890l01223l46733r5608K28979L94445K75463
30995E04155r4517m26108l52220J17698N13349M34847N463l33069l23892q0301
30985c4595J16991J26824Q9300K08753L59847J46196m62917q68335n88975j200
30975i08111J76972o2921j06493K34964M62812K60903m1578r0409j4244m7061
30965a35166j26754j34124j16360n8227J52871L54373J73005l22754n32270j64294
30955i09700L07914L51810Q0232j00397j09929o7559O0605K67311L01075O8623
$$ plain form
31025 -155019 -82007 351468 836429 963576 801716 633557 531139 568382 1007814 1803677
31015 1803677 2297186 1931324 1002529 222464 -206882 -569276 -915716 -965000 -660265 -295377
31005 -295377 -51353 164347 363722 348832 47609 -299124 -394732 -165753 228692 504155
30995 504155 409638 -16470 -368690 -250992 262357 697204 702667 369598 45706 -34595
30985 -34595 82396 209220 298520 507273 867120 1013316 550399 -317936 -906911 -908111
30975 -908111 -731139 -794060 -900553 -665589 -202777 58126 16548 -73861 -88105 -135166
30965 -135166 -261920 -396044 -512404 -570631 -417760 -63387 109618 -213136 -745406 -909700
30955 -909700 -601786 -249976 -169744 -270141 -380070 -447629 -387024 -119713 181362 249985
30945B49985q8286O9410K07938m0721l91790l09312J37669M00167K90480J15791
30935F41331K6970j72908m95571n85365k68213J34349K76668K46100K80926K95600
30925C79887M4155l51167m27035l7694L26563J48840l66320n35905j60084K23369
30915g55391J95245N4373J92288L46405P0178l89359m13466l2966J57814L9670
30905e35209O3875K64276J29326l10829k79833M02912P58310J18048p11417o36958
30895g37499P8115L79153J03747k9431J74874J64817j98755l47492n9231J33408
30885c38294j04925l52186k02234P5618Q8286j3245J05036L27058K94044J1117
30875a09725j66872m7108K05921L36277K58995Q6788M135P8907J63599N4334k41608
$$ plain form
30945 249985 161699 231109 439047 398326 6536 -302776 -165107 235060 525540 641331
30935 641331 668301 495393 -178 -585543 -853756 -719407 -442739 -196639 84287 379887
30925 379887 424042 72875 -354160 -391854 -65291 83549 -282771 -818676 -978760 -755391
30915 -755391 -560146 -505773 -313485 32920 103098 -286261 -699727 -732693 -574879 -535209
30905 -535209 -471334 -207058 -77732 -388561 -668394 -265482 492828 610876 -100541 -737499
30895 -737499 -659384 -280231 -176484 -205915 -31041 133776 -64979 -412471 -471702 -338294
30885 -338294 -443219 -795405 -997639 -922021 -833735 -846980 -741944 -414886 -120842 -109725
30875 -109725 -276597 -323705 -117784 218493 477488 564276 568411 647318 810917 865251 623643
30864F23643m79324m21595o8635L03208L17983j26340o09499n53047N2745N75068
30854c85793N56865K48795O9974l1157k58334m18658k60585m8376j58688l43864
30844a029821j07102L55953L83408l9176k35216J6798J68424l6473n9235M39520
30834a42920Q65168N34391l08302r11887j012447q23437m18989K19682P63016
30825a235725P74431L52962M7019J24860L17202K91540M5115k18755l51496l34663
30815a87510k39211j34125P950K32595M08331K94210j12883m90138n48492l00806
30805a070079P7209M01117M43121Q7433l58140l82160J7597K45341j8921k95891
30795h53373l9658M97952O42192K78235q1837r8531L7165M7788n1369j04672p0849
$$ plain form
30864 623643 144319 -277276 -345911 -42703 275280 148940 -460559 -1013606 -960861 -385793
30854 -385793 171072 419867 489841 458684 200350 -218308 -478893 -527269 -685957 -1029821
30844 -1029821 -1136923 -780970 -397562 -436738 -671954 -655156 -486732 -523205 -582440 -142920
30834 -142920 722248 1256639 948337 36450 -975997 -1799434 -2218423 -1998741 -1235725
30825 -1235725 -461294 -108332 -61313 63547 380749 672289 717404 498649 147153 -187510
30815 -187510 -426721 -560846 -552896 -320301 88030 382240 269357 -220781 -769273 -1070079
30805 -1070079 -992870 -591753 -148632 -61199 -419339 -801499 -783902 -538561 -557482 -853373
30795 -853373 -893031 -395079 247113 525348 443511 344980 382145 429933 378564 273892 203043
30784B03043l9582j16471k72802k78168L2337L81660K85761k00979m32367j28698
30774e66266J47782p9359l59231p3429M36513L72451j82678m05083j02069P9237
30764g32132j11657j32526K33564L79223l0070l70325r5220L26092K30396j42871
30754d45526j74782N5501P1993m2730J08794L45992J87548j74183j25763K34487
30744D1331K06415k38828l32463J40817M11055N1621k57157Q4719N25095K90034
30734I22639l04955m16062o8065J6904k68132k97746J13333L82357J78466p0301
30724A88438O499J15090r3232l86104l76761j49553q149O7445K65654M76007L98817
30713E04151R959l98001n59844m16748q0017K06612K19950K4078q3830J1967J34481
$$ plain form
30784 203043 163461 46990 -225812 -503980 -471643 -89983 195778 -5201 -437568 -566266
30774 -566266 -418484 -497843 -857074 -930503 -493990 -121539 -304217 -709300 -811369 -732132
30764 -732132 -843789 -976315 -742751 -363528 -393598 -763923 -859143 -533051 -302655 -445526
30754 -445526 -620308 -564807 -492814 -535544 -426750 -80758 106790 -67393 -193156 41331
30744 41331 247746 8918 -323545 -182728 228327 279948 22791 107510 632605 922639
30734 922639 617684 201622 133557 150461 -117671 -415417 -302084 80273 258739 188438
30724 188438 194937 310027 216795 -169309 -546070 -695623 -703772 -636327 -370673 105334 504151
30713 504151 514110 116109 -443735 -860483 -940500 -733888 -513938 -489860 -573690 -561723 -427242
30702d27242J95630L22881M61073K96748j70669m55813l08329r1567m3619K11118
30692i789P99462R20590k2703j110334r23025L26405R89665M00366k77080m7223
30682A046334M12155Q6880o31771o83990j14748J12210k63608n14755k09069K14785
30672e45577K79790Q4534r4107j72424p6593K41931M70001J72344m67057o93493
30662h00651j92066M67255O58461M67439K87060J29655j61862l70416j79099J53901
30652D59677J7578n80304q32352k10156P07735R39753L87072j45518j63906n7361
30642E22218k33106l63537n7729K67309J8263m14360j65839N27838M84051m56262
30632A28846r27459j53816P07245L82279m69713m44337K06251J01140p42255q18211
$$ plain form
30702 -427242 -231612 91269 552342 849090 678421 222608 -85721 -177288 -220907 -9789
30692 -9789 789673 1710263 1687560 577226 -345799 -19394 970271 1370637 1093557 1046334
30682 1046334 1458489 1545369 913598 229608 114860 227070 -36538 -551293 -760362 -545577
30672 -545577 -265787 -181253 -275360 -447784 -524377 -282446 187555 359899 -107158 -800651
30662 -800651 -992717 -525462 132999 600438 887498 1017153 855291 484875 305776 459677
30652 459677 477255 -103049 -935401 -1145557 -437822 501931 889003 743485 579579 522218
30642 522218 289112 -74425 -132154 135155 153418 -260942 -426781 101057 585108 128846
30632 128846 -798613 -952429 -245184 137095 -332618 -776955 -570704 -469564 -1211819 -2030030
30622b030030L15669J222748Q43535m4731l72523l33905m53212l84662K09487
30613a027624O34304K53556k53394l149M80752J73839n40478m46928L50922N28703
30603A50503k09982o39121r5986M85918K67554j28150J51966O57674M25615l83498
30593F82493p43771l27341J65546J49347j67316l03112j03927K99417O93174P99442
30583A143952M10315l24293r00388q91865l70592J38534J71547j66022l02279
30574a091091Q8693O43118P83685M44634m87l33833n60398n41517j50669K59568
30564d58297K00236j21650l9104M10254M12102k48483o61788j87351M81191M03848
30554A90958j65002l33935l0753J13886m451Q5827L81832L34911j16190l68655
$$ plain form
30622 -2030030 -1714361 -491613 351922 307191 -65332 -399237 -852449 -1237111 -1027624
30613 -1027624 -393320 -139764 -393158 -396307 84445 258284 -282194 -729122 -378200 150503
30603 150503 -59479 -698600 -794586 -308668 -41114 -169264 -17298 640376 1065991 682493
30593 682493 -61278 -388619 -223073 -73726 -241042 -544154 -648081 -348664 344510 1143952
30583 1143952 1554267 1229974 329586 -562279 -932871 -794337 -622790 -788812 -1091091
30574 -1091091 -1002398 -359280 424405 869039 868552 534719 -25679 -567196 -717865 -458297
30564 -458297 -258061 -379711 -418815 -8561 403541 155058 -506730 -694081 -212890 190958
30554 190958 25956 -307979 -338732 -224846 -229297 -143470 238362 573273 457083 88428
30544H8428j65888M9276j4465q6897k1977j16357m10327m00601J29536O39625
30534c09647O43939L93616K61883N7486m27207p20750l07731L80747M50360j12189
30524C10507m03303K2603N20032L85130j11196k10567J85277M23214R5523l64024
30514H53196k99199K18656M25579j11127q30709q31782m1196O70713N95298K097
30504F51526l69267k85478j10824j15584j37939M0202L17236M01847J58304k47244
30494C02779m66302k73639J40690K89119l2666m16228l58665M529P7147k84620
30484a017856n03030j18012N19315P39069M39699N4836j68953l42285m29129j59693
30474i86039L73665N67371J29832l48316j53711M67149N86856q2456p54545o21213
$$ plain form
30544 88428 -77460 -28184 -42649 -129546 -151523 -267880 -678207 -1078808 -949272 -309647
30534 -309647 334292 727908 989791 1047277 620070 -100680 -408411 -27664 422696 310507
30524 310507 -92796 -70193 449839 834969 723773 513206 698483 1121697 1217220 853196
30514 853196 553997 772653 1198232 1087105 256396 -575386 -616582 54131 649429 651526
30504 651526 282259 -3219 -114043 -229627 -367566 -327364 -10128 391719 550023 302779
30494 302779 -163523 -437162 -296472 -7353 -40019 -456247 -814912 -810383 -733236 -1017856
30484 -1017856 -1520886 -1638898 -1119583 -380514 59185 114021 -54932 -397217 -826346 -986039
30474 -986039 -612374 -45003 84829 -263487 -417198 49951 636807 554351 -200194 -821407
30464h21407J57780P81237P37716J30339n87725q95893n35322J16253L00997j43538
30454g59563m35403M8397P16779N44350l22202o62624K2392P53790N29181k53465
30444A81632m96320j266M22929K45263j49137j74773J76347M90626N06008K88484
30434A489793K0195j91578l38482m33034m24189k37727O2779K51066J80986q000
30424C71809m6949J24369K68454J02724l90571q86473r60806m87817K01062O28169
30414a076029O13001L20743l3183l25326m25977k29600J62099M82414N53611L48281
30404C90034j04137o01075o85575j17273O04056O95758J42621k61144p3793K09306
30394A98778M9930k64270j56484K91379N10137K77954j35113m35535m67670j41523
$$ plain form
30464 -821407 -663627 117610 855326 985665 397940 -497953 -1033275 -917022 -616025 -759563
30454 -759563 -1194966 -1146569 -429790 114560 -207642 -870266 -847874 -94084 435097 181632
30444 181632 -314688 -315954 106975 352238 203101 28328 204675 695301 1201309 1489793
30434 1489793 1509988 1318410 979928 546894 122705 -115022 -52243 198823 379809 371809
30424 371809 324860 449229 717683 820407 429836 -456637 -1417443 -1905260 -1704198 -1076029
30414 -1076029 -463028 -142285 -175468 -500794 -926771 -1156371 -994272 -511858 41753 390034
30404 390034 285897 -315178 -1000753 -1118026 -513970 181788 324409 63265 -10528 198778
30394 198778 248708 -15562 -172046 119333 629470 907424 772311 336776 -130894 -272417
30384b72417L60771N50682K39249j00077k2824J84139M8602k11437q5560K29798
30374I20926Q3952m69025o41988j38504L95734L50821j10790n31959p40596o78671
30364a560100k35478M10914P43827N16679P3657j35220k9536K11120L54859J70474
30354E21196k98681n29484j16553M74114M30779j32177k78193K44995N77907J79210
30344A073113l11915k20711P9851k838j66177J55012O39745N40375r4650n58748
30334A133057n67188l86957j55748J43519K84154J28010O1967L35514L63397l64866
30324I74859j075530o12741O39274J079386K22963o46655n08269K7873M536l82472
30314b76776m17054j13759P9900J95025M70320O34280K92594k81664m73357k02011
$$ plain form
30384 -272417 88354 639036 878285 778208 755384 939523 988125 776688 691128 920926
30374 920926 1004878 535853 -106135 -244639 151095 501916 391126 -140833 -881429 -1560100
30364 -1560100 -1795578 -1384664 -640837 -124158 -50501 -185721 -215257 -4137 350722 521196
30354 521196 222515 -306969 -423522 50592 481371 349194 71001 315996 893903 1073113
30344 1073113 761198 540487 620338 617500 451323 606335 1246080 1786455 1691805 1133057
30334 1133057 565869 178912 23164 166683 450837 578847 640814 976328 1339725 974859
30324 974859 -100671 -713412 -74138 1005248 1228211 581556 73287 101160 105696 -276776
30314 -276776 -693830 -807589 -727689 -532664 -62344 571936 864530 582866 109509 -92502
30304i2502J33338L20199L71982J94617j95610l99202j70666N5854k02865o22311
30294f07166n47432o9274J65699N6778J03021L90912M08335l887l35720k74348
30284g13082j42137j85081j34602J58496L16744J12693l1743K57143N94881M02150
30274F35462j78650n06868l49197l4106J41894J82932J53579O9263j4293p1878
30264B8138j63629k24460l9211L33895M53242J49722r0240J27615L60740j5173
30254I20639o93610p81929j67227L08353J45773j48820J3021M23321N33841K45569
30244G98931j76048n23311n89731j35613O35540R50316L33207o53854j025030
30235c85593n40670J74071N10630M17173J47412q8189j88311j69519j32570q3683
$$ plain form
30304 -92502 40836 361035 733017 927634 732024 332822 162156 218010 15145 -607166
30294 -607166 -1154598 -1223872 -1058173 -1001395 -898374 -507462 -99127 -103014 -438734 -713082
30284 -713082 -855219 -1040300 -1174902 -1016406 -699662 -586969 -618712 -361569 233312 635462
30274 635462 456812 -50056 -399253 -433359 -291465 -108533 45046 114309 100016 28138
30264 28138 -135491 -359951 -399162 -65267 387975 537697 447457 575072 935812 920639
30254 920639 227029 -554900 -722127 -413774 -268001 -416821 -403800 19521 553362 798931
30244 798931 622883 99572 -490159 -625772 9768 960084 1293291 639437 -385593
30235 -385593 -926263 -752192 -241562 175611 323023 234834 46523 -122996 -255566 -339249
30225c39249Q0649K84825K47140m0744j54510J16950L45063J24593k20580j80090
30215B64047L7833j12307m56030l05230L10726N53445R8505l44838j97423J28173
30205b3099N0208k05436j10427K12852K60063K4166q3721J6860L9928p6192j17409
30194a2207o4505r2688j44081K703K51041K54700j0372j92490j20462K2010J24166
30183A7815K91358M58278L21517j48496n20384m51732j07595J64982K58855K00516
30173D85114l2258l12949k97807J14894M99426M10764k8138l74962m77191m41577
30163d54684k21749K39708N74684L05077l54230o08643j74989L23965L33820J34802
30153I7761J79829K34629j34480o06938m82670J38802M24432J01321j84321k0570
$$ plain form
30225 -339249 -258600 26225 273365 232621 78111 195061 540124 664717 444137 264047
30215 264047 301880 189573 -266457 -571687 -260961 292484 390989 46151 -151272 -23099
30205 -23099 27109 -178327 -288754 -75902 184161 208327 124606 141466 181394 105202 -12207
30194 -12207 -76712 -169400 -313481 -310778 -59737 194963 184591 -7899 -128361 -106351 17815
30183 17815 309173 767451 1088968 940472 420088 -31644 -139239 25743 284598 485114
30173 485114 452856 139907 -157900 -43006 456420 867184 839046 464084 -13107 -454684
30163 -454684 -676433 -436725 137959 443036 88806 -519837 -694826 -370861 -37041 97761
30153 97761 277590 512219 377739 -229199 -711869 -573067 -148635 -47314 -231635 -252205
30143b52205J34836r5027k48637J20890N28621L30283j13039j7041M14835K64925
30133A068441m87296p81151j42567N29235L42668l06728n03774j70813J07562
30124c44423J33526J67731K30406R8335j11322l8957K43912K61503j07661m28985
30114A04065l73982j21943L2685O1943L2849p9660k12611j50536J44026L67328
30104a95836K50586p0116k42537j24712J34481L27264L46399J95631j2123j05362
30094E03675j8011J12645R6747p1427k10794j99461j32742j56689k04679o9465
30084c50201K12730K60247j60281o77609o77308j09445M12405M10295R5231o0197
30074f44133K1795Q1776Q624n3350K5617K22631M03562L59143r763l93009k65703
$$ plain form
30143 -252205 -117369 -212396 -461033 -340143 188478 518761 405722 388681 803516 1068441
30133 1068441 581145 -200006 -342573 186662 529330 222602 -281172 -451985 -344423
30124 -344423 -210897 -43166 187240 285575 174253 135296 379208 640711 533050 104065
30114 104065 -269917 -391860 -359175 -297232 -264383 -344043 -556654 -707190 -563164 -195836
30104 -195836 54750 -15366 -257903 -382615 -248134 79130 425529 621160 609037 503675
30094 503675 485664 598309 695056 623629 412835 213374 80632 -76057 -280736 -350201
30084 -350201 -137471 122776 -37505 -715114 -1392422 -1501867 -1089462 -679167 -583936 -644133
30074 -644133 -622338 -540562 -531938 -585288 -559671 -337040 66522 425665 415902 22893 -242810
30063b42810L48709O60700R7001p86179r46534k61784L54376K58240j61413k33855
30053i13549N8798K71103K24803J20321J05865R9202r43j50448k11392q2069J85035
30042b93274L78616L29151R5185j59017l74847m91512k81973L23559Q15717N22720
30032H64325m15819r93222n54671L38773O68448K71070j08581O2607M71076N28525
30022A132531J54801k52119l97061l60300l34763l18411j71836J18477L83319
30013d5362M79008M14012K29303p3218l73450l99762o1659L33888M40765L04859
30003A248384J57617l3287l83681o04043k80128L20637L79335k87354p92834l81488
29993f56842M48243O33706L4854m73336l05148J34117K04688p2737k13107k1726
$$ plain form
30063 -242810 105899 766599 863600 77421 -869113 -1130897 -776521 -518281 -679694 -913549
30053 -913549 -854751 -583648 -358845 -238524 -132659 -33457 -34400 -184848 -396240 -478309 -293274
30042 -293274 85342 414493 509678 350661 -24186 -515698 -797671 -474112 341605 864325
30032 864325 448506 -544716 -1099387 -760614 -92166 178904 70323 132930 604006 1132531
30022 1132531 1287332 1035213 638152 277852 -56911 -375322 -547158 -428681 -45362
30013 -45362 433646 847658 1076961 1003743 630293 230531 168872 502760 943525 1248384
30003 1248384 1406001 1372714 989033 384990 104862 425499 804834 517480 -275354 -656842
29993 -656842 -208599 425107 459961 -13375 -318523 -184406 20282 -52455 -265562 -287288
29983b87288K26295K47897Q4705n5724q5540n5932l794N9051K7359k15720n11643
29972e70334m59010M3371M96976L92475n8801k38918p8204r5660m17419m53777
29962a439301J28780P57875P71491L51638N7664j02608m19988o62037l50161K91876
29952f14771N16127J89444n0039J21764K81261J39696O2768L04870M24911J0344
29942A386375n58250o67824m04018l09686m78100m89996j25217L90100P80608
29933d76008R10435O43250j3029o16461o06097k1910M45775K69564l19532o83682
29923d67695n08237l2373L08255L22495J75261J22013J79693J51953k3124j45902
29913H2339p2424N6930P7500P4803J67291K22867R0979n8338K0002J89859J07277
$$ plain form
29983 -287288 -60993 186904 271609 215885 130345 74413 70619 129670 157029 -58691 -570334
29972 -570334 -1029344 -985973 -488997 -96522 -155323 -394241 -472445 -568105 -985524 -1439301
29962 -1439301 -1310521 -552646 218845 570483 628147 525539 105551 -556486 -906647 -614771
29952 -614771 -98644 90800 40761 162525 443786 583482 646250 951120 1376031 1386375
29942 1386375 828125 160301 -243717 -553403 -1031503 -1521499 -1646716 -1256616 -476008
29933 -476008 434427 1077677 1064648 448187 -157910 -179820 265955 535519 215987 -467695
29923 -467695 -975932 -1008305 -700050 -377555 -202294 -80281 99412 251365 228241 82339
29913 82339 9915 66845 144345 219148 386439 609306 700285 641947 661949 851808 959085
29902I59085k28717m92672n43577m95365l15456J41502O39352O49138J41296k11640
29892B42946N2241M85479L58037l07640p84299n95833k2663L44377K60073k6012
29882F706j16364J02122L63976L91724K58500J88071J02072k41319o50185n66796
29872a61493N3006M57597J02713n06577n21824J9102L21220O0769k03460M4529
29862c34418N15765N66204O7479m71844n27958j16076K68405K19241j14652k58963
29852a86817r0540J4764j77868l66959k42992k1406k2781o6811J74132M91863
29842d95415M42081J40053P2616K25556J42331j67341j87322J25142J61183k62373
29832A96511m65074Q342N79242M99799l6699k98577j25996K7173o8263j54335
$$ plain form
29902 959085 730368 237696 -305881 -801246 -1116702 -975200 -335848 313290 454586 242946
29892 242946 295187 780666 1138703 831063 46764 -549069 -571732 -227355 32718 6706
29882 6706 -109658 -7536 356440 748164 1006664 1194735 1296807 1055488 405303 -161493
29872 -161493 -108487 349110 451823 -54754 -576578 -557476 -236256 -175487 -378947 -334418
29862 -334418 181347 747551 815030 343186 -184772 -300848 -32443 186798 72146 -186817
29852 -186817 -277357 -262593 -440461 -807420 -1050412 -1071818 -1094599 -1161410 -987278 -495415
29842 -495415 -53334 86719 159335 384891 527222 359881 172559 297701 458884 196511
29832 196511 -268563 -260221 319021 818820 782121 483544 357548 384721 316458 162123
29822A62123q339K26173K51854p5565n85632q28506m94472J01374L02496J6130
29812i32364j30558K27038O03481M57000L7915r7348K7979L6341m5954O5511K50575
29801D99616J54458j17577j31909J14382J86401m7700k44276j84283k6587Q4616
$$ plain form
29822 162123 153784 379957 631811 556246 -29386 -857892 -1352364 -1250990 -948494 -932364
29812 -932364 -1062922 -835884 -232403 224597 262512 165164 193143 229484 183530 249041 499616
29801 499616 654074 536497 404588 518970 705371 657671 413395 229112 202525 287141
$$ [...]
##END NTUPLES=NMR SPECTRUM
##END=
