##TITLE=31Pdec_LY-17Dix.4.B
 CD3CN, 24 sc
 4.06.2021
##JCAMPDX= 6.0         $$ Bruker NMR JCAMP-DX V2.0
##DATA TYPE= NMR SPECTRUM
##DATA CLASS= NTUPLES
##ORIGIN= UXNMR, Bruker Analytische Messtechnik GmbH
##OWNER= root
$$ XWIN-NMR		Version 3.5
$$ Fri Jun  4 10:37:01 2021 Russian Standard Time (UT+4h)  she@DPX200
##.OBSERVE FREQUENCY= 81.013821
##.OBSERVE NUCLEUS= ^31P
##.ACQUISITION MODE= SIMULTANEOUS
##.ACQUISITION SCHEME= undefined
##.AVERAGES= 24
##.DIGITISER RES= 16
##SPECTROMETER/DATA SYSTEM= spect
##.PULSE SEQUENCE= zgpg30
##.SOLVENT NAME= CD3CN
##.SHIFT REFERENCE= (INTERNAL, CD3CN, 0, 248.564)
##AUDIT TRAIL= $$ (NUMBER, WHEN, WHO, WHERE, WHAT)
$$ ##TITLE= Audit trail, XWIN-NMR		Version 3.5
$$ ##JCAMPDX= 5.01
$$ ##ORIGIN= Bruker BioSpin GmbH
$$ ##OWNER= she
$$ F:/spectra/data/she/nmr/P31/1/pdata/1/auditp.txt
$$ ##AUDIT TRAIL=  $$ (NUMBER, WHEN, WHO, WHERE, WHAT)
(   1,<2021-06-04 10:36:03.12 +0400>,<she>,<DPX200>,
      <created by zg, POWCHK disabled, PULCHK disabled
       configuration hash MD5:
       00 E9 B6 7A A2 85 ED C7 34 08 36 98 17 FE 4E 26
       data hash MD5: 32K
       AE EB 7D 47 51 06 98 CB 37 1E 96 2D ED D8 C6 38>)
(   2,<2021-06-04 10:36:07.00 +0400>,<she>,<DPX200>,
      <Start of raw data processing
       efp BC_mod = 2 LB = 1 FT_mod = 6 PKNL = 1 PHC0 = -5909.353 PHC1 = 145.2705 SI = 64K 
       data hash MD5: 64K
       96 EC 91 C7 A8 8D 76 2B 75 07 A8 BC 38 94 2E 02>)
(   3,<2021-06-04 10:36:26.84 +0400>,<she>,<DPX200>,
      <pk PHC0 = -82.34569 PHC1 = 156.801 
       data hash MD5: 64K
       5F 70 32 06 5E 45 AF 1E F1 4C C6 2E C7 56 68 41>)
(   4,<2021-06-04 10:36:36.34 +0400>,<she>,<DPX200>,
      <abs ABSG = 5 
       data hash MD5: 64K
       9E 5F 5E 86 4F 37 2F AE A8 DF C1 BE E9 E5 1B 92>)
$$ ##END=
$$ 
$$ hash MD5
$$ 67 BD 5D 96 34 8C 2A 49 52 FD 1B 7D 41 F3 ED 3B
##$RELAX= 
##$RELAX= 
##$RELAX= 
##$RELAX= 
##$RELAX= 
##$RELAX= 
##$RELAX= 
##$RELAX= 
$$ Bruker specific parameters
$$ --------------------------
##$DU= <F:/spectra>
##$EXPNO= 1
##$NAME= <P31>
##$PROCNO= 1
##$TYPE= <nmr>
##$USER= <she>
##$AMP= (0..31)
100 100 100 100 100 100 100 100 100 100 100 100 100 100 100 100 100 100 
100 100 100 100 100 100 100 100 100 100 100 100 100 100 
##$AQSEQ= 0
##$AQ_mod= 1
##$AUNM= <au_zg>
##$AUTOPOS= <>
##$BF1= 81.014009
##$BF2= 200.13
##$BF3= 200.13
##$BF4= 200.13
##$BF5= 200.13
##$BF6= 200.13
##$BF7= 200.13
##$BF8= 200.13
##$BYTORDA= 1
##$CFDGTYP= 0
##$CFRGTYP= 5
##$CHEMSTR= <none>
##$CNST= (0..31)
1 1 145 1 1 1 1 1 1 1 1 1 1 1 1 1 1 1 1 1 1 1 1 1 1 1 1 1 1 1 1 1 
##$CPDPRG= <waltz16>
##$CPDPRG1= <>
##$CPDPRG2= <waltz16>
##$CPDPRG3= <>
##$CPDPRG4= <mlev>
##$CPDPRG5= <mlev>
##$CPDPRG6= <mlev>
##$CPDPRG7= <mlev>
##$CPDPRG8= <mlev>
##$CPDPRGB= <>
##$CPDPRGT= <>
##$D= (0..31)
0 1 0 0 0 0 0 0 0 0 0 0.03 2e-05 3e-06 0 0 0 0 0 0 0 0 0 0 0 0 0 0 0 0 
0 0 
##$DATE= 1622788562
##$DBL= (0..7)
120 120 120 11 120 120 24 19 
##$DBP= (0..7)
150 150 150 150 150 150 150 150 
##$DBP07= 0
##$DBPNAM0= <>
##$DBPNAM1= <>
$$ [...]
##$SUBNAM3= <"">
##$SUBNAM4= <"">
##$SUBNAM5= <"">
##$SUBNAM6= <"">
##$SUBNAM7= <"">
##$SUBNAM8= <"">
##$SUBNAM9= <"">
##$SW= 501.771253377433
##$SWIBOX= (0..15)
0 1 3 0 0 0 0 0 0 0 0 0 0 0 0 0 
##$SW_h= 40650.406504065
##$TD= 32768
##$TD0= 1
##$TE= 0
##$TE2= 300
##$TE3= 300
##$TEG= 300
##$TL= (0..7)
0 120 53 12 22 120 120 120 
##$TP= (0..7)
150 150 150 150 150 150 150 150 
##$TP07= 0
##$TPNAME0= <>
##$TPNAME1= <>
##$TPNAME2= <>
##$TPNAME3= <>
##$TPNAME4= <>
##$TPNAME5= <>
##$TPNAME6= <>
##$TPNAME7= <>
##$TPOAL= (0..7)
0.5 0.5 0.5 0.5 0.5 0.5 0.5 0.5 
##$TPOFFS= (0..7)
0 0 0 0 0 0 0 0 
##$TUNHIN= 0
##$TUNHOUT= 0
##$TUNXOUT= 0
##$USERA1= <user>
##$USERA2= <user>
##$USERA3= <user>
##$USERA4= <user>
##$USERA5= <user>
##$V9= 5
##$VALIST= <valist>
##$VCLIST= <CCCCCCCCCCCCCCC>
##$VD= 0
##$VDLIST= <DDDDDDDDDDDDDDD>
##$VPLIST= <PPPPPPPPPPPPPPP>
##$VTLIST= <TTTTTTTTTTTTTTT>
##$WBST= 1024
##$WBSW= 4
##$XGAIN= (0..3)
0 0 0 0 
##$XL= 0
##$YL= 0
##$YMAX_a= 3185
##$YMIN_a= -8617
##$ZGOPTNS= <>
##$ZL1= 120
##$ZL2= 120
##$ZL3= 120
##$ZL4= 120
##$ABSF1= 248.5645
##$ABSF2= -253.2056
##$ABSG= 5
##$ABSL= 3
##$ALPHA= 0
##$AQORDER= 0
##$ASSFAC= 0
##$ASSFACI= 0
##$ASSFACX= 0
##$ASSWID= 0
##$AUNMP= <proc_1d>
##$AZFE= 0.1
##$AZFW= 0.5
##$BCFW= 0
##$BC_mod= 2
##$BYTORDP= 0
##$COROFFS= 0
##$CY= -3
##$DATMOD= 1
##$DC= 0
##$DFILT= <>
##$DTYPP= 0
##$F1P= 0
##$F2P= 0
##$FCOR= 1
##$FTSIZE= 65536
##$FT_mod= 6
##$GAMMA= 0
##$GB= 0
##$INTBC= 1
##$INTSCL= 5.30512e-09
##$ISEN= 30
##$LB= 1
##$LEV0= 0
##$LPBIN= 0
##$MAXI= 10000
##$MC2= 0
##$MEAN= 0
##$ME_mod= 0
##$MI= 50
##$NCOEF= 0
##$NC_proc= -4
##$NLEV= 6
##$NOISF1= 182.463
##$NOISF2= 159.3651
##$NSP= 0
##$NTH_PI= 0
##$NZP= 0
##$OFFSET= 248.5645
##$PC= 4
##$PHC0= -5991.699
##$PHC1= 302.0715
##$PH_mod= 1
##$PKNL= yes
##$PPARMOD= 0
##$PSCAL= 0
##$PSIGN= 0
##$REVERSE= no
##$SF= 81.014009
##$SI= 65536
##$SIGF1= 159.3651
##$SIGF2= -187.1042
##$SINO= 113.3802
##$SIOLD= 16384
##$SREGLST= <1H.CDCl3>
##$SSB= 0
##$STSI= 65536
##$STSR= 0
##$SW_p= 40650.406504065
##$SYMM= 0
##$S_DEV= 0
##$TDeff= 32768
##$TDoff= 0
##$TI= <>
##$TILT= no
##$TM1= 0
##$TM2= 0
##$TOPLEV= 0
##$USERP1= <user>
##$USERP2= <user>
##$USERP3= <user>
##$USERP4= <user>
##$USERP5= <user>
##$WDW= 1
##$XDIM= 65536
##$YMAX_p= 409989758
##$YMIN_p= -44778098
$$ End of Bruker specific parameters
$$ ---------------------------------
##NTUPLES= NMR SPECTRUM
##VAR_NAME=  FREQUENCY,     SPECTRUM/REAL,   SPECTRUM/IMAG
##SYMBOL=    X,             R,               I
##VAR_TYPE=  INDEPENDENT,   DEPENDENT,       DEPENDENT
##VAR_FORM=  AFFN,          ASDF,            ASDF
##VAR_DIM=   65536,         65536,           65536
##UNITS=     HZ,            ARBITRARY UNITS, ARBITRARY UNITS
##FACTOR=    0.620285442955139, 1,           1
##FIRST=     20137.2065510759, 0,            0
##LAST=      -20513.1999529892, 0,           0
##MIN=       -20513.1999529892, -44778098,   0
##MAX=       20137.2065510759, 409989758,    0
$$ Real data points
##PAGE= N=1
##DATA TABLE= (X++(R..R)), XYDATA
$$ [...]
35745B63875q9822j8735K720j4340k4680n6859m2610J89692M94678L70091k53775
35734H20235o22617j61847N28115M71157j94502m86819j82802k8057k71944k22781
35724c51862L49602N73281p4399p33600m85991J69907K31598j25251k436N40522
35714I1371N77848o6654n57012m57881k43004k04153K4129N08820O38945J88772
35704E01181j71007J2542K05070j22938n26456l78919L4370P5085j24104j1170
35694e06346K89593J88516k63794m06214n8779K52578K12767J05929J72413K42627
35684B29290J69274O8315J221r5661j11533J12348L53665K45069q6243k12548
35674F73197j81269l70527n93981k48820M97185O55657p0931o87533l82726K74027
$$ plain form
35745 263875 174053 155318 158038 143698 119018 62159 19549 209241 703919 1074010 820235
35734 820235 197618 35771 563886 1035043 840541 353722 170920 142863 -129081 -351862
35724 -351862 -2260 571021 496622 -236978 -722969 -553062 -321464 -446715 -449151 91371
35714 91371 669219 602565 45553 -412328 -655332 -859485 -835356 -326536 312409 501181
35704 501181 330174 342716 547786 424848 -101608 -480527 -446157 -371072 -495176 -506346
35694 -506346 -216753 -28237 -292031 -698245 -757024 -504446 -291679 -185750 -13337 229290
35684 229290 398564 466879 468100 372439 260906 373254 726919 971988 885745 673197
35674 673197 491928 121401 -472580 -721400 -224215 431442 360511 -327022 -709748 -435721
35664d35721L41365n5437j76564K9118M0078j81786j85138J08128L47023M17948
35654B49014M40015K70110k34240o20748l22980L50248N31320P8204k97669k26040
35644B17234j11183k11599j88559J05521K23643m3208j65745K49448P02187N24777
35634A302516j08401n21501n34409m94047n39331m49535j54564J17101K22335
35625a159836K55147K84783K42257J07621j4428m3009J430O5852J02644P1608
35615h5931p863n3159k9973m353l5330q3191n8486Q3587K79720L55242J89333
35604E49596n8829r6813J1335j55724o11566o38023K09997J133421R43333k25484
35594A061243r67560n09297L39778M87378r288l50744j94526J68334L97929L19603
$$ plain form
35664 -435721 -94356 -149793 -326357 -297239 -257161 -438947 -624085 -515957 -168934 249014
35654 249014 689029 959139 724899 104151 -218829 131419 662739 740943 443274 217234
35644 217234 106051 -105548 -294107 -188586 35057 -8151 -173896 75552 777739 1302516
35634 1302516 1194115 672614 138205 -355842 -895173 -1344708 -1499272 -1382171 -1159836
35625 -1159836 -904689 -619906 -377649 -270028 -284456 -327465 -326035 -260183 -157539 -85931
35615 -85931 -93794 -146953 -176926 -181279 -216609 -299800 -358286 -274699 5021 360263 549596
35604 549596 490767 393954 405289 249565 -362001 -1000024 -790027 343394 1286727 1061243
35594 1061243 93683 -415614 -75836 411542 402254 51510 -143016 25318 423247 742850
35584G42850j00556n44966m72000J31399N33793K32606l09044m04226j44566l1125
35574c65835l4677K00136M85004K67125l70562o58092k07405M75346P19438M59807
35564I70285Q9404j08717j79067l05434n05151n09342q5362M97674O44857K10983
35554G20130k90758m46742m17111l75498j01819L85117M51615j79786o74290k09389
35544a138531O08340N34153l69499p82193j43073N74400M21069k29952m62334
35535i87620j05974L33360M90610L61581O5175k10851k69464j42438m0016N293
35525e00344J24193K47883J90423Q4568K27999M84610M08140N835k37084j72182
35515H64041j65753l44069l74892j90609j74711l48241j56544N19159Q98249M09026
$$ plain form
35584 742850 642294 97328 -374672 -243273 290520 523126 214082 -190144 -334710 -365835
35574 -365835 -400512 -200376 284628 551753 181191 -476901 -684306 -208960 510478 970285
35564 970285 1059689 950972 771905 466471 -38680 -548022 -633384 -135710 509147 720130
35554 720130 429372 -17370 -434481 -809979 -911798 -526681 -75066 -254852 -929142 -1138531
35544 -1138531 -530191 3962 -365537 -1147730 -1290803 -716403 -295334 -525286 -987620
35535 -987620 -1093594 -760234 -269624 91957 157132 -53719 -323183 -465621 -505637 -500344
35525 -500344 -376151 -128268 62155 146723 374722 859332 1267472 1273307 1036223 864041
35515 864041 698288 354219 -20673 -211282 -385993 -734234 -890778 -371619 526630 935656
35505I35656l84531n97860k42996L5118K0631K0020J48238J87324P0676r446M3752
35494B26582J24787J22506j6655k95747n43310m72673o1265L25773L57901R3480
35484a38621j76256k04234R5607M89539M54558j74737p06862l94097L56900M51700
35474E3497j82204m49746P4746M14899q3699n54273j22687M88900J74523n84029
35464g70073m76539M06613P11791N4639m40578l0582O01156O16141J90036j25513
35454G37091k78151l84590k75454P8045K79314J22251l9045O0507J29515p2785
35444C56698k17165k422K16228j3829m25143m03419M6088L31772J95111Q469R2047
35433A84435K48627J78483l3198j31068j34962k29580l35155j73557K10315L84545
$$ plain form
35505 935656 551125 -46735 -289731 -254613 -233982 -213962 -65724 121600 192276 182830 226582
35494 226582 351369 473875 457220 161473 -381837 -854510 -915775 -590002 -232101 -138621
35484 -138621 -314877 -519111 -423504 66035 520593 345856 -361006 -755103 -398203 53497
35474 53497 -128707 -578453 -503707 -88808 -172507 -726780 -849467 -360567 -186044 -770073
35464 -770073 -1246612 -839999 -128208 -73569 -514147 -544729 56427 672568 862604 737091
35454 737091 458940 74350 -201104 -123059 156255 278506 239461 299968 429483 356698
35444 356698 139533 137111 353339 339510 -85633 -489052 -442964 -111192 83919 92388 184435
35433 184435 433062 611545 578347 447279 312317 82737 -252418 -425975 -215660 168885
35423A68885J65130n1920R1452L01242J08230l03290l67026q5439M1005O393L13920
35412C88582Q17167N81030n80919j408446q50626L64895P90316K72633j79624
35403A95008j05947L3041O443J32990L87703K68469k44671n24662l08610k7184
35393a87420O7722K34782M68422K99406k73242n21781j25578K35705k4264m45287
35383b71535l19081J66542L23150Q3322j1011K82448O45253P48160N73531K53019
35373B473798m8709j62471r3477l8842k0164K49380Q37288J193936P06447m47362
35363D649824j384147j478372r65957n22096m46268m30229r8611M11033O07735
35354C42912L33683l3399j65809j86975k47793j46173K07228L67740j5171n00091
$$ plain form
35423 168885 334015 282095 373547 674789 783019 479729 112703 27264 68269 74662 388582
35412 388582 1205749 1786779 1205860 -202586 -1053212 -688317 101999 374632 195008
35403 195008 89061 122102 128545 261535 649238 917707 673036 148374 -160236 -187420
35393 -187420 -119698 115084 583506 882912 609670 87889 -37689 198016 173752 -271535
35383 -271535 -590616 -424074 -100924 -17602 -28613 253835 899088 1647248 2220779 2473798
35373 2473798 2425089 2262618 2169141 2130299 2110135 2359515 3196803 4390739 5097186 4649824
35363 4649824 3265677 1787305 821348 299252 -147016 -577245 -675856 -264823 342912
35354 342912 676595 643196 477387 290412 42619 -103554 103674 471414 456243 -43848
35344d3848m63679j02273m6701k49665j70421J25438R5780j32258R2297N98474
35334b96856M67105l07640n82433M1042M61982o3242o50922l47942K71573K70208
35324g37125L8493M09722R19418N20368m79429p73741j15504M66765M31889K80481
35314I61337K79779J6207n25037o87654l16522q8783k83337k82048K42970O62211
35304b0877M68739R5503K2706o1576m64336o35985l2187P37209O26199k62574
35294D72821p79536l76991K22814K04504k18459k82991J57323M77646K19495k64023
35284a67397l19027Q3369L12753P511l70401k05181L43367N46967J47394l09015
35274G0340k60413J57089L73772J00649m00167o27691l48166J38436L04740O3621
$$ plain form
35344 -43848 -507527 -609800 -656501 -906166 -1076587 -951149 -855369 -987627 -895330 -296856
35334 -296856 170249 -137391 -719824 -678782 -216800 -280042 -930964 -1278906 -1007333 -737125
35324 -737125 -698632 -288910 630508 1150876 671447 -102294 -217798 248967 680856 961337
35314 961337 1241116 1257323 732286 44632 -271890 -360673 -644010 -926058 -683088 -20877
35304 -20877 447862 543365 566071 504495 40159 -595826 -628013 109196 735395 472821
35294 472821 -306715 -683706 -460892 -256388 -474847 -757838 -600515 -122869 96626 -167397
35284 -167397 -486424 -403055 -90302 -82791 -453192 -658373 -315006 231961 379355 70340
35274 70340 -190073 -32984 340788 441437 41270 -586421 -934587 -796151 -491411 -427790
35264d27790q9583J81152M87074L06871j55086k99249j16058j10316l12310j98215
35254g33510K90509N12348K01612o2111R4375J38681l67057p94313l40995O02128
35244d58333R38342M64670K0713Q5145J76384j40146m86512l52384N0820J42051
35234D40750j56509l86412k47905P2862K56602K34008J38432M7861r4219l18983
35224a3513m99560m83951l32461k45907k08160N1815N60663Q30390M46616k33390
35214a27458m37042k0438L44255J62746k01506j56936K22426M00030K27232O5996
35204D79305J29573K00512Q2726q6772j35355j29511j68643j77295q9410q6M4002
35193A49046J59931L45899L57572J08726q8643R539J61405P0938n9390P5899J93392
$$ plain form
35264 -427790 -517373 -336221 150853 457724 302638 3389 -112669 -222985 -535295 -733510
35254 -733510 -443001 69347 270959 208848 303223 441904 74847 -719466 -1060461 -458333
35244 -458333 480009 944679 965392 1050537 1226921 1086775 600263 247879 298699 440750
35234 440750 284241 -102171 -350076 -277214 -20612 213396 351828 399689 305470 -13513
35224 -13513 -513073 -997024 -1329485 -1575392 -1783552 -1731737 -1171074 -340684 105932 -127458
35214 -127458 -564500 -584938 -240683 -77937 -279443 -436379 -213953 186077 413309 479305
35204 479305 608878 809390 892116 805344 669989 540478 371835 194540 105130 105044 149046
35193 149046 308977 654876 1012448 1121174 1032531 1042070 1203475 1274413 1215023 1290922 1484314
35182A484314j87694p70274p08635O6644N81959K19866l89362m08694m3164j5212
35172a70252k95445k39846K31672M71187J39728l30230m44107k11741J46990N07198
35162a94846O56508L25755l28003o87173m08556J28407L44690J29177k34209m86498
35152g54748m79051j32097L77814O00188K94182k04926l72196j35485J22862J28195
35142e55262K1391R3462L82473N91254L88233j72990n82525l99839J50277L72339
35132B88813k2388n38548n90830k66894o5159j00711k8535K90739N15557L51797
35122a66159m384j85527j65359j69147k23004j27642J25950K41552N6430j51541
35112g68831k8763L21940M50474J66779k33970l95870k94358j04748P4908K04631
$$ plain form
35182 1484314 1296620 526346 -182289 -115645 466314 686180 296818 -111876 -155040 -170252
35172 -170252 -465697 -705543 -473871 -2684 137044 -193186 -637293 -849034 -702044 -194846
35162 -194846 461662 787417 459414 -227759 -636315 -507908 -163218 -34041 -268250 -754748
35152 -754748 -1233799 -1365896 -988082 -387894 -93712 -298638 -670834 -806319 -683457 -555262
35142 -555262 -533871 -440409 -57936 533318 921551 748561 166036 -233803 -83526 288813
35132 288813 266425 -272123 -862953 -1129847 -1195006 -1295717 -1324252 -1033513 -517956 -166159
35122 -166159 -170543 -356070 -521429 -690576 -913580 -1041222 -915272 -673720 -617290 -768831
35112 -768831 -797594 -475654 -25180 141599 -92371 -488241 -782599 -887347 -812439 -607808
35102f07808K09116J02831N2677J22494J14692j08807l04513j37135K96194N36000
35092B75741L42326n6805l11084l10622j75051p0505o3585l6089J90786N11504
35082B96616M85851r6247p52851q00056k48199K16633J76456m7187j5677J66638
35072f18023J20125j64414l04644o5644L39845N11668L11804K3387L4487L31042
35062E19633M37493K9864n36372o11790j01564M25333M88869J96150q2103j65441
35052F00072o8332J03114J08361k31776o27350m84302K69582Q87928O89072n1943
35042A194426n08146l91175j56641j85411k69920p5948K62157L20121J5881k43466
35032c8122j07663K29184K75099r1169m34673l19432J61607N60138N94223L05919
$$ plain form
35102 -607808 -398692 -295861 -243184 -120690 -5998 -114805 -419318 -556453 -260259 275741
35092 275741 618067 561262 250178 -60444 -235495 -306000 -369585 -405674 -214888 296616
35082 296616 782467 686220 -66631 -866687 -1114886 -898253 -721797 -768984 -784661 -618023
35072 -618023 -497898 -662312 -966956 -1032600 -692755 -181087 130717 154104 188591 519633
35062 519633 957126 986990 450618 -161172 -262736 162597 651466 847616 765513 600072
35052 600072 531740 634854 743215 511439 -115911 -600213 -330631 557297 1246369 1194426
35042 1194426 686280 295105 138464 -46947 -316867 -392815 -130658 189463 205344 -38122
35032 -38122 -145785 83399 358498 267329 -167344 -486776 -325169 234969 829192 1135111
35022A135111j24788m72605n14572k60140k5165k9536q2604N6513K45533K62745
35012A90492K63381M17061L74373k02235p77828n01050L99119P57720J96528l32017
35002G85544j24709J95208j40300p09656o58567r9689K37897K61154L91972N40252
34992F79106K61419k25772k33500J80886K11297l29442o11172j07803N28373M41970
34982G95362j93379n17330j94120K80173L50288N0940j64600l6139J81097O2399
34972F14691l48667n06580j35259K95151K35551r9678j12300J63540J36492k70389
34962b7448m05104M5123M97218L76177l2986j50150l8421j57166m70327m72139
34952h35223m2680L26136K76858P2019R6123K41852J49904j39689k11761L4689
$$ plain form
35022 1135111 1010323 537718 23146 -236994 -262159 -291695 -374299 -317786 -72253 190492
35012 190492 453873 870934 1245307 1043072 265244 -235806 163313 921033 1117561 785544
35002 785544 660835 856043 715743 6087 -652480 -752169 -514272 -253118 138854 679106
34992 679106 940525 714753 481253 662139 873436 543994 -67178 -174981 353392 795362
34982 795362 601983 84653 -109467 170706 520994 571934 407334 371195 552292 614691
34972 614691 266024 -240556 -375815 -80664 154887 55209 -57091 106449 242941 -27448
34962 -27448 -432552 -387429 109789 485966 452980 302830 264409 107243 -363084 -835223
34952 -835223 -877903 -551767 -274909 -202890 -106767 135085 284989 145300 -66461 -31772
34942c1772J57068j37009m28699j63524M13740M92250j10721o24521m42118L5363
34932h39943J09736j61740k17961M6050K33581J88804J48447K03789J74455J8139
34922i6643j12235j89793k51228j25783K71576N30689K47151j94277p6185M48932
34912D52204M64279k64092q24470m91696K60744N63694L25442N9397L6837J50699
34902G33038K64136K44865l5624l93120l89456j2251J59926j58308m19821q2905
34892h9520M83560N37156N0297l68313l94815k25406n9880P8697J13542M232l4552
34881I4998J46726K48998m5386m16020k60231L42790O25672J90500m48395n87171
34871a07519k09154J28949P0647j51522j06225K00724K74482j57849o05868l97509
$$ plain form
34942 -31772 125296 -11713 -440412 -603936 -190196 302054 191333 -433188 -875306 -839943
34932 -839943 -730207 -891947 -1109908 -1063858 -830277 -641473 -493026 -289237 -114782 -96643
34922 -96643 -208878 -398671 -649899 -775682 -504106 26583 273734 79457 3272 452204
34912 452204 916483 652391 -172079 -663775 -403031 160663 486105 545502 582339 733038
34902 733038 997174 1242039 1206415 813295 423839 411588 571514 413206 -6615 -89520
34892 -89520 394040 931196 981493 613180 218365 -7041 -66921 11776 125318 129550 94998
34881 94998 241724 490722 445336 29316 -230915 111875 737547 928047 479652 -107519
34871 -107519 -316673 -187724 -117077 -268599 -374824 -174100 100382 -57467 -663335 -1060844
34861a060844K87411N66157J32570l19682k46282m8862j91784k88123J43479O46523
34851c79437N18999O5230P8176L98192J84867n02590o72392o3438M09873J92746
34841B30226j31539q6245j51117o42052q01795L606R73315Q75316j18980p08341
34831e57606l36321K54583L28588O5030m2020O4227J82181K65840L28673K61184
34821H14359J0746k58839l64833l23117k67934k65632k60000j32450J57381M25379
34811d64940L73364k1443l63114k78113J07487L47850K51291M1863r486J11517
34801I6276K32671J93812l2257k85450l05601j746L88996N26245L24135q508k37279
34790H91294l05251k90710k48021j16659J74882M74144M09071j57062p63805p83360
$$ plain form
34861 -1060844 -773433 -207276 -74706 -394388 -640670 -689532 -881316 -1169439 -1025960 -379437
34851 -379437 139562 204792 282968 681160 866027 363437 -308955 -372393 37480 230226
34841 230226 98687 12442 -138675 -780727 -1582522 -1578916 -605601 269715 150735 -557606
34831 -557606 -893927 -639344 -310756 -245726 -287746 -223519 -41338 224502 553175 814359
34821 814359 825105 566266 201433 -121684 -389618 -655250 -915250 -1047700 -890319 -464940
34811 -464940 -91576 -113019 -476133 -754246 -646759 -298909 -47618 -5755 -15241 96276
34801 96276 328947 522759 490502 205052 -100549 -102295 286701 812946 1137081 1128573 891294
34790 891294 586043 295333 47312 -69347 105535 579679 988750 831688 67883 -715477
34780g15477k29712K39569K23858N3394J53836L78954L41151N9468j60235k48089
34770I6717l22026k95137n863L47205L60845J8112k65141k07668N5943K69386
34760E2373L10935J47345j56996l65936k93960j07188j17579k91422k79844N0936
34750a051336M41013O18318N50528K96168o1400k91505j84863P3448N3099k91997
34740A51473n08312l09136J9449J12604P8151K18166M46357L87545j4936l51798
34730B29563k80261L4095J57702k4651j47121J28744N69072N84683K9815n32322
34720G49319n63365k33673l0735J2545J75132L39927J18015l27640l36281J71405
34710G4649M08522q8410o60906m96632J55586M58924K84899J98403L25415J48879
$$ plain form
34780 -715477 -945189 -705620 -481762 -428368 -274532 104422 445573 505041 344806 96717
34770 96717 -225309 -520446 -526309 -179104 181741 199853 -65288 -272956 -217013 52373
34760 52373 363308 510653 353657 -12279 -306239 -413427 -531006 -822428 -1102272 -1051336
34750 -1051336 -610323 7995 558523 854691 793291 501786 316923 390371 443470 151473
34740 151473 -356839 -665975 -646526 -533922 -455771 -237605 208752 596297 581361 229563
34730 229563 -50698 -16603 141099 116448 -30673 98071 667143 1251826 1281641 749319
34720 749319 185954 -47719 -78454 -65909 109223 449150 567165 239525 -96756 74649
34710 74649 483171 394761 -266145 -762777 -607191 -148267 136632 335035 660450 809329
34700H09329m40637p25816j99506N73831O63586R298n66392m50633J03971M37095
34690B14126K48004k16289n22347m37922n0832L49190M91908L11430k6567k75971
34680H4730l12269k03298r0519k4212N6495J93652L15780L08965J65632J9850
34670E14806K128O7981L6283j55998l22434k77142j40697j66514k79404j26905
34660h47896K93076M55379O0510l96730k76905K41869M22397N3972l54955m45233
34650g94516l74627k18300K37355Q08312P77517l8112p22494m26091L88610O14057
34640B51711O1029m67100m74828k72282j53219O1603M10322M59524P641m26422
34630e42021k98524J50538K72208l2825k35094J010L61924L77058O6151j42443
$$ plain form
34700 809329 368692 -357124 -556630 17201 680787 690085 123693 -326940 -222969 214126
34690 214126 462130 245841 -276506 -714428 -765260 -416070 75838 387268 360701 84730
34680 84730 -227539 -430837 -521356 -545568 -489073 -295421 20359 329324 494956 514806
34670 514806 516934 584915 621198 465200 142766 -134376 -275073 -441587 -720991 -847896
34660 -847896 -554820 -99441 -38931 -435661 -712566 -470697 -48300 5672 -349283 -794516
34650 -794516 -1169143 -1387443 -1150088 -341776 435741 397629 -324865 -750956 -362346 251711
34640 251711 312740 -154360 -629188 -901470 -1054689 -993086 -582764 -123240 -115599 -542021
34630 -542021 -840545 -690007 -417799 -450624 -685718 -684708 -322784 54274 120425 -22018
34620b2018l6562R8956p0249l89108l94343J12L47348L21329J61535J89121K27684
34609D33805l9612l69232j98865M39711Q24045M92359j85672n84993n61725l76605
34599a26784k31992j65160j60504j31559K3945K08721K00083M6814O7421L00231
34589C1216L50974M1765k06644j5410L19499L20523J15448J22932K03171j23703
34579A159771o78273o82048l676M65407J01229m91059m15535J73498M40884K14634
34569B84832O9422J97546J42749k10537l03155P9016K89061j11956n02715j78259
34559b43996M05825L07465l53792n86370j42745J75068l6183j50453K51752N52581
34549A79152J77898l42501k39458K13619K17349k02237l38773m2248J70815J40996
$$ plain form
34620 -22018 -58580 40376 -29873 -418981 -813324 -813212 -465864 -144535 17000 206121 433805
34609 433805 394193 24961 -173904 265807 1089852 1582211 1396539 811546 249821 -126784
34599 -126784 -358776 -523936 -684440 -815999 -792054 -583333 -383250 -336436 -269015 31216
34589 31216 382190 423955 217311 201901 521400 841923 957371 1080303 1283474 1159771
34579 1159771 481498 -200550 -204226 261181 362410 -128649 -544184 -370686 70198 284832
34569 284832 354254 551800 694549 484012 180857 259873 548934 436978 -65737 -243996
34559 -243996 161829 469294 115502 -470868 -613613 -438545 -474728 -625181 -373429 179152
34549 179152 357050 14549 -224909 -11290 206059 3822 -334951 -377199 -206384 -65388
34539f5388K26998M01539J56879m64390o60931r7860M57230K62503k87649l28270
34529c99339J75353N06459L18789j4835j22426j02814j76502l21506m33504n28771
34519a099096n80235l71266K24852Q81730R92887L32829n75395r38574n29435
34510a661703J38629M90770M81479L79691K74727J10347M547J32886L58621L54966
34500A064960R7043j04921q2001P773K294p7714k13665m31952n76011l62809J78240
34489d98763N83158M59264l4332l51262j39174L84770O14697J92332n06748p40495
34479c6553l44772M8560l7947k33750k7849L09272K06209j56775j22638K97742
34469i8501M62721K29109R8805J83046J7313m04731m39622L9277L04518L7881
$$ plain form
34539 -65388 161610 563149 720028 255638 -405293 -503153 -45923 216580 -71069 -399339
34529 -399339 -223986 282473 601262 586427 464001 361187 184685 -136821 -570325 -1099096
34519 -1099096 -1679331 -2050597 -1825745 -944015 48872 381701 -193694 -1132268 -1661703
34510 -1661703 -1523074 -1032304 -550825 -171134 103593 213940 218487 351373 709994 1064960
34500 1064960 1162003 1057082 975081 982854 985148 907434 693769 261817 -314194 -677003 -498763
34489 -498763 84395 543659 509327 158065 18891 403661 1018358 1210690 703942 -36553
34479 -36553 -381325 -332765 -370712 -604462 -632311 -323039 -116830 -273605 -396243 -98501
34469 -98501 364220 593329 692134 875180 892493 487762 48140 87417 391935 429816
34459D29816j10538K05516K78098l42827q23710l70628L12405J30567n20997l99521
34449a211819M59346P66998R0380n20409k89856J93465J68477r9900k4336K17933
34439b49721J15466j78475r3829L47864N10326J33748k45649p5497M02548M71691
34429A138472n4848n33051l49495K12309L49881j23454n24426k96359K32008L82955
34419D33992M1795l40851l93753j16255K76834M99785L65192L5462j18068o4753
34409F19380j65799m85138n37952o1571M62143M94244J84759m2830j70830l09781
34399a3375k38139J38564L24636o5827n63995n36123j88949p7223n4539L24643
34389i50327P31000M82099j86241l95247m9094J54936P1995K32106N64163L17653
$$ plain form
34459 429816 319278 524794 802892 460065 -363645 -734273 -421868 -291301 -812298 -1211819
34449 -1211819 -752473 14525 104905 -415504 -705360 -511895 -343418 -443318 -467654 -249721
34439 -249721 -134255 -312730 -406559 -58695 451631 585379 339730 264233 666781 1138472
34429 1138472 1083624 550573 201078 413387 763268 639814 115388 -180971 51037 433992
34419 433992 475787 134936 -258817 -375072 -98238 401547 766739 802201 684133 619380
34409 619380 453581 -31557 -569509 -631080 -168937 325307 510066 467236 296406 -13375
34399 -13375 -251514 -112950 211686 145859 -418136 -954259 -1143208 -1220431 -1274970 -950327
34389 -950327 -219327 262772 76531 -318716 -367810 -212874 -140879 91227 655390 973043
34379I73043m77147p74231j87134L32321Q1744k89860j8203M85425M76101J48548
34369G50607J06547K28551L1719l24399l27122o5103n4305l37585m77316k69827
34359g38233J22150N32521P54930M29765m45344j140157r34320p4167N53029N49158
34349c90668K86432J77594J87834Q6678j77776l95595k54165K76433O70697L40124
34339H07588m67835p87671k31080M21670L57953j27772k28876J39568M13560L36997
34329F34102J29120o8786k52793k56701k005J62671l4089k13409M9886L45158
34319D93154r433o96521o69641K38779R38716O14120j94345n00728k10556M0151
34309D3696l9513j14822R6737L72217L23186n7587l61987k64445P2255K36352
$$ plain form
34379 973043 495896 -278335 -465469 -133148 -51404 -341264 -359467 125958 602059 750607
34369 750607 857154 1085705 1117424 793025 465903 400800 346495 8910 -468406 -738233
34359 -738233 -616083 -83562 671368 1101133 655789 -484368 -1418688 -1492855 -939826 -390668
34349 -390668 -104236 73358 261192 347870 170094 -225501 -479666 -203233 467464 807588
34339 807588 339753 -447918 -678998 -257328 100625 -27147 -256023 -116455 297105 634102
34329 634102 763222 694436 441643 184942 182937 345608 311519 98110 147996 493154
34319 493154 483721 -212800 -882441 -643662 295054 909174 714829 214101 3545 43696
34309 43696 4183 -110639 -13902 358315 681501 623914 261927 -2518 69737 306089
34299C06089J53862J40160K99301K78695j13026m42140k40997K32355L45321J5031
34289I74651k62278k08539m7272m135k9386n8688j07731p1004J58523L51508J50106
34278H45755l56506o85540o21784m01238k08630L9273L25815M20024K81153J72103
34268a89575K17625K18653M4457j43113j83106j02260O9100L08569L89536R5065
34258G24951k99135k74180Q6505J07115l89451o63314j69350N15389N07596o9770
34248G6356l25996O5097N09048M39644l6657n29188q02682o69854j7712P67099
34238e24845Q96372J26480p43928p90833j33261L34533K21586J8335J54997L58681
34228h1883K53255J9817k9903q7880m33459p00862l20688M28435O30890P9507
$$ plain form
34299 306089 459951 600111 899412 1178107 1065081 622941 381944 614299 959620 974651
34289 974651 712373 503834 456562 452427 423041 364353 256622 185618 344141 695649 845755
34278 845755 489249 -196291 -818075 -1219313 -1427943 -1388670 -1062855 -642831 -361678 -189575
34268 -189575 28050 246703 291160 148047 -35059 -137319 -68219 240350 629886 724951
34258 724951 425816 151636 238141 345256 -44195 -707509 -876859 -361470 146126 76356
34248 76356 -249640 -184543 324505 764149 727492 198304 -604378 -1274232 -1291944 -524845
34238 -524845 371527 498007 -245921 -1036754 -1170015 -835482 -613896 -595561 -440564 -81883
34228 -81883 171372 191189 161286 73406 -360053 -1060915 -1381603 -953168 -322278 -242771
34218b42771m01710k20816J96495K77811J72545J77237L2331m34900n93756R6626
34208i40908R12419O85383l89205r12545l10345M29301L52525j67929k78594O5799
34198e54099L40390L60663K57167j6478m69441o73910k32183N23698Q60830N72646
34188I69283J03821j45496j71840q9604L6170N9777j48376m22294m37183j64864
34178d10606R2195J39587P0137k2905j89695l80654l55591j7542L63403M52931
34168b58740K59118O6812M4128Q4912L1319r4237j42531n5052N1035K7028j14990
34157a01198j93697n8990K08634L34166J34938k17144l07314M5057M81086M60843
34147G86381n5619n19124m93816j92393p8272j68411j10590J57618K85202R8633
$$ plain form
34218 -242771 -644481 -865297 -668802 -390991 -218446 -41209 -8878 -443778 -1037534 -940908
34208 -940908 -28489 656894 267689 -644856 -955201 -525900 -173375 -341304 -619898 -554099
34198 -554099 -213709 146954 404121 387643 -81798 -755708 -987891 -464193 396637 969283
34188 969283 1073104 927608 755768 666164 702334 762111 613735 191441 -245742 -410606
34178 -410606 -318411 -178824 -108687 -131592 -321287 -701941 -1057532 -1075074 -711671 -258740
34168 -258740 378 67190 111318 196230 227549 133312 -9219 -64271 -13236 13792 -101198
34157 -101198 -294895 -353885 -145251 188915 323853 106709 -200605 -155548 325538 786381
34147 786381 730762 211638 -282178 -474571 -552843 -721254 -831844 -674226 -389024 -290391
34137b90391j14739r0318K0567N82j3630J81372L79693K22332j50525j80924K69121
34126B33140N90898K25716m99890p41865k53103L04201K75862j41868k86502j000
34116b94411K33987R8637j23930q4021O8243J151j77235n3994M03405P07227M77392
34105A256451q5158m83116m82940k55553p7860k5261M6595K46782M15173K63722
34095H18835j96694n52149m77032j75099r1823k96451m30454k20509K33954O55454
34085g31968P96606N02701r3035m48505j00020O40029R03328L74533k51314k39226
34075A353129J57319J36878m22357p99173n19622k0707M9718k32634k66218J42749
34065d20918N12352L84127q4907l96271l25596n4735J51292J80750P8916M324
$$ plain form
34137 -290391 -405130 -495448 -474881 -474299 -487929 -306557 73136 295468 144943 -35981 233140
34126 233140 824038 1049754 549864 -192001 -445104 -140903 134959 -6909 -293411 -294411
34116 -294411 -60424 38213 -85717 -169738 -101495 -100344 -277579 -331573 71832 779059 1256451
34105 1256451 1171293 688177 205237 -50316 -128176 -153437 -106842 139940 555113 818835
34095 818835 622141 69992 -407040 -582139 -673962 -970413 -1400867 -1621376 -1387422 -731968
34085 -731968 64638 567339 474304 25799 -74221 565808 1469136 1843669 1592355 1353129
34075 1353129 1510448 1647326 1224969 425796 -93826 -114533 -64815 -297449 -563667 -420918
34065 -420918 91434 475561 390654 -5617 -331213 -385948 -234656 -53906 25010 29334
34055B9334J07005K95457K59275p6232l14767j36122J14111j22854o64399p16702
34045a225894o3352N46917M98641J53614J25679K88107J57780j52281j36593J59850
34035C52468J83400j75805l98699k03028M9643L60k01944k73119k06374o2862
34025i35960K40148O44222P82426M15848j59254m05169j45426K82308M00592N1955
34015A171690m37197n63466k13790J72471J64630j07448k28236j37284j01154
34006b79784j58723n9765K40216M58861M18743K28696N422k11324k58521J6568
33996D00389L80521L86902j3013m18637n60377n18187l67875q9680J48627J24481
33986e26849O951J39360L73736K49447j38244j95685J25416J85187j82174k64367
$$ plain form
34055 29334 136339 431796 691071 614839 300072 163950 278061 155207 -509192 -1225894
34045 -1225894 -1289246 -742329 -243688 -90074 35605 323712 481492 329211 192618 352468
34035 352468 535868 360063 -38636 -241664 -192021 -191661 -393605 -666724 -873098 -935960
34025 -935960 -695812 -51590 730836 1146684 987430 582261 436835 719143 1119735 1171690
34015 1171690 734493 171027 -42763 129708 294338 186890 -41346 -178630 -279784
34006 -279784 -438507 -498272 -258056 200805 619548 848244 853666 642342 383821 400389
33996 400389 780910 1167812 1154799 736162 175785 -342402 -710277 -799957 -651330 -526849
33986 -526849 -519898 -380538 -6802 242645 104401 -91284 34132 219319 37145 -227222
33976b27222L14191Q39709O02330j9898l00460l01158m26683m39477Q2932O94233
33966H18497N36940k90678q00883n50585j09947J2830N7560L33661N64416L46568
33956I18379j70114m67534l09908N1889K12560J7247l01030l72727j13901K13355
33946c21784L92416M44858L47307l2420m85656m42922J77400N78771J22259o63279
33936A16950q10937l16634K7525p623J37019O36518Q47389L53711l24214m85895
33926A73809j57166J48287J48249n5228k14077j05887K35945L84971L88n44534
33916A4757n41517m141L03332M3326k22095l7933K21643J23434k6467K02292N11809
33905E88440L68390o6987k50193j82113k52980l86152j63125K84456L47644k9372
$$ plain form
33976 -227222 86969 926678 1529008 1509110 1208650 907492 480809 41332 124264 818497
33966 818497 1355437 1064759 263876 -286709 -396656 -383826 -326266 7395 571811 918379
33956 918379 748265 280731 -29177 22712 235272 252519 -48511 -421238 -535139 -321784
33946 -321784 70632 515490 862797 830377 344721 -98201 79199 657970 780229 116950
33936 116950 -693987 -1010621 -983096 -990719 -853700 -217182 630207 983918 659704 173809
33926 173809 16643 164930 313179 257951 43874 -62013 173932 558903 559291 14757
33916 14757 -526760 -530901 -227569 -184243 -406338 -444271 -222628 -99194 -125661 76631 588440
33905 588440 956830 889843 639650 457537 204557 -181595 -344720 -60264 287380 258008
33895B58008j98532J11925L35256M3055l02226j05926L59041L63121j40843m54459
33885B68420j76758K70438L17000R334j83704q0624L5823q7941k95594k65707
33875a89313J4150K17172J10661j56626k68477j04859K06024M69426N21798K71114
33865A091070j64646m36310k99621O2167K62403K08684J12961M4787j54722m38031
33855B88742m45514o7617K48577J01340k30677j79621K53224N04944K84069o5851
33845F91616j26419O2197J90174J05665j13871l00297k86906o2148J10730k4222
33835B46519k82353k29819J16228K19988j33338m01012o5033N41493O91089K86750
33825I90512j11205j45653q342M2642K31j07187k93872l89108j45016L10677N10177
$$ plain form
33895 258008 59476 171401 506657 549712 247486 141560 500601 863722 722879 268420
33885 268420 91662 362100 679100 688434 504730 424106 459929 371988 76394 -189313
33875 -189313 -175163 42009 152670 -3956 -272433 -377292 -171268 298158 819956 1091070
33865 1091070 926424 490114 190493 252660 515063 723747 836708 881495 726773 288742
33855 288742 -156772 -224389 24188 125528 -105149 -284770 -31546 473398 757467 691616
33845 691616 565197 627394 817568 923233 809362 509065 222159 160011 270741 246519
33835 246519 -35834 -265653 -149425 70563 -62775 -463787 -528820 12673 703762 990512
33825 990512 879307 733654 725312 767954 768185 660998 367126 -21982 -166998 143679 653856
33814F53856K73174n1474j20526k9152k3407r9495j22501r1624n5635K7821J32730
33803D93767O3031k47878m89629k96235K40425O09804M69237N0867j01324K17170
33793A009235N68604L55557l81046q79434n51317K57741P07552N13174J64516
33784A764582J45090L61238M42061K56274k3446j49501j0139K21404J90692j67416
33774C030839m02233j36066K87612K49835j55394k28132J99705M61313J35096
33765C442575k64433j02659M23039O58446M21155M6353k16193l79464m67355m68179
33755C093285m29171l56476j79661L2840Q3303R291R0781L25676L20209n9347
33745B930730l73809k58330M9141J69180J46871J83133K09076J22919P1092J25060
$$ plain form
33814 653856 927030 875556 755030 725878 702471 602976 480475 388851 333216 361037 493767
33803 493767 556798 308920 -180709 -476944 -236519 373285 842522 893389 792065 1009235
33793 1009235 1577839 1933396 1552350 672916 121599 379340 1086892 1600066 1764582
33784 1764582 1909672 2270910 2712971 2969245 2945799 2796298 2786159 3007563 3198255 3030839
33774 3030839 2628606 2492540 2780152 3029987 2874593 2646461 2846166 3307479 3442575
33765 3442575 3178142 3075483 3498522 4156968 4578123 4624476 4408283 4028819 3561464 3093285
33755 3093285 2664114 2307638 2127977 2160817 2244120 2253411 2344192 2669868 2990077 2930730
33745 2930730 2556921 2298591 2347732 2516912 2663783 2846916 3055992 3178911 3250003 3375063
33735C375063P9420q9770n2962K20908K33725j52082k67358K77168P34896K99016
33725D658024n32723o50010K0822N81444N84430L47993N5426l66276n60331o1855
33715D076944O49562N47289l15250o92329P437Q29446P31471k108m30187k83691
33705E118584M7472K85507L69756J87043k42970n79696n53384k91314j1223K54044
33695D583819M15293K59067j17738k62563l7974J22587q6117l80295m48035m53566
33685C594478n86234o03196k87060P0910J25211K8469N5027N8721j70309l65544
33675A920473j92427Q2304l5401l99128l83862J23898N20329L69837k6979j55971
33665A823073N373P2935j59822m69446m97877j61696K77818N07246M28107J13335
$$ plain form
33735 3375063 3454483 3364713 3311751 3532659 3766384 3614302 3346944 3624112 4359008 4658024
33725 4658024 4125301 3475291 3496113 4077557 4661987 5009980 5065406 4699130 4138799 4076944
33715 4076944 4726506 5273795 4958545 4266216 4273653 5103099 5834570 5832462 5402275 5118584
33705 5118584 5166056 5451563 5821319 6008362 5765392 5185696 4632312 4340998 4329775 4583819
33695 4583819 4999112 5258179 5140441 4877878 4839904 4962491 4876374 4496079 4048044 3594478
33685 3594478 3008244 2405048 2117988 2188898 2314109 2342578 2397605 2456326 2286017 1920473
33675 1920473 1728046 1810350 1774949 1375821 991959 1115857 1636186 2006023 1979044 1823073
33665 1823073 1828446 1901381 1741559 1272113 774236 612540 890358 1397604 1825711 1939046
33655A939046l10270n73601l07414M48677R53001N25714m22287p70084k23681
33646A259101K53334j06491p21406n91370J80479O26720L90553P8290J37394K10115
33636A716719j08710m99620l88196J30992L53659n5447n38990l45327M20781Q32386
33626A518247L47598m01960m35294K12054N56245Q4696n73704o22538j17282L70183
33616I38245N70543N22493K05109k88383n41817l20279p198k7766j49852M9250
33606I50345L25235J10209m53855o11664j22140M42326N93063M19958Q7960m11159
33596A330278p83533m72540M27320R54469M85122l77293o64201l35073p6415j45358
33586C42776j40809J67884M51852L74451O3595j26056l6405J97463K80679Q446
$$ plain form
33655 1939046 1628776 1055175 747761 1196438 2149439 2675153 2252866 1482782 1259101
33646 1259101 1512435 1405944 684538 93168 273647 900367 1290920 1369210 1506604 1716719
33636 1716719 1608009 1108389 720193 851185 1204844 1149397 610407 265080 685861 1518247
33626 1518247 1865845 1463885 1028591 1240645 1796890 1881586 1307882 685344 568062 938245
33616 938245 1508788 2031281 2236390 1948007 1406190 1085911 1078713 1050947 901095 950345
33606 950345 1275580 1385789 931934 320270 198130 640456 1233519 1653477 1741437 1330278
33596 1330278 546745 74205 501525 1455994 1941116 1563823 899622 564549 488134 342776
33586 342776 201967 369851 821703 1196154 1259749 1133693 1097288 1294751 1575430 1583876
33576A583876m29329n13972l5226M95741M44894o3863l45171j78286n9688l13648
33566E85328n34575k34329L92492P35094N16987m1575n67828p56490m88819j5689
33556d09404K01799O5332l7450R5764J21789j71050l17316J13268O58442N43468
33546H64642j26879n17289k74446J60441L79759L92641K13086j63169l79359r9846
33536D49581K72789J29764j98257Q9408P11327N89720j79128k51335O59838J253131
33526C526838J202494K113615M365748N066808J674923l619825o015727m150576
33518D164298j250703k36746n64338o17937m76579p80789r17719j68143O63016
33509a85640M42958l83891n73251m7224K92490J73149Q4470J65821J04143q9370
$$ plain form
33576 1583876 1154547 640575 605349 1101090 1545984 1482121 1136950 958664 898976 585328
33566 585328 50753 -183576 208916 944010 1460997 1419422 851594 95104 -393715 -409404
33556 -409404 -207605 -142273 -179723 -83959 37830 -133220 -450536 -337268 321174 864642
33546 864642 737763 220474 -53972 106469 486228 878869 1091955 928786 549427 449581
33536 449581 722370 852134 653877 743285 1454612 2044332 1865204 1613869 2273707 3526838
33526 3526838 4729332 6842947 11208695 16275503 17950426 14330601 8314874 4164298
33518 4164298 2913595 2676849 2112511 1494574 1017995 237206 -680513 -848656 -185640
33509 -185640 257318 -126573 -699824 -747048 -454558 -281409 -196939 -31118 73025 -16345
33499a6345j51227j85494l98008n02201j65840K75282L17775J55585K65317M92258
33489H7102L75820M8173m8338l0712k74205n26913k76765K05216J83757k79186
33479e36051l79160J04206M96607L51928m95j80462k03692n0062L98079P97408
33469G98306N37079k60105p12096m35524m6056o2114j23975J93932N32810L62929
33459G85186j08894l20600k36302j99230k28116j11188L0204p4202k32896k1525
33449g17563M05534L90377k13809p00076m56598K13952N88360M81503K69606J73726
33439D35012K8904k47570m22748l23340r9932N4999J61330K43765J74042m1721
33429c7259j19266O2105J77908j2211j75845N8558L78832K38797j83413k36144
$$ plain form
33499 -16345 -167572 -353066 -751074 -1253275 -1419115 -1143833 -826058 -670473 -405156 87102
33489 87102 462922 511095 462757 432045 157840 -369073 -645838 -440622 -256865 -536051
33479 -536051 -915211 -811005 -314398 37530 37035 -143427 -347119 -397181 898 798306
33469 798306 1335385 1075280 363184 -72340 -118396 -180510 -304485 -110553 422257 785186
33459 785186 676292 355692 119390 -79840 -307956 -419144 -388940 -463142 -696038 -717563
33449 -717563 -312029 78348 -135461 -835537 -1292135 -1078183 -489823 -8320 261286 435012
33439 435012 463916 216346 -206402 -529742 -629674 -574675 -413345 -169580 4462 -37259
33429 -37259 -156525 -94420 83488 71277 -104568 -46010 332822 571619 388206 152062
33419A52062R6266J92315o4048q4551K71546L41662j30767m12689j8391L91458
33409G34863J38122k83203j11160K81578L9711o03126o40983L7156N07531L19727
33399D20216O016l8149j04213l36691l31666M8838L04347J52717N737J59656K35668
33388E22476o6694l27524j24833J66561r003l84307k51954L41219N54242j6250
33378D03933o94344o02353K00652Q20642O40135q586l66265j90849R6030J22408
33368D21403L4645J06697K44858K05611O1436O4926J96264K25639J19276Q262
33358A689017j42777m25140o23226m17096N9837L08526J46196j13306j99702j79708
33348A02621j41103k1270J17825M8775k08794k81924M3215M61111M85515r144
$$ plain form
33419 152062 248328 440643 376595 292044 563590 905252 774485 361796 343405 734863
33409 734863 872985 589782 478622 760200 799911 196785 -444198 -407042 100489 420216
33399 420216 426232 388083 283870 -52821 -384487 -335649 -31302 121415 127152 286808 522476
33388 522476 455782 128258 3425 169986 160983 -223324 -475278 -134059 420183 403933
33378 403933 -290411 -892764 -692112 128530 768665 760079 393814 202965 298995 421403
33368 421403 456048 562745 807603 1013214 1074650 1139576 1335840 1561479 1680755 1689017
33358 1689017 1546240 1121100 497874 80778 140615 449141 595337 482031 282329 102621
33348 102621 -38482 -59752 58073 106848 -101946 -383870 -340655 120456 605971 596827
33338E96827o63191r16775m73267L20102O80519K70329k95739k24425L53048O07415
33328B54843K50025j32689o9754J53613J04157j36991k65105k45658j80620o3019
33318c31198M5070m0549k44421k05701R0604J24342l35109o74709k45131N98825
33308a217977Q77089K81038m69185n86618p6547M78179O33411L92263P373k94322
33298B4704m00856k81109J072K31026J74789r7675j84288J26055M61006L34035
33288C88759j10458k75771k6018J10788j93855n16915l11605K93635O93956N73283
33278F25799J57884j33197n8582K68604M09913J2723o59080q75589l26974M14599
33268a63900N80658J21502l51147l56618Q911L11332K27994j76746m90077l63056
$$ plain form
33338 596827 -66364 -983139 -1456406 -1136304 -455785 -185456 -481195 -705620 -352572 254843
33328 254843 504868 372179 302425 456038 560195 423204 158099 -87559 -268179 -331198
33318 -331198 -286128 -326677 -571098 -776799 -686195 -561853 -896962 -1571671 -1816802 -1217977
33308 -1217977 -340888 -59850 -529035 -1115653 -1192200 -714021 -80610 311653 319026 24704
33298 24704 -376152 -657261 -656189 -425163 -250374 -348049 -532337 -406282 54724 388759
33288 388759 278301 2530 -23488 87300 -106555 -623470 -935075 -641440 52516 625799
33278 625799 783683 650486 591904 860508 1270421 1283144 624064 -251525 -578499 -163900
33268 -163900 416758 538260 187113 -169505 -160594 150738 378732 201986 -288091 -651147
33258f51147O2886L29454K74648J51874Q8728j05852l98444l27723K57432P23809
33248D05665M64244j65826l52861l8977P5961l07136o46999m40155O5141L15201
33238f25742J65220j49588m06905m59667j89162K79730N11393K27449k68074m16516
33228a331862r7446K72713L26519J68068J18625K31880K43569k8067l81380m32474
33218i09855j00373K30667J44886k62342m53013j05389M71707P14425M52218n892
33208A77039l20257l92081k27725J36400M78441M66097P5476l03953l76792k97068
33198e84423k80442j78424J74980M76530L46083K0686L0600K75834J63106k95931
33188A48599l70548J58999N42622K97655K3395K68123M15224k74046j127882q60741
$$ plain form
33258 -651147 -588261 -258807 15841 167715 256443 150591 -247853 -575576 -318144 405665
33248 405665 869909 704083 351222 312245 388206 81070 -565929 -1006084 -940943 -625742
33238 -625742 -460522 -610110 -1017015 -1476682 -1665844 -1386114 -874721 -647272 -915346 -1331862
33228 -1331862 -1429308 -1156595 -830076 -662008 -543383 -311503 -67934 -96001 -477381 -909855
33218 -909855 -1010228 -779561 -634675 -897017 -1350030 -1455419 -983712 -269287 182931 177039
33208 177039 -143218 -535299 -763024 -626624 -148183 317914 393390 89437 -287355 -584423
33198 -584423 -864865 -1043289 -868309 -391779 -45696 -25010 5590 281424 444530 148599
33188 148599 -221949 -62950 479672 777327 800722 1068845 1484069 1210023 82141 -778600
33178g78600L50978R47536K54239o11210n10322J78057M53703K06367p335n5289
33168D28124j99517l33551q8406M29622O84789M62351N4639k47223l81599l07809
33158E01420l9268J52151J5321k21190j29826J85425J69623k69238m87293l6024
33148a58899N99585O32287N4541m00316k75793R4284J50265j84883n20154m84642
33138d93725n3607M47511N65121J26805m69567n91135j27513L42705L37142J05856
33128A89593J36812L27123J92607k40161m02705j05014J59006M6836r9323Q2811
33118B87585L16204J87597j00870o1793K49678L24757P557l23177l70435k58352
33108B58751k01677k07240j89973j15339L7050K55443M26651M36796L05385J03746
$$ plain form
33178 -778600 -427622 519914 774153 162943 -347379 -169322 284381 490748 483413 428124
33168 428124 228607 -104944 -193350 236272 921061 1383412 1438051 1190828 809229 501420
33158 501420 462152 614303 629624 408434 278608 464033 633656 364418 -122875 -158899
33148 -158899 440686 1072973 1127514 727198 451405 545689 695954 511071 -9083 -493725
33138 -493725 -547332 -99821 465300 592105 122538 -468597 -596110 -253405 83737 189593
33128 189593 326405 653528 846135 605974 203269 98255 257261 304097 204774 287585
33118 287585 603789 791386 690516 628723 878401 1203158 1210715 887538 517103 258751
33108 258751 57074 -150166 -340139 -455478 -418428 -162985 263666 700462 1005847 1109593
33098A109593j45254l59719l67793j49989P6465J71469K26336K46383K8195l89332
33088D46354n37627j51912L58201M85455L20766K04969O7036k88311n58508l31157
33078A5266J05354J06198k60966k87816J91547M94727J81698k73815k55772J31140
33068A47561L83912L50127K19496O6044j64838l52154k65714N0529K29178L1079
33058F95220k87451k52721J64309M16986J24717l10991k59744J56153K67372p324
33048G06526m9018K79451K77409l36510p53926l48732K39766J70940k04806n8879
33038g7779M19140M04304r9160l64167k41286j82604j62120K23356O68350M10598
33028I98632l77336o43879o9676N03323M71729K05691R7034o6918l87271m61970
$$ plain form
33098 1109593 964339 604620 236827 86838 163303 334772 561108 807491 835686 446354
33088 446354 -91273 -243185 115016 600471 921237 1126206 1193242 904931 346423 15266
33078 15266 120620 226818 -34148 -321964 -130417 364310 546008 272193 16421 147561
33068 147561 531473 881600 1101096 1167140 1002302 650148 384434 434963 664141 695220
33058 695220 407769 155048 319357 736343 861060 550069 290325 446478 713850 706526
33048 706526 657508 936959 1214368 877858 123932 -224800 14966 185906 -18900 -77779
33038 -77779 341361 745665 646505 282338 41052 -141552 -303672 -80316 588034 998632
33028 998632 621296 -22583 -92259 411064 882793 1088484 1185518 1118600 731329 269359
33018B69359j44351J16248O1030n035Q3411N3546j30255r4608J64622J54060j81079
33007C46948k50240J15413K69597j37447m90611j94197L85449N36915K12214j07335
32997F86706j41418R517J13080r604k92096l89443j42355R9247M2734o641K16888
32986A86615K53277k53265n84712oP40326M03055n11147l95831P00064R85717
32976A524093o8564p79544r1300O77850J50115q24421p37418R3129K88213k78997
32966d6844n65833k01247J84328J78591l10j26539j57619j2104K36754K62298
32956b48525K3059p0115J15864J72733l7373q4831J29976P3348l71464n10726
32946h08054l6507L66115K07249p100J91664M04468K56433J18238K27266J05403
$$ plain form
33018 269359 125008 241256 302286 297251 380662 434208 303953 209345 373967 528027 346948
33007 346948 96708 212121 481718 344271 -146340 -340537 44912 581827 794041 686706
32997 686706 545288 554805 667885 658281 366185 -23258 -165613 -66366 -23632 -30273 186615
32986 186615 439892 186627 -398085 -398091 342235 745290 234143 -161688 538376 1524093
32976 1524093 1455529 675985 584685 1262535 1412650 588229 -149189 -56060 232153 -46844
32966 -46844 -612677 -813924 -629596 -451005 -451315 -577854 -735473 -747577 -510823 -248525
32956 -248525 -225466 -295581 -179717 -6984 -44357 -129188 788 74136 -297328 -808054
32946 -808054 -844561 -478446 -271197 -278297 -86633 317835 574268 692506 919772 1025175
32936A025175m09051n91291p5535L73937J50412j90606n4155J45709m8232k04055
32926A22308K8096Q8985l71794o25587j24604M29544L09384r871J05395K63014
32916B14870L329j51148K44607N19974Q5421l90557j80682J98311P1225j23156
32906D92194J24735K36314k73717o30388j69421L16578J5804l54439M9143N06314
32896C13117J02672m37079o6879N78739L66901k22984j01892L23986N2311m43692
32886D65200j16388N07047J98882o32129n95005K40162N94395K13724p7665j08447
32876F89776l11945m25852J5418M41042J57848k14389J13579M54624m5187n34908
32866C40006O3723Q48661M89770j62331M03734J288095N28425j248899j604829
$$ plain form
32936 1025175 616124 24833 -50702 323235 473647 283041 228886 374595 326363 122308
32926 122308 150404 239389 -132405 -757992 -882596 -453052 -143668 -153539 -48144 214870
32916 214870 218199 67051 311658 831632 917053 526496 345814 544125 615350 492194
32906 492194 616929 853243 579526 -50862 -220283 96295 112099 -242340 -193197 313117
32896 313117 415789 -21290 -88169 490570 857471 634487 532595 856581 908892 465200
32886 465200 348812 855859 1054741 422612 -172393 67769 662164 875888 798223 689776
32876 689776 377831 -48021 -32603 408439 566287 351898 465477 920101 874914 340006
32866 340006 403729 1252390 1742160 1579829 1983563 3271658 3800083 2551184 946355
32857I46355l07408M88356m4910m94299j23948J22286j57559j61763K24667J85651
32847F77428j94389m4398L62559J7863o43361l20322O02818N56542l53564n47343
32837A13833J20747K78600k38565k38742L02843K17904l96861l07484L67183L85421
32827F04879j17471N631M33277K7847n74508m846Q81526L50774o72194m5268J370667
32816B260314R81305o78204p83356N10773M71400o84150Q2017K572015K876952
32807G609066j30k314199j766629m84742l11909j02897O31197K70597j034339
32798B496015q30098Q08499R11006o34412m85053J616689J832277m98620j182874
32789D033429J022338J960361J23676l24841K158043L158394J195994J351891
$$ plain form
32857 946355 638947 1127303 1082393 588094 464146 586432 428873 267110 491777 677428
32847 677428 483039 438641 801200 819063 175702 -144620 458198 1014740 661176 113833
32837 113833 234580 513180 274615 35873 338716 556620 159759 -147725 219458 604879
32827 604879 487408 493039 926316 954163 379655 374809 1256335 1607109 934915 889647 2260314
32816 2260314 3241619 2563415 1780059 2290832 2762232 2078082 2160099 4732114 7609066
32807 7609066 7608936 5294737 3528108 3043366 2731457 2628560 3259757 3530354 2496015
32798 2496015 1665917 2474416 3385422 2751010 2265957 3882646 5714923 5216303 4033429
32789 4033429 5055767 7016128 7139804 6814963 8973006 12131400 13327394 14679285
32781A4679285N145385O193331K358715K102432J0009234J6416883J3894822J5393145
32773H6193232L9340646P8975940J01690090Q1352931K2436919m6496871r3198347
32766B70294540r8596569o8144259k9816610j0513828j1360954j3679008p472252
32759C0711060j250269k905540o433671m283279k23926q55724l642046k736335
32751H380270K39032K16496j777565j451627M26877J99797j369310r60726O86118
32742D589362M29965j130718j051386K54984J46926j007909p81008N20829O77525
32733B648570j07523k4608M60558l23402j522340j077898L35094M80087l95546
32724D72992l22211N90777O25756j68827l69370o8015l03174n73250J27003Q75525
$$ plain form
32781 14679285 19824670 26018001 28376716 30479148 40488382 56905265 70800087 86193232
32773 86193232 125533878 204509818 306199908 387552839 409989758 363492887 270294540
32766 270294540 171697971 103553712 73737102 63223274 51862320 38183312 30711060
32759 30711060 29460791 26555251 20121580 15838301 15614375 14758651 11116605 8380270
32751 8380270 8619302 8835798 7058233 5606606 6033483 6233280 4863970 3903244 4589362
32742 4589362 5019327 3888609 2837223 3092207 3239133 2231224 1450216 1971045 2648570
32733 2648570 2541047 2516439 2976997 2653595 1131255 53357 388451 868538 472992
32724 472992 150781 741558 1367314 1198487 829117 761102 457928 -115322 11681 887206
32714H87206L48172m34651J31749J021045K81504j259364j316049j51200J24009
32705c67579n35970k94601R51034J386095N11797l25128m69737m57600k89948
32696A08363L83686Q22108K22788m81321j18187M08702k23502r57861q7656J303066
32686A380186Q59335q78837j245074O3708P22771r3928p06034k62284J09061q5674
32676a36770J01466P22499N32838n05656q71757j61518L07510J3332o0939L41481
32666B82486K44456l63120k48432O17697P49405j29314m76864K49720O01583j59809
32656A367808p17377j27312N64339L14017k38292k65703j89260m59967m97054
32647b48801M2011L75133M832l36677p5940J90352n7346k97662q6256J18288K0028
$$ plain form
32714 887206 1235378 800727 932476 1953521 2235025 975661 -340388 -491588 -367579
32705 -367579 -903549 -1198150 -247116 1138979 1650776 1325648 855911 398311 108363
32696 108363 492049 1314157 1536945 1055624 937437 1346139 1122637 164776 77120 1380186
32686 1380186 2239521 1360684 115610 179318 902089 808161 102127 -160157 -51096 -136770
32676 -136770 -35304 687195 1220033 714377 -157380 -318898 -11388 1944 -58995 282486
32666 282486 526942 163822 -84610 533087 1282492 1153178 676314 926034 1527617 1367808
32656 1367808 650431 523119 1087458 1401475 1163183 897480 708220 248253 -248801
32647 -248801 -206790 168343 173175 -163502 -239442 -49090 -106436 -404098 -490354 -372066 -352038
32636c52038J13506N07546M31148l05032o71641j00417M73615J77667l82805k67229
32626c75680K93171N32328L94631K11226o7947m59419m96017J1133M20343J80901
32616F44670l11964m17555k03201j02828j68410j98908j54755l5247K28671M96101
32606b23426M79201K19810K1907q5388k51266k99568j8586K44043R3013p9121
32596A00619K57598O11471J65738o40287o45378N6542K47587k75660l96644K20143
32586b98271M67850k09780p93473m07646L55791O18302M50068J87399k61793p15365
32576f06918n31590J68982L30230k81127m71415L86706J127260O23165m05386
32567C39907o40222j63357Q7881n910O5944K42389J29785m4345J60565M45218
$$ plain form
32636 -352038 -238532 269014 700162 395130 -276511 -376928 96687 274354 -108451 -375680
32626 -375680 -82509 449819 844450 1055676 987729 528310 32293 43426 463769 644670
32616 644670 332706 -84849 -288050 -390878 -559288 -758196 -912951 -948198 -719527 -223426
32606 -223426 255775 475585 497492 412104 160838 -138730 -157316 86727 179740 100619
32596 100619 358217 969688 1135426 495139 -150239 -93697 153890 -121770 -518414 -298271
32586 -298271 169579 -40201 -833674 -1241320 -885529 -267227 182841 370240 108447 -606918
32576 -606918 -1138508 -969526 -639296 -920423 -1391838 -1005132 122128 745293 339907
32567 339907 -300315 -463672 -375791 -381701 -315757 -73368 56417 12072 172637 617855
32557F17855K43201k21046k91844J9955J65253M156j50149j75416j52020q335
32547E1610K50674K83774o8112l75017k59497k8724j17375l27016k06192J78095
32537f17780M02852L16746N9267k24595l44687j35902J58163P0121k91637k76251
32527h83703K11097M41832Q3555j99266Q0019L53865L6646l85574j89128L29661
32517a20996L84642J111j46684J19767L35563J94910j52767m29531l92024L7677
32507a68332M61100L02570k49409k86102L94885P63253J30818o45942m87082J81521
32497C97280K04795l63072m28632K67241P45655L51762l57040n56871k00918J79987
32487B40187J94809j04582l35258j73349J89486K11099j74187l47658K4277L88332
$$ plain form
32557 617855 861056 640010 348166 368121 533374 537530 387381 211965 59945 51610
32547 51610 302284 586058 517946 142929 -116568 -145292 -262667 -589683 -795875 -617780
32537 -617780 -214928 101818 161085 -63510 -408197 -544099 -385936 -315815 -607452 -883703
32527 -883703 -672606 -230774 -147219 -346485 -266466 87399 124045 -261529 -450657 -120996
32517 -120996 263646 264757 118073 237840 573403 768313 615546 186015 -206009 -168332
32507 -168332 292768 595338 345929 59827 454712 1217965 1348783 702841 215759 397280
32497 397280 602075 239003 -189629 77612 823267 1175029 817989 261118 60200 240187
32487 240187 434996 330414 -4844 -178193 11293 222392 48205 -299453 -275176 113156
32477A13156K04674j55650j14396R4977k5982j87876J70617O78734M76679k94141
32467I60792n89610r7962L13274J1915n13717n59324j94114J01717J79909J55078
32457b32042K6391k22045l98668k81277R1701M12977L36077j72916o06877l42890
32447a389569M64338Q49118L23784l03471p6249O11652O11877j57265o14055k59466
32437F0694J47319j6599k58524P887L56542Q4836n37359o37293p0129M26666L39419
32426i6541m8324k62838k44301j40473N3687L26046L95484L4023m29521l45688
32416g58446L63995R01231N26617m03941q20071l28107L30441L85597M5140j0809
32406B31647K92535M19545R7721l44616m83628k39617J72718M23536K64585j71159
$$ plain form
32477 113156 317830 162180 47784 142761 116779 -71097 99520 778254 1254933 960792
32467 960792 371182 273220 586494 598409 84692 -474632 -668746 -567029 -387120 -232042
32457 -232042 -205651 -427696 -826364 -1107641 -1015940 -602963 -266886 -439802 -1046679 -1389569
32447 -1389569 -925231 -76113 247671 -55800 -132049 479603 1091480 934215 320160 60694
32437 60694 208013 191414 -67110 -59223 297319 382155 -155204 -792497 -862626 -435960 -96541
32426 -96541 -144865 -407703 -652004 -792477 -738790 -412744 -17260 16763 -412758 -758446
32416 -758446 -394451 506780 1033397 629456 -190615 -518722 -188281 197316 242456 231647
32406 231647 524182 943727 1041448 696832 213204 -26413 146305 569841 834426 663267
32396F63267l91774j53289J60770J18567p6743J3075K33246Q4857l21502l46948
32386a6474Q1948K79579n5920l14870k6187L16127J16733k54550r1393L69775
32376D04768K72316l92099o52782p1859N55024M46543k1199p6968J65072M3974
32366F72790l87463m05734J23273M56572J52516k86832l17773j65601k27854l04919
32356f91025o6190K17568J27722r1150O1103L97333L33142m3166p8836K74115
32346D40616L14445k03131n85343k78664L04069M82850K44893Q581p1648r4165
32336E62503o6465N409l6989k35099l48432k10018L4443K24361L66712L60722
32326F57147k727n38417o64990k27116J59348l3020m75226n01109l0564M51646
$$ plain form
32396 663267 271493 118204 278974 397541 320798 333873 567119 651976 330474 -16474
32386 -16474 65474 345053 289133 -25737 -51924 264203 380936 126386 34993 404768
32376 404768 677084 284985 -367797 -439656 115368 561911 540712 463744 628816 672790
32366 672790 285327 -120407 2866 459438 611954 325122 7349 -158252 -386106 -691025
32356 -691025 -757215 -539647 -411925 -503075 -441972 -44639 288503 245337 166501 440616
32346 440616 755061 551930 -33413 -312077 -8008 474842 719735 728316 656668 562503
32336 562503 496038 501447 464458 229359 -119073 -329091 -294648 -70287 296425 657147
32326 657147 654420 116003 -548987 -776103 -616755 -649775 -1125001 -1626110 -1656674 -1205028
32316a205028N54065K63867j54303k82475J01066N97459N45986j0834l03242k4076
32306H2485J92201r7033l44911k2361L35568p766o57406o39684O1963N45696L92655
32295a58593O4875n0202r9258k00390j83137M24K02462M24652O84414O50743N0546
32284A386536o82754q55375m97011j83703k5989L27075P60265P16332K09949j18906
32274A036419j00195k30174n74060m98254J30220M87047P9960m16908k72841J75980
32264a82806K59216R2401J13281J25450k29699n10075l8353Q06044R19022R1904
32254A446385o69723o09069j33732L1686j41506k55979k02985j16341Q197J93087
32244d49980K42609L3273j60294j4635L13815L80681Q1846k60705l80425k89449
$$ plain form
32316 -1205028 -650963 -387096 -541399 -823874 -722808 -125349 420637 409803 106561 82485
32306 82485 274686 177653 -167258 -189619 145949 138183 -519223 -1158907 -1096944 -551248 -158593
32295 -158593 -93718 -143920 -243178 -443568 -626705 -626281 -423819 833 685247 1335990 1386536
32284 1386536 703782 -151593 -648604 -832307 -858296 -531221 229044 945376 1155325 1036419
32274 1036419 936224 706050 131990 -366264 -236044 251003 330963 -85945 -358786 -182806
32264 -182806 76410 168811 282092 407542 177843 -332232 -370585 435459 1354481 1446385
32254 1446385 776662 167593 33861 65547 -75959 -331938 -534923 -651264 -643067 -449980
32244 -449980 -207371 -174098 -334392 -349027 -35212 345469 427315 166610 -213815 -503264
32234e03264o3423K21948L35986Q4347k71861k22135K19114M11870K3413m27888
32224a91893l73950p2250q1093k36621N0265O38945P03277M4610m95113k62603
32214b76426K99067M28851J20284j29924j67399j82907j96691r5029L8613R0092
32204g1469J92577M26276N07078K19323j15125r4827Q3837m9624m31833n55569
32194A10644k64352Q4463K04951J49504K6004j17942j65935n9282L6632J4606
32184A9293O3461K62220K70328q3229k98841L3724L68715k1058p05676o23807
32174g14870J56613M39283j65789n93237r7167N38051L56017k18130k00384L14544
32164a85069M64414J21875m2469J85550K95358N1892j63636j45530j66571k75338
$$ plain form
32234 -503264 -566687 -344739 -8753 75594 -196267 -418402 -199288 212582 235995 -191893
32224 -191893 -565843 -638093 -719186 -955807 -905542 -266597 436680 481290 -13823 -276426
32214 -276426 22641 451492 571776 441852 274453 91546 -105145 -200174 -161561 -71469
32204 -71469 121108 547384 1054462 1273785 1158660 1063833 1147670 1098046 666213 110644
32194 110644 -153708 -69245 135706 285210 311214 193272 27337 -31945 4687 19293
32184 19293 82754 344974 615302 532073 233232 266956 635671 614613 -91063 -714870
32174 -714870 -558257 -118974 -284763 -878000 -975167 -437116 -81099 -299229 -499613 -185069
32164 -185069 279345 401220 358751 544301 839659 891551 727915 582385 415814 140476
32154A40476p4322M54574O12600j6814p73458p38920j0180M86161K91302j19312
32144B52107j89441J0348J45745J83652K29469J59617j32883l41654r4178L79765
32134F02547M42506k8538m17730k61168J09738J38144j25219j91115Q8971L55462
32124G13598K84107n0413l48211l92828k15227q1396j97321l47044j01917M65575
32114b71077O88896K37310k99521k29527K35826M01361J90299R3300K13202J71893
32104A431962p2222j34133p399j45607n51878n94304n2171M04890K18077k41428
32094B55787l59219k00008j59345j68956R2114M86268N43281J66166k79103m86986
32084a10001m38938k16598O6523K39538K46246K20135K03300K9283l00726m43155
$$ plain form
32154 140476 66154 520728 1133328 1116514 343056 -395864 -406044 80117 371419 252107
32144 252107 62666 73014 218759 402411 631880 791497 658614 316960 222782 602547
32134 602547 1045053 1016515 598785 337617 447355 585499 460280 269165 358136 713598
32124 713598 997705 947292 599081 206253 -8974 -90370 -287691 -634735 -736652 -271077
32114 -271077 417819 655129 355608 126081 361907 763268 953567 1046867 1260069 1431962
32104 1431962 1359740 1225607 1218208 1072601 520723 -73581 -125752 279138 497215 255787
32094 255787 -103432 -303440 -462785 -631741 -539627 -53359 489922 656088 376985 -110001
32084 -110001 -548939 -765537 -699014 -459476 -213230 6905 210205 239488 -61238 -504393
32074e04393k06683J04864J82236J89128L37748L62845k4769m56668l41366J72230
32064a84828L50869k2547l69737k39893R9436K02028O1092p7034j16956o7562
32054c65132R5982K91341L08267J12261p4365j29872j86786k86002k07263J38940
32044c02629M51932M32142J79116n1971k29053l90467l80161j05119J48161O7459
32034a80590j58351j06464J83634K76927Q8608J0649J81051J97733j64635m76906
32024a48344l15009L1889M6146j41680J270M43536N68778J67783k20682j76366
32014B57321m492j21067l29671j88546K35113M84481L95702J87427j6919k82246
32004F17103m94624l58441J24952N19984M60771O9455k60617l27682k38059j65948
$$ plain form
32074 -504393 -711076 -606212 -423976 -234848 102900 465745 440976 -15692 -357058 -184828
32064 -184828 166041 143494 -226243 -466136 -366700 -164672 -103580 -180614 -297570 -365132
32054 -365132 -269150 22191 330458 442719 368354 238482 51696 -234306 -441569 -302629
32044 -302629 149303 581445 760561 708590 479537 89070 -291091 -396210 -248049 -180590
32034 -180590 -338941 -445405 -261771 15156 103764 114413 295464 493197 328562 -148344
32024 -148344 -463353 -431464 -385318 -526998 -525728 -82192 486586 654369 433687 257321
32014 257321 252829 131762 -197909 -386455 -151342 333139 728841 916268 899349 617103
32004 617103 122479 -235962 -111010 408974 869745 939200 678583 350901 112842 -53106
31994e3106j21618K5277L01808M78635L15315m1868j70319J2333O6921k87073
31984E26305o45644m78534M9225L33178K49618K15882L53960K60751k06278n29278
31974A29185k71030K48673M30909K12144k0409o8030l4597K2226J02370J8890
31964G70331l91138p97149n89219K59621R30216O74318k22762p61765m54138J48607
31954d33078K67242r7098k86891L5907M58491M44821L4809l25507m13766l71837
31944f86907l20864j72362J25774L94284L96527J15079k09522k91646p1450K06113
31934e14974K57714J21616R3132K43426K45511j35147o00410o60070k84700Q8038
31924a145864J48809L2720K8926K05339L78547L37958R0690q8494L2026K59915
$$ plain form
31994 -53106 -174724 -149447 152361 630996 946311 904443 734124 746457 813378 526305
31984 526305 -119339 -597873 -548648 -215470 34148 250030 603990 864741 658463 129185
31974 129185 -141845 106828 537737 749881 729472 661442 626845 649071 751441 770331
31964 770331 379193 -417956 -1007175 -747554 182662 856980 634218 -127547 -581685 -433078
31954 -433078 -165836 -262934 -549825 -513918 -55427 389394 424203 98696 -315070 -686907
31944 -686907 -1007771 -1180133 -1054359 -660075 -263548 -148469 -357991 -649637 -721087 -514974
31934 -514974 -257260 -135644 -42512 200914 446425 311278 -289132 -949202 -1233902 -1145864
31924 -1145864 -997055 -964335 -935409 -730070 -351523 -13565 77125 -11369 20657 280572
31914B80572J65995k45947m07699L5515O63863Q31818M59285r1783n74891q33062
31904B83666n92792J02890N54944K10261m09974l58673L05155O12322K02088k11326
31894F98561q9487J40075n9320m72961o17813m56258j64064K48935O42957O23221
31884D93846J69345j34156M6748K52363L6501k59268j50260J08839J7238k26375
31874C54821q0223L35294M30882J85095J36693L59329K84185k92154p70770o33164
31864C09988j73823L2780l6974J2397K89822M71088L06088l9929k25533j47930
31854G97974p450j7094j80637l82722n33138n07590j58836L58039M96854p241
31844a41841n36580k70857N58433Q43616J99417m51034l04322J47809O0117l70935
$$ plain form
31914 280572 446567 200620 -207079 -171564 492299 1324117 1783402 1691619 1116728 283666
31904 283666 -309126 -206236 348708 558969 148995 -209678 95477 707799 909887 698561
31894 698561 609074 749149 689829 216868 -400945 -857203 -1021267 -772332 -129375 493846
31884 493846 663191 529035 575783 828146 864647 605379 455119 563958 581196 354821
31874 354821 274598 609892 1040774 1225869 1362562 1721891 2006076 1713922 943152 309988
31864 309988 136165 168945 131971 144368 434190 905278 1211366 1171437 945904 797974
31854 797974 790524 773430 592793 210071 -323067 -830657 -989493 -631454 -134600 -141841
31844 -141841 -678421 -949278 -390845 452771 652188 201154 -103168 44641 104758 -266177
31834b66177l74895K7930J64353n1595o4959K11593K65421K6119K2262K94196
31824B54248J76537m44501o58425N4019P98280N03632m49813q08034k73550K55013
31814e92594J70435j07186n9950J26366R8455K1170J93061M03356K41653j84297
31804C10469l82883k27858o2224o6492l7182J05079R6002j46012k30853J04253
31794e37701M71792L56292j04702l53678k41724q6015p498J86935M39379L69976
31784D93056o9675m12300l56098j37794n819J57475L93748L80129o409l01438
31774A34875j12288K25927J79922j25567j67305R1323J97647J660j36747K8523
31764C17970K73303K69296j9771l60069m34693o4265N23083P66338L90711k00066
$$ plain form
31834 -266177 -641072 -613142 -448789 -500384 -565343 -353750 -88329 -62210 -39948 254248
31824 254248 430785 -13716 -672141 -618122 180158 683790 233977 -574057 -847607 -592594
31814 -592594 -422159 -529345 -589295 -462929 -364474 -343304 -150243 253113 494766 310469
31804 310469 -72414 -300272 -362496 -428988 -466170 -361091 -265089 -411101 -641954 -537701
31794 -537701 -65909 290383 185681 -167997 -409721 -495736 -503234 -316299 123080 493056
31784 493056 423381 11081 -345017 -482811 -488630 -331155 62593 442722 436313 134875
31774 134875 22587 248514 428436 302869 135564 226887 424534 426194 289447 317970
31764 317970 591273 860569 840798 480729 46036 -18229 504854 1271192 1661903 1461837
31754A461837m50500l72473l57856m71219m19375j41291O6662L9431m6945K072
31744f89657J77355L56078L59376L7444m23984m99440K435N24313M93974J74358
31734E12252J56291K92770j5953o05153o14882Q6923N51457J96516l05152j53003
31724A02066L44011L87191k7548k55152r9034J6078j55265l65368l63853k00430
31714f17304l315J73781K76158K99995L59252M52468L08718k19864p54674p58210
31704d82995k44868K30824K83328P5800k3109J18441L42005L84794J02102l45358
31694D40964n69213l64032M5620L10434L54429K82653J04674j59364k86231j24602
31684C5332P8953J7880j44338l9019K21290J85973j17087j64044J26598J49303
$$ plain form
31754 1461837 1011337 638864 281008 -190211 -609586 -750877 -684215 -644784 -691729 -689657
31744 -689657 -512302 -156224 203152 240596 -183388 -682828 -680393 -156080 337894 512252
31734 512252 668543 961313 945360 340207 -274675 -187752 363705 560221 255069 102066
31724 102066 446077 833268 805720 550568 451534 467612 312347 -53021 -416874 -617304
31714 -617304 -620619 -446838 -170680 129315 488567 941035 1249753 1029889 275215 -482995
31704 -482995 -727863 -497039 -213711 -137911 -161020 -42579 299426 684220 786322 440964
31694 440964 -128249 -492281 -446661 -136227 218202 500855 605529 446165 159934 35332
31684 35332 114285 132165 -12173 -51192 170098 356071 238984 74940 201538 350841
31674C50841l42925o34623r1186P16481P12261j24355p20855m14509K73036N26220
31664B50386K38264j59630l29959j51098L46613Q06023O87158l6752o68472o56115
31654C26418l19294k54151l81473k08490K11826L30805O6824l7883K39105M04322
31644C78009Q8225l26936l25968k9267J17463O1193O3632J49525J16795k4313
31634B68358n0985O9511J20931j4652k04443k59041j06891J69794L34751J57389
31624D84722k61913m75536j94857L24110N90108M21845O718l83565n15850k60962
31614b65180J80277L27356J8005k52683K2029N55101N86521m6045o48151n66161
31604h8931N3633N52269N14480Q1614l00904l17824n1299J46642P3880j27405
$$ plain form
31674 350841 7916 -626707 -717893 -1412 710849 586494 -134361 -548870 -275834 250386
31664 250386 488650 329020 -939 -152037 194576 1000599 1687757 1651005 982533 326418
31654 326418 7124 -247027 -628500 -836990 -625164 -294359 -227535 -265418 -26313 378009
31644 378009 466234 139298 -186670 -215937 -98474 -37281 26351 175876 292671 268358
31634 268358 217373 286884 407815 393163 188720 -70321 -177212 -7418 327333 484722
31624 484722 222809 -252727 -447584 -123474 466634 888479 895197 511632 -4218 -265180
31614 -265180 -84903 242453 260458 7775 29804 584905 1171426 1125381 477230 -88931
31604 -88931 -35298 516971 1031451 1113065 812161 494337 443038 589680 663560 536155
31594E36155k46936k64853k01492J6996L15627L84196J32953o8429L6581J31137
31584G71935r3204k76632K9678M29779J58685o31083r51671m07226L28179O17520
31574b4040N70380L88674p7072o75739p35446j04947L52100R030m75157j86163
31564i58380N69285P88473L47849O941P4283J31846K0321M0733J00901k74262
31554H47990q52177o91371L27287R99562N00304l32789l12060K63989K29470m62002
31544E18203o87123m2039N13987K47412k45213j57169K09902J11146k84137k14199
31534b9230K93143M09684r5452m30560o3712M09839K24152l61735n17089j13126
31524b74086J96870L4808k64078l11286j39701J28792N04162P59697M16605m69055
$$ plain form
31594 536155 289219 24366 -177126 -160130 155497 539693 672646 604217 640798 771935
31584 771935 678731 402099 431777 861556 1020241 389158 -562513 -969739 -641560 -24040
31574 -24040 546340 935014 857942 182203 -553243 -658190 -306090 -297060 -772217 -958380
31564 -958380 -389095 399378 747227 754168 828451 960297 980618 1021351 1122252 847990
31554 847990 -4187 -695558 -368271 631291 1131595 798806 486746 750735 980205 518203
31544 518203 -168920 -210959 303028 550440 305227 148058 357960 469106 184969 -29230
31534 -29230 263913 673597 578145 147585 83873 493712 717864 356129 -160960 -274086
31524 -274086 -77216 -42408 -306486 -617772 -757473 -628681 -124519 635178 1051783 582728
31514E82728r95465n07121L36827L51866m43675p93866q4266O87301M11813m29722
31504h83580n06879L33805Q86894M25880l38943m58205Q525M54908O83910P55361
31494A361676M81237j84611o86147n42964j50521j59244l82508j74591L47969
31485h9704M35112j4403k93376r7681P5631m9925o4568K42671M41323L18432L02178
31474A205690N28285L69399m41523j039396o22561K21371L24008l55214p75455
31465e85396l63328L46960O05340L01939j37402k61716L1293L86398L68004N4656
31455G46748q8463j9567j83719n36697l42202N38564J036355L62582o65510p90403
31445E7688j66571J00695k08611l26264R731K35135J19280P1392J82922L7164
$$ plain form
31514 582728 -412737 -919858 -583031 -231165 -674840 -1468706 -1552972 -865671 -453858 -883580
31504 -883580 -1390459 -1056654 -169760 256120 -82823 -541028 -532503 -77595 606315 1361676
31494 1361676 1842913 1658302 972155 429191 278670 119426 -263082 -437673 -89704
31485 -89704 345408 331005 37629 -60052 15579 -34346 -98914 143757 585080 903512 1205690
31474 1205690 1733975 2103374 1661851 622455 -106 221265 545273 190059 -585396
31465 -585396 -948724 -601764 3576 305515 168113 -93603 -62310 324088 692092 746748
31455 746748 658285 638718 454999 -81698 -423900 114664 1151019 1513601 848091 57688
31445 57688 -108883 -8188 -216799 -543063 -533332 -298197 -178917 -107525 75397 112561
31435A12561l51046m00449m11K23444m9270l36015j76222K46496N48799O06526
31425D24413M14770M9544j80533q6341o291k62072m57157r7333L93860K64185
31415D57045k31861k47294J05841k9240n37584l55096N76250R38850J17189q11519
31405a7419q15444k98697k0080J18241L79377M36388J46043J9654J61264j23363
31395a4036q72406r23685J68679J005755M16272n73455l77274N89339P51099L3161
31385B03449k20455L59804P10205K82567j97391j68164l5682j81657l16249j97792
31375B38635o5743m0809J06167L47750K98313p9663l30040k15984J8978J73983
31365D51587K80382K40726j11168n46186o00986k33571J68077L64562L69714J43982
$$ plain form
31435 112561 -238485 -638934 -639345 -415901 -465171 -801186 -977408 -730912 -182113 424413
31425 424413 839183 888727 708194 621853 615562 353490 -103667 -201000 192860 457045
31415 457045 225184 -22110 83731 54491 -483093 -838189 -261939 676911 794100 -17419
31405 -17419 -832863 -1131560 -1151640 -1033399 -654022 -217634 -71591 -51937 109327 -14036
31395 -14036 -886442 -1810127 -1641448 -635693 -219421 -792876 -1170150 -580811 170288 203449
31385 203449 -17006 342798 1053003 1335570 1138179 970015 934333 752676 436427 238635
31375 238635 172892 132083 238250 586000 884313 804650 474610 258626 277604 451587
31365 451587 731969 972695 861527 315341 -285645 -519216 -351139 13423 383137 527119
31355E27119k63344m52990j49520K58597K51772J084j065J56913L4859k79614
31345H3811l40052j83353j63366j44094K43061P03443N92655J8953l22380l03524
31335A85154l33910k96156K96902J049682Q79725k60450j085830q25257k08702
31326e98842p8026j39597J61662M94707K73974k30063k85520K04216O87553P34390
31316A224454L09966l75891q70341p14026o3401L28483Q9028k96331l22646j86902
31306h77607j93910n5630N25375J022876O52253l97198j032869o14740L06279
31297f65171P40728L67288k92817n80766l61896N912K01612K31728J80622j120
31287a73880k29118j45986L31466O11432J42689o51731q18566j92182M20504M08615
$$ plain form
31355 527119 263775 -189215 -338735 -80138 171634 172718 171653 328566 363425 83811
31345 83811 -256241 -439594 -602960 -747054 -503993 199450 792105 811058 488678 185154
31335 185154 -148756 -444912 -148010 901672 1781397 1520947 435117 -390140 -598842
31326 -598842 -676868 -816465 -654803 -160096 113878 -116185 -401705 -197489 490064 1224454
31316 1224454 1534420 1158529 288188 -425838 -489239 -160756 -71728 -368059 -690705 -877607
31306 -877607 -1071517 -1127147 -601772 421104 1073357 676159 -356710 -971450 -665171
31297 -665171 75557 442845 150028 -430738 -792634 -786722 -585110 -353382 -172760 -173880
31287 -173880 -402998 -548984 -217518 393914 536603 -115128 -933694 -1125876 -705372 -296757
31277b96757J9674k60012l08326j65650J40034L58645J88813j49137j12046K61332
31267c23430L39842k2806j84535J91089N18375K26519l73465o72686o16111m48453
31257a365661j58250K70440N09336L21859j6526j53222j25990n3677J55796M19992
31247a95903L44286j07815l60099r3902K14714J37708L6164L14551N49647J68776
31237A008127m74205n71114r9328K52405J95200O6962N7007k4419j99081k14213
31227b659m7911K1158r7316j96812j70257j17866o9745N0183K11227L02730K95729
31216A78461J88143j3990j08832J44621M84511K88797m07661o87660q4974N41028
31206E22444K50323m75178m99749J36587L69486p7151l23440O5029L41856q8823
$$ plain form
31277 -296757 -277083 -537095 -845421 -1011071 -871037 -512392 -323579 -472716 -584762 -323430
31267 -323430 16412 -6394 -190929 160 518535 745054 371589 -301097 -917208 -1365661
31257 -1365661 -1523911 -1253471 -744135 -422276 -438802 -592024 -718014 -771691 -615895 -195903
31247 -195903 148383 40568 -319531 -413433 -198719 -61011 -24847 289704 839351 1008127
31237 1008127 533922 -37192 -136520 115885 311085 378047 435054 410635 211554 -2659
31227 -2659 -50570 -29412 -126728 -323540 -493797 -611663 -681408 -631225 -419998 -117268 178461
31216 178461 366604 352614 243782 388403 872914 1161711 754050 66390 -18584 522444
31206 522444 772767 297589 -202160 -65573 303913 226762 -96678 -31649 310207 221384
31196B21384o35872m84110J58975N06980L74679J92378J40403l4195l90480n47632
31186d97490k19429L22296N32176K52440r3802n9566K05797J63840k83457n73675
31176b50870l01011J60000K33385n815o8063J18302K03861J12618J26663K93109
31166F22179L16976J01664j03559j58636j79513j87311n8598J37489J85053J07933
31156G83677P3439k4340l54186n99759k91773L00759L75107j59647m45642K88
31146c42077N13242L31321k50078m09496n469L98421M01675Q4540l04702m80867
31136f3490j76279M56585P38969K60213m56514o19138k70234r3605k69236k71843
31126g64572J34134M54252L02619N0043J91811N21666M65928j1305l73518l11128
$$ plain form
31196 221384 -414488 -898598 -739623 -232643 142036 334414 474817 440622 50142 -497490
31186 -497490 -716919 -394623 137553 389993 296191 236625 442422 606262 322805 -250870
31176 -250870 -551881 -391881 -158496 -164311 -232374 -114072 89789 202407 329070 622179
31166 622179 939155 1040819 937260 778624 599111 411800 353202 490691 675744 783677
31156 783677 857116 832776 478590 -121169 -412942 -112183 262924 103277 -342365 -342077
31146 -342077 171165 502486 252408 -157088 -162557 235864 637539 722079 417377 -63490
31136 -63490 -239769 216816 955785 1215998 759484 140346 -129888 -223493 -492729 -764572
31126 -764572 -630438 -176186 126433 176476 368287 889953 1355881 1344576 971058 659930
31116F59930r2937m9932j15915p3254L7578K0226j17671j64857j8041K07250L48942
31105F41319L07701L4437l72392n89289l66834O4595K02510k4692j24821J98292
31095b9174N47509M40165O3744o9246J3880j69321o63716q93937n08070J22138
31085a146028M61034M40816L06359K10520K00241K63340J85126k63171p92686
31076a34449p35968k8427M86395K05441l15038k45286K05806K56250j6738J54665
31066a67349O80101N20488n01662j077242l57792N83254L46950n82445o29321
31057a185018L45694Q91034L19684l57831k54599Q9152l5417k00868J79567N66142
31047C57540K00355m09287k29124N04194N97496j52103o79177m05703J4396L346
$$ plain form
31116 659930 566993 517061 401146 327892 365470 385696 268025 103168 85127 292377 641319
31105 641319 949020 983457 611065 21776 -345058 -280463 -77953 -102645 -227466 -29174
31095 -29174 518335 958500 1022244 952998 966878 797557 133841 -760096 -1268166 -1146028
31085 -1146028 -684994 -244178 62181 272701 472942 736282 921408 658237 -134449
31076 -134449 -870417 -898844 -412449 -207008 -522046 -767332 -561526 -305276 -322014 -167349
31066 -167349 512752 1033240 531578 -545664 -903456 -320202 26748 -555697 -1185018
31057 -1185018 -839324 51710 371394 13563 -241036 -151884 -187301 -388169 -208602 357540
31047 357540 557895 148608 -80516 423678 1021174 869071 189894 -215809 -201413 -198067
31037a98067q3235J13961K39123M5959O810L89118N44252o7326q16214p60799
31027e86418o0714L75240K89678J88600K55032J09007l02003m17030P1607O53068
31017E76067O18506p3306p70906q18043k01032M10320L53603k32176n52363k16307
31007i05637K48784K26537r3761j32855J21950J81655r7519l15465j46609K85995
30997f26925O30279N82519P5751n14588n90921r6393K65839j691l97593j76647
30987h50370M62629O85705L00566o5543r930J76387J43473n3009k17941k50283
30977C21684j03446O4614j33412o96613r00022k51946N51185N10648j08989j79254
30967i25551M49162P29836J63921m87110n58207l57151k23737J19969O65104O77951
$$ plain form
31037 -198067 -281302 -167341 71782 117741 124551 513669 1057921 990595 174381 -586418
31027 -586418 -647132 -271892 17786 206386 461418 570425 268422 -148608 -77001 576067
31017 576067 1194573 1121267 350361 -467682 -668714 -258394 95209 -136967 -689330 -905637
31007 -905637 -656853 -430316 -524077 -656932 -534982 -353327 -450846 -766311 -912920 -626925
30997 -626925 3354 585873 661624 147036 -443885 -540278 -274439 -276130 -673723 -850370
30987 -850370 -387741 297964 598530 532987 523057 699444 842917 789908 571967 321684
30977 321684 218238 282852 149440 -547173 -1447195 -1699141 -1147956 -637308 -746297 -925551
30967 -925551 -476389 253447 417368 -69742 -627949 -985100 -1208837 -1088868 -423764 254187
30957B54187n4327n43359n6798O35936M63770k77720n48438k31554j9022o7605
30947d44930N4479L23229K83256K0104P7472M13123L97605q6383m42562l70091
30937B25302k23165k01750j4468L89245N14421J12787l45270l75976j44941m5364
30927a09179n1659R7629L73335M85373K84407r6211l83053l54022m6791K07176
30917D07005J60177L819O1450K28775J42920j50632k32568n2328m5612l47378
30907A75628m93204j97563J45708J40291L2185J70062K95418J1275l90518l08453
30897d19171J46917K86889k5038j72751J33329L65924J24269j48565N2146L65159
30887G09108J38823m30921n53025r9893K15225Q055k15080L7723M46624M39206
$$ plain form
30957 254187 199860 -343499 -400297 235639 699409 421689 -126749 -358303 -377325 -444930
30947 -444930 -390451 -67222 216034 236138 313610 726733 1124338 1037955 595393 225302
30937 225302 2137 -199613 -214081 175164 689585 802372 457102 81126 -63815 -109179
30927 -109179 -160838 -63209 310126 795499 1079906 983695 600642 246620 199829 407005
30917 407005 567182 571001 632451 861226 1004146 853514 620946 568618 523006 175628
30907 175628 -317576 -515139 -369431 -229140 -196955 -26893 268525 279800 -110718 -419171
30897 -419171 -272254 14635 -10403 -183154 -49825 316099 440368 291803 343949 709108
30887 709108 847931 417010 -136015 -235908 -20683 -12628 -227708 -189985 256639 695845
30877F95845N0301k74461l68210l37226j60244J80815L77276J34930k79951l36923
30867c17848o034K58562K42030J71060J93587J62088R381j13862j72775l03248
30857A22941m40065l03229J17439M36343L70848O6303j58234j18473J71609M46291
30847G11773K98349k77623o27836k44383L78158L95724m4092m3370M71276N37942
30837A555918j85336p19431l32027K47967M9395n69851o07809n9693K33035J6677
30827c71155j62889l6722O5045k6168m9981J07340K14587J36443l6289k62254
30817d22043m86324m31493M1932N31448N68843L01268J47452M5516k80974n54015
30807e38390k46661M45656P45352M05540n6880k49280k92563k93917j58935J0336
$$ plain form
30877 695845 746146 471685 103475 -233751 -393995 -213180 164096 299026 19075 -317848
30867 -317848 -323882 -65320 176710 347770 541357 703445 712826 598964 426189 122941
30857 122941 -317124 -620353 -502914 -66571 304277 370580 212346 93873 265482 711773
30847 711773 1010122 732499 104663 -139720 238438 634162 590070 546700 1017976 1555918
30837 1555918 1370582 651151 319124 567091 616486 46635 -561174 -620867 -387832 -371155
30827 -371155 -534044 -570766 -505721 -531889 -581870 -474530 -259943 -123500 -159789 -422043
30817 -422043 -908367 -1339860 -1297928 -766480 -197637 103631 251083 296599 15625 -538390
30807 -538390 -785051 -339395 405957 811497 754617 505337 212774 -81143 -240078 -229742
30797b29742J3586N0851M00925O63941K08745o15121p39818l0568M14613j1018
30787A26394m98638k34785K72818J32591m43021n61308p7539L39247L17053J36993
30777d90195P8751Q3694O2952L9778j4294j33639k12383j66543r7932p1090N3026
30766h67875L29424N35243M96339L23758J22456j72722m51737l72360N3046K94876
30756B90448R0666j19432L0983J84925m8181l05578r4448K57171J06879l69107
30746B4326m38845k1077K73308K25887K20291L32863J48604l19201m19210P4128
30736A01074M75279K27280k47986k83074N226M1614k39234l95758k49304o3096
30726f27979j5744O975O7996L3462j30798k13069l8026K79225M66297L85314J32609
$$ plain form
30797 -229742 -216156 -165305 235620 899561 1108306 493185 -246633 -277201 137412 126394
30787 126394 -372244 -607029 -334211 -201620 -644641 -1205949 -1283488 -944241 -627188 -490195
30777 -490195 -411444 -327750 -264798 -225020 -239314 -372953 -585336 -751879 -849811 -920901 -867875
30766 -867875 -538451 -3208 493131 816889 939345 766623 314886 -57474 -4428 290448
30756 290448 381114 261682 292665 477590 429409 123831 29383 286554 393433 24326
30746 24326 -414519 -435596 -162288 63599 283890 616753 765357 446156 26946 101074
30736 101074 576353 803633 555647 272573 277799 319413 80179 -315579 -564883 -627979
30726 -627979 -643723 -636748 -568752 -535290 -666088 -879157 -917183 -637958 -171661 213653 346262
30715C46262q7716j44317n9282N6004J10873O8544n8407j67728r9970J51909L28542
30704D44714J87568j34930k78576j72316j04669k08180k07005J13775M79018M86743
30694F06142K10611N8133J12775M4079k77084n03584l54521o8474M877j5439J96917
30683A4432M93843L69051j98153n50283k47190K83270L54877m1847l49346k74352
30673a45698m0486Q6737P0660p3982l08376m14874k07001J08710J74339M7359
30663g02612P2097K34760K08520L2343O6563K01492p5333n98796m55387N14409
30653e01944J094930L78314p42395q01133J13078O44137K43796k97843l21592
30644a90652p5783J19963L62951N39474K35199l69930m78929M6847L47802j4981
$$ plain form
30715 346262 258546 114229 54947 110951 221824 290368 231961 64233 -35737 116172 444714
30704 444714 632282 497352 218776 46460 -58209 -266389 -473394 -359619 119399 606142
30694 606142 816753 874886 987661 1031740 754656 251072 -103449 -171923 -167046 -182485 14432
30683 14432 508275 877326 679173 128890 -118300 164970 519847 478000 128654 -145698
30673 -145698 -186184 -99447 -28787 -102769 -411145 -826019 -1033020 -924310 -749971 -702612
30663 -702612 -630515 -395755 -187235 -154892 -88329 113163 37830 -560966 -1016353 -501944
30653 -501944 592986 971300 228905 -572228 -459150 184987 428783 130940 -190652
30644 -190652 -266435 -146472 216479 755953 991152 621222 142293 189140 536942 521961
30634E21961k96214J10791N42171J49361o54816q57369l95360q36R9923K61770
30624e18618M39241K07497k86273l78716L8125L70074L22720K18513K21426Q7792
30614G21781j58080j33940J16838Q2418k52348k79436J03306K02997j94262k98084
30604h8810K71395N82421j28043r77952o96793K85875M70341k92825n91990K00502
30594i65879R03910M34499n30407o86750j4350M58942K84302j5067Q369J51076
30584B8645J05897l8926m3150J00727J89799N9487k30891l95168k01344J74393
30574b50531K67389q3061m85168m86676q4898L89826O24021M29580j26821n30204
30564c36543k18752N50097P77378Q3603o01415l40506L82585M25848k10777m45780
$$ plain form
30634 521961 225747 336538 878709 1028070 373254 -484115 -879475 -880311 -780388 -518618
30624 -518618 -79377 128120 -158153 -536869 -498744 -128670 194050 412563 633989 721781
30614 721781 563701 429761 546599 629017 376669 97233 200539 403536 209274 -88810
30604 -88810 182585 765006 636963 -340989 -1037782 -751907 -281566 -574391 -1166381 -965879
30594 -965879 -61969 372530 -157877 -844627 -858977 -400035 -115733 -130800 -122431 28645
30584 28645 134542 95616 52466 153193 342992 402479 171588 -223580 -424924 -250531
30574 -250531 16858 -66203 -551371 -1038047 -1122945 -733119 -109098 320482 193661 -336543
30564 -336543 -555295 -5198 772180 855783 254368 -86138 296447 722295 511518 65738
30554F5738J02662N41555J70719m77660n57426r7539K89123L21709J33597j45596
30544C46882m05681m49849k33510M6491K91248N53526O32176J83011n45158p60452
30534c41316k69885J43160m5342k67044O8264M54172J67888l77593k85838K59145
30524d94389L23293j06749j08476M84853P16377J52944l42012n2537M36289K66393
30514A275986l52028o36604m47084k10434r0728L1742R9841M0858O7060K45159
30504B3768J55476l94384p39717k16996O72212Q29479J31992m45551k61927K87822
30494D2174N86618N02840J18136m74737q60137n29388K69371O22114K35099j16356
30484C95734J25046L63214j04911q01103p41968L4073N86511M95268K09616N1908
$$ plain form
30554 65738 168400 709955 880674 403014 -154412 -251951 37172 358881 492478 346882
30544 346882 -58799 -508648 -742158 -695667 -404419 149107 781283 964294 419136 -341316
30534 -341316 -611201 -468041 -513383 -780427 -712163 -257991 -90103 -467696 -753534 -494389
30524 -494389 -171096 -277845 -386321 98532 814909 967853 625841 573304 1009593 1275986
30514 1275986 923958 287354 -159730 -370164 -460892 -429150 -329309 -288451 -221391 23768
30504 23768 179244 -215140 -954857 -1171853 -499641 329838 461830 16279 -245648 42174
30494 42174 628792 1131632 1249768 775031 -85106 -614494 -345123 276991 512090 395734
30484 395734 520780 883994 779083 -22020 -763988 -729915 -143404 351864 561480 613388
30474F13388j68235m44706l89704j2266J24431j49137k52545J56138N49702L86158
30464D13224n1386k36552k29262k78300j46128L92194Q05442M28564m32724q69265
30454b04193o55616l12846m8178L83084P75379N17030k41527n09918M6321N13825
30444B63361J89249l08955j45683L28670K45184k92489m49804q2836J46961M955
30434a01387J8881M26061O63582K60147m09525o67654l98756j3468J50319P7376
30424E576p7472j35446J5074L06429N02613L84242p1035o20537q44045m86662
30414a021263J65535M70259J71118k76564l33281m5688J95052K52965K23629J03818
30404i4420o1820K9225M87824Q19756N43390K529j05897J49241O4702m80104p73608
$$ plain form
30474 613388 445153 447 -389257 -401523 -277092 -426229 -678774 -522636 27066 413224
30464 413224 361838 125286 -103976 -382276 -528404 -136210 669232 1097796 665072 -204193
30454 -204193 -859809 -1172655 -1220833 -837749 -62370 454660 213133 -296785 -250464 263361
30444 263361 452610 143655 -2028 326642 571826 279337 -170467 -253303 -106342 -101387
30434 -101387 -82506 343555 1007137 1267284 857759 190105 -208651 -222119 -71800 5576
30424 5576 -71896 -207342 -192268 114161 616774 1001016 929981 309444 -534601 -1021263
30414 -1021263 -855728 -385469 -214351 -490915 -824196 -869884 -674832 -421867 -198238 -94420
30404 -94420 -156240 -127015 360809 1180565 1723955 1726484 1620587 1769828 1834530 1354426 580818
30393E80818l97045J64355L04886M2917k99313n61794o04649k75916J71144J82292
30383f92305k60070m61631k8977N06429M93244N4197k94533m12099l82291m9999
30373a528035O50708J208183J021408K41799m05667n49155m48977m14873l93789
30364f18398j98935J37153L32328J27142l44138n15338q969P33001Q84196L45109
30354H73151j49513j66755j06274k83257k83813J80857N11802J16449n09154n13058
30344c29565p3587k6709l65404k44881M90935R02519L95653l57491m41091M8506
30334a115L45166J52479j44889j89517o1957J0467J3959Q7398K26137K15473n1892
30323F01709l16353k66070o2213j43731m48558l84012J81496N36446K08682k04545
$$ plain form
30393 580818 183773 348128 653014 695931 396618 -165176 -769825 -1045741 -874597 -692305
30383 -692305 -952375 -1414006 -1442983 -936554 -443310 -389113 -683646 -1095745 -1478036 -1528035
30373 -1528035 -877327 330856 1352264 1594063 1188396 639241 190264 -224609 -618398
30364 -618398 -817333 -680180 -347852 -220710 -564848 -1080186 -1089155 -356154 528042 873151
30354 873151 723638 556883 450609 167352 -116461 64396 576198 692647 183493 -329565
30344 -329565 -403152 -429861 -795265 -1040146 -549211 353308 748961 391470 -49621 -1115
30334 -1115 344051 496530 351641 162124 100167 110634 124593 211991 438128 653601 601709
30323 601709 285356 19286 -42927 -186658 -635216 -1019228 -837732 -301286 -92604 -297149
30313b97149J1314M67361L24137k33645k76424K57580L94291k84133r57419q30198
30303a424285j61416L92415O51398O61408L21156j96180l06817J16737L36619
30294C91035j60309p11877l86538N42132Q82095J76913p03403p48321J860O93146
30284b3267P12494K20602k18024k90087j50568p9802j20319j66176k16633k80725
30274f12505j86797J50729L97029J95255j67445o9746M28727N50794j1134n57871
30264A17036m31403J5300N6403k70609l35758L5948L57275K76361L2948J8077
30254a28422K39863L71392J76345j84365k81358M8419L61744J02023n61657q17997
30244f74013k82060M72973P03768L79602l7993k60768k24769J05147M99012L96300
$$ plain form
30313 -297149 -285835 181526 505663 272018 -4406 253174 647465 363332 -594087 -1424285
30303 -1424285 -1585701 -1193286 -541888 119520 440676 244496 -62321 54416 391035
30294 391035 230726 -481151 -867689 -325557 556538 733451 30048 -718273 -716413 -23267
30284 -23267 689227 909829 691805 401718 251150 171348 51029 -115147 -331780 -612505
30274 -612505 -799302 -648573 -251544 -56289 -223734 -293480 135247 686041 674907 117036
30264 117036 -314367 -299067 -242664 -513273 -849031 -813083 -455808 -179447 -146499 -128422
30254 -128422 111441 482833 659178 474813 193455 241874 603618 705641 143984 -674013
30244 -674013 -956073 -483100 220668 600270 562277 301509 76740 181887 680899 1077199
30234A077199l67448j058520q75191p2980L83345J73773o9030J53404N02764M45167
30224B92483O4079j44228J4506K72885L21576J16868j99059m82533o20344m80871
30214h44638j2108N29129O31731Q9235n75117o15634k3844M44673L11722n7390
30204a22241j73790j62095l22766m24653o8448N02423O14677J24776l88139l93760
30194h14016P2595O38072R05195N83494k19166q37310o58967N3977M23389J09324
30184B56587k93227j81832K36938L97204K47891J96711L36585K32664l78060j009653
30174D1808q93339J0521Q06189O84737p4713m91336j61278L42526M09529J66689
30164H41333L1890M335j35218k82052k02685n0280j48732l74856k68338K48240
$$ plain form
30234 1077199 709751 -348769 -1223960 -1296940 -913595 -739822 -808852 -655448 -152684 292483
30224 292483 356562 212334 226840 499725 821301 938169 739110 256577 -363767 -844638
30214 -844638 -856746 -327617 304114 393349 -181768 -797402 -821246 -376573 -64851 -122241
30204 -122241 -296031 -458126 -780892 -1205545 -1273993 -771570 -156893 -32117 -420256 -814016
30194 -814016 -741421 -103349 801846 1385340 1166174 328864 -330103 -276126 147263 256587
30184 256587 -36640 -218472 18466 415670 663561 860272 1196857 1429521 1051461 41808
30174 41808 -851531 -841010 -34821 649916 575203 83867 -77411 265115 674644 841333
30164 841333 873223 877558 742340 460288 257603 207323 58591 -316265 -584603 -336363
30154c36363O90559O12097Q3161m49659n66501j92664K92859L78154J0377l25494
30144A96526k71008k1020J27933K35192L78121L05689r7852m13510k87895m2249
30134A09927j03445k43177n4096K35843K00771O1787K08837K77642k40025p94497
30124c40433m40362M58535N83110k18754o50868j27735L16669q7151n17598p6868
30114a101455O22778N67477N4879J6479L53102K69352k08305l43053m9328O9388
30104B51314q2726k693L14691K76833j89229m20358j43981Q5744j12264l31151
30094c53820j65217R6007N6219o6900J33398M79997M29417r1644n36730m41524
30084d60797L2782L53074K57081M240k7423J42532J83481J0981q9463j0388p3385
$$ plain form
30154 -336363 354196 966293 1049454 599795 33294 -159370 133489 511643 522020 196526
30144 196526 -74482 -95502 32431 267623 645744 951433 853581 440071 152176 109927
30134 109927 6482 -236695 -290791 -54948 145823 207610 416447 694089 454064 -340433
30124 -340433 -780795 -322260 260850 42096 -608772 -736507 -419838 -506989 -1024587 -1101455
30114 -1101455 -478677 88800 143679 160158 513260 782612 574307 231254 181926 251314
30104 251314 168588 165895 480586 757419 568190 147832 3851 89595 -22669 -353820
30094 -353820 -519037 -423030 -366811 -433711 -300313 179684 609101 517457 -19273 -460797
30084 -460797 -428015 -74941 182140 186380 158957 301489 484970 495951 406488 396100 322715
30073C22715m26146o01253j77938M27055M71600K8847j13312K88597N43537J42703
30063I06405m30463m56058j3307K93540K80498K33601K02565q5732n64240o95106
30053c28297k58560K13639J85608o5698Q5073N32973N16460j45109o02160j70697
30043c6768N98114O75958J2087n19468m42635j28312P2547K74334M45775K22882
30033A174514k90044l57634K17697N50313m654p10031n37832J90636L64157q7942
30023E09180j84432L46102N95222O7090m48047j97024L04844J78281l67923m17972
30013C85321J72619N89246L01655k64582m58090k38771j5159j4213j32170k33423
30003I2433k84385k01306J59424P00542R46867N05500l35904q02402n68413j69842
$$ plain form
30073 322715 -103431 -704684 -882622 -455567 16033 44880 -68432 220165 763702 906405
30063 906405 475942 19884 6577 300117 580615 814216 1016781 931049 366809 -328297
30053 -328297 -586857 -373218 -187610 -253308 -168235 364738 881198 736089 133929 -36768
30043 -36768 561346 1237304 1249391 729923 287288 158976 231523 505857 951632 1174514
30033 1174514 884470 526836 744533 1294846 1290192 580161 42329 232965 597122 509180
30023 509180 324748 670850 1266072 1333162 885115 688091 992935 1171216 803293 385321
30013 385321 557940 1147186 1448841 1184259 726169 487398 472239 458026 325856 92433
30003 92433 -191952 -393258 -233834 466708 1413575 1919075 1583171 780769 212356 42514
29993D2514k09277m84292l69527J52489M47335K11492r7232O624L52916M30313
29983D83355M8709n35091q89056o74795L9922O34347M96480j26591l08889K96089
29973e35520R05079O98025m1923m32070k48455k1478r4980k80894l96281m90597
29963i39094m73586j09800M65083P36581N06501J45529k3315j23781k87148l09098
29953d12128q2089P3613p3057k06056m915K09365k4350m18520k80786L29427N77967
29942c11529J27724l38310k07851J51990J20828j16830K6054M31088M09516j27647
29932A65033m53017j53515K25974L8635m85073n95634p6909N18705O00027J76559
29922c9215k27149j27646M14085P93604N11496j59899m48965j15808K08120j1601
$$ plain form
29993 42514 -166763 -651055 -1020582 -868093 -420758 -209266 -306498 -299874 53042 483355
29983 483355 532064 -3027 -892083 -1566878 -1526956 -892609 -396129 -522720 -831609 -535520
29973 -535520 369559 1067584 1025661 593591 345136 323658 228678 -52216 -448497 -939094
29963 -939094 -1412680 -1522480 -1057397 -320816 185685 331214 307899 184118 -103030 -412128
29953 -412128 -494217 -420604 -493661 -699717 -704632 -495267 -519617 -938137 -1218923 -889496 -311529
29942 -311529 -183805 -522115 -729966 -577976 -457148 -573978 -547924 -116836 292680 165033
29932 165033 -287984 -441499 -215525 -176890 -661963 -1257597 -1334506 -815801 -215774 -39215
29922 -39215 -266364 -394010 20075 813679 1325175 1165276 716311 600503 808623 797022
29912G97022l62572j55794L64897K71057n62205j039840l38461Q12698J037714
29903H24516J95088m74949j55846M17096J38297p52278r89266j71083O18071L94718
29893D4364l26500m05422J93850M69726J0806m26179j74989L53444M12621K5244
29883A76965k37743j79005p4058n9417L6075L05530N99393P12242M90957r0954
29873A679985p15173q10973k15352M63075N25441N3100l05957k50217n6183L872
29863C71618j8007j9397k5015m5444p0099j68010l06493k19893J55035L19859
29853b5846j52524p64336n76770M13283J120211Q16006M0849k93583r7992R3553
29843E72851M1809o4629j24893k23044l15472k52356o9156N3878O4339L1095k3956
$$ plain form
29912 797022 434450 278656 643553 914610 352405 -687435 -1025896 -213198 824516
29903 824516 1019604 544655 388809 805905 944202 191924 -797342 -968425 -350354 44364
29893 44364 -282136 -687558 -493708 -23982 -13176 -439355 -614344 -260900 151721 176965
29883 176965 -60778 -239783 -313841 -373258 -337183 -31653 567740 1279982 1770939 1679985
29873 1679985 964812 153839 -61513 401562 927003 980103 674146 423929 367746 371618
29863 371618 353611 334214 309199 263755 193656 25646 -280847 -500740 -345705 -25846
29853 -25846 -178370 -942706 -1519476 -1106193 14018 830024 870873 577290 479298 572851
29843 572851 614660 550031 425138 202094 -113378 -365734 -434890 -381012 -316673 -285578 -309534
29832c09534o0337O1206L33906M40917J40977l11287m62009k83554j46556k03799
29822h00070j88308R6824M23041M38183J10156k80166m37936k37207K34181O70507
29812B9205P11650K80634k79361n18861l10488R4793L56338K86585r3429n50128
29802F938p16755l97526J49237M20647K41636o7219j89559k16986l42563m16916
29792a529066j66107L05115O19359O45301N19214K57454j61859m01368p0781N07205
$$ plain form
29832 -309534 -369871 -308665 25241 466158 607135 295848 -166161 -449715 -596271 -800070
29822 -800070 -988378 -891554 -468513 -30330 79826 -200340 -638276 -875483 -641302 29205
29812 29205 740855 1021489 742128 223267 -87221 7572 363910 650495 557066 6938
29802 6938 -709817 -1107343 -958106 -537459 -295823 -363042 -552601 -769587 -1112150 -1529066
29792 -1529066 -1695173 -1390058 -770699 -125398 393816 651270 489411 88043 17262 524467
$$ [...]
##END NTUPLES=NMR SPECTRUM
##END=
