##TITLE=31Pdec_LY-17Dix.3.B
 CD3CN, 24 sc
 2.06.2021
##JCAMPDX= 6.0         $$ Bruker NMR JCAMP-DX V2.0
##DATA TYPE= NMR SPECTRUM
##DATA CLASS= NTUPLES
##ORIGIN= UXNMR, Bruker Analytische Messtechnik GmbH
##OWNER= root
$$ XWIN-NMR		Version 3.5
$$ Wed Jun  2 13:39:09 2021 Russian Standard Time (UT+4h)  she@DPX200
##.OBSERVE FREQUENCY= 81.013821
##.OBSERVE NUCLEUS= ^31P
##.ACQUISITION MODE= SIMULTANEOUS
##.ACQUISITION SCHEME= undefined
##.AVERAGES= 24
##.DIGITISER RES= 16
##SPECTROMETER/DATA SYSTEM= spect
##.PULSE SEQUENCE= zgpg30
##.SOLVENT NAME= MeOD
##.SHIFT REFERENCE= (INTERNAL, MeOD, 0, 248.564)
##AUDIT TRAIL= $$ (NUMBER, WHEN, WHO, WHERE, WHAT)
$$ ##TITLE= Audit trail, XWIN-NMR		Version 3.5
$$ ##JCAMPDX= 5.01
$$ ##ORIGIN= Bruker BioSpin GmbH
$$ ##OWNER= she
$$ F:/spectra/data/she/nmr/P31/1/pdata/1/auditp.txt
$$ ##AUDIT TRAIL=  $$ (NUMBER, WHEN, WHO, WHERE, WHAT)
(   1,<2021-06-02 13:38:19.53 +0400>,<she>,<DPX200>,
      <created by zg, POWCHK disabled, PULCHK disabled
       configuration hash MD5:
       00 E9 B6 7A A2 85 ED C7 34 08 36 98 17 FE 4E 26
       data hash MD5: 32K
       C3 FA A1 55 3A 94 B9 22 41 8D 8D 70 A4 68 44 40>)
(   2,<2021-06-02 13:38:22.00 +0400>,<she>,<DPX200>,
      <Start of raw data processing
       efp BC_mod = 2 LB = 1 FT_mod = 6 PKNL = 1 PHC0 = -6045.91 PHC1 = 474.2701 SI = 64K 
       data hash MD5: 64K
       AA 24 BF AF 90 77 5E 48 45 96 E0 5E 78 8F 04 20>)
(   3,<2021-06-02 13:38:34.45 +0400>,<she>,<DPX200>,
      <pk PHC0 = -39.99269 PHC1 = 0 
       data hash MD5: 64K
       14 A5 01 E4 B3 54 34 1E 18 A3 8E D1 3B C3 89 56>)
(   4,<2021-06-02 13:38:38.23 +0400>,<she>,<DPX200>,
      <abs ABSG = 5 
       data hash MD5: 64K
       6C C6 96 35 83 5E 68 08 2A 90 F3 23 C5 FA 91 9E>)
$$ ##END=
$$ 
$$ hash MD5
$$ 35 F2 20 2E 5A 38 ED EC EB DA 73 BE 39 04 8D 6B
##$RELAX= 
##$RELAX= 
##$RELAX= 
##$RELAX= 
##$RELAX= 
##$RELAX= 
##$RELAX= 
##$RELAX= 
$$ Bruker specific parameters
$$ --------------------------
##$DU= <F:/spectra>
##$EXPNO= 1
##$NAME= <P31>
##$PROCNO= 1
##$TYPE= <nmr>
##$USER= <she>
##$AMP= (0..31)
100 100 100 100 100 100 100 100 100 100 100 100 100 100 100 100 100 100 
100 100 100 100 100 100 100 100 100 100 100 100 100 100 
##$AQSEQ= 0
##$AQ_mod= 1
##$AUNM= <au_zg>
##$AUTOPOS= <>
##$BF1= 81.014009
##$BF2= 200.13
##$BF3= 200.13
##$BF4= 200.13
##$BF5= 200.13
##$BF6= 200.13
##$BF7= 200.13
##$BF8= 200.13
##$BYTORDA= 1
##$CFDGTYP= 0
##$CFRGTYP= 5
##$CHEMSTR= <none>
##$CNST= (0..31)
1 1 145 1 1 1 1 1 1 1 1 1 1 1 1 1 1 1 1 1 1 1 1 1 1 1 1 1 1 1 1 1 
##$CPDPRG= <waltz16>
##$CPDPRG1= <>
##$CPDPRG2= <waltz16>
##$CPDPRG3= <>
##$CPDPRG4= <mlev>
##$CPDPRG5= <mlev>
##$CPDPRG6= <mlev>
##$CPDPRG7= <mlev>
##$CPDPRG8= <mlev>
##$CPDPRGB= <>
##$CPDPRGT= <>
##$D= (0..31)
0 1 0 0 0 0 0 0 0 0 0 0.03 2e-05 3e-06 0 0 0 0 0 0 0 0 0 0 0 0 0 0 0 0 
0 0 
##$DATE= 1622626698
##$DBL= (0..7)
120 120 120 11 120 120 24 19 
##$DBP= (0..7)
150 150 150 150 150 150 150 150 
##$DBP07= 0
##$DBPNAM0= <>
##$DBPNAM1= <>
##$DBPNAM2= <>
$$ [...]
##$SUBNAM3= <"">
##$SUBNAM4= <"">
##$SUBNAM5= <"">
##$SUBNAM6= <"">
##$SUBNAM7= <"">
##$SUBNAM8= <"">
##$SUBNAM9= <"">
##$SW= 501.771253377433
##$SWIBOX= (0..15)
0 1 3 0 0 0 0 0 0 0 0 0 0 0 0 0 
##$SW_h= 40650.406504065
##$TD= 32768
##$TD0= 1
##$TE= 0
##$TE2= 300
##$TE3= 300
##$TEG= 300
##$TL= (0..7)
0 120 53 12 22 120 120 120 
##$TP= (0..7)
150 150 150 150 150 150 150 150 
##$TP07= 0
##$TPNAME0= <>
##$TPNAME1= <>
##$TPNAME2= <>
##$TPNAME3= <>
##$TPNAME4= <>
##$TPNAME5= <>
##$TPNAME6= <>
##$TPNAME7= <>
##$TPOAL= (0..7)
0.5 0.5 0.5 0.5 0.5 0.5 0.5 0.5 
##$TPOFFS= (0..7)
0 0 0 0 0 0 0 0 
##$TUNHIN= 0
##$TUNHOUT= 0
##$TUNXOUT= 0
##$USERA1= <user>
##$USERA2= <user>
##$USERA3= <user>
##$USERA4= <user>
##$USERA5= <user>
##$V9= 5
##$VALIST= <valist>
##$VCLIST= <CCCCCCCCCCCCCCC>
##$VD= 0
##$VDLIST= <DDDDDDDDDDDDDDD>
##$VPLIST= <PPPPPPPPPPPPPPP>
##$VTLIST= <TTTTTTTTTTTTTTT>
##$WBST= 1024
##$WBSW= 4
##$XGAIN= (0..3)
0 0 0 0 
##$XL= 0
##$YL= 0
##$YMAX_a= 3015
##$YMIN_a= -9544
##$ZGOPTNS= <>
##$ZL1= 120
##$ZL2= 120
##$ZL3= 120
##$ZL4= 120
##$ABSF1= 248.5645
##$ABSF2= -253.2056
##$ABSG= 5
##$ABSL= 3
##$ALPHA= 0
##$AQORDER= 0
##$ASSFAC= 0
##$ASSFACI= 0
##$ASSFACX= 0
##$ASSWID= 0
##$AUNMP= <proc_1d>
##$AZFE= 0.1
##$AZFW= 0.5
##$BCFW= 0
##$BC_mod= 2
##$BYTORDP= 0
##$COROFFS= 0
##$CY= -3
##$DATMOD= 1
##$DC= 0
##$DFILT= <>
##$DTYPP= 0
##$F1P= 0
##$F2P= 0
##$FCOR= 1
##$FTSIZE= 65536
##$FT_mod= 6
##$GAMMA= 0
##$GB= 0
##$INTBC= 1
##$INTSCL= 5.30512e-09
##$ISEN= 30
##$LB= 1
##$LEV0= 0
##$LPBIN= 0
##$MAXI= 10000
##$MC2= 0
##$MEAN= 0
##$ME_mod= 0
##$MI= 50
##$NCOEF= 0
##$NC_proc= -4
##$NLEV= 6
##$NOISF1= 182.463
##$NOISF2= 159.3651
##$NSP= 0
##$NTH_PI= 0
##$NZP= 0
##$OFFSET= 248.5645
##$PC= 4
##$PHC0= -6085.903
##$PHC1= 474.2701
##$PH_mod= 1
##$PKNL= yes
##$PPARMOD= 0
##$PSCAL= 0
##$PSIGN= 0
##$REVERSE= no
##$SF= 81.014009
##$SI= 65536
##$SIGF1= 159.3651
##$SIGF2= -187.1042
##$SINO= 113.3802
##$SIOLD= 16384
##$SREGLST= <1H.CDCl3>
##$SSB= 0
##$STSI= 65536
##$STSR= 0
##$SW_p= 40650.406504065
##$SYMM= 0
##$S_DEV= 0
##$TDeff= 32768
##$TDoff= 0
##$TI= <>
##$TILT= no
##$TM1= 0
##$TM2= 0
##$TOPLEV= 0
##$USERP1= <user>
##$USERP2= <user>
##$USERP3= <user>
##$USERP4= <user>
##$USERP5= <user>
##$WDW= 1
##$XDIM= 65536
##$YMAX_p= 427775991
##$YMIN_p= -61011777
$$ End of Bruker specific parameters
$$ ---------------------------------
##NTUPLES= NMR SPECTRUM
##VAR_NAME=  FREQUENCY,     SPECTRUM/REAL,   SPECTRUM/IMAG
##SYMBOL=    X,             R,               I
##VAR_TYPE=  INDEPENDENT,   DEPENDENT,       DEPENDENT
##VAR_FORM=  AFFN,          ASDF,            ASDF
##VAR_DIM=   65536,         65536,           65536
##UNITS=     HZ,            ARBITRARY UNITS, ARBITRARY UNITS
##FACTOR=    0.620285442955139, 1,           1
##FIRST=     20137.2065510759, 0,            0
##LAST=      -20513.1999529892, 0,           0
##MIN=       -20513.1999529892, -61011777,   0
##MAX=       20137.2065510759, 427775991,    0
$$ Real data points
##PAGE= N=1
##DATA TABLE= (X++(R..R)), XYDATA
$$ [...]
35692E30833p9730J52288j63307l86259q6073J15043l21290p07218j72086P43685
$$ 530833 451103 603391 440084 53825 -32248 82795 -238495 -945713 -1117799 -374114
35682c74114P69144j14317o60422l06794J61896J33153O3781L26504L38984l23473
$$ -374114 395030 280713 -379709 -686503 -524607 -391454 -327673 -1169 337815 14342
35672A4342q83025m50076M80681P04776R2494l85639k50914n0059k06284l38342
$$ 14342 -868683 -1318759 -838078 -133302 -40808 -426447 -677361 -727420 -933704 -1272046
35662a272046p3952K55380K23649M2435J45310M15050L74268k6438l05362j42820
$$ -1272046 -1345998 -1090618 -866969 -824534 -679224 -264174 110094 83656 -221706 -364526
35652c64526J87575K12567j00208k70496R2745P02430Q07970J28581o46201o37789
$$ -364526 -176951 35616 -64592 -335088 -242343 460087 1268057 1396638 750437 112648
35642A12648M1934L96140p3188o59216m89863K26860N89595L11037r6327l06738
$$ 112648 154582 550722 477534 -181682 -671545 -444685 144910 455947 359620 52882
35632E2882m98536n81252n5664Q98412J092643q6416j429081j313027J1494P80584
$$ 52882 -445654 -1026906 -1082570 -184158 908485 822069 -607012 -1920039 -1908545 -1127961
35622a127961K91032k56763J58729Q19524O24588r3730k72832Q0472Q6072l77415
$$ -1127961 -836929 -1093692 -934963 -115439 509149 415419 142587 223059 309131 -68284
35612f8284n37696j70376M7997j88834l00039O5293L74941J88708m6779J89033
$$ -68284 -605980 -776356 -728359 -917193 -1217232 -1151939 -776998 -588290 -635069 -446036
35602d46036N40283L56634k08544m05697K620M55906L93720r4481m66717l36082
$$ -446036 94247 450881 242337 -163360 -160740 295166 688886 594405 127688 -208394
35592b08394J47439M44343K12355k80197m96315k98091K4402K80579M76651M31964
$$ -208394 -60955 383388 595743 315546 -180769 -478860 -454458 -173879 302772 734736
35582G34736j00761q05769r05058j73823O39464P19984J14673n02807o16438k09033
$$ 734736 633975 -171794 -1076852 -1250675 -611211 108773 223446 -279361 -895799 -1104832
35572a104832L08335L76468j00170m20955N9291Q02911O68147l03729p62420p0238
$$ -1104832 -796497 -420029 -520199 -941154 -881863 -78952 589195 285466 -476954 -547192
35562e47192P11576N17266j65037l54826j88752l03399m23856Q6105Q01172P43166
$$ -547192 164384 681650 516613 161787 -26965 -330364 -754220 -668115 133057 876223
35552H76223J5815l88870k48872k65451n91008n25129J29276O08278M29627P9101
$$ 876223 892038 503168 254296 -11155 -602163 -1127292 -998016 -389738 39889 118990
35542A18990P5680K22448J68554l1631k57202n53045p54659n11771R1587N34211
$$ 118990 194670 417118 585672 554041 296839 -256206 -1010865 -1522636 -1431049 -896838
35532h96838O10633N74812M82209J07196m06027n71060l44141j40239l8501J91320
$$ -896838 -286205 288607 770816 878012 471985 -99075 -443216 -583455 -621956 -430636
35522d30636K96297j83958p87444m92344N44006R24641J53314n30876j73835L96431
$$ -430636 -134339 -318297 -1105741 -1598085 -1054079 -129438 23876 -507000 -680835 -284404
35512b84404J16716m83270l13125L34945L34815l43552o82678l21261R1730J54984
$$ -284404 -167688 -650958 -964083 -629138 -294323 -637875 -1320553 -1641814 -1550084 -1395100
35502a395100J72784L27227L80909K76652K06853Q2026k90023n62224k22778M28051
$$ -1395100 -1222316 -895089 -514180 -237528 -30675 51351 -238672 -800896 -1023674 -595623
35492e95623N53354N9378k93296j56655m4270k70895l47569J27015P01993P20714
$$ -595623 -42269 17109 -276187 -432842 -477112 -748007 -1095576 -968561 -266568 454146
35482D54146K18472k73377m12550j77571K86266O12829L90799k58458o26091k87635
$$ 454146 672618 399241 -13309 -190880 95386 708215 1099014 840556 214465 -73170
35472g3170K90895L84554l9614m10237l83768j59878m4187o8916p7804N0094K89457
$$ -73170 217725 602279 562665 152428 -231340 -391218 -435405 -504321 -582125 -532031 -242574
35461b42574M51191L34796K7025p8609K30569N93099M69399q5279l99785q2623
$$ -242574 208617 543413 570438 491829 722398 1315497 1784896 1699617 1299832 1217209
35451A217209L92920L22062k30969n47864l57409k39303o43112j039981o46095
$$ 1217209 1610129 1932191 1701222 1153358 795949 556646 -86466 -1126447 -1772542
35442a772542L12980Q11094M58127m4139n8984J40664Q3804m6715J01510K55343
$$ -1772542 -1459562 -648468 -190341 -234480 -293464 -152800 -68996 -115711 -14201 241142
35432B41142j8136l87557j58106N16602O98499O2414n77318m63528N8320J84363
$$ 241142 223006 -164551 -322657 193945 892444 954858 377540 -85988 -27668 156695
35422A56695j48082l11445m501L72153L56029j6319l92896n18189l24119J12141
$$ 156695 8613 -302832 -307333 64820 420849 404530 11634 -506555 -830674 -718533
35412g18533N04514M76949J8095l29565p5707M81698N49423n3605n67949l48169
$$ -718533 -214019 262930 281025 -48540 -124247 357451 906874 853269 285320 -62849
35402f2849K27271L82866J00767j8309J67004J88197j04543k63741p5843P6495
$$ -62849 164422 547288 648055 629746 796750 984947 880404 616663 540820 617315
35392F17315l7223j05476J4726o2853m39542n11464J8349M38633J28885l13883
$$ 617315 580092 474616 489342 426489 -13053 -524517 -506168 -67535 61350 -252533
35382b52533k9332N84912N05661r7100m5771Q43398J368872R16749M54592P94282
$$ -252533 -281865 303047 808708 711608 665837 1509235 2878107 3794856 4249448 5043730
35372E043730J040443m7737j862859k496124j345317P6801K45831m80369p18120
$$ 5043730 6084173 6036436 4173577 1677453 332136 408937 654768 174399 -543721
35363e43721j07312M28960K59981j03481j4651K62256J34359k31317k27331O0754
$$ -543721 -651033 -222073 37908 -65573 -80224 182032 316391 85074 -142257 -81503
35353h1503j5111m23488l60623L54877Q14394M35514j23109j44816j6921l09044
$$ -81503 -96614 -520102 -880725 -525848 288546 724060 600951 456135 439214 130170
35343A30170n64933j71296K96931j6587n39249p2977R68193R34970l27226j016810
$$ 130170 -434763 -606059 -309128 -325715 -864964 -937941 30252 965222 637996 -378814
35333c78814k08252O80112K59825o10550m13268M78695N81229j24770k67471M66193
$$ -378814 -587066 93046 352871 -257679 -670947 -192252 388977 264207 -3264 462929
35323D62929P58223j21644j041328p13643L77910P21403j13403j049242j051526
$$ 462929 1221152 1099508 58180 -655463 -277553 443850 330447 -718795 -1770321
35314a770321l12974L07984M67037M86818N55951L69641k33555p41334n49239
$$ -1770321 -2083295 -1775311 -1308274 -821456 -265505 104136 -129419 -870753 -1419992
35305a419992J43719N59724M02121J30980J37500K43259K00660J12695P1349r0634
$$ -1419992 -1276273 -716549 -314428 -183448 -45948 197311 397971 510666 582015 491381
35295D91381l47111k87657K06712N60852K60955l71279o61363n04716k78050j16924
$$ 491381 144270 -143387 63325 624177 885132 513853 -147510 -652226 -930276 -1047200
35285a047200J23571L43880K26497k03760m98672l39160J16235M64096M57882
$$ -1047200 -923629 -579749 -353252 -557012 -1055684 -1394844 -1278609 -814513 -356631
35276c56631K08545P0426K06136K74410j41395p83621q91113k71822L54884L72100
$$ -356631 -148086 -77660 128476 402886 261491 -522130 -1413243 -1685065 -1330181 -958081
35266i58081N1415n8908L9160P0202P0952J53396J45100J605R4343N29340P14484
$$ -958081 -906666 -965574 -926414 -856212 -785260 -631864 -486764 -485159 -390816 138524 853008
35255H53008K43799l43757m09188k35126l72402n60042k85501J16902M7900j46142
$$ 853008 1096807 753050 343862 108736 -263666 -823708 -1109209 -992307 -944407 -1090549
35245a090549K15563P28607M88537j93802k19921K74836N8199q90246j050803
$$ -1090549 -874986 -146379 342158 148356 -71565 203271 261470 -628776 -1679579
35236a679579J22576J131816P45927j91186l43905R5537K13869O1761J83883L39368
$$ -1679579 -1557003 -425187 320740 129554 -214351 -118814 95055 156816 340699 680067
35226F80067K6277l81538k61702P6590K0443j22254K35663O27062J89415p09115
$$ 680067 706344 324806 63104 139694 160137 37883 273546 900608 1090023 380908
35216C80908q90096k35993K02018n7974l58682j85067J43859K69145K74617J85241
$$ 380908 -509188 -745181 -543163 -601137 -959819 -1144886 -1001027 -731882 -457265 -272024
35206b72024j12801l17817L7837O80543Q14311L17160j72871l81906o14505q08060
$$ -272024 -384825 -702642 -664805 15738 830049 1147209 974338 592432 -22073 -830133
35196h30133m88918J73272M12698J93996K99658Q02698P65181n9877n85544j61778
$$ -830133 -1319051 -1145779 -733081 -539085 -239427 563271 1328452 1268575 683031 521253
35186E21253L14914l0929n94766m89532j06486k22554m75889j18616M39769L05768
$$ 521253 836167 805238 210472 -279060 -385546 -608100 -1083989 -1202605 -762836 -457068
35176d57068k17106j24484M61221M89213j44609m42037o8344J97319r250p7201
$$ -457068 -674174 -798658 -337437 151776 7167 -434870 -503214 -305895 -315145 -392346
35166c92346K30227K24679l42534o18746j00497L65308m3223o56939l22080P20455
$$ -392346 -162119 62560 -279974 -898720 -999217 -633909 -677132 -1334071 -1656151 -935696
35156i35696J119144L72222n15164m53264L80457Q97713M33664n42555r90888
$$ -935696 183448 555670 40506 -412758 -32301 865412 1299076 756521 -234367
35147b34367m75274L58128O12306K35569j11635j23792j42400l37793l39146K9047
$$ -234367 -709641 -351513 260793 496362 384727 260935 118535 -219258 -558404 -529357
35137e29357L09921J42345j30676n5503K07928K45876N9073j07332k12505k39429
$$ -529357 -219436 -77091 -207767 -263270 -55342 190534 249607 142275 -70230 -309659
35127c09659J6713M85061N82340J3706n94591m96077R9667M18930K64860M7662
$$ -309659 -292946 192115 774455 788161 193570 -302507 -202840 216090 480950 528612
35117E28612m3129j24843r9496J54023K41672k47092q39831p05360j2667K59984
$$ 528612 485483 360640 261144 415167 656839 409747 -430084 -1135444 -1148111 -888127
35107h88127o4405q0298N75780R85223M31796l96056n05455r0263K0048k05611
$$ -888127 -952532 -1032830 -457050 528173 959969 563913 58458 -31805 -11757 -217368
35097b17368j63411J41589J00142l06353l17095L78491J015691P63934j42884
$$ -217368 -380779 -239190 -139048 -445401 -762496 -384005 631686 1395620 1252736
35088A252736p18317m31841K32724L95480k00403q58988o99028K69235J089732
$$ 1252736 534419 102578 335302 730782 530379 -328609 -1027637 -758402 331330
35079C31330J005205L14615k07466l79642n64013p68754n17561K81760R59413
$$ 331330 1336535 1651150 1443684 1064042 500029 -268725 -786286 -504526 454887
35070D54887Q77065J93503m44733o45682m33622M261L81325L58534q8275m77950
$$ 454887 1331952 1525455 1080722 435040 1418 5679 387004 745538 657263 179313
35060A79313l47717J27859L84866K52985Q1349Q5459M4089j90103l33220j56222
$$ 179313 -168404 -40545 344321 597306 678655 764114 808203 618100 284880 128658
35050A28658K7877j75612n16062l91635J68853M22875q947n33834m14987K24628
$$ 128658 156535 -19077 -535139 -926774 -757921 -335046 -343993 -877827 -1292814 -1068186
35040a068186O99801P43885O20183M44647P1584l26662k50683L14071O52875K62017
$$ -1068186 -368385 375500 995683 1440330 1511914 1185252 934569 1248640 1901515 2163532
35030B163532m20758o64126m44189k63378k34881K792M93930P20440L41531k78146
$$ 2163532 1742774 1078648 634459 371081 136200 138992 632922 1353362 1694893 1416747
35020A416747n40472l08024R9982L42349K55079j45500n88920o63195k83544R9280
$$ 1416747 876275 568251 668233 1010582 1265661 1120161 531241 -131954 -415498 -316218
35010c16218N9256j80503p8087L40769M37480o0451n45782l67400J95231L25118
$$ -316218 -256962 -437465 -515552 -174783 262697 202246 -343536 -710936 -515705 -190587
35000a90587j36914m95718k61048J80675K39925O491J146L04703M56588J87915
$$ -190587 -327501 -823219 -1084267 -903592 -663667 -657176 -656030 -351327 105261 293176
34990B93176k02506l17260j57573K5969J20251J63379J37461m503j60942j47062
$$ 293176 90670 -226590 -384163 -358194 -237943 -74564 62897 58394 -102548 -249610
34980b49610M3838K08296K06616J21639O3950k7362k19579l34756j34583K44737
$$ -249610 -205772 2524 209140 330779 394729 367367 147788 -186968 -321551 -76814
34970g6814L60638Q5986j65344o3074J25273R118k45598k21546O027P1662J01834
$$ -76814 283824 369810 204466 141392 266665 275783 30185 -191361 -185334 -113672 -11838
34959a1838M86128Q83538M45657o96629j204939l75105P33122Q13871J24263k43463
$$ -11838 474290 1357828 1803485 1106856 -98083 -473188 259934 1073805 1198068 954605
34949I54605j81947l73559p15521m07140M27931O36799j41916q01112m17427M59414
$$ 954605 772658 399099 -316422 -723562 -295631 341168 199252 -601860 -1019287 -559873
34939e59873P82214M27708j0672j92620j62766l590J20075k5595l09696k57116
$$ -559873 222341 650049 639377 446757 283991 280401 400476 374881 65185 -191931
34929a91931K03674N33384L99374J08727o1089k81747n67305m84705O0593M54209
$$ -191931 11743 545127 944501 1053228 992139 710392 143087 -341618 -281025 173184
34919A73184K97606J5255K7393N9714j54080k73800j03228j01236m11817l07714
$$ 173184 470790 486045 513438 573152 419072 145272 42044 -59192 -471009 -778723
34909g78723M92335R31149K02921o95608m41714L79482K35391o95028p74917L04246
$$ -778723 -286388 644761 847682 152074 -289640 89842 325233 -369795 -1144712 -840466
34899h40466R96704M63874k19471n2195L75630K25449j52333j40812n4154l46314
$$ -840466 156238 620112 400641 348446 724076 949525 797192 656380 602226 255912
34889B55912n68497j92368K89724J47587l17130l17220R2565K51096R5336J28783
$$ 255912 -312585 -504953 -215229 -67642 -384772 -701992 -609427 -358331 -262995 -134212
34879a34212L83097L47522q8152l97576j98272K95096O25809M82155j73322r38848
$$ -134212 248885 596407 508255 110679 -87593 207503 833312 1315467 1142145 203297
34869B03297j093254l53409O07454Q53357K89909l54831n16718k77132O1284L54997
$$ 203297 -889957 -1243366 -635912 217445 507354 152523 -364195 -641327 -580043 -225046
34859b25046N03640L72631m559l65502m54758k33516R6360K07168n2713l74604
$$ -225046 278594 651225 646666 281164 -173594 -407110 -310750 -103582 -156295 -530899
34849e30899k58552K79389N92083K54149l00100l65791O6916L78931K04554j88078
$$ -530899 -789451 -510062 82021 336170 36070 -329721 -262805 116126 320680 132602
34839A32602l58043j83544J07475J66127j58168n52150m60003K08170Q11142P24493
$$ 132602 -225441 -408985 -301510 -135383 -293551 -845701 -1305704 -1097534 -286392 438101
34829D38101J41693k44628j83249l5564q2734j41975L7775L62425N27395L58146
$$ 438101 579794 335166 151917 116353 33619 -108356 -70581 291844 819239 1177385
34819A177385o1988m45027m71120q8847L49093M20966J08650k21709k87100j41591
$$ 1177385 1115397 670370 199250 110403 459496 880462 989112 767403 480303 338712
34809C38712M3142K22254L84205L75203M0075m46258n98450j66125M35684N39621
$$ 338712 381854 604108 988313 1363516 1403591 957333 358883 192758 628442 1168063
34799A168063J01648k09234K4869L49298J66696l12583m46270k16114j70679m06291
$$ 1168063 1269711 1060477 1085346 1434644 1601340 1288757 842487 626373 455694 49403
34789D9403m06498J025K97146J24941j81255k08843j1164K25313M57137M78334
$$ 49403 -357095 -356070 -58924 66017 -115238 -324081 -335245 -109932 347205 825539
34779H25539J49o70726p43756r6206M27079K88569K8424K08369M19462Q9143m58183
$$ 825539 825688 154962 -588794 -685000 -257921 30648 59072 267441 686903 776046 317863
34768C17863n99096m40592l63132j29639N53277J089425P17091j48684m11696
$$ 317863 -281233 -721825 -1084957 -1214596 -661319 428106 1145197 996513 584817
34759E84817N5838L46696J8037m12812n13661m66980l94748o0360N00972P85919
$$ 584817 640655 987351 1005388 592576 78915 -388065 -782813 -843173 -342201 443718
34749D43718N10601m0822m58076n34125k28834J99008K33453j66477k50651L81412
$$ 443718 954319 913497 455421 -78704 -307538 -108530 124923 -41554 -292205 89207
34739H9207Q37472J81576q34684o81869N04292R84010Q1827q28790n36784L01392
$$ 89207 926679 1108255 273571 -408298 95994 1080004 1161831 333041 -203743 97649
34729I7649M80693K6087l08337l46043l20734j53094K08317L38707J5894k38098
$$ 97649 578342 604429 296092 -49951 -370685 -523779 -315462 23245 39139 -198959
34719a98959j2322K19638o0816m17811j52080M97775P09228K90974k24014m19500
$$ -198959 -211281 8357 -52459 -470270 -622350 -124575 584653 875627 651613 232113
34709B32113k60654J90776O95650P51467J67169n43689q19906p37355n91053l09359
$$ 232113 -28541 162235 857885 1609352 1776521 1232832 412926 -324429 -915482 -1224841
34699a224841J45040L38423K9213k27475J02296N70510M37782p9172j68540K43791
$$ -1224841 -1079801 -741378 -712165 -939640 -837344 -266834 170948 91776 -76764 167027
34689A67027M52448J27392l36451n47768m56266q1546L87019M09618k23385p51544
$$ 167027 619475 746867 410416 -137352 -593618 -675164 -288145 121473 -101912 -853456
34679h53456l45241N47821P36951P9002l47334L9144N24980L67394j12236k26810
$$ -853456 -1198697 -650876 86075 165077 -182257 -143113 381867 749261 637025 410215
34669D10215J4950J16295j13805m40894n72744l65250P5657L84319L21635J41820
$$ 410215 425165 541460 427655 -13239 -585983 -951233 -875576 -491257 -169622 -27802
34659b7802J95938L23600J80640l2607Q4488K27568k18147r00875p44578L08483
$$ -27802 168136 491736 672376 639769 724257 951825 733678 -167197 -911775 -603292
34649f03292R69685M92299k40716k05576K33864J98406j79074j74748J94265L49952
$$ -603292 366393 858692 617976 412400 646264 844670 665596 490848 685113 1035065
34639A035065K44147K33372J97121j82277n14758j59155N43711N94537r7605n67411
$$ 1035065 1279212 1512584 1709705 1527428 1012670 853515 1397226 1991763 1894158 1326747
34629A326747l54560j10928l26766n13401j89566K34427K23429K3559R2171K45129
$$ 1326747 972187 861259 534493 21092 -168474 65953 289382 312941 405112 650241
34619F50241J18504n0799J01043K65675L025k93138M0367O28595M34287n22628
$$ 650241 768745 717946 818989 1084664 1087689 794551 834918 1463513 1897800 1375172
34609A375172r78770k98996N43652M67818j60125l12003N2126J34813k69612n31585
$$ 1375172 396402 97406 641058 1108876 948751 636748 688874 823687 554075 22490
34599B2490k99967N0834J77211J93045J91566M5379j34439k1246K34810N8328
$$ 22490 -277477 -226643 -49432 143613 335179 380558 246119 224873 459683 518011
34589E18011n09783o04056J43161Q29070N39725k51263m34739L9961K71035q287
$$ 518011 8228 -595828 -452667 376403 916128 664865 230126 270087 541122 532835
34579E32835j07228K31810K56317m87027j187423q63643J77320P90597N65086
$$ 532835 425607 657417 913734 426707 -760716 -1624359 -1447039 -656442 -91356
34570i1356J31720K6317N6689o0286j39142K9635J72410n0947m02831l46631J25824
$$ -91356 40364 66681 123370 63084 -76058 -46423 125987 75040 -327791 -674422 -548598
34559e48598M38952K67225l9185p4555k279j64725l69955j33478M41135O45941
$$ -548598 -109646 157579 118394 43839 41560 -123165 -493120 -626598 -185463 460478
34549D60478K05145k43866q2330L45973K85422k27762m16673L153L66479J06818
$$ 460478 665623 421757 339427 685400 970822 743060 326387 329540 696019 802837
34539H02837l41947k14530L71654N29794r8118p75717o68912L1063M28759J66997
$$ 802837 460890 246360 618014 1147808 1049690 273973 -394939 -363876 64883 231880
34529B31880j82591m2460L47606L60048o9511l81381k19592J14318J46326j59544
$$ 231880 49289 6829 354435 714483 644972 263591 43999 158317 304643 145099
34519A45099m58769m72189j96000J67002L30799J40139j84543j89062K34237N80293
$$ 145099 -313670 -785859 -981859 -814857 -484058 -343919 -528462 -717524 -483287 97006
34509I7006L23343l24590n97099j69378L69043K79147l03525n10563N0984O62073
$$ 97006 420349 95759 -501340 -670718 -301675 -22528 -326053 -836616 -785632 -123559
34499a23559M23322m38488p86614j36679O48468N73834j43752n30085k47343J95641
$$ -123559 299763 -138725 -925339 -1062018 -413550 160284 16532 -513553 -760896 -565255
34489e65255M00215M33491K78343k18319p15221n30519K83388P89006M70939m4843
$$ -565255 -165040 268451 546794 328475 -386746 -917265 -633877 155129 626068 581225
34479E81225o0857J32803p1669m88482n08280j76995o5493k60244k66970J12439
$$ 581225 520368 653171 581502 93020 -415260 -592255 -657748 -917992 -1184962 -1072523
34469a072523M72875M49613J70236k4774L4029K74389M54695L50725K5729k35107
$$ -1072523 -599648 -150035 20201 -4573 29456 303845 758540 1109265 1134994 899887
34459H99887l42285m34067m15991j0459N24923M26697l99786r58715n20672L07569
$$ 899887 557602 123535 -292456 -302915 222008 648705 248919 -709796 -1230468 -922899
34449i22899O06443N01965N58322N20693j16499q02167n87315J74813K52773l92169
$$ -922899 -316456 185509 743831 1264524 1148025 345858 -241457 -66644 186129 -206040
34439b06040m88891L78376J014775N43923k85182m59599j98022k06429l82645
$$ -206040 -694931 -316555 698220 1242143 956961 497362 299340 92911 -289734
34430b89734k15333J97683M00291L43935J87250j65386o52497p10311p5102N26614
$$ -289734 -505067 -307384 92907 436842 624092 458706 -193791 -904102 -979204 -452590
34420d52590K72189n10388p70862k05442M42266M82201M3868l05108k36753J32204
$$ -452590 -180401 -690789 -1461651 -1667093 -1224827 -742626 -698758 -1003866 -1240619 -1108415
34410a108415M38961M32924K25436Q2948k985k19111m12422j96996K81251L18323
$$ -1108415 -669454 -236530 -11094 71854 68869 -150242 -562664 -759660 -478409 -160086
34400a60086k77526p14145l22263L97322M72423j55132o18324l36724L49342P32912
$$ -160086 -437612 -1151757 -1474020 -1076698 -604275 -759407 -1377731 -1714455 -1365113 -632201
34390f32201N01597p2222m44787l21291M6830K27059K28731L77045N78158L42096
$$ -632201 -130604 -202826 -647613 -968904 -922074 -695015 -466284 -89239 488919 831015
34380H31015k69665m57144J11410N97706J57219p43373r70697l40553K61019K54560
$$ 831015 561350 104206 215616 813322 970541 227168 -743529 -1084082 -823063 -568503
34370e68503M7442J99625N47177M94861j11295p15252o79603q1847L15967M5967
$$ -568503 -521061 -321436 225741 720602 609307 -105945 -785548 -867395 -551428 -505461
34360e05461l85743k27673L41039M68858P811k51282J01419M66900L06582o3072
$$ -505461 -891204 -1118877 -777838 -308980 -301169 -552451 -451032 15868 322450 259378
34350B59378k43300m14122o09230k76830O28938J039653K68915p04141o25029
$$ 259378 16078 -398044 -1007274 -1284104 -655166 384487 653402 -50739 -675768
34341f75768Q2894J32850m06496l11628N74383R98981L96660k16049R990M18658
$$ -675768 -592874 -460024 -866520 -1178148 -603765 395216 791876 575827 585817 1004475
34331A004475N5613p58970r78468l71385L17957M68527J80267j33781k60845k22332
$$ 1004475 1060088 301118 -677350 -1048735 -730778 -262251 -81984 -215765 -476610 -698942
34321f98942n9134K38498N55323N57564Q1350m02430k22055M28133N19881k95449
$$ -698942 -758076 -519578 35745 593309 674659 272229 50174 478307 998188 702739
34311G02739r52276m72854M84620N90748j43773n31107j46808J78830j20429n29539
$$ 702739 -249537 -722391 -237771 352977 209204 -321903 -468711 -289881 -410310 -939849
34301i39849m38740L6997N28798Q49069P23418l8194q58217p83258J33243P32922
$$ -939849 -1378589 -1341592 -812794 36275 759693 721499 -136718 -919976 -786733 -53811
34291e3811L84839j99581k19935P0028O7019j50175j86384q2693l5580R7320M04186
$$ -53811 331028 131447 -88488 -18460 48559 -101616 -288000 -370693 -406273 -308953 95233
34280I5233N38723L00111P4869J25978O2o68252j263342r22840J33567Q14295
$$ 95233 633956 934067 1008936 1134914 1134976 466724 -796618 -1719458 -1585891 -771596
34270g71596N71930q8608m70931m18617j23963K57377O07848P61689N85394R1375
$$ -771596 -199666 -288274 -759205 -1177822 -1301785 -1044408 -436560 325129 910523 1001898
34260A001898m81398o98531k95217L88425O55337L03679j25129j64990n8253k19408
$$ 1001898 520500 -178031 -473248 -84823 570514 874193 749064 584074 525821 306413
34250C06413m97951m92705k84389k41311k64736R6740P48738R28932K60466n70500
$$ 306413 -191538 -684243 -968632 -1209943 -1474679 -1377939 -629201 299731 560197 -10303
34240a0303o29509L9806N00457K00480l26464k66401L39782P03374L90508j78691
$$ -10303 -639812 -600006 -99549 100931 -225533 -491934 -152152 551222 941730 763039
34230G63039l98643j90362J36771L29640K57481r3855m35960l69252j8949n908
$$ 763039 364396 174034 310805 640445 897926 804071 368111 -1141 -20090 -25998
34220b5998m48798n82655R3206Q69884P70550k2261n16236l36150Q0913M33316
$$ -25998 -474796 -1057451 -964245 -94361 676189 653928 137692 -198458 -117545 315771
34210C15771P43604P82536K89503l16295l98385j80073l47352o90508l50457N28049
$$ 315771 1059375 1841911 2131414 1815119 1416734 1236661 889309 198801 -151656 376393
34200C76393P24725j41178q97035n70100K62975N45897K07270j63562l22700l48774
$$ 376393 1101118 959940 62905 -507195 -244220 301677 508947 345385 22685 -326089
34190c26089k17914J9211J33316J47223L04252M30821J18323l06737k9830P50035
$$ -326089 -544003 -524792 -391476 -244253 59999 490820 609143 302406 272576 1022611
34180A022611P76010k89736j100212n97854M28622P01313K92334K6650k9826l08080
$$ 1022611 1798621 1508885 408673 -189181 239441 940754 1233088 1259738 1229912 921832
34170I21832o59800o52358l89329j15407L63556R93332R80329j8647r99955r75832
$$ 921832 262032 -390326 -779655 -895062 -531506 461826 1442155 1423508 423553 -552279
34160e52279m27296k44722j20059N81302J170590N79728n72010o76381L25284
$$ -552279 -979575 -1224297 -1344356 -763054 407536 987264 415254 -261127 64157
34151F4157Q94318L80709k01957j17196N2779k14710m32367j69580J30210N0647
$$ 64157 958475 1339184 1137227 1020031 1072810 858100 425733 256153 386363 437010
34141D37010o4159J28039L11546J43620j76223l73533m67397l99980k1584L37933
$$ 437010 372851 500890 812436 956056 779833 406300 -61097 -461077 -482661 -144728
34131a44728R2027n65176p05151m8966N83678N82814L87091N02427N69851J19961
$$ -144728 -52701 -617877 -1323028 -1371994 -788316 -205502 181589 684016 1253867 1373828
34121A373828m47312m45102n563J70427q7313k69551o7260J85811P2233k74826
$$ 1373828 926516 481414 475851 646278 558965 289414 222154 407965 480198 205372
34111B05372l32890R9646N70540N06041m1881n00849o01289o02911n95186k29646
$$ 205372 -127518 -27872 542668 1048709 1006828 505979 -95310 -698221 -1293407 -1523053
34101a523053N11158R60582O97854J86260p3723k79186n38624k76324N90523Q42637
$$ -1523053 -1011895 -51313 646541 832801 759078 479892 -58732 -335056 255467 1098104
34091A098104l05009j484293q95336Q19387J372890K73515o39663k60961L35108
$$ 1098104 793095 -691198 -1586534 -767147 605743 879258 239595 -21366 313742
34082C13742J16195k53766K1781L54029J0093m83021l88215r8508k52334m63881
$$ 313742 429937 176171 197952 551981 562074 79053 -309162 -407670 -660004 -1123885
34072a123885r5837M88018N38013J42742j17521j32684m3778K70357O86094N56178
$$ -1123885 -1219722 -731704 -193691 -50949 -168470 -301154 -344932 -74575 611519 1167697
34062A167697k19052o34985l8682O63304L45286n21783o48055K8851M18186J09364
$$ 1167697 948645 313660 274978 938282 1283568 761785 113730 142581 560767 670131
34052F70131j76376N5638L90660L27645o6240m63819o12003l38615K42953O17936
$$ 670131 493755 549393 940053 1267698 1201458 737639 125636 -212979 29974 647910
34042F47910M30811k0748k78110l65592m46780k93451K39677O31630L60578j71007
$$ 647910 1078721 1057973 779863 414271 -32509 -325960 -86283 545347 905925 734918
34032G34918j81976K54813L46153j72468o85858n98230J2162O32924P84233L63343
$$ 734918 552942 807755 1153908 981440 295582 -302648 -290486 342438 1126671 1490014
34022A490014j51158j23539L22734L28214l71205q55897m12851K54390J35779
$$ 1490014 1338856 1215317 1538051 1866265 1495060 639163 226312 480702 616481
34013F16481m31056l70049L21616O31147K04358k59225k84264j77982j89446r2974
$$ 616481 185425 -184624 136992 768139 972497 713272 429008 251026 61580 -31394
34003c1394J88113L37234J89326r6691l94039n59148k65384M02815N63050l13493
$$ -31394 156719 493953 683279 586588 192549 -366599 -631983 -229168 333882 20389
33993B0389j228147q07087O03745J319372P28476r2018k91897k78845m59678m14613
$$ 20389 -1207758 -2014845 -1411100 -91728 636748 544730 252833 -26012 -485690 -900303
33983i00303M3253K78467K6670m726M99638O67706o6837p69517m13210M36863
$$ -900303 -857050 -578583 -551913 -556639 -57001 610705 543868 -225649 -638859 -201996
33973b01996N75840P0985j04175J53388O5674m47023n26062J48452P71747O32039
$$ -201996 373844 444829 340654 494042 559716 112693 -413369 -264917 506830 1138869
33963A138869M4953l06790k97572k23315k26660k49195k71424k99577k57590o0808
$$ 1138869 1183822 877032 579460 356145 129485 -119710 -391134 -690711 -948301 -1009109
33953a009109K71713O01282P03672M29683m3394k97732j94272p4719j94703k57356
$$ -1009109 -737396 -136114 567558 997241 953847 656115 461843 387124 192421 -64935
33943f4935P0983M45262K41758m07282o44325r6463N47908M89489j32938n67465
$$ -64935 6048 451310 693068 285786 -358539 -455002 92906 582395 449457 -118008
33933a18008m75446j32171J90376M70065N76851K40001m22910p97061n12577K9929
$$ -118008 -593454 -725625 -535249 -65184 511667 751668 328758 -468303 -980880 -950951
33923i50951K33324J23721J47514L52404L40545J9229j77525L3334L64772M29625
$$ -950951 -717627 -593906 -446392 -93988 246557 265786 88261 121595 486367 915992
33913I15992K38563K8853n6494L0440K03338J36435l29563o56260j77412O83271
$$ 915992 1154555 1183408 1126914 1157354 1360692 1497127 1167564 511304 333892 1017163
33903A017163O89874l39404r96964l24801O56882N20600l72070o19357q2174J63064
$$ 1017163 1707037 1367633 370669 45868 702750 1223350 851280 231923 149749 312813
33893C12813j20844k7779O48245R05250K85890l20427k27916r456k69910n21176
$$ 312813 191969 164190 812435 1717685 2003575 1683148 1455232 1445776 1175866 654690
33883F54690j55269M06907M64491J89108J31463J81239j01811n64141o65768l12327
$$ 654690 499421 906328 1370819 1559927 1691390 1872629 1770818 1206677 540909 228582
33873B28582J33784L82234L05354j04047m73617k50410M49039P71308L16684k79718
$$ 228582 362366 744600 1049954 945907 472290 221880 670919 1442227 1758911 1479193
33863A479193m08671l32452l93324k57438K67890N10191j2773n56741k41716M58647
$$ 1479193 1070522 738070 344746 87308 355198 865389 852616 295875 54159 512806
33853E12806M72430j58377n39742m65075m05950k93805L07408R64606P35459j78270
$$ 512806 985236 826859 287117 -177958 -583908 -877713 -570305 394301 1129760 951490
33843I51490n16443P6888N03819K7212o01238m35868K54942N87038L29918q0850
$$ 951490 435047 511935 1015754 1042966 441728 5860 260802 847840 1177758 1096908
33833A096908k76467j74432J38548L82656K88876O498q1089K1037o904j36160
$$ 1096908 820441 646009 784557 1167213 1456089 1462587 1381498 1402535 1395631 1259471
33823A259471n4283J24180k6257l86190l89187m7330L8962j77823o4332M39923
$$ 1259471 1205188 1329368 1303111 916921 527734 480404 519366 341543 277211 717134
33813G17134N43824j1363m00302j13289J80009j07376l92532j0673N11252L27781
$$ 717134 1260958 1249595 849293 736004 916013 808637 416105 405432 916684 1244465
33803A244465k71433l87353J511J66267p3641k05344j8692J59725J72265K05431
$$ 1244465 973032 585679 587190 753457 679816 474472 455780 615505 787770 993201
33793I93201K75614J71502r2504k48652j57424J14665M28107N39080K67518q9153
$$ 993201 1268815 1440317 1347813 1099161 941737 1056402 1484509 2023589 2291107 2201954
33783B201954j4306L35482K24559l45494l79177M45696R25139J10677j026416
$$ 2201954 2187648 2523130 2747689 2402195 2023018 2468714 3393853 3504530 2478114
33774B478114r49775J87249R99665R82394P21566M55402m7981m51535k10985J92588
$$ 2478114 1528339 1715588 2715253 3697647 4419213 4874615 4826634 4375099 4164114 4356702
33764D356702j09133o61936k66034P83197Q57597l56872j219405o73300L10403
$$ 4356702 4247569 3585633 3319599 4102796 4960393 4603521 3384116 2710816 3021219
33755C021219N55852L27812K55686Q3032m66362q09392n14869j22756o7160J02986
$$ 3021219 3577071 3904883 4160569 4243601 3777239 2967847 2452978 2330222 2263062 2366048
33745B366048N75606N97395p4195l51937L73344R07581J35132r82635r03845L1730
$$ 2366048 2941654 3539049 3464854 3112917 3486261 4393842 4528974 3546339 2642494 2674224
33735B674224M00849J17359J70453N55894M22377p8400k0082M09975J72326n26312
$$ 2674224 3075073 3192432 3362885 3918779 4341156 4262756 4242674 4652649 4824975 4298663
33725D298663l77933O10470Q54408j79701j006484n43012K55795J96032k34447
$$ 4298663 3920730 4531200 5385608 5205907 4199423 3656411 3912206 4108238 3873791
33716C873791K6242P35221Q64383K48040m17947p05674o60659l10544K42213N81268
$$ 3873791 3900033 4635254 5499637 5747677 5329730 4624056 3963397 3652853 3895066 4476334
33706D476334M45708J14405q6165j92061j86993J73082P02683O86106l1956n91648
$$ 4476334 4922042 5036447 4950282 4758221 4571228 4744310 5446993 6133099 6101143 5509495
33696E509495l68769P1463m473k87409j49676R1029k53434q41300o85822K02267
$$ 5509495 5140726 5212189 5207716 4920307 4770631 4861660 4608226 3766926 3081104 3283371
33686C283371P15792K95885l60341n14305l87557m67792n44879j33017N19694
$$ 3283371 3999163 4295048 3934707 3420402 3032845 2565053 2020174 1887157 2406851
33677B406851N81665j75004r05245p16765J48150O24411K66659j94396q617M51920
$$ 2406851 2988516 2813512 1908267 1191502 1339652 1964063 2230722 2036326 2027709 2479629
33667B479629L42380k33014l40269K66934O74829J53072p92442j158781o72417
$$ 2479629 2822009 2588995 2248726 2515660 3190489 3343561 2551119 1392338 719921
33658G19921J60667P62548Q24315L36736l31670o80881o28608m77109k81899J63695
$$ 719921 880588 1643136 2467451 2804187 2472517 1791636 1163028 685919 404020 567715
33648E67715O24772N05224r6984k99935J54020L47053k96207q95047m67739M02932
$$ 567715 1192487 1697711 1600727 1300792 1454812 1801865 1505658 610611 142872 545804
33638E45804M41942l08714o32232o4645N63800N66252K77611K35318L51649K63171
$$ 545804 987746 679032 46800 -17845 545955 1112207 1389818 1625136 1976785 2239956
33628B239956q2285m74136o81897n34353r9395K30872J82849R536O8249K01902
$$ 2239956 2157671 1683535 1001638 467285 367890 598762 781611 791147 859396 1061298
33618A061298M0455k86173l19290j5402K62496L75130M41044L62087n5054n64895
$$ 1061298 1101753 815580 496290 480888 743384 1118514 1559558 1921645 1866591 1301696
33608A301696o83611l99774j30558l6109N6308J43594Q2211N0130L18522O16466
$$ 1301696 618085 218311 87753 51644 107952 251546 333757 383887 702409 1318875
33598A318875M13416j68111m28335j39273J69450Q7148j65248k52132j65370Q607
$$ 1318875 1732291 1564180 1135845 996572 1166022 1253170 1087922 835790 670420 679027
33588F79027K45175L90375K90210J45078K40568L70432J12354l77256n19406k50446
$$ 679027 924202 1314577 1604787 1749865 1990433 2360865 2473219 2095963 1576557 1326111
33578A326111q1704j96442k51313j44052j66025k68263l6528M05095L68540k22839
$$ 1326111 1244407 1047965 796652 652600 486575 218312 181784 586879 955419 732580
33568G32580n49930j96206J86487M5879j36282K10015O51632M71262j08345l23749
$$ 732580 182650 -13556 172931 218810 82528 292543 944175 1415437 1307092 983343
33558I83343r4757K9443j11381j65346l2487K6159P476J73298L92891J70432m82866
$$ 983343 888586 918029 806648 641302 608815 634974 642450 815748 1208639 1379071 896205
33547H96205q01085k26595P64778J168576O05308l11727o92554k56990M77042
$$ 896205 95120 -131475 633303 1801879 2407187 2095460 1402906 1145916 1622958
33538A622958P55377L26434l08329m10169J49620O63808M53939j23812n7259P85457
$$ 1622958 2378335 2704769 2396440 1986271 2135891 2799699 3253638 3129826 3072567 3858024
33528C858024J291426R49570J176647L271676N415038L943657j577976o628440
$$ 3858024 5149450 6099020 7275667 10547343 15962381 19906038 18328062 11699622
33520A1699622o771792k974939J67989M21594m56252n88954m54085q03988q12125
$$ 11699622 4927830 1952891 2120880 2542474 2086222 1497268 1043183 239195 -572930
33511e72930J76011R63945L33756p75578o88220L35805O33176j80688q04221m39423
$$ -572930 -396919 567026 900782 125204 -563016 -227211 405965 225277 -578944 -1018367
33501a018367J49209O1656m15535m18921K60125J015924J177373O57776k9209
$$ -1018367 -869158 -807502 -1223037 -1641958 -1381833 -365909 811464 1469240 1440031
33492A440031l59967l89008n29386p83217o86526j46071K80227K28553M1541P1136
$$ 1440031 1080064 691056 161670 -621547 -1308073 -1454144 -1173917 -945364 -903823 -832687
33482h32687J13054j3935k100K66177K52712l20064p17050k02360O94622Q53493
$$ -832687 -719633 -733568 -735668 -469491 -216779 -536843 -1253893 -1456253 -761631 91862
33472I1862J70073m40302m46679j93170m3710R2475K66226K40949m0082k45752
$$ 91862 261935 -178367 -625046 -818216 -861926 -769451 -503225 -262276 -302358 -548110
33462e48110j21279J67467K76873O5919k93540m67973k91745K2397J84762K65431
$$ -548110 -669389 -501922 -225049 -159130 -452670 -920643 -1212388 -1189991 -1005229 -739798
33452g39798M41342M26693j65076q84962p73266J56705P59139M87909J91277N33424
$$ -739798 -298456 128237 -36839 -921801 -1695067 -1538362 -779223 -291314 -100037 433387
33442D33387P84751J67184o38587n72941L8674J63554j34461k4226M01821K85345
$$ 433387 1218138 1385322 746735 173794 212468 376022 241561 217335 619156 904501
33432I04501l47553n60619j21367K04256M0205j67428j98664l28403m31093k0514
$$ 904501 556948 -3671 -125038 79218 119423 -48005 -246669 -575072 -1006165 -1026679
33422a026679O51042P14370R8635l39167k84218l28323o19539m75539K34196O27883
$$ -1026679 -375637 338733 437368 98201 -186017 -514340 -1133879 -1609418 -1375222 -747339
33412g47339K95270p36K52168M24489M7561k11232J61570L88452k69250r78067
$$ -747339 -452069 -452805 -200637 223852 271413 60181 221751 610203 340953 -637114
33402f37114m86401Q05138J318194N48089m41881p08291m47879j92273J8845L08456
$$ -637114 -1123515 -318377 999817 1547906 1106025 397734 -50145 -242418 -223573 84883
33392H4883M93151L40787n6935m06150n09251l73118j64978l1334J02607L61255
$$ 84883 578034 918821 861886 455736 -53515 -426633 -591611 -622945 -520338 -159083
33382a59083N07310J20185o24017q81379k54535N16894N40088K7376j19692L01806
$$ -159083 348227 468412 -155605 -1036984 -1291519 -774625 -234537 -207161 -326853 -25047
33372b5047O20777M33318J27416J15886K15744R8377j28076j48026N2477K37759
$$ -25047 595730 1029048 1156464 1272350 1488094 1586471 1458395 1310369 1362846 1600605
33362A600605L07892L42526L34023J27334l20475p56677q32645n05015j45467
$$ 1600605 1908497 2251023 2585046 2712380 2391905 1635228 802583 297568 152101
33353A52101j36703l95268m67654j31395K99940L89181J28020r7604j1389K48555
$$ 152101 15398 -379870 -847524 -978919 -678979 -289798 -161778 -259382 -270771 -22216
33343b2216L20176K1635m39133o46094m07522J3755J95355N6757p7996O9060L75968
$$ -22216 297960 319595 -119538 -765632 -1173154 -1159399 -964044 -907287 -985283 -916223 -540255
33332e40255M85078K20793k08234l76713m2782N44363Q15706M83623j22384m70270
$$ -540255 -55177 165616 -42618 -419331 -462113 82250 897956 1381579 1259195 788925
33322G88925m38706k92104j91548p2707M2972J492j48637j07853K40159N78963
$$ 788925 350219 58115 -133433 -206140 -163168 -161676 -310313 -418166 -178007 400956
33312D00956N05324Q311m89781n30630q3216L58918K84354j80654l99996j36429
$$ 400956 906280 914591 424810 -105820 -189036 169882 454236 273582 -126414 -262843
33302b62843J03361n1969j44420L17531Q24270N08955l96804p60682k31411L06002
$$ -262843 -159482 -211451 -355871 -38340 785930 1294885 898081 137399 -94012 211990
33292B11990J94357r8975j4215J19268j73536n42789l97828P1801K58098J13038
$$ 211990 406347 307372 293157 412425 238889 -303900 -701728 -629927 -371829 -258791
33282b58791o446j19554m31060o28173k49385L73128M47482J2404l6771N88848
$$ -258791 -265237 -384791 -815851 -1444024 -1693409 -1320281 -872799 -860395 -897166 -308318
33272c08318J004842M98813l46937n37209r8162J56895k7363r8448K28226M60686
$$ -308318 696524 1195337 848400 311191 213029 369924 342561 244113 472339 933025
33262I33025J77136k49111k34009J12111J99817j23249m25831m33540l71868m24347
$$ 933025 1110161 861050 627041 739152 938969 815720 389889 -43651 -415519 -839866
33252h39866l37459J11600N97079O18561K41023M0768K91028N44729K03299o55528
$$ -839866 -1177325 -1065725 -468646 149915 390938 431706 722734 1267463 1470762 815234
33242H15234j231010q57795J64586Q04209M73520k59402m42519j3059K42724m2536
$$ 815234 -415776 -1273571 -1108985 -304776 168744 -90658 -533177 -546236 -303512 -346048
33232c46048l08659p5033K63648J74584o0591J56575O55890O92465R5441m86558
$$ -346048 -654707 -729740 -466092 -291508 -352099 -195524 460366 1152831 1248272 761714
33222G61714n03274q6771L27279M66919K61824j60260m70335m61548l25247l00647
$$ 761714 258440 171669 498948 965867 1227691 1067431 597096 135548 -189699 -490346
33212d90346k40746N8328L28240J77797j94885k42749P1651K62862J16853q9986
$$ -490346 -731092 -672764 -344524 -166727 -361612 -604361 -532710 -269848 -152995 -242981
33202b42981j31415l2550J99700M91998M96701Q5733j77383J76201N32068m972
$$ -242981 -374396 -406946 -207246 284752 781453 867186 689803 866004 1398072 1393100
33192A393100r90103j060873n8965O28566K23286l23864n1152M67072K98586j86730
$$ 1393100 402997 -657876 -716841 -88275 135011 -188853 -240005 227067 525653 338923
33182C38923p8650L90218K70399l80199n23270J50957P13616M21476k78411n53327
$$ 338923 260273 650491 920890 540691 17421 168378 881994 1303470 1025059 471732
33172D71732l33026j86280m02253o26605l82800K53758O46644L54618k25771k97057
$$ 471732 138706 -47574 -449827 -1076432 -1459232 -1205474 -558830 -204212 -429983 -727040
33162g27040K54746O67915L75727k12931l53767J5403L49415L11250M2266k24696
$$ -727040 -472294 195621 571348 358417 4650 20053 369468 680718 722984 498288
33152D98288l85100l47582n6301L30542M86424J99442l94045q02570n35248K90457
$$ 498288 113188 -234394 -290695 39847 526271 725713 331668 -470902 -1006150 -715693
33142g15693Q48350N28997j59943k09116M21897P23774J78818m85693m96753j63390
$$ -715693 132657 661654 501711 292595 714492 1438266 1617084 1131391 634638 471248
33132D71248j67286m03060l12862Q4657L03395K40190J78434J42952n9543k99727
$$ 471248 303962 -99098 -411960 -327303 -23908 216282 394716 537668 478125 178398
33122A78398k79929j29834k16651m22245k53874K93554O09406L52105o8225j26504
$$ 178398 -101531 -231365 -448016 -870261 -1124135 -830581 -221175 130930 62705 -63799
33112f3799J08916J97655l710k08180j63261j042k1399k23710k57294P3553M66759
$$ -63799 45117 242772 239062 30882 -132379 -133421 -154820 -378530 -635824 -562271 -95512
33101i5512N23416L06570J39861J4856k82010n36630k81591L00748L97424k13543
$$ -95512 427904 734474 874335 889191 607181 70551 -211040 89708 487132 273589
33091B73589o86837l27578L73551N45149K20921O3113J91477J39550j78416k90148
$$ 273589 -413248 -740826 -367275 177874 398795 461908 653385 792935 614519 324371
33081C24371j8130J96592K1293k75097l17945j79597j17230p4047J72076N06797
$$ 324371 306241 502833 524126 249029 -68916 -248513 -365743 -439790 -267714 239083
33071B39083N35405J93743o2563Q9231K97534O7798l60360l05182J76171K15466
$$ 239083 774488 968231 905668 994899 1292433 1360231 999871 694689 870860 1086326
33061A086326m37392q03070j65363O57776N41025j28284j52443L92209L11399
$$ 1086326 648934 -154136 -319499 338277 879302 751018 598575 990784 1302183
33052A302183n48541r37601l08488K83034R970m10293j03176M58572L72249j85988
$$ 1302183 753642 -183959 -492447 -209413 -199443 -609736 -712912 -254340 117909 -68079
33042f8079m10068j43348K19318N28370P45819N68618l2395m32126k34313L5490
$$ -68079 -478147 -621495 -402177 126193 872012 1440630 1408235 976109 741796 777286
33032G77286j70616m76505l33181o0982k14101m68402j57019M94694O77556K70824
$$ 777286 606670 130165 -203016 -263998 -478099 -946501 -1103520 -608826 68730 339554
33022C39554j21000j98060j69823r2910J73381M37422L37207j691q4565K07467
$$ 339554 218554 20494 -149329 -242239 -68858 368564 705771 704080 619515 826982
33012H26982M91921M50426J30728k17226l35650j69101k9601k32172n14522l54408
$$ 826982 1318903 1769329 1900057 1682831 1347181 1178080 1148479 916307 401785 47377
33002D7377R2615J37965k28762k28902L23050O03572J98961j95444q8645j3069
$$ 47377 139992 277957 49195 -179707 143343 746915 945876 750432 661787 648718
32992F48718k89602k36266M32610O77882k00414j126577q40455R2260L31994o6233
$$ 648718 359116 122850 555460 1233342 1032928 -93649 -934104 -841844 -509850 -576083
32982e76083j08958K48703L03635J32971L12101N37000R8400o05537n58367J27428
$$ -576083 -685041 -436338 -132703 268 312369 849369 947769 342232 -216135 -88707
32972h8707M05634J9302l52825m37688n01802l98720J62249O52727L76159k02900
$$ -88707 316927 336229 -16596 -454284 -956086 -1354806 -1192557 -539830 -163671 -366571
32962c66571j32241L69323L54131j15935k02512O1418m1745l60312j69803K25357
$$ -366571 -498812 -129489 224642 108707 -93805 -32387 -74132 -434444 -604247 -378890
32952c78890o1120o44214l28826O58294Q60186R2644k55548L10094O34255R7126
$$ -378890 -440010 -1084224 -1413050 -754756 105430 198074 -57474 252620 886875 984001
32942I84001l73574j28264J34058j40264l92828k16092j02164k39095m451O55423
$$ 984001 610427 482163 616221 475957 83129 -132963 -235127 -474222 -478673 176750
32932A76750P75405K8299n46529k23122L11432K85161J1441j3748O483j09475
$$ 176750 952155 980454 433925 210803 522235 807396 818837 805089 811572 702097
32922G02097o6671M6944l32125r32357o35190N67510J104139J91774q06398n02395
$$ 702097 635426 682370 350245 -582112 -1217302 -649792 454347 646121 -160277 -662672
32912f62672L95488M14491l33359n98926n5487M91259N39846L45585J51499p5152
$$ -662672 -267184 147307 -186052 -784978 -840465 -349206 190640 536225 687724 612572
32902F12572k32699j18317J72013L18712J69351j68911m52872m48297j90741j4003
$$ 612572 379873 261556 433569 752281 921632 752721 299849 -148448 -339189 -353192
32892c53192k4493J31639N18302M72769l10686q75778k82413P41198P61208j38785
$$ -353192 -377685 -246046 272256 745025 434339 -441439 -723852 17346 778554 639769
32882F39769n87444j38744L21671K92062J81557J05019k79662o65603l60591L05117
$$ 639769 52325 -86419 235252 527314 708871 813890 534228 -131375 -491966 -186849
32872a86849L61975o3848k2482L85187K15851l42391j81476N87425Q05501N37345
$$ -186849 175126 111278 88796 473983 689834 347443 165967 753392 1558893 2096238
32862B096238Q54451J329972L91519j521931j999638n32964N19953j62877q68234
$$ 2096238 2950689 4280661 4672180 3150249 1150611 617647 1137600 974723 106489
32853A06489j09645Q65823N76018j15218J33920P07690M09418l71146o20307m13697
$$ 106489 -3156 862667 1438685 1323467 1457387 2165077 2574495 2203349 1583042 1169345
32843A169345k10023J70032O40002M17718m27869o16516J92837O73979J62632
$$ 1169345 959322 1129354 1769356 2187074 1759205 1142689 1335526 2009505 2172137
32834B172137k74319l2843m9857o48554o28564L21572O94310j07004n73434Q5092
$$ 2172137 1897818 1864975 1815118 1166564 538000 859572 1553882 1446878 873444 958536
32824I58536N16374j8318k28328M04731L66893p15661q05910P53294J496488Q9164
$$ 958536 1474910 1456592 1228264 1632995 1999888 1284227 478317 1231611 2728099 2817263
32814B817263j082465j13306J086308N70166J5576J229507K253777P43263j607184
$$ 2817263 1734798 1621492 2707800 3277966 3293542 4523049 6776826 7520089 5912905
32805E912905j897436p59298m46099o14139J40484Q39138N2880r11254m06131
$$ 5912905 4015469 3256171 2810072 2195933 2336417 3175555 3228435 2317181 1911050
32796A911050L08151k46237n29834Q59183J831083O05503m49717Q72403K118376
$$ 1911050 2219201 1972964 1443130 2302313 4133396 4738899 4289182 5161585 7279961
32787G279961Q25505l16614J522333L422450K202485J217196M125191O658352
$$ 7279961 8105466 7788852 9311185 12733635 14936120 16153316 20278507 26936859
32779B6936859L892626J229079O630584J5289580J6284695J4315373K8678934
$$ 26936859 30829485 32058564 38689148 53978728 70263423 84578796 113257730
32772A13257730O4658051R8241820R7690928N3927462j3864500p3903140r9710689
$$ 113257730 177915781 276157601 373848529 427775991 413911491 340008351 240297662
32765B40297662q4708060m8330659k0842697j4844194j7210380j2587984l993909
$$ 240297662 155589602 107258943 86416246 71572052 54361672 41773688 37779779
32758C7779779k284197o354570o787202k625184j009979l204411l417378n07031
$$ 37779779 35495582 29141012 22353810 19728626 18718647 15514236 12096858 11589827
32750A1589827L70160j943639k649042l27019P22732j059077j842773m5430Q31085
$$ 11589827 11959987 10016348 7367306 7040287 7763019 6703942 4861169 4815739 5646824
32741E646824q63038j910582m90613O62506k15324q28471K75209Q66980l72759
$$ 5646824 4783786 2873204 2382591 3045097 2829773 2001302 2276511 3143491 2770732
32732B770732j157882l5023Q24942j87366j147159l48197O41606J94674m55912
$$ 2770732 1612850 1577827 2402769 2215403 1068244 720047 1361653 1556327 1100415
32723A100415K5177M62166k73336q71163r4116P99435L49874n97853o73998k33840
$$ 1100415 1125592 1587758 1314422 443259 349143 1148578 1498452 900599 226601 -7239
32713g239p0016J64646O84449O57802n1194k16373M36578M12398p78423j337639
$$ -7239 -77255 87391 771840 1429642 1378448 1162075 1598653 2011051 1232628 -105011
32703a05011j76649J063675P05242l25201l79391K21867K71531r1949o7439J39360
$$ -105011 -281660 782015 1487257 1162056 782665 1004532 1276063 1184114 1116675 1256035
32693A256035m1943k85222j00881J65029J46185J98103M28713K04399n41292q31107
$$ 1256035 1214092 928870 827989 993018 1139203 1337306 1766019 1970418 1429126 598019
32683E98019k88070J44029j00650l07428o0151n6686m59294k13703R01182J346531
$$ 598019 309949 453978 353328 45900 -14251 -70937 -530231 -743934 157248 1503779
32673A503779K54389r14270o21200L70534M56108k96267p13521n13620j89732
$$ 1503779 1758168 843898 222698 593232 1049340 753073 39552 -474068 -663800
32664f63800J89681O64757O93860L2191n03309k50750J97170J38363j4979K46916
$$ -663800 -474119 190638 884498 916689 413380 162630 359800 498163 483184 730100
32654G30100L79888j27328n74277k69347R5755k83309o55450N4210J107446Q34150
$$ 730100 1109988 982660 408383 139036 234791 -48518 -703968 -649758 457688 1291838
32644A291838p14561j691573j024153L58664J039781P26853R0980j82910Q0783
$$ 1291838 577277 -1114296 -2138449 -1779785 -740004 -13151 77829 -105081 -24298
32635b4298M85880M34428j53689o43906m85145P9413M08635K66831n8707j70557
$$ -24298 461582 896010 742321 98415 -386730 -307317 101318 368149 309442 138885
32625A38885Q8114M33460L22041k90801o18029j02375N38280K79423n26413o94051
$$ 138885 226999 660459 982500 691699 73670 -28705 509575 788998 262585 -431466
32615d31466k12303j50163n63103l02093P45076J132267K86090m00319Q4159O80131
$$ -431466 -643769 -793932 -1357035 -1659128 -914052 218215 504305 103986 188145 868276
32605H68276K04406n90911m33363K86476L81358p7227j90967L4063n7855l44789
$$ 868276 1072682 481771 48408 334884 716242 639015 448048 482111 424256 79467
32595G9467j93256K61818L83922K22398K79126M37455K05422k76110m40045k26812
$$ 79467 -113789 148029 531951 754349 1033475 1470930 1676352 1400242 960197 733385
32585G33385q53J10984J08446j58589n15275l69987K43540L70427l44729q24271
$$ 733385 732532 843516 951962 793373 278098 -91889 151651 522078 177349 -646922
32575f46922k28091N72053M15345k22692j86391K97476J67239m23909l46214M65893
$$ -646922 -875013 -302960 112385 -110307 -296698 778 168017 -255892 -602106 -136213
32565a36213Q74715M33667p8439j34418j11926k57114k08081J44700L24321Q2204
$$ -136213 738502 1172169 1093730 959312 847386 590272 382191 526891 851212 933416
32555I33416k53000m02327m03540k25369J72663M33993J72769l27286m59278j76609
$$ 933416 680416 278089 -125451 -350820 -178157 255836 428605 101319 -357959 -534568
32545e34568J42102M14255O63201M87599l16923r36964m54720O14612Q74427P2307
$$ -534568 -392466 21789 684990 1172589 855666 -81298 -536018 78594 953021 1025328
32535A025328o29611m87357o5653k5082j43703j0333K04441J77358j8692j77800
$$ 1025328 395717 -91640 -157293 -182375 -326078 -336411 -131970 45388 26696 -151104
32525a51104k41461j01108L18924O46971L68580k98818n01413O2909O82704O21025
$$ -151104 -392565 -493673 -174749 472222 840802 541984 40571 103480 786184 1407209
32515A407209L452n51939o95621m64085m7573L01981M07011L32546K04296n0817
$$ 1407209 1410661 858722 163101 -300984 -348557 -46576 360435 692981 897277 846460
32505H46460m38978n57863o2961O15552O50359l8161o10829m30483J64407M18432
$$ 846460 407482 -150381 -213342 402210 1052569 1014408 403579 -26904 137503 555935
32495E55935R5735l68905m28544R29M38526L70310p1074k53325j814R2244l34754
$$ 555935 651670 282765 -145779 -144850 293676 663986 592912 339587 337773 430017 95263
32484I5263p06519l89981K37079L90580J45858J87356N51368O00652J74894j89668
$$ 95263 -611256 -1001237 -764158 -373578 -227720 -40364 511004 1111656 1286550 1096882
32474A096882k33446k67417l89409k83271J7038N515l92575n75832k35534J57421
$$ 1096882 863436 596019 206610 -76661 -59623 -54108 -446683 -1022515 -1258049 -1100628
32464a100628J85011J10554K53000L59589J14971k10868j61356J87629L84812
$$ -1100628 -915617 -805063 -552063 -192474 -77503 -288371 -449727 -262098 122714
32455A22714K55397j417j91200k56083j64365K0066N0546k22875n07843k98016
$$ 122714 378111 376694 185494 -70589 -234954 -214888 -164342 -387217 -895060 -1193076
32445a193076M24853R29619M87998n95377j094140l07194R28843J217109L93090
$$ -1193076 -768223 161396 649394 54017 -1040123 -1347317 -418474 798635 1191725
32436A191725m08442m57882k55382l67241m53167j01303K42609N8452k14845Q6816
$$ 1191725 783283 325401 70019 -297222 -750389 -851692 -609083 -550631 -765476 -678660
32426f78660O00134M73805j79927m49290o8449L19237K77586J7659k47699m97346
$$ -678660 -78526 395279 215352 -233938 -302387 16850 294436 312095 64396 -432950
32416d32950m74596M9079N94433M50781j64096l42961P8425L16825P548k44076
$$ -432950 -907546 -858467 -264034 186747 22651 -320310 -241885 74940 82488 -161588
32406a61588J6240L51731K46169j09830k87082k58503j91905j14552o3135j11535
$$ -161588 -145348 206383 452552 342722 55640 -202863 -394768 -509320 -572455 -683990
32396f83990j07755J32507L54948J82077j44862o8402K77038K20576k53036m32790
$$ -683990 -791745 -659238 -304290 -122213 -267075 -335477 -58439 162137 -90899 -523689
32386e23689j30995L5535j44632r0677L45638L96344k65907p26488j83730P37730
$$ -523689 -654684 -619149 -763781 -854458 -508820 -112476 -378383 -1104871 -1288601 -550871
32376e50871Q90932J89644n10981o06930j32704N53815Q69896L21811p06551j075057
$$ -550871 340061 529705 18724 -588206 -720910 -167095 702801 1024612 318061 -756996
32366g56996l84139L49454K11110k10717R2169P68328O64447k14044o34762l2302
$$ -756996 -1141135 -791681 -580571 -791288 -699119 69209 733656 519612 -115150 -147452
32356a47452P21579O95333P3546m29666n75308n48114m09632p8196L62356O34713
$$ -147452 574127 1269460 1343006 913340 338032 -210082 -619714 -697910 -335554 299159
32346B99159M97387l5443o06140p44435l60223J34795L74462M52089N28235L89615
$$ 299159 796546 761103 154963 -589472 -949695 -814900 -440438 11651 539886 929501
32336I29501j25323n57868l28904L03201M56453j41905p63364p17210k31142L4588
$$ 929501 804178 246310 -82594 220607 677060 535155 -228209 -945419 -1176561 -1141973
32326a141973o6173j37585M7121K42036J60847q4352j34458J34755M48863M77898
$$ -1141973 -1208146 -1345731 -1298610 -1056574 -895727 -980079 -1114537 -979782 -530919 -53021
32316e3021K08791j25436l61566m58629l32734O0928M77784N46469K73035O4778
$$ -53021 155770 30334 -331232 -789861 -1122595 -1061667 -583883 -37414 235621 300399
32306C00399J21706J51032r7423l54118k22451J86074L82791J64667j71345k46335
$$ 300399 422105 573137 475714 121596 -100855 85219 468010 632677 461332 214997
32296B14997L274L33979M36496J87935k31065m99726m66056k16609J07177L62074
$$ 214997 218271 552250 988746 1176681 945616 445890 -20166 -236775 -129598 232476
32286B32476L34213m6917m07493k53396K88602M98594N2138m68581l90321J21702
$$ 232476 566689 519772 112279 -141117 147485 646079 698217 229636 -160685 -38983
32276c8983L86539J66767j72397k88281j88547j5899R9516Q537k99872n23998
$$ -38983 347556 514323 341926 53645 -134902 -150801 -51285 -42748 -342620 -866618
32266h66618l20804K31933O53393N53780R735m82604l81523L74856J125395J040974
$$ -866618 -1187422 -955489 -302096 251684 261419 -221185 -602708 -227852 897543 1938517
32256A938517Q6663q52431r91874m71100O1141K80654K57282P4643j51977j57209
$$ 1938517 2025180 1172749 180875 -290225 -229084 51570 308852 383495 231518 74309
32246G4309J03564K04236j63944o06765n48178r3251K17298K93356M46189N99079
$$ 74309 177873 382109 218165 -388600 -936778 -1030029 -812731 -519375 -73186 525893
32236E25893L46958j72146k82063J65435M91581K57129r3922p9204K753l09372
$$ 525893 872851 700705 418642 584077 1075658 1332787 1238865 1159661 1162414 853042
32226H53042p10456n29128J90998O74006M32111k06022o14253n32880j66478J06252
$$ 853042 142586 -386542 -195544 478462 910573 704551 90298 -442582 -609060 -502808
32216e02808Q1036o3968J9771L23748M00979K7587l62077k82260L8471K8710k62576
$$ -502808 -421772 -485740 -465969 -142221 258758 286345 -75732 -357992 -319521 -290811 -553387
32205e53387k30905K45117N29231K22550j93838j16233K65815L15102j01662n14807
$$ -553387 -784292 -539175 -9944 212606 18768 -97465 168350 483452 381790 -133017
32195a33017n33753j85810L06514O79005O47059J66135l75563n52184l95578j79062
$$ -133017 -666770 -852580 -546066 132939 779998 946133 570570 18386 -377192 -556254
32185e56254R0695M90650O67414J66248p00234r92270l66816M20619N32139O6424
$$ -556254 -465559 25091 692505 858753 158519 -833751 -1200567 -779948 -247809 -181385
32175a81385k74184j12178L59029P14224N84698n9633o76584n93910Q0130M66232
$$ -181385 -455569 -567747 -208718 505506 1090204 1030571 353987 -239923 -159793 306439
32165C06439J13689l82141l58809n3632j9416j67236j17393n685j20170j53739
$$ 306439 420128 37987 -320822 -374454 -393870 -561106 -678499 -684184 -804354 -958093
32155i58093K73617O92002M01007k18624j50721N49143P17664m1038o67270l25935
$$ -958093 -684476 7526 408533 189909 39188 588331 1305995 1264957 597687 271752
32145B71752L15566K30879l85494n66954q4911L56137K18006k62172n14759k44547
$$ 271752 587318 818197 432703 -134251 -219162 136975 354981 92809 -421950 -666497
32135f66497L62690P71723N51591j17103n65738m00728Q9180L73120K16901k83292
$$ -666497 -303807 467916 1019507 902404 336666 -64062 25118 398238 615139 331847
32125C31847q08257q67379k10828O68990R45014N21522J28790J61372J21799l87776
$$ 331847 -476410 -1343789 -1554617 -885627 59387 580909 709699 871071 992870 605094
32115F05094q26280n00436L12571P29236M51980k8390k27608j15535J00102J81259
$$ 605094 -221186 -721622 -409051 320185 772165 743775 516167 400632 500734 681993
32105F81993l2366l69878l76355M9727L45124L0623n01120m67167J98192P50084
$$ 681993 649627 279749 -96606 -46879 298245 328868 -172252 -639419 -441227 308857
32095C08857O17553L1639l83992l28381m4867K1632k32519l92146p2601M16179
$$ 308857 926410 958049 574057 245676 200809 222441 -10078 -402224 -474825 -58646
32085e8646L80907k16547n97572k91891J69679J04371l28007n19931l43615q0276
$$ -58646 322261 105714 -491858 -783749 -614070 -509699 -837706 -1357637 -1701252 -1781528
32075a781528J87923M69383M79207O0989k66738O9278O91532O66581j14148p04631
$$ -1781528 -1593605 -1124222 -645015 -584026 -850764 -781486 -89954 576627 462479 -242152
32065b42152l96786L85909P17004K43967n58745r07057l97384N56898J013848
$$ -242152 -638938 -253029 463975 707942 149197 -757860 -1155244 -598346 415502
32056D15502N19189k92888m94606q4017J35881j84305m75384k00571L37677N04063
$$ 415502 934691 641803 147197 63180 199061 14756 -460628 -661199 -323522 180541
32046A80541K40231L1673J36758K60174O1776k82125k80515J37740M05459O2047
$$ 180541 420772 452445 589203 849377 911153 629028 348513 486253 891712 953759
32036I53759n38670o85044l11097K2568Q7798K06794M19365K81763j91585k77241
$$ 953759 415089 -269955 -581052 -558484 -470686 -263892 155473 437236 245651 -31590
32026c1590K39424M74433j92588r83077q72298j74332J00464r7670m3076L28623
$$ -31590 207834 682267 489679 -493398 -1365696 -1540028 -1439564 -1537234 -1580310 -1251687
32016a251687M39511K87264L64327M95215P7147n54887m14690L59078M93598l15341
$$ -1251687 -812176 -524912 -160585 334630 411777 -143110 -557800 -198722 294876 -20465
32006b0465q01663k23243M14996J14045m71040k77492L51467M11206O634l134
$$ -20465 -822128 -1045371 -630375 -516330 -987370 -1264862 -913395 -502189 -495555 -498689
31996d98689L69615L53229p4583j18529L60307N11561r0287p06723n50401J12478
$$ -498689 -129074 224155 149572 31043 391350 902911 812624 105901 -444500 -332022
31986c32022M72038K74230o7007j50810J7661J82844J38601p5454k03718q9891
$$ -332022 140016 414246 347239 196429 214090 396934 535535 460081 256363 166472
31976A66472P8722L7927j03543J578L26621L75241j01568o05512m48432L29599
$$ 166472 245194 283121 179578 181156 507777 883018 781450 175938 -272494 57105
31966E7105R55735Q37115J50869n56802r94599j096271p07647J98996J108876
$$ 57105 1012840 1849955 2000824 1444022 449423 -646848 -1354495 -1155499 -46623
31957d6623J314689P65160Q2537l45778o91100r26549n49595M21795R44648K73933
$$ -46623 1268066 2033226 2115763 1769985 1078885 152336 -397259 24536 969184 1243117
31947A243117p89622r69518l88425j84063n04242l06892P03872J395647R88647
$$ 1243117 453495 -516023 -904448 -1088511 -1592753 -1899645 -1195773 199874 1188521
31938A188521K28576J8794K6386l75007p54730m08849K20073J98459k77828k40252
$$ 1188521 1417097 1435891 1462277 1087270 332540 -76309 143764 342223 64395 -175857
31928a75857L16582M20861j41660m37614k2386L09890l4017l90940k1979N69650
$$ -175857 140725 561586 419926 -17688 -40074 269816 235799 -155141 -177120 392530
31918C92530M85102n7227j52619K12643J71492m78876q51624l60173L98263O01298
$$ 392530 877632 820405 667786 880429 1051921 573045 -278579 -638752 -240489 360809
31908C60809K85498p7644m24899q12664q05704l4687Q93121R55889J67337l94812
$$ 360809 646307 568663 143764 -668900 -1474604 -1509291 -616170 339719 507056 112244
31898A12244j24074L94787M56129J89535P445j47348m03975m32812J217M33272
$$ 112244 -11830 382957 839086 1028621 1036066 888718 484743 51931 53148 486420
31888D86420L45297J1247k2663Q6354j57028n55028m87546o1853O05l49695l28373
$$ 486420 831717 842964 820301 906655 749627 194599 -292947 -354800 -354195 -703890 -1032263
31877a032263L24879P82688L84567l22908l99892J74720O34382N48257K14267
$$ -1032263 -707384 75304 459871 136963 -262929 -88209 546173 1094430 1308697
31868A308697K0338r3639l84356p48130o98510m0061O33844N63205m6873j70924
$$ 1308697 1329035 1235396 851040 102910 -595600 -635661 -1817 561388 514515 343591
31858C43591M84760Q79548K26443o26451m34889M40782N93021k00827p60705m89697
$$ 343591 828351 1707899 1934342 1307891 873002 1313784 1906805 1705978 945273 455576
31848D55576j00180j34812j94435m4207j19034m05580j71881N53680O10503l72611
$$ 455576 355396 220584 26149 -18058 -137092 -542672 -714553 -160873 449630 77019
31838G7019j047746l78289O69947P04354L6596j79954J8862j66804n44530k75147
$$ 77019 -970727 -1349016 -679069 25285 61881 -118073 -99211 -266015 -810545 -1085692
31828a085692M28609N74554J63562J28152N46962M63010l51530q99852n87529
$$ -1085692 -657083 -82529 81033 209185 756147 1219157 867627 -32225 -619754
31819f19754o3473K8552k463K36667L85718L5141m50718m61824k1380L58342L60685
$$ -619754 -683227 -654675 -657138 -420471 -34753 388 -450330 -912154 -933534 -575192 -214507
31808b14507Q5188j33531J1695M23577N39266P1930l65653k9632P21073Q22637
$$ -214507 -129319 -262850 -251155 172422 711688 783618 417965 388333 1109406 1932043
31798A932043J21451m09871k57282r4024m74417q26504m81267J22488J73205j49478
$$ 1932043 2053494 1643623 1386341 1292317 817900 -8604 -489871 -367383 -194178 -343656
31788c43656m3420M87470N92916k5103n88855m13834R7658J24061l29070m45277
$$ -343656 -387076 100394 693310 668207 79352 -334482 -236824 -112763 -441833 -887110
31778h87110K05991J006553J041230K17029o75535q95036m33701J90115M91956
$$ -887110 -681119 325434 1366664 1583693 908158 13122 -420579 -230464 261492
31769B61492L20441r8034l13633r9732K21380J91341q8606j28527R9448J15943
$$ 261492 581933 483899 170266 70534 291914 483255 394649 266122 365570 481513
31759D81513j43669j26816L07259M75806R031m06490j37025K86814P1595m45062
$$ 481513 337844 211028 518287 994093 1003124 596634 459609 746423 818018 372956
31749C72956l68265K09963L88453j7283k56503L8594L39013J85826j72030l20615
$$ 372956 4691 214654 603107 585824 329321 367915 706928 892754 720724 400109
31739D00109k20503n1032J1605j39423l27321j73176K36057K58812k08091k87464
$$ 400109 179606 128574 140179 756 -326565 -499741 -263684 -4872 -212963 -500427
31729e00427M34339R03635K04774p08428m39826M30287K73101p16239q05029J89765
$$ -500427 -66088 837547 1042321 333893 -105933 324354 597455 -118784 -923813 -734048
31719g34048N06423m64796j089559l46259M76794J57175m06366q97P64615P62865
$$ -734048 -227625 -692421 -1781980 -2128239 -1651445 -1494270 -1900636 -1901533 -1136918 -374053
31709c74053L37970L14047K75078m25757j013460m49646O01362P34062N1905k58312
$$ -374053 -36083 277964 553042 127285 -886175 -1335821 -734459 -397 51508 -206804
31699b06804j8093m511k65012j92461M3964j97121n45318q9621Q27477R44614
$$ -206804 -224897 -229408 -494420 -686881 -642917 -840038 -1385356 -1474977 -647500 297114
31689B97114J75352k65294Q5314L56472M3738k40019q8131P760k56172m23498
$$ 297114 472466 207172 292486 648958 692696 452677 364546 372306 116134 -307364
31679c07364k26334l0078K0692K51986N62641L59404k95264n47264r5489L80834
$$ -307364 -533698 -563776 -543084 -291098 271543 630947 335683 -211581 -307070 73764
31669G3764M39283M09618L95107n3598q15028r61183k31735M02806K93176Q0582
$$ 73764 513047 922665 1317772 1264174 449146 -512037 -743772 -340966 -47790 32792
31659C2792L65530N57528K0369o27465m74068J69337L39126l1386k18168p982
$$ 32792 398322 955850 976219 348754 -125314 44023 383149 351763 133595 125613
31649A25613J11580j04978l54011l44365o8571L56197O61615M85170j23515n57370
$$ 125613 237193 132215 -221796 -566161 -634732 -278535 383080 868250 744735 187365
31639A87365m09990k1890R8819l8884j85449k97600k89314Q2804O09700N60116
$$ 187365 -222625 -244515 -145696 -184580 -370029 -667629 -956943 -874139 -264439 295677
31629B95677j99304p12320k78141M13916L71156j41012j86043K24140L13136K3540
$$ 295677 96373 -615947 -894088 -480172 -109016 -250028 -436071 -211931 101205 124745
31619A24745K3582L16994J46523n51090q16791j85126N27439M82283n982j67859
$$ 124745 148327 465321 611844 60754 -756037 -941163 -413724 68559 62577 -105282
31609a05282N1187K04530K27712L94089O37951N52081K9376n29634p10401n37767
$$ -105282 -54095 150435 378147 772236 1410187 1962268 1991644 1462010 751609 213842
31599B13842l65465m14721m96104k70297J97478L78327Q48m09020j42492O39445
$$ 213842 -151623 -566344 -1062448 -1332745 -1135267 -756940 -756092 -1165112 -1307604 -668159
31589f68159J000222M67470l22283m73688N4100N33445M48334J3347k62404k29104
$$ -668159 332063 799533 477250 3562 57662 591107 1039441 1052788 790384 561280
31579E61280j57962k53128l23984q6887L26736M53786J38782k13438j87494J05153
$$ 561280 403318 150190 -173794 -260681 66055 519841 658623 445185 257691 362844
31569C62844K51323O8255l02537n96776n24333K3395O14375N19874l02394q81385
$$ 362844 614167 682422 379885 -216891 -741224 -717829 -103454 416420 114026 -767359
31559g67359m23839N24405P80563J41893m81906m74266k09886j93023k64261m1175
$$ -767359 -1191198 -666793 113770 255663 -226243 -700509 -910395 -1103418 -1367679 -1408854
31549a408854L78283N69963L62064k1476k36466j33319N6800p9167n26564o55125
$$ -1408854 -1030571 -460608 -98544 -120020 -356486 -489805 -433005 -512172 -1038736 -1693861
31539a693861o0477O56178N86612j45067n07741m2216N97013P27052M39002M9400
$$ -1693861 -1754338 -1098160 -511548 -656615 -1164356 -1206572 -609559 117493 556495 605895
31529F05895m14666p69764n12471L39277R20039O41071L7369j35337k8994j62763
$$ 605895 191229 -578535 -1091006 -751729 168310 809381 846750 711413 682419 519656
31519E19656l19698M8135O45013O04346j19967o06239l60972n338k35607p84949
$$ 519656 199958 248093 893106 1497452 1377485 771246 410274 404936 169329 -615620
31509f15620q96354l98985J76662L66027K43692J35337J38316Q0154j17179k32835
$$ -615620 -1511974 -1910959 -1734297 -1368270 -1124578 -989241 -850925 -770771 -887950 -1120785
31499a120785n7672K21066K41219M4535N3107L86035O23337M38599M6013k32042
$$ -1120785 -1178457 -957391 -716172 -671637 -618530 -232495 390842 829441 875454 643412
31489F43412m07508n23494l68218Q9770L99033K33399p7504j18963q7976l43048
$$ 643412 235904 -287590 -655808 -566038 -167005 66394 -11110 -130073 -218049 -561097
31479e61097o47469n37446j30660J37711K94728N87915P51056L89593j05331o573
$$ -561097 -1208566 -1746012 -1876672 -1738961 -1444233 -856318 -105262 284331 179000 172427
31469A72427M69982L91961l12293o13654k1186N85875K84330n81888j012959o43722
$$ 172427 642409 1034370 722077 108423 87237 673112 957442 375554 -637405 -1281127
31459a281127J08086O72412O82515J75901k51003o647N72283N37443k09781o34347
$$ -1281127 -1173041 -500629 181886 357787 106784 100137 672420 1209863 1000082 365735
31449C65735j41851M89741L62286k26172m77424l38102j95374N536M20335O33826
$$ 365735 223884 713625 1075911 849739 372315 34213 -161161 -155625 264710 898536
31439H98536K57919k63328l30939j85606l11633l95552M4935M91527J27389o45995
$$ 898536 1156455 893127 562188 376582 64949 -330603 -285668 205859 333248 -312747
31429c12747p27011j32249J14334j66361q3632N49310P77379K53237q2960K78320
$$ -312747 -1039758 -1172007 -1057673 -1224034 -1307666 -758356 19023 272260 189300 467620
31419D67620M39724k68072r36947m93694N17143P89780K11648k50371j71508k3609
$$ 467620 907344 639272 -297675 -791369 -274226 515554 727202 476831 305323 281714
31409B81714j28840k67906k70809k13232r0425Q1234J5327l86440n87328j02601
$$ 281714 152874 -115032 -385841 -599073 -689498 -608264 -592937 -979377 -1566705 -1669306
31399a669306O17475P30632K36296j06356K3363J84520M6702j60591j69859l2637
$$ -1669306 -1051831 -321199 -84903 -191259 -167896 16624 63326 -97265 -267124 -299761
31389b99761J34228K52181J47794j74043k48853K32319O83294K98458n88466p69542
$$ -299761 -165533 86648 234442 60399 -188454 43865 727159 1025617 437151 -332391
31379c32391N3269P33623L48585m90521o41761o0430L71842K45406L1856J73285
$$ -332391 -279122 454501 803086 312565 -329196 -389626 -17784 227622 259478 432763
31369D32763M28119K99191k39168o55021m48249K41654P22632N47179M5725k04051
$$ 432763 860882 1160073 920905 265884 -182365 59289 781921 1329100 1374825 1170774
31359A170774k21595m38015p88498o83316r423N26572L65285j68581m41104k97321
$$ 1170774 949179 511164 -277334 -960650 -970073 -443501 -78216 -246797 -687901 -985222
31349i85222P5547N28556P85398M50913l21805p07812l09919J66166n47l54986
$$ -985222 -909675 -381119 404279 855192 533387 -174425 -484344 -318178 -318725 -673711
31339f73711n2175O13925N80015k39520p36600l00786L30858L03336j63432l45958
$$ -673711 -725886 -111961 468054 228534 -508066 -808852 -477994 -174658 -338090 -684048
31329f84048j03712J89963L26667L32781K01964Q052o189J72875J55261k62169
$$ -684048 -787760 -597797 -271130 61651 263615 271667 265478 438353 593614 331445
31319C31445o57910n39404l1305L98803N87584N88726K72616l79970q08328m07664
$$ 331445 -326465 -865869 -897174 -498371 89213 677939 950555 570585 -237743 -645407
31309f45407M86957Q35959K47985n08827n82295q6389K65023J48468j68530l55628
$$ -645407 -158450 677509 925494 416667 -165628 -252017 13006 161474 -7056 -362684
31299c62684l29338j42969J03939K76351L24630L27381K83043L8953l71650n49647
$$ -362684 -692022 -834991 -731052 -454701 -130071 197310 480353 519306 147656 -401991
31289d01991k21678K49678K73048j06245k30614J85273N89870L99904j34467l13161
$$ -401991 -623669 -373991 -100943 -207188 -437802 -252529 337341 737245 602778 289617
31279B89617n341K34220M8841k19416r9472L06048M96646K68517q0537k02124
$$ 289617 284276 518496 567337 347921 248449 554497 1051143 1319660 1239123 1036999
31269A036999r1879K4634J2096r4449k43502m52460o94651p77882m63561K19590
$$ 1036999 945120 969754 981850 887401 643899 191439 -503212 -1281094 -1744655 -1525065
31259a525065Q49219R43941M62244j46283m44251m31016l60008k91428p9498K30284
$$ -1525065 -675846 268095 730339 584056 139805 -291211 -651219 -942647 -1022145 -791861
31249g91861L08798P657l08136j62105L76518P17730M69052j19379n31827n71305
$$ -791861 -483063 -475406 -783542 -945647 -569129 148601 617653 498274 -33553 -604858
31239f04858l73714n1049L51879O27044N18059J48527q847K28970M48061K25364
$$ -604858 -978572 -1029621 -677742 -50698 467361 615888 607041 836011 1284072 1509436
31229A509436k42912m58802l77914l87213n72578n14481K8414O46973P72499L73882
$$ 1509436 1266524 807722 429808 42595 -529983 -1044464 -1016050 -369077 403422 777304
31219G77304j18863m01933n16962n82533n83642m39107j22817K75391N35799M58594
$$ 777304 658441 256508 -260454 -842987 -1426629 -1865736 -1988553 -1713162 -1177363 -718769
31209g18769J40797k9338J73732M73413M10503o0514n00112m90438m2783M82245
$$ -718769 -577972 -607310 -433578 39835 450338 389824 -110288 -600726 -643509 -161264
31199a61264O96357M36843j26485n93651o53937l41938O3204L44494M76258N12297
$$ -161264 535093 971936 845451 251800 -402137 -744075 -680871 -336377 139881 652178
31189F52178M64717K96178j985k93959l18906m960K66251K7663n54465p27357
$$ 652178 1116895 1413073 1411088 1117129 798223 793263 1059514 1087177 532712 -194645
31179a94645j58554N14348N44556J20927j3922K60307L45776m4780m82658n85466
$$ -194645 -353199 161149 705705 826632 812710 1073017 1418793 1374013 891355 305889
31169C05889n35315n69379n03690j16348M00523O96939O63814L64016p8570l57100
$$ 305889 -229426 -798805 -1302495 -1418843 -1018320 -321381 342433 706449 627879 270779
31159B70779k08612M8116k21910q86256r40700M747Q84944O26838j96522k26350
$$ 270779 62167 110283 -111627 -997883 -1938583 -1933836 -1048892 -422054 -618576 -844926
31149h44926N69594R11883K77064l74330k50079J20865J4868k35613J9450N03681
$$ -844926 -275332 636551 913615 539285 289206 410071 424939 189326 208776 712457
31139G12457M72232m5282l86188l59592l33639l82996k10268J18240J79212j194
$$ 712457 1184689 1139407 753219 393627 59988 -323008 -533276 -415036 -235824 -237018
31129b37018P5780M58442N55233J04653l76718m28256k63230j92167q3668J60587
$$ -237018 -161238 297204 852437 957090 580372 152116 -111114 -303281 -386949 -226362
31119b26362K33954M9341R5083N38285O39653r4295p80680k91787Q63698J081217
$$ -226362 7592 56933 152016 690301 1329954 1235659 454979 163192 1026890 2108107
31109B108107J0226r79317q99979l72882k21796j22052M47612R19490M54295n57549
$$ 2108107 2118333 1139016 239037 -133845 -355641 -477693 -30081 889409 1343704 786155
31099G86155r34801l48771M15173O34028K67930l83756q66162o36670K60471Q40348
$$ 786155 -148646 -497417 -82244 551784 819714 435958 -430204 -1066874 -806403 33945
31089C3945L50638m82607l88857M95964Q32492K17864k37704J94096O98753L21754
$$ 33945 384583 -98024 -486881 9083 841575 1059439 821735 1015831 1714584 2036338
31079B036338n28348q19823m01144L6100l362m41915q67632p25075K06511J193753
$$ 2036338 1507990 688167 287023 323123 319761 -122154 -989786 -1714861 -1508350 -314597
31069c14597J111017l002q04150n38957o6147k71282n70491p6989P06359P12616
$$ -314597 796420 793418 -10732 -549689 -615836 -887118 -1457609 -1534598 -828239 -115623
31059a15623J22449r7519N0089j65932n51698k18653O23223P72839Q9241k18412
$$ -115623 6826 -90693 -40604 -206536 -758234 -976887 -353664 419175 508416 290004
31049B90004K75947M38576l98673j167184p84027J20922L34056o3059j41107K50595
$$ 290004 565951 1004527 605854 -561330 -1345357 -1224435 -890379 -953438 -1094545 -843950
31039h43950M86151L53833J85688O9846j57627l39373k09002Q628p7072k90537
$$ -843950 -357799 -3966 181722 251568 93941 -245432 -454434 -445806 -522878 -813415
31029h13415j67420K27827M35556L70506K81597J20946l13064p08538m92267K17295
$$ -813415 -980835 -753008 -317452 53054 334651 455597 142533 -566005 -1058272 -840977
31019h40977O28930L69062r5727k77321k61634k35304l3845M15754O54037K18064
$$ -840977 -212047 157015 61288 -216033 -477667 -712971 -746816 -331062 322975 541039
31009E41039n88244r27225m26517L93479P67592N16855Q2171j18667j23406j90351
$$ 541039 -47205 -974430 -1400947 -1007468 -239876 276979 359150 240483 117077 -73274
30999g3274l55131m02185j89426J67607M00376K76650j97209o33794n22881J40531
$$ -73274 -428405 -830590 -1020016 -852409 -452033 -175383 -372592 -1006386 -1529267 -1388736
30989a388736P05630O47606K45217O8288Q9666q6952l53256k42460J27330J35153
$$ -1388736 -683106 -35500 209717 278005 367671 280719 -72537 -314997 -187667 -52514
30979e2514k30793k57041K63446N99786K63895k41700l20853j09705R2467L81954
$$ -52514 -283307 -540348 -276902 322884 586779 345079 24226 -85479 6988 388942
30969C88942O75369M42207l16558o89604k19099K49560k4109l59684J02514P08567
$$ 388942 1064311 1506518 1189960 500356 281257 530817 506708 147024 249538 958105
30959I58105K81905p80070r84467q0142O13542K51351n20283p67390l41705M21398
$$ 958105 1240010 459940 -524527 -604669 8873 260224 -260059 -1027449 -1369154 -947756
30949i47756J069893J013566J02971p73084o55135L7479J43596l31256l22654
$$ -947756 122137 1135703 1238674 465590 -189545 -152066 -8470 -339726 -662380
30940f62380L16077N27354j8935l20367J28280M40410k4281n42227l76543L5941
$$ -662380 -346303 181051 162116 -158251 -29971 410439 386158 -156069 -532612 -496671
30930d96671J30091K36940O14932O09846j61486q20698n27887J40513K11898j46443
$$ -496671 -366580 -129640 485292 1095138 933652 112954 -414933 -274420 -62522 -208965
30920b08965k32265j25236k20503j96490L33006P98402N15890p5523k12961j69452
$$ -208965 -441230 -566466 -786969 -983459 -650453 147949 663839 588316 375355 205903
30910B05903n18185p33320l5660R14109Q19847r1583m09281J25511L49492k08000
$$ 205903 -312282 -1045602 -1081262 -167153 652694 561111 151830 277341 626833 418833
30900D18833o44256l81255L5285K02492M37869O73873K57272o18782p48185J51547
$$ 418833 -225423 -606678 -571393 -368901 68968 742841 1000113 381331 -366854 -215307
30890b15307P53664J90389n58410l56500K55820J49453m73623n99361j44679J48042
$$ -215307 538357 728746 170336 -186164 69656 219109 -254514 -853875 -998554 -850512
30880h50512J06105J68244L13019J13600k67165k10294K35793L38603j04502m03476
$$ -850512 -744407 -576163 -263144 -149544 -416709 -627003 -391210 -52607 -157109 -560585
30870e60585o1146M76982M82118j05128o67422o14568M5848P10795P71616K81507
$$ -560585 -621731 -144749 337369 232241 -435181 -1049749 -1003901 -293106 478510 760017
30860G60017j52271k20510k49146m52760m03364K32046Q87173P50836k8962n32811
$$ 760017 607746 387236 138090 -314670 -718034 -485988 401185 1152021 1123059 590248
30850E90248l44052P5924K48158K04241R2795p9213j79924k0947J76301k7371
$$ 590248 246196 322120 570278 774519 867314 788101 608177 587230 763531 736160
30840G36160m91840n41617l1525L25976P3312k44657j9773L39092O4183o14412
$$ 736160 244320 -297297 -328822 -2846 70466 -174191 -193964 145128 209311 -405101
30830d05101p15682m8074M43859J22443l91032k30097L87357N77374J81206j05445
$$ -405101 -1120783 -1168857 -724998 -602555 -993587 -1223684 -836327 -258953 -77747 -183192
30820a83192N1091J31042k34237n08550p5785O65997P56357L1678o66583o61224
$$ -183192 -132101 -1059 -235296 -743846 -819631 -153634 602723 634401 -32182 -693406
30810f93406j90189J57761J94041N8834j27598k16176q421L77804M46947k0882
$$ -693406 -883595 -725834 -531793 -472959 -600557 -816733 -825154 -447350 -403 -21285
30800b1285n50490n76915j98743P6152Q4295M5311M8780P146p324J18227J88290
$$ -21285 -571775 -1148690 -1347433 -1271281 -1186986 -1141675 -1092895 -1085749 -1093073 -974846 -786556
30789g86556K768r8174L53027J005739R35363L4376o34829l18655L03652J34853
$$ -786556 -783788 -881962 -528935 476804 1412167 1446543 811714 493059 796711 931564
30779I31564p24513j189245p58995l7960K99776K93924K61974K19938O9219p4839
$$ 931564 207051 -982194 -1741189 -1779149 -1479373 -1185449 -923475 -703537 -634318 -709157
30769g09157p4307k010N8357J73299L16699K70943O798j49012l800J63100R1939
$$ -709157 -783464 -785474 -727117 -553818 -237119 33824 40622 -108390 -112190 50910 142849
30758A42849L0489K50805L73098j53770r82134j045462k9690J003355R16319m3368
$$ 142849 173338 424143 797241 643471 -338663 -1384125 -1413815 -410460 505859 462491
30748D62491o53076l38977K42808K81072j12413k36933J03066L41284N0370l37590
$$ 462491 -190585 -529562 -286754 -5682 -118095 -355028 -251962 89322 139692 -197898
30738a97898j17280N57952P28437n696p72004n96422J79375M33428l5057l30966
$$ -197898 -315178 242774 971211 965515 193511 -402911 -223536 209892 174835 -156131
30728a56131l8449J47531j96514l01236M77169J278096Q46673m61061j061931
$$ -156131 -194580 -47049 -243563 -544799 -67630 1210466 2057139 1596078 534147
30719E34147m11638L62911K61389l33573o22128n72188m89944k33993L43892P46784
$$ 534147 122509 485420 746809 413236 -208892 -781080 -1271024 -1505017 -1161125 -414341
30709d14341M52169j71133l47364n8852N1087j85178k44896Q5220K95120N0816
$$ -414341 37828 -133305 -480669 -539521 -488434 -673612 -918508 -833288 -538168 -487352
30699d87352j66080J67831O74857N64860j30755n11046q5917N15875M59711j40125
$$ -487352 -653432 -485601 189256 754116 623361 112315 26398 542273 1001984 861859
30689H61859n01970l47414j49526k38238l23613j16149J72070K92908M00807N80991
$$ 861859 359889 12475 -137051 -375289 -698902 -815051 -642981 -350073 50734 631725
30679F31725M48416j82234o69391l57013K89695K58484m26577o86629n5217O41498
$$ 631725 1080141 897907 228516 -128497 161198 419682 -6895 -693524 -748741 -107243
30669a07243O17701K16454J15441K24897Q4311k10793k36395l4435K3219o2202
$$ -107243 510458 726912 842353 1067250 1151561 940768 704373 669938 693157 630955
30659F30955K1938K76688L76135J86082j40986m70133o88976n71814n4476M88346
$$ 630955 652893 929581 1305716 1491798 1350812 880679 191703 -380111 -434587 53759
30649E3759O16081L39053l5915l36221m77797l23505M869N5620k20131j29765
$$ 53759 669840 1008893 972978 636757 158960 -164545 -159676 -104056 -324187 -453952
30639d53952O82781J298121O41222p36481j178750k76600N30083R5529q24641
$$ -453952 228829 1526950 2168172 1431691 252941 -23659 506424 601953 -222688
30630b22688q33970J07422Q58930P46540J31655m00907o15432m73478q0940K07165
$$ -222688 -1056658 -949236 -90306 656234 787889 386982 -228450 -701928 -782868 -575703
30620e75703J41215n810J50068L86533J54870m58287p18959l20904J89373L15260
$$ -575703 -434488 -440298 -290230 96303 251173 -207114 -926073 -1246977 -1057604 -742344
30610g42344K69265L09266Q6470o36367j121547m82463P94668J213812L30253
$$ -742344 -473079 -163813 -77343 -713710 -1835257 -2317720 -1523052 -309240 21013
30601B1013n78753l80494L36396L61915k28517l85358J16160M43980K28873P0538
$$ 21013 -557740 -938234 -601838 -239923 -468440 -853798 -737638 -293658 -64785 5753
30591E753K59763J70196n15147r84313m91854L98352O50621K70576N2423K14191
$$ 5753 265516 435712 -79435 -1063748 -1555602 -1157250 -506629 -236053 -183630 30561
30581C0561K64161M0592o8257N0516L7916j84304k09903R7296K92518O6551k66006
$$ 30561 294722 335314 267057 317573 355489 171185 -38718 58578 351096 417647 151641
30570A51641l12371j99819k55973l80092j51112M78194R20305N91056k60809o81335
$$ 151641 -160730 -360549 -616522 -996614 -1147726 -669532 250773 841829 581020 -100315
30560a00315j97598M51146L07533l36568l68731K66848L54816n01669r55726m8034
$$ -100315 -297913 153233 460766 124198 -244533 22315 377131 -124538 -1080264 -1128298
30550a128298J016501O64248m95775p13731P762J55514m49752l60153P04042J085209
$$ -1128298 -111797 552451 56676 -657055 -649293 -493779 -943531 -1303684 -599642 485567
30540D85567n278j019788n69965M42866N82365J65484K00899L84129p0852o25718
$$ 485567 480289 -539499 -1109464 -666598 -84233 81251 282150 666279 595427 -30291
30530c0291k85599M70748M49295j31585j11671M10767K70508n19458o66834J00401
$$ -30291 -315890 154858 604153 472568 360897 771664 1042172 522714 -144120 -43719
30520d3719N16338j3550m44570n757N07132K43526k39464o2450M79467N67975
$$ -43719 472619 459069 14499 8742 515874 759400 519936 457486 936953 1504928
30510A504928K21404O969k452q5334j79130j36509k30415o52255r22417n44796
$$ 1504928 1726332 1733301 1730849 1645515 1466385 1329876 1099461 447206 -475211 -1020007
30500a020007J15992L44576J44786O5986K20981K36091L6357n1027M2817J084
$$ -1020007 -904015 -559439 -414653 -348667 -127686 108405 144762 93735 136552 137636
30490A37636k89607n35311m91205k27386Q3736L11507L37082K00981J95187M72139
$$ 137636 -151971 -687282 -1178487 -1405873 -1322137 -1010630 -673548 -472567 -277380 194759
30480A94759O86949M29329r5092k84745k2662J53829j34988n71195o25845k63534
$$ 194759 881708 1311037 1215945 931200 908538 1062367 927379 356184 -269661 -533195
30470e33195J10994K31819K15671K41487K22413k3325l39508k71687K60761O03573
$$ -533195 -422201 -190382 25289 266776 489189 465864 126356 -145331 115430 719003
30460G19003J21516p99948j087161l84254N03379P86872O20033M41688J34000
$$ 719003 840519 40571 -1046590 -1430844 -927465 -140593 479440 921128 1055128
30451A055128m53088p40892j38116Q01680R35124J48240n30346m64456j07402
$$ 1055128 602040 -138852 -276968 524712 1459836 1608076 1077730 613274 505872
30442E05872L885P171J20482J37129k8075k5052K07606J09489n37185r73935m99036
$$ 505872 509757 516928 637410 774539 746464 721412 929018 1038507 501322 -472613 -971649
30431i71649M01797P19353L08133j60362l09671l28970l42638k79008k38469k99202
$$ -971649 -569852 149501 457634 297272 -12399 -341369 -684007 -963015 -1201484 -1500686
30421a500686j35414M40667Q03028K91676n13411m17013M77788P53923j07448
$$ -1500686 -1636100 -1195433 -392405 -100729 -614140 -1031153 -553365 200558 93110
30412I3110q27765l29022N92259O17225m5944k34407K00061L75821K1095k32193
$$ 93110 -734655 -1063677 -471418 145807 99863 -134544 65517 441338 462433 230240
30402B30240j47526j96280m36207k94495K37430L63402j16378l03495K59872O46922
$$ 230240 82714 -113566 -549773 -844268 -606838 -243436 -359814 -663309 -403437 243485
30392B43485M6478p41775m90405M43699O53247q0805n24188n7766L84768k5428
$$ 243485 289963 -451812 -942217 -498518 154729 73924 -450264 -508030 -123262 -148690
30382a48690n87500j95908Q68472J312579O71761k09932n34355m95610n86470
$$ -148690 -736190 -932098 -63626 1248953 1920714 1710782 1176427 680817 94347
30373I4347o79276l62745J94673L67733l633l77018l09520j3716J35105K04588
$$ 94347 -584929 -947674 -753001 -385268 -388901 -765919 -1075439 -1089155 -954050 -749462
30363g49462L96141M72287R4481m05476k83164M81367R60540N01339l73134p05018
$$ -749462 -353321 118966 213447 -192029 -475193 6174 966714 1468053 1094919 389901
30353C89901l19627J72624K68694k4794m39451o21183k72718M16912P23497K76226
$$ 389901 70274 242898 511592 486798 47347 -573836 -846554 -429642 293855 570081
30343E70081k79855j42543L90541L56445k97634n75857l9886M70696J97064l63729
$$ 570081 290226 147683 538224 894669 597035 21178 -18708 451988 649052 285323
30333B85323l52791Q5666K01654o3140j25928R2223K9265m33124o05409m4190
$$ 285323 -67468 18198 219852 156712 30784 123007 152272 -280852 -886261 -930451
30323i30451O61305O30323j31298p52055n69409J74214P28735O86011K99182L3313
$$ -930451 -269146 361177 229879 -522176 -1091585 -917371 -188636 497375 796557 829870
30313H29870j3157r2150k98476l70977j15897K36707L38382J91779K8586j23723
$$ 829870 816713 724563 426087 55110 -60787 175920 514302 706081 734667 610944
30303F10944l84351o01801m34790N9598L30092O2513l04792j44521M46015P09491
$$ 610944 226593 -375208 -809998 -750400 -420308 -357795 -662587 -807108 -361093 348398
30293C48398K44372m30682n67115j69101J21991M0762N7959N12729Q98815N46556
$$ 348398 592770 162088 -405027 -574128 -452137 -411375 -353416 159313 1058128 1604684
30283A604684k87059p05904m77712k69620m31189l93347K46963Q17420N25621
$$ 1604684 1317625 611721 134009 -135611 -566800 -960147 -713184 104236 629857
30274F29857k13474l52930J63429L86863m5448l72909n4815L29295R7714l81562
$$ 629857 416383 63453 226882 613745 568297 195388 140573 469868 567582 186020
30264A86020l10828K61041N85819L92371J47991J85030K44232K0587l45831n23927
$$ 186020 -124808 136233 722052 1114423 1262414 1447444 1691676 1712263 1366432 842505
30254H42505m07444j36104N9678j1789k84056l63204M292M26151K63747l94427
$$ 842505 435061 298957 358635 346846 62790 -300414 -296122 130029 393776 -651
30244f51o70059n7431Q14283R85012L90025k04721k87113q4280m713r6657j70027
$$ -651 -670710 -728141 86142 1071154 1461179 1256458 969345 885065 880352 783695 613668
30233F13668q8482J81633N30293O47713L06564k57339n82698o23196p10092q19461
$$ 613668 525186 706819 1237112 1884825 2191389 1934050 1351352 728156 18064 -801397
30223h01397m93605K42509N75745O6938m83576j25889P17191Q11781J1095n37410
$$ -801397 -1295002 -1052493 -476748 -409810 -893386 -1019275 -302084 509697 520792 -16618
30213a6618k17660J78821j06398n26762k27836M55492N32132l8163l39312J2662
$$ -16618 -234278 -55457 -161855 -688617 -916453 -460961 71171 33008 -306304 -293642
30203b93642L77113K28999p1324N909L22963L91828J08448k39139m30935m39620
$$ -293642 83471 312470 241146 247055 570018 961846 1070294 831155 400220 -39400
30193c9400k70062L2245K94775L45250J96783J5875m3761M6831J58404R3837j77501
$$ -39400 -309462 -277217 17558 362808 559591 575466 531705 578536 736940 830777 653276
30182F53276m23371m25397k63879j39300l8035J43282K59700R3818j66325p3412
$$ 653276 229905 -195492 -459371 -598671 -636706 -493424 -233724 -139906 -306231 -379643
30172c79643L74346O14676K90547k46425m47375k62444m0454K2665K1283N7192
$$ -379643 -5297 609379 899926 653501 206126 -56318 -96772 -74107 -52824 4368
30162D368R0499M0785j10560k85267l31728j82804J2189P7800R9292K59841M19883
$$ 4368 94867 135652 25092 -260175 -591903 -774707 -762518 -684718 -585426 -325585 94298
30151I4298K45300j65931k37943K56612P26939M99246k50317p23105n27645p3623
$$ 94298 339598 173667 -64276 192336 919275 1418521 1168204 445099 -82546 -156169
30141a56169O7323j39308k60643j545M18821N37319K40069q7540j11526j8590
$$ -156169 -88846 -228154 -488797 -490342 -71521 465798 705867 618327 506801 488211
30131D88211j34542k79531j1782N30572O43750Q3576m95518m43231J8028K15548
$$ 488211 353669 74138 62356 592928 1236678 1320254 824736 381505 399533 615081
30121F15081m5448l76993l83934j7476M51899O09398K82086j51460k00887m5315
$$ 615081 569633 192640 -191294 -208770 243129 852527 1134613 983153 782266 736951
30111G36951k88109q28379p99450K1685O62626M31767L9537L61085Q96679O16693
$$ 736951 448842 -379537 -1178987 -1157302 -494676 -62909 -23372 337713 1234392 1851085
30101A851085k56245o15136k75729p8353l20980m24641k05944j88585m58070m32221
$$ 1851085 1594840 979704 703975 625622 304642 -119999 -325943 -514528 -972598 -1404819
30091a404819l4826R9799j04093O0184O36186O66023j01572n13911J27050P90745
$$ -1404819 -1439645 -1339846 -1443939 -1383755 -747569 -81546 -183118 -697029 -569979 220766
30081B20766L93944l98685l75562J61325O7956n46010n31522K65794P75467N21061
$$ 220766 614710 216025 -159537 1788 69744 -476266 -1007788 -741994 33473 554534
30071E54534K00726K34367J00198m51303p41875l33096J58054J04656j06106J37074
$$ 554534 755260 989627 1089825 638522 -103353 -436449 -278395 -173739 -279845 -142771
30061a42771N29639L70054k07339m00525J7332M07393K63277j40427k89101j41975
$$ -142771 386868 756922 549583 149058 166390 573783 837060 696633 407532 265557
30051B65557j2511k1464m502J17229J66705j1431k91101m31392l93382l05186
$$ 265557 253046 231582 227080 344309 511014 499583 208482 -222910 -616292 -921478
30041i21478j81443P1936L71738M62465K86589P5835k0993q9504j12016J21652
$$ -921478 -1102921 -1030985 -659247 -196782 89807 165642 144649 55145 -56871 64781
30031F4781N34252O18177J40687l81914l64320J4199J61874k4441j92334k47424
$$ 64781 599033 1217210 1357897 975983 611663 625862 787736 763295 570961 323537
30021C23537l77951m80534k43945K01162L78416K58489K83517M94083L58505k66189
$$ 323537 -54414 -534948 -778893 -577731 -199315 59174 342691 836774 1195279 929090
30011I29090p02579m16445J48425K25686j82676m33289k30787O2413P5385n8734
$$ 929090 226511 -189934 -41509 184177 1501 -431788 -662575 -600162 -524777 -583511
30001e83511J7032L19907M52471J31997l23357k98663K35149N09305k0173p74252
$$ -583511 -566479 -246572 205899 337896 14539 -284124 -48975 460330 440157 -334095
29991c34095p59971K1687O10551N03231K09384K10021K02403j88444o50484o86438
$$ -334095 -1094066 -1072379 -461828 41403 250787 460808 663211 474767 -175717 -862155
29981h62155l46277N3039M48956P70573O72333J14030k84380j16623O8177l40469
$$ -862155 -1208432 -1155393 -706437 64136 736469 850499 566119 449496 517673 177204
29971A77204q46582n43675L13645N49692j30957o98417m08003J69516K12850j12930
$$ 177204 -669378 -1213053 -899408 -349716 -480673 -1179090 -1587093 -1417577 -1204727 -1317657
29961a317657j48989J37618K61014J07019M8384K88753N89106O24090L08667j61658
$$ -1317657 -1466646 -1329028 -1068014 -960995 -912611 -623858 -34752 589338 898005 736347
29951G36347m17029k40983O3388m7147n10271n50653J85662Q72763N38866m66815
$$ 736347 319318 78335 141723 94576 -415695 -966348 -780686 92077 630943 164128
29941A64128q75111k82726L72241L14338N186J87976N89190L83756m18751r17608
$$ 164128 -710983 -993709 -621468 -307130 -301944 -113968 475222 858978 440227 -477381
29931d77381o05449M1136L90733M23646L87967K47996p6549k92243p7013L20753
$$ -477381 -1082830 -1041694 -650961 -227315 160652 408648 332099 39856 -37157 283596
29921B83596L25766j37124n03788l53856N5366K36905J40991O6473R3441r222
$$ 283596 609362 472238 -31550 -385406 -330040 -93135 47856 114329 207770 198548
29911A98548l00502m45805j64380L23493N53227M17244K31040K15418K24781R1896
$$ 198548 -101954 -547759 -712139 -388646 164581 581825 812865 1028283 1253064 1344960
29901A344960n9596o0623q698n8940j09462k5533J1086k00372l75070p3014M93077
$$ 1344960 1285364 1224741 1216043 1157103 1047641 1022108 1033194 832822 457752 384738 877815
29890H77815N94340N5588m37250l56824l9159K1756k6158J37429K56826o0310
$$ 877815 1472155 1527743 1090493 733669 694510 716266 690108 827537 1084363 1024053
29880A024053n05147m42954O3826L64478K48922J00721M7121k23010o60334o83475
$$ 1024053 518906 75952 139778 504256 753178 853899 901020 678010 17676 -665799
29870f65799j18507L82355K71975j05314j12363K45004M57779K71692j28860m65577
$$ -665799 -784306 -401951 -129976 -235290 -347653 -102649 355130 626822 497962 32385
29860C2385n33737k33528K35831L97004K0611n08443o08254j62176M28300P00382
$$ 32385 -501352 -734880 -499049 -102045 -81434 -589877 -1198131 -1360307 -932007 -231625
29850b31625M75040o1437m37293k48401L75639Q24842O86872J88007j85573k75992
$$ -231625 243415 181978 -255315 -503716 -128077 696765 1383637 1571644 1386071 1110079
29840A110079k60736k68282k33828o6354J90874L45706K14752r9388j97005J12825
$$ 1110079 849343 581061 347233 280879 471753 817459 1032211 932823 735818 848643
29830H48643M25770K41177k47007l72574k4162J53163k28823o65702m84433K30698
$$ 848643 1274413 1515590 1268583 896009 871847 1025010 796187 130485 -353948 -123250
29820a23250Q09055P98235L11422j89230k76786K4857J57725k85685q35668o68609
$$ -123250 685805 1484040 1795462 1606232 1329446 1354303 1512028 1226343 390675 -277934
29810b77934J22345N28469R6378m20144k74423K02769L19501J20128Q1502K34634
$$ -277934 -155589 372880 469258 49114 -225309 -22540 296961 417089 498591 733225
$$ [...]
##END NTUPLES=NMR SPECTRUM
##END=
