##TITLE=31Pdec_LY-17Dix.2B
 CD3CN, 24 sc
 2.06.2021
##JCAMPDX= 6.0         $$ Bruker NMR JCAMP-DX V2.0
##DATA TYPE= NMR SPECTRUM
##DATA CLASS= NTUPLES
##ORIGIN= UXNMR, Bruker Analytische Messtechnik GmbH
##OWNER= root
$$ XWIN-NMR		Version 3.5
$$ Wed Jun  2 09:50:08 2021 Russian Standard Time (UT+4h)  she@DPX200
##.OBSERVE FREQUENCY= 81.013821
##.OBSERVE NUCLEUS= ^31P
##.ACQUISITION MODE= SIMULTANEOUS
##.ACQUISITION SCHEME= undefined
##.AVERAGES= 24
##.DIGITISER RES= 16
##SPECTROMETER/DATA SYSTEM= spect
##.PULSE SEQUENCE= zgpg30
##.SOLVENT NAME= CDCl3
##.SHIFT REFERENCE= (INTERNAL, CDCl3, 0, 248.564)
##AUDIT TRAIL= $$ (NUMBER, WHEN, WHO, WHERE, WHAT)
$$ ##TITLE= Audit trail, XWIN-NMR		Version 3.5
$$ ##JCAMPDX= 5.01
$$ ##ORIGIN= Bruker BioSpin GmbH
$$ ##OWNER= she
$$ F:/spectra/data/she/nmr/P31/1/pdata/1/auditp.txt
$$ ##AUDIT TRAIL=  $$ (NUMBER, WHEN, WHO, WHERE, WHAT)
(   1,<2021-06-02 09:48:41.90 +0400>,<she>,<DPX200>,
      <created by zg, POWCHK disabled, PULCHK disabled
       configuration hash MD5:
       00 E9 B6 7A A2 85 ED C7 34 08 36 98 17 FE 4E 26
       data hash MD5: 32K
       97 21 5A 4B 84 88 C7 7B 8E 85 9D D3 47 F5 DE 7F>)
(   2,<2021-06-02 09:48:56.95 +0400>,<she>,<DPX200>,
      <Start of raw data processing
       efp BC_mod = 2 LB = 1 FT_mod = 6 PKNL = 1 PHC0 = -5900.695 PHC1 = 141.8726 SI = 64K 
       data hash MD5: 64K
       52 45 DE 2B 78 DE 93 56 74 72 14 9B B9 28 53 B7>)
(   3,<2021-06-02 09:49:27.20 +0400>,<she>,<DPX200>,
      <pk PHC0 = 8.063959 PHC1 = -53 
       data hash MD5: 64K
       54 92 9F D9 30 E7 BB 6E 80 54 E6 4E 77 EF 82 77>)
(   4,<2021-06-02 09:49:31.06 +0400>,<she>,<DPX200>,
      <abs ABSG = 5 
       data hash MD5: 64K
       A7 60 73 42 96 55 A8 35 DA 73 D9 12 2C 26 55 C4>)
$$ ##END=
$$ 
$$ hash MD5
$$ E6 78 91 72 13 5D 77 57 E1 B3 CC F5 29 B5 BE 01
##$RELAX= 
##$RELAX= 
##$RELAX= 
##$RELAX= 
##$RELAX= 
##$RELAX= 
##$RELAX= 
##$RELAX= 
$$ Bruker specific parameters
$$ --------------------------
##$DU= <F:/spectra>
##$EXPNO= 1
##$NAME= <P31>
##$PROCNO= 1
##$TYPE= <nmr>
##$USER= <she>
##$AMP= (0..31)
100 100 100 100 100 100 100 100 100 100 100 100 100 100 100 100 100 100 
100 100 100 100 100 100 100 100 100 100 100 100 100 100 
##$AQSEQ= 0
##$AQ_mod= 1
##$AUNM= <au_zg>
##$AUTOPOS= <>
##$BF1= 81.014009
##$BF2= 200.13
##$BF3= 200.13
##$BF4= 200.13
##$BF5= 200.13
##$BF6= 200.13
##$BF7= 200.13
##$BF8= 200.13
##$BYTORDA= 1
##$CFDGTYP= 0
##$CFRGTYP= 5
##$CHEMSTR= <none>
##$CNST= (0..31)
1 1 145 1 1 1 1 1 1 1 1 1 1 1 1 1 1 1 1 1 1 1 1 1 1 1 1 1 1 1 1 1 
##$CPDPRG= <waltz16>
##$CPDPRG1= <>
##$CPDPRG2= <waltz16>
##$CPDPRG3= <>
##$CPDPRG4= <mlev>
##$CPDPRG5= <mlev>
##$CPDPRG6= <mlev>
##$CPDPRG7= <mlev>
##$CPDPRG8= <mlev>
##$CPDPRGB= <>
##$CPDPRGT= <>
##$D= (0..31)
0 1 0 0 0 0 0 0 0 0 0 0.03 2e-05 3e-06 0 0 0 0 0 0 0 0 0 0 0 0 0 0 0 0 
0 0 
##$DATE= 1622612921
##$DBL= (0..7)
120 120 120 11 120 120 24 19 
##$DBP= (0..7)
150 150 150 150 150 150 150 150 
##$DBP07= 0
##$DBPNAM0= <>
##$DBPNAM1= <>
##$DBPNAM2= <>
$$ [...]
##$SUBNAM3= <"">
##$SUBNAM4= <"">
##$SUBNAM5= <"">
##$SUBNAM6= <"">
##$SUBNAM7= <"">
##$SUBNAM8= <"">
##$SUBNAM9= <"">
##$SW= 501.771253377433
##$SWIBOX= (0..15)
0 1 3 0 0 0 0 0 0 0 0 0 0 0 0 0 
##$SW_h= 40650.406504065
##$TD= 32768
##$TD0= 1
##$TE= 0
##$TE2= 300
##$TE3= 300
##$TEG= 300
##$TL= (0..7)
0 120 53 12 22 120 120 120 
##$TP= (0..7)
150 150 150 150 150 150 150 150 
##$TP07= 0
##$TPNAME0= <>
##$TPNAME1= <>
##$TPNAME2= <>
##$TPNAME3= <>
##$TPNAME4= <>
##$TPNAME5= <>
##$TPNAME6= <>
##$TPNAME7= <>
##$TPOAL= (0..7)
0.5 0.5 0.5 0.5 0.5 0.5 0.5 0.5 
##$TPOFFS= (0..7)
0 0 0 0 0 0 0 0 
##$TUNHIN= 0
##$TUNHOUT= 0
##$TUNXOUT= 0
##$USERA1= <user>
##$USERA2= <user>
##$USERA3= <user>
##$USERA4= <user>
##$USERA5= <user>
##$V9= 5
##$VALIST= <valist>
##$VCLIST= <CCCCCCCCCCCCCCC>
##$VD= 0
##$VDLIST= <DDDDDDDDDDDDDDD>
##$VPLIST= <PPPPPPPPPPPPPPP>
##$VTLIST= <TTTTTTTTTTTTTTT>
##$WBST= 1024
##$WBSW= 4
##$XGAIN= (0..3)
0 0 0 0 
##$XL= 0
##$YL= 0
##$YMAX_a= 1203
##$YMIN_a= -18229
##$ZGOPTNS= <>
##$ZL1= 120
##$ZL2= 120
##$ZL3= 120
##$ZL4= 120
##$ABSF1= 248.5645
##$ABSF2= -253.2056
##$ABSG= 5
##$ABSL= 3
##$ALPHA= 0
##$AQORDER= 0
##$ASSFAC= 0
##$ASSFACI= 0
##$ASSFACX= 0
##$ASSWID= 0
##$AUNMP= <proc_1d>
##$AZFE= 0.1
##$AZFW= 0.5
##$BCFW= 0
##$BC_mod= 2
##$BYTORDP= 0
##$COROFFS= 0
##$CY= -3
##$DATMOD= 1
##$DC= 0
##$DFILT= <>
##$DTYPP= 0
##$F1P= 0
##$F2P= 0
##$FCOR= 1
##$FTSIZE= 65536
##$FT_mod= 6
##$GAMMA= 0
##$GB= 0
##$INTBC= 1
##$INTSCL= 5.30512e-09
##$ISEN= 30
##$LB= 1
##$LEV0= 0
##$LPBIN= 0
##$MAXI= 10000
##$MC2= 0
##$MEAN= 0
##$ME_mod= 0
##$MI= 50
##$NCOEF= 0
##$NC_proc= -4
##$NLEV= 6
##$NOISF1= 182.463
##$NOISF2= 159.3651
##$NSP= 0
##$NTH_PI= 0
##$NZP= 0
##$OFFSET= 248.5645
##$PC= 4
##$PHC0= -5892.631
##$PHC1= 88.8726
##$PH_mod= 1
##$PKNL= yes
##$PPARMOD= 0
##$PSCAL= 0
##$PSIGN= 0
##$REVERSE= no
##$SF= 81.014009
##$SI= 65536
##$SIGF1= 159.3651
##$SIGF2= -187.1042
##$SINO= 113.3802
##$SIOLD= 16384
##$SREGLST= <1H.CDCl3>
##$SSB= 0
##$STSI= 65536
##$STSR= 0
##$SW_p= 40650.406504065
##$SYMM= 0
##$S_DEV= 0
##$TDeff= 32768
##$TDoff= 0
##$TI= <>
##$TILT= no
##$TM1= 0
##$TM2= 0
##$TOPLEV= 0
##$USERP1= <user>
##$USERP2= <user>
##$USERP3= <user>
##$USERP4= <user>
##$USERP5= <user>
##$WDW= 1
##$XDIM= 65536
##$YMAX_p= 535217176
##$YMIN_p= -58539623
$$ End of Bruker specific parameters
$$ ---------------------------------
##NTUPLES= NMR SPECTRUM
##VAR_NAME=  FREQUENCY,     SPECTRUM/REAL,   SPECTRUM/IMAG
##SYMBOL=    X,             R,               I
##VAR_TYPE=  INDEPENDENT,   DEPENDENT,       DEPENDENT
##VAR_FORM=  AFFN,          ASDF,            ASDF
##VAR_DIM=   65536,         65536,           65536
##UNITS=     HZ,            ARBITRARY UNITS, ARBITRARY UNITS
##FACTOR=    0.620285442955139, 1,           1
##FIRST=     20137.2065510759, 0,            0
##LAST=      -20513.1999529892, 0,           0
##MIN=       -20513.1999529892, -58539623,   0
##MAX=       20137.2065510759, 535217176,    0
$$ Real data points
##PAGE= N=1
##DATA TABLE= (X++(R..R)), XYDATA
$$ [...]
35696I3725N47568L36227l61855o20895k28843K12836K03528q8938j93636J8438
35686h1845K39104K01960L3182n354M6607n2114k59774k32711J05229L27987Q4257
35675D06528l50888m10626J4129M52686M40072j401m63832n77812l17478M0953
35665g67669K58329L89457N83691O98448M01833k72532p92388p36512k84634J03231
35655d18746K46527K45823J73237O3756K9341Q4374K6300k24175l74054j91116
35645c38733M6232k3836j78862M9919M81533M32116j52850m54532O434N80675
35635D48096M42055j86083m31664q9723K11561Q0117j40835q1363Q2619N8251
35625C93031n6345n8185n8711k14300l19839j11507K07408K01356j21961l21813
$$ plain form
35696 93725 641293 977520 615665 -5230 -234073 -21237 182291 93353 -100283 -81845
35686 -81845 157259 359219 392401 387047 433654 381540 121766 -110945 -5716 322271 406528
35675 406528 55640 -354986 -340857 111829 551901 550500 86668 -491144 -808622 -767669
35665 -767669 -509340 -119883 463808 1162256 1564089 1291557 499169 -237343 -521977 -418746
35655 -418746 -172219 73604 246841 310597 339938 424312 450612 226437 -147617 -338733
35645 -338733 -292501 -316337 -495199 -445280 36253 468369 315519 -139013 -132579 448096
35635 448096 890151 704068 272404 182681 394242 474359 333524 252161 334780 393031
35625 393031 336686 278501 219790 5490 -314349 -425856 -218448 -17092 -139053 -460866
35615d60866k03527m1970m9346m5889J66835M56261N88673N26843L18222l0776
35605A224460l87043m99538l78109l38177m46734l27467J59507N00814K86825
35596b05462l9018J46542N57537M18785j89971l74825J14211M71003J99009r4221
35586A003590J55664M21139K3142n73077m55154J49480J57016n65258q58277o0028
35576f01763Q85144P49322k52390q54642m93621J49450L00285M4931j04462n0193
35566b27939p4192k19999j93757J06554L63791L21326J87916K60549L36309o8453
35556G92105q98635j395447r70381M8442Q10699Q82847N17385J50355k4400j5534
35546a02564J09608K39715K68956J97017Q5265o2692k50843l63280k46520Q6214
$$ plain form
35615 -460866 -664393 -706363 -755709 -801598 -634763 -178502 410171 937014 1255236 1224460
35605 1224460 837417 337879 -40230 -378407 -825141 -1152608 -993101 -492287 -205462
35596 -205462 -244480 -97938 459599 878384 688413 313588 427799 898802 1097811 1003590
35586 1003590 1159254 1580393 1603535 1030458 575304 724784 881800 316542 -541735 -601763
35576 -601763 283381 1032703 780313 -74329 -567950 -418500 -118215 -73284 -177746 -227939
35566 -227939 -302131 -522130 -715887 -609333 -245542 75784 263700 524249 860558 792105
35556 792105 -106530 -1501977 -2472358 -2423916 -1613217 -730370 -212985 -62630 -87030 -102564
35546 -102564 7044 246759 515715 712732 797997 735305 484462 121182 -125338 -39124
35536c9124M54815O82568O55440L12931k21236n78269m85987j72180j37009m49209
35526B2740n77491j19549N63644P72167M03516O3635J77404L88719J34993m58957
35516A370821p18755l85669O4462J93472J71727K48661J43241m55606j086225
35507d53871r46082q0861N73241M57799L1572r3684n272q2144k67995k35997O9746
35496a033548M52418P15117O17912J1599o84958o95869J423M08912n8375n59578
35486h24947j11540P32744O67861k46273o23369N3084O60971K91749l78838l30802
35476a09360J67664J58931l68483n00039J17341P10149M70625l56512p84807k87133
35466g81624N47286O63789j60904r47004p21451J79226N86546J43616l11838j27956
$$ plain form
35536 -39124 415691 1098259 1753699 2066630 1845394 1267125 781138 608958 471949 22740
35526 22740 -554751 -674300 -110656 661511 1065027 1128662 1306066 1694785 1829778 1370821
35516 1370821 652066 266397 330859 524331 696058 944719 1087960 632354 -453871
35507 -453871 -1399953 -1480814 -907573 -449774 -418202 -511886 -517158 -599302 -867297 -1103294 -1033548
35496 -1033548 -581130 133987 751899 763498 78540 -617329 -615906 -206994 -265369 -824947
35486 -824947 -936487 -203743 464118 217845 -405524 -352440 308531 600280 221442 -109360
35476 -109360 58304 217235 -151248 -651287 -533946 176203 646828 290316 -494491 -781624
35466 -781624 -234338 429451 268547 -678457 -1399908 -1220682 -634136 -490520 -802358 -930314
35456i30314K54355J97053q3535n637L62351M81282K29031l0581q6000n0191k6593
35445C11221l2100j03309j37527J20048N75252O24648k9609p53799p52133j77968
35435c55276J61986q649k41093k16793q0000N4461K37088L00420N047l71512k61714
35424g76035K71658N25356K30294o7938L9682K04635M1966j85316j22372j2154
35414A49776k14794m53534k21358L04410M45840O1622k34450n25M06214L80478
35404F23679p9637l87965j52084L14111L85533n0442m14877k22737K25919L18296
35394E59796Q4393O5244K69160R5055m42799l71108O88201J525506J028340J95334
35384C697122Q90793K716550K959695L22294k902252l650012j967336m74872n73471
$$ plain form
35456 -930314 -675959 -478906 -562441 -568078 -205727 275555 504586 474005 388005 337814 311221
35445 311221 279121 175812 38285 158333 733585 1358233 1328624 574825 -177308 -355276
35435 -355276 -193290 -201939 -443032 -659825 -739825 -685364 -448276 -147856 -142809 -514321 -776035
35424 -776035 -504377 20979 251273 183335 223017 427652 469618 284302 161930 149776
35414 149776 -65018 -518552 -739910 -435500 10340 71962 -162488 -163013 243201 623679
35404 623679 544042 156077 3993 318104 703637 653195 238318 15581 241500 559796
35394 559796 644189 709433 978593 1073648 630849 259741 947942 2473448 3501788 3697122
35384 3697122 4587915 7304465 10264160 10586454 7684202 4034190 2066854 1591982 1018511
35375A018511j044666n24011M25292N30620j60047n91092l54292M2563K16184
35366d40938K49220J27669k76712o23918l09008N51717J022047N54285k54052
35357F00310n09570j91421K6627j43535k75555O398M10294L72849j52017o00545
35347d56165m94888Q53L49908L01246M4129j98427l81895m15234j37413K96448
35337a091438M14546J11832p2696K27238N31919K49934k79566k74884J60118J50564
35327A27567m60234p55744k22144L72960J85792l88586l85063K75450Q22489Q11261
35317C83748M68393L6868m49631p48459m72910K62579P85052O49501J22864k59259
35307G78746l15049k50732k84575l69890k41269K25288O74068N31644k20594q29763
$$ plain form
35375 1018511 -26155 -550166 -124874 405746 245699 -345393 -699685 -657122 -440938
35366 -440938 -191718 -64049 -340761 -964679 -1273687 -721970 300077 854362 600310
35357 600310 90740 -100681 -74054 -217589 -493144 -486746 -76452 296397 144380 -456165
35347 -456165 -951053 -950200 -600292 -299046 -254917 -453344 -835239 -1250473 -1387886 -1091438
35337 -1091438 -676892 -565060 -637756 -410518 121401 371335 91769 -183115 -22997 127567
35327 127567 -332667 -1088411 -1310555 -937595 -751803 -1140389 -1525452 -1250002 -427513 383748
35317 383748 852141 889009 439378 -309081 -781991 -519412 265640 915141 1038005 778746
35307 778746 463697 212965 -71610 -441500 -682769 -457481 216587 748231 527637 -302126
35297c02126o47638K4069L64357J12774k48915k80683m1435K43157M92027O34787
35287C50374N41053K33463p3547k27356k32953j08125J10376K29902M7091l30450
35277E39828n25506k96678K21476O33622N50445p2141p05971o39364J48059Q06963
35267F60733O60931Q0321j61274m2571j28436m85575n90651l12400j60156l70052
35257h49130m84748j45431L35815N52543N88591O18448M29981j44910o78895n73321
35247c51057J16485P11286P08580K46360j95850l17346k02997j38465k49043l49826
35237b1873k24657M3907K09656K37047K76838L21382J86428j59390n06617o33980
35227b71259m25235R5528N76519M52543l06485q37481m01577M59559N84659r4704
$$ plain form
35297 -302126 -949764 -925695 -561338 -448564 -697479 -978162 -1019597 -776440 -284413 350374
35287 350374 891427 1124890 1051343 823987 591034 482909 593285 823187 870278 539828
35277 539828 14322 -282356 -60880 572742 1123187 1051046 345075 -294289 -146230 660733
35267 660733 1321664 1401985 1240711 1198140 1069704 584129 -6522 -318922 -479078 -849130
35257 -849130 -1333878 -1479309 -1143494 -590951 -2360 616088 1046069 901159 222264 -351057
35247 -351057 -234572 476714 1185294 1431654 1235804 918458 715461 576996 327953 -21873
35237 -21873 -246530 -202623 7033 244080 520918 842300 1028728 869338 362721 -271259
35227 -271259 -696494 -600966 -24447 428096 121611 -715870 -1117447 -657888 -73229 -167933
35217a67933m79960o0222L50400P7336k55029J76249R14596Q46766j00130q55556
35207D46517p02726p4209K30270J0138l32713l69518m3456L34019M17841K05128
35197A21291j0953p0321q8816j17891p208K33281K91066J2729k97302k92822l7815
35186b64761J79473K27510J35583k3771j10325m7873m1142k93755n06406j94532
35176i39999M39631O36505K42933m4097J10910J33060k83756l99358L39480J091137
35166A326446P17507m30485r65589m41699K29040K88615L0124J8102K58870M34267
35156A465198L71145M5665m46255p92181p00951k95298K5635O6939q1021k65246
35146f06370k75068J03021O71920Q04499K76641k71002k27885P8314L2728j74314
$$ plain form
35217 -167933 -647893 -708115 -357715 -280379 -535408 -359159 555437 1402203 1302073 446517
35207 446517 -256209 -330418 -100148 -90010 -422723 -792241 -835697 -501678 -83837 121291
35197 121291 110338 40017 -48799 -166690 -173898 59383 350449 363178 65876 -226946 -264761
35186 -264761 -85288 142222 277805 254034 143709 95836 54694 -239061 -745467 -939999
35176 -939999 -500368 136137 379070 334973 445883 578943 295187 -104171 235309 1326446
35166 1326446 2043953 1613468 647879 206180 435220 723835 753959 772061 1030931 1465198
35156 1465198 1836343 1882008 1435753 643572 -57379 -352677 -327042 -260103 -341124 -606370
35146 -606370 -881438 -778417 -106497 698002 974643 703641 475756 554070 586798 412484
35136D12484K3532L98296K16342m28313o14091j5757O07457N55483K2806m44106
35126G34133o31875n63226l02264o4403n4497j23123k2778R7599K828l0265L50921
35115f06950P48579N23698r202L5673N36910L89738o28538j267283o53668L60657
35105e70386M96088j68819n98404l80708L914J61431K09361K96944K90402J8053
35095b42124m21980o26219k02955O66746J146201O78437j41152k77036K50029
35086H29947M23478j47434o52309m44991j3975m1898l31473l45251j47354q5161
35076i56421m0908K86045O98418P28099L14465k05012n43414n55471j86675L29986
35066a30888N18292J91344l12157n76905m88986j38350K25586J87841l16110n88838
$$ plain form
35136 412484 436016 834312 1050654 622341 8250 -7507 599950 1155433 1178239 734133
35126 734133 102258 -460968 -763232 -827635 -882132 -1005255 -1028033 -930434 -927606 -957871 -606950
35115 -606950 141629 665327 656125 691798 1228708 1618446 989908 -277375 -931043 -570386
35105 -570386 -74298 -243117 -841521 -1222229 -1218315 -1056884 -847523 -550579 -260177 -242124
35095 -242124 -664104 -1290323 -1493278 -826532 319669 998106 856954 579918 829947
35086 829947 1253425 1105991 453682 8691 -5284 -47182 -378655 -723906 -871260 -956421
35076 -956421 -997329 -711284 -12866 715233 1029698 824686 281272 -274199 -460874 -130888
35066 -130888 387404 578748 266591 -310314 -799300 -937650 -712064 -524223 -840333 -1429171
35056a429171k3451P76521P26129J8215j27125M34543M65467m19168q76353n9376
35046e13769Q58119N84875k36945l14556J14722j1967n73600o25005j71435K012
35036h87549j56900j07630J6092k65706n36516n1810P31658P05906j839k18932
35026g73226K98821O23300L84619K03304K77675N7123m47563m87063r51J78555
35016C14594j39558j78350K49004L24863j57257k64637L41103O19563n8308p20158
35006C30859m17176J95738Q4365m02546l05335J96058J78482l47312m74987N0083
34996i11771M66925K42610k12211k55393J62042N65733N09248j7604n52766n95435
34986e98622j66383K38726K77533M7236k35165m03831k09577M21123R49745P00980
$$ plain form
35056 -1429171 -1452622 -676101 50028 68243 -58882 375661 841128 421960 -454393 -513769
35046 -513769 344350 929225 692280 377724 492446 480479 -93121 -718126 -889561 -887549
35036 -887549 -1044449 -1152079 -1135987 -1401693 -1938209 -1990019 -1258361 -552455 -554294 -773226
35026 -773226 -474405 148895 533514 736818 1014493 1071616 624053 136990 136039 314594
35016 314594 175036 -3314 245690 570553 413296 148659 489762 1109325 1051017 330859
35006 330859 -86317 109421 193786 -208760 -514095 -318037 -139555 -486867 -961854 -911771
34996 -911771 -444846 -202236 -414447 -669840 -507798 57935 567183 549579 -3187 -598622
34986 -598622 -765005 -526279 -248746 -201510 -436675 -840506 -1050083 -628960 320785 1021765
34976A021765j12821n44947k49653J12122L6590j08666P2677K75948J33049j33260
34966E02804k28955l06295m39516k50213L63302P47636L78917k93762m85194j04122
34956a15398L61122N34784L00185k54679o70420m49698J48116L26537M490o2985
34946A22054K79626K11394m60045o62188R5396O21799J6860n97276P1400J063739
34936G62759O06769q21365j141447q3934M34783m10883j015037r4501J191553
34927e71303J124832j3835o67611l49470R8018R4478l3491R8092L11719K35135
34917C26564j52530m59207k92503J90539K97969k82868q09662l71155O79930J054210
34907A81287L66267l31443j75894L32877L62290O8993Q3733L21935K21775j95935
$$ plain form
34976 1021765 908944 363997 114344 226466 263056 154390 227067 503015 636064 502804
34966 502804 273849 -32446 -471962 -722175 -358873 388763 767680 473918 -11276 -115398
34956 -115398 245724 780508 1080693 826014 155594 -294104 -145988 180549 185039 122054
34946 122054 401680 613074 153029 -509159 -413763 208036 224896 -372380 -300980 762759
34936 762759 1369528 548163 -593284 -677218 -242435 -653318 -1668355 -1762856 -571303
34927 -571303 553529 539694 -127917 -477387 -379369 -284891 -318382 -220290 91429 326564
34917 326564 174034 -285173 -577676 -387137 -89168 -372036 -1181698 -1552853 -872923 181287
34907 181287 547554 216111 40217 373094 735384 804377 888110 1210045 1431820 1235885
34897A235885l70067j40630R6907J22593J24400J79701Q6177j79853l15848j69212
34887F70053J2375r378j13255j13292j64220n29440j000945r37811r1726Q65093
34877a412546J017296L44261k53103j32377L71474O19795N18084K73072j63978
34868A181978p60406r25373k15269O91507O59029k59839p90383k44702N77813
34859h5645P01739L07250J16500J52002p8795n59756p34713l76958J36249L87121
34849c5006K87241n8097m30910n02832j63666J92177J06915k39432k10508L41366
34839g12752P70526M99839j81478n26751l15550j2955j561j06222l9299Q1649
34829e44554R155j14609J1345K26246Q5035l11543k93954L34288Q38942N56921
$$ plain form
34897 1235885 865818 725188 822095 944688 1069088 1248789 1334966 1155113 839265 670053
34887 670053 682428 673050 559795 446503 282283 -247157 -1248102 -2185913 -2277639 -1412546
34877 -1412546 -395250 -50989 -304092 -436469 -64995 554800 1072884 1345956 1181978
34868 1181978 421572 -503801 -719070 -27563 631466 371627 -418756 -663458 -85645
34859 -85645 616094 923344 1039844 1191846 1113051 553295 -181418 -558376 -422127 -35006
34849 -35006 252235 194138 -236772 -739604 -903270 -711093 -604178 -843610 -1054118 -712752
34839 -712752 57774 557613 376135 -150616 -466166 -479121 -480682 -586904 -626203 -544554
34829 -544554 -535399 -650008 -638663 -412417 -327382 -638925 -932879 -598591 240351 797272
34819G97272j54295m91743l13609p9596k2923l2962j19072l14532k89380K43905
34809g76935Q41279P55787L3067n09413m18255m6752J80045K49723K01766m8131
34799D62181l47651l54650r4429O0834L5534R8390K41934J65360q2908j39256
34789D5339l6513j29279k92885p2781L13080J46810m39959m32681L82597Q84781
34779C68509L48096m21452m29571N5367K54274J52099Q9895p9124m49350m52455
34769e63712J94092O60814K11278m60285k75883M61241O32159J36310j92204j44613
34759F59197k22705l76954o4160M84775M14302k61786n91462k42688R9403O5320
34749c6758R6313L41059K63861k63208n72544l09937O8124K39901M26715N42482
$$ plain form
34819 797272 642977 151234 -162375 -241971 -264894 -297856 -416928 -731460 -1020840 -776935
34809 -776935 64344 820131 853198 343785 -74470 -121222 58823 308546 510312 462181
34799 462181 114530 -240120 -334549 -273715 -238181 -139791 102143 267503 184595 45339
34789 45339 8826 -120453 -413338 -486119 -173039 -26229 -466188 -898869 -516272 368509
34779 368509 716605 295153 -134418 -79051 175223 327322 417217 338093 -111257 -563712
34769 -563712 -369620 291194 502472 42187 -233696 227545 859704 996014 803810 659197
34759 659197 436492 59538 -4622 480153 894455 632669 41207 -201481 -102078 -36758
34749 -36758 59555 400614 664475 401267 -171277 -481214 -413090 -173189 253526 796008
34739G96008Q3666p06626p67148J11697P34492L22620k94419j88642J17491k48084
34729c8945q10697m94111N40483J115492P76409J54896k03756l28429k51458R8707
34719E58591M49998M05005O4223j90055l27075m44673k63488L49420P07288J40965
34709A450199p42849p59690O973L03512k46068n42627Q0591O58727J72794o92984
34699c11422n31174O26115J350383Q86157M9964j76989k2404l03339j002658j255818
34689f91185o73425N4828J72896p6848K5945M20882L42492l20630o42264m5582
34679a432891P19066O69050M0049k23214K6218J56712L5009J54232M76468K97256
34669I17955m62638q92578m74112J15121J47056o0233J19014N08613N35279J89600
$$ plain form
34739 796008 879674 173048 -594100 -482403 252089 574709 280290 91648 209139 -38945
34729 -38945 -849642 -1343753 -803270 312222 1088631 1243527 1039771 711342 459884 558591
34719 558591 1008589 1413594 1477817 1287762 960687 516014 252526 601946 1309234 1450199
34709 1450199 707350 -52340 -45367 258145 12077 -530550 -449959 208768 381562 -311422
34699 -311422 -842596 -216481 1133902 2020059 2070023 1893034 1870630 1567291 564633 -691185
34689 -691185 -1364610 -1309782 -1136886 -1213734 -1187789 -766907 -424415 -745045 -1387309 -1432891
34679 -1432891 -713825 -44775 -4726 -227940 -201722 -45010 -10001 144231 620699 917955
34669 917955 455317 -437261 -911373 -796252 -649196 -709429 -590415 -81802 453477 643077
34659F43077j59823m27238n77129k52555N64197J020038M53946m10388l75577
34650D78548M00607O35233j02305q43202q07156l84147j63963l3439K22958L15784
34640b81082P8260l1888K77023M61113k7073p34415p86227j47866L97857L60076
34630d34222K0159j32697J0131J50569o7334n64851o76236P9345J040784R71561
34620C97209j46122q17775j31792Q37850O86129j63967k97155L28801M75872j41667
34610A027383m43702k143K01584l84182p90947j72911O94184O42756q5877m18279
34600B67866j57579M2442k1163M7311K81183K47074j13429l50704k58992j17724
34590a33715j56062l00868m31873m43981j66690L55317O90325N61114K93580K60220
$$ plain form
34659 643077 483254 56016 -521113 -773668 -209471 810567 1264513 854125 478548
34650 478548 879155 1514388 1412083 568881 -238275 -622422 -786385 -819824 -596866 -281082
34640 -281082 -202822 -234710 42313 503426 476353 -258062 -1044289 -1192155 -794298 -434222
34630 -434222 -414063 -546760 -536629 -386060 -453394 -1018245 -1694481 -1615136 -574352 397209
34620 397209 251087 -566688 -698480 139370 825499 661532 364377 693178 1169050 1027383
34610 1027383 583681 581538 783122 398940 -392007 -564918 129266 772022 686145 267866
34600 267866 110287 152729 131566 178877 460060 707134 593705 243001 -15991 -133715
34590 -133715 -289777 -590645 -1022518 -1466499 -1633189 -1277872 -587547 -26433 267147 527367
34580E27367K48684k1697j83376J85127O12535L43862l37513m76810m8964J1323
34570H60538m85940n41297L09643J036280O54373k44339m55460N0058L24998j2652
34560A496202m54180o05480n80093m23279J9923N59110O87344L35489K3857P7060
34550A135953K08698J01157j01090j74535k50680m71839n52123j69610L83748
34541A09679M71675K8851l04813j20922J67094R478l98440m48228j12311N0002
34531e47935j18264r5062L49215N89103P4053o96173p97567j73873L91212M20087
34521f05204J59220q1226k94378m20571k77270J9558J29842Q2198K07247M09723
34511f70861K12113l06269l96254J95423P05384M82063n5242j78690L8141P1764
$$ plain form
34580 527367 776051 754354 570978 756105 1368640 1712502 1374989 898179 849215 860538
34570 860538 374598 -166699 142944 1179224 1833597 1589258 1133798 1183856 1508854 1496202
34560 1496202 1042022 436542 -143551 -566830 -546907 12203 699547 1035036 1058893 1135953
34550 1135953 1344651 1445808 1344718 1170183 919503 447664 -104459 -274069 109679
34541 109679 581354 610205 305392 184470 351564 361042 -37398 -485626 -597937 -547935
34531 -547935 -666199 -761261 -412046 177057 251110 -445063 -1242630 -1416503 -1025291 -605204
34521 -605204 -445984 -527210 -821588 -1242159 -1519429 -1499871 -1370029 -1287831 -1080584 -670861
34511 -670861 -458748 -765017 -1161271 -965848 -260464 221599 166357 -12333 25808 97572
34501I7572q0087m6533J32261J24477r249M4138J91257Q8653j73658k09853n3081
34490A05897n5808j55781L0066L79273L06506k24041m74655j2555O22028O91222
34480A212152J91741l60311o36150n93118k43516K37030M25986J00437l77077
34471d2826m63399j13849K48208L43321K90094K54227J58199j08144l55017k13487
34461b673L31408O93959K61456p29924j228983n61648O52979J182268O41636j93354
34451A047124m96558k67172K8507J51797J19408o4648l32623m53810l25321j61915
34441g55211j32816m4639L00530O43775N44911R394n07228o55417m40269K922
34431a034048N10292P72209N06661j24467n66241m92457j56108K0969j0769K68
$$ plain form
34501 97572 17485 -29048 103213 227690 218441 262579 453836 542489 368831 158978 105897
34490 105897 50089 -105692 -75626 303647 610153 386112 -88543 -101098 520930 1212152
34480 1212152 1403893 1043582 407432 -185686 -429202 -192172 233814 334251 -42826
34471 -42826 -506225 -620074 -371866 -28545 261549 515776 673975 565831 210814 -2673
34461 -2673 328735 1022694 1284150 554226 -674757 -1236405 -583426 598842 1240478 1047124
34451 1047124 550566 283394 311901 463698 583106 518458 185835 -267975 -593296 -755211
34441 -755211 -888027 -932666 -632136 11639 556550 565944 58716 -596701 -1036970 -1034048
34431 -1034048 -523756 248453 755114 630647 64406 -428051 -584159 -563190 -573959 -573691
34421e73691J47123K26794N1538k77251m61568l10817O3684L35907K72238k5022
34411e51065k25223j42721P1660J58808P3210k4472j5300Q4486K34047L92199
34401E5629M25783J97747j76784l53334j69530J26840K18568J24138M9263n449
34391D92871j72893l39427k23925J19827K64691K4972k35409j38980J56220K41686
34381A89633P2408m4052N1463K04873K31961R4376j60670l87418l33304P6756
34371c974M89097M57321L6111k59309j33784J35161J19894k23095n56371n30859
34361d69808r6399L98961M47116m4133m67907j80846N41384P09737l0950p94422
34351A2733o04133K82690P80996M41836j60384m23551l87560k78267o0276K24076
$$ plain form
34421 -573691 -426568 -199774 -148236 -425487 -887055 -1197872 -1134188 -798281 -526043 -551065
34411 -551065 -776288 -919009 -847349 -688541 -615331 -639803 -655103 -570617 -336570 55629
34401 55629 481412 679159 502375 149041 -20489 106351 324919 449057 498320 492871
34391 492871 319978 -19449 -243374 -123547 141144 166116 -69293 -208273 -52053 189633
34381 189633 262041 217989 269452 474325 706286 800662 639992 252574 -80730 -3974
34371 -3974 485123 942444 978555 719246 585462 720623 840517 617422 61051 -469808
34361 -469808 -566207 -167246 279870 235737 -232170 -413016 128368 838105 807155 12733
34351 12733 -591400 -308710 472286 914122 753738 330187 -57373 -335640 -395916 -171840
34341a71840K25274j64991m77829l57277j60307k72195k46961N03429J395433
34332B72736J161104j98286j094867n24315M97196N17258k39702n24542j76296
34323c09714j04593m06663j37538P96204J104924J65926p83348n10919K97570
34314A11849K58919m43179n11389K19035N73055M3687m73677k73046J05995k9983
34304d18734l91626l48694K5451K42511K17704J74712J12901o5918j71930L2615
34294e91008L83722M96784K62939j09387l80651l94357j20237K14214K63659J2392
34284C8070j73234q8106L5832k5273j25497o7794O1087J34418K36162M05730M54818
34273H86213K92326R9055m5977l06990o14646n55751r2606J60482j39555m33973
$$ plain form
34341 -171840 53434 -111557 -589386 -946663 -1106970 -1379165 -1626126 -1122697 272736
34332 272736 1433840 1235554 140687 -383628 113568 630826 391124 -133418 -309714
34323 -309714 -414307 -820970 -958508 -162304 942620 1108546 325198 -185721 111849
34314 111849 370768 -72411 -583800 -364765 208290 251977 -221700 -494746 -388751 -418734
34304 -418734 -810360 -1159054 -1133603 -891092 -673388 -498676 -385775 -451693 -623623 -591008
34294 -591008 -207286 289498 552437 443050 62399 -331958 -452195 -237981 25678 38070
34284 38070 -135164 -223270 -187438 -212711 -338208 -406002 -344915 -210497 25665 431395 886213
34273 886213 1178539 1277594 1231617 924627 309981 -245770 -338376 -177894 -317449 -751422
34263g51422j87765J18081k18451p66345m88469N18530R80018L43699l66352j09121
34253i27597O54166P57834O1821m96613l66596o0604k21980o40734o03784N2031
34243a792056O94655P46882M17353L04043M77589M20499q5095n19920l64760J34509
34233D33699L60656J89883j9529r8155j94202l24813l12457j53547n973J47210
34223B2772L76055M44151J09642k95705k28053J49095J46270k76155l66908J20191
34213B01355L96245q6281o70779n43611l8506J7868k58643r1789N04767O89563
34203A20189K31683r4709J68209M19674P6564m19094l50085R6338J77561j94420
34193B31910l73408l4337L87605M26610K03105Q5425J21948P3526k02032n81091
$$ plain form
34263 -751422 -939187 -821106 -1039557 -1805902 -2294371 -1775841 -795823 -452124 -818476 -927597
34253 -927597 -273431 484403 546224 49611 -316985 -377589 -599569 -1240303 -1844087 -1792056
34243 -1792056 -1097401 -350519 66834 370877 848466 1268965 1183870 663950 299190 433699
34233 433699 794355 984238 964709 866554 672352 347539 35082 -118465 -124438 22772
34223 22772 398827 842978 952620 656915 428862 577957 724227 448072 81164 201355
34213 201355 597600 511319 -159460 -703071 -741577 -723709 -982352 -1074141 -569374 120189
34203 120189 351872 257163 425372 845046 921610 502516 152431 248769 426330 231910
34193 231910 -141498 -175835 211770 638380 841485 926910 1048858 1122384 920352 339261
34183C39261p55061m33539L12930Q85730O70290j52339o72471l70232K05242K47186
34173B76997j66372l08485L811J54050k36534o59261m42796K99009Q33249O96032
34163D49700J14881l17373k07851K62094M69950Q3258l85380j95150M47758N14371
34153A236258l05902r76427n79157L11331N29434L5464k61133m6901J29865L4525
34143A07357O9355K99117K10312k62507m36799k4147K99076k4117n38173n41724
34133h42250j05812K62214M25952N12027M59866K20731J0708p1612k43824m93684
34123A34316m04925N6550K50404j23039m30892j60541J96283Q8104n2153L19013
34113a26880O74006K83399l46018k41754K88628J67467m76289m63894L15452O26119
$$ plain form
34183 339261 -415800 -849339 -536409 349321 1019611 867272 194801 -175431 29811 276997
34173 276997 110625 -197860 -194049 -39999 -276533 -935794 -1378590 -1079581 -246332 449700
34163 449700 564581 247208 39357 301451 771401 854659 469279 274129 721887 1236258
34153 1236258 930356 -46071 -625228 -313897 215537 251001 -10132 -57033 72832 107357
34143 107357 176712 475829 686141 423634 -13165 -37312 261764 237647 -300526 -842250
34133 -842250 -948062 -685848 -259896 252131 711997 932728 943436 871824 628000 134316
34123 134316 -270609 -214059 36345 -86694 -517586 -678127 -481844 -393740 -445893 -126880
34113 -126880 547126 830525 484507 242753 531381 698848 222559 -241335 74117 700236
34103G00236P063m60683m7750M75726L20582o4039q4471j11064n06115o61411
34093d31926j05497M02721O9494m82984k23451N19149O33167P8201k00322P8658
34083C37210K83313J47062O1189J02177p9724l44957j46652L49809L19689l26004
34073G03112o61750k25054K16156j03187p60013q21293j52391N43207O67796K76562
34063c16855j30883j27527K00463L32089L3878k16158N7020M88442M05589n9852
34053F66206k31402q6905j99822n27473l97031J57520K65640k28033l41289L46641
34043e75948Q22690K91750m43686l06799L12403L50185j32523k39364J58223L74080
34033F11011J79301l7041j74277m04368m43371P1379O33100M16343l22403n50028
$$ plain form
34103 700236 707299 246616 198866 674592 995174 931135 846664 735600 229485 -431926
34093 -431926 -537423 -134702 -65208 -548192 -771643 -252494 380673 458874 258552 337210
34083 337210 620523 767585 828774 930951 851227 506270 359618 709427 1029116 703112
34073 703112 41362 -183692 32464 -70723 -830736 -1652029 -1804420 -1261213 -593417 -316855
34063 -316855 -447738 -575265 -374802 -42713 -8835 -224993 -167973 320469 726058 666206
34053 666206 434804 347899 148077 -379396 -776427 -618907 -353267 -581300 -922589 -575948
34043 -575948 246742 538492 94806 -211993 100410 450595 318072 78708 236931 611011
34033 611011 790312 753271 578994 174626 -268745 -197366 435734 852077 529674 -20354
34023b0354j17594J17555j13541j10605L25518M12017j24044l81708J61898O29898
34013G79040K01311m45774k58584M23300M62621k21527o46315l83904j1136N6618
34003d4350J17892L75199M60795J06819l60159n19730l62787m5530L94908P97833
33993I20890P69467J82795m70641n84559j83059J27464n4299m14685l40827K28038
33983A80584O06606K14861n46950p03274k7407N74630L13190l61747m51872J26174
33973g5205N12132K34421k14574k78704r0100J2741J00569K92175K44401l69393
33963C68463j104385j110447k46898P06094J042868Q53372N63682K40996k34741
33954A079004o19231m83981P3969M09725J87681j47705m7444L22984L61365n5824
$$ plain form
34023 -20354 -137948 -20393 -133934 -244539 80979 492996 368952 -12756 149142 779040
34013 779040 980351 534577 275993 699293 1161914 940387 294072 -89832 -100968 -44350
34003 -44350 73542 448741 909536 1016355 656196 136466 -226321 -271851 123057 920890
33993 920890 1690357 1873152 1402511 817952 634893 762357 708058 293373 -47454 180584
33983 180584 787190 1002051 455101 -248173 -275580 299050 612240 250493 -201379 -75205
33973 -75205 436927 671348 456774 178070 87970 100711 201280 493455 737856 368463
33963 368463 -735922 -1846369 -2093267 -1387173 -344305 509067 1072749 1313745 1079004
33954 1079004 459773 -24208 49761 459486 647167 499462 452018 775002 1136367 1080543
33944A080543m28002l88807j26525O7901K10377L42869K55640j47249m96834l79224
33934i311P2860L86258L94905K89606J51171j10627l94353m49981l19455k86135
33924b75062l26343j09837L17832M19995L8708j79413K64427Q00785N34397l36540
33914A148949o87377j14060M38327R4961o03123m84277M84427J054174L84954
33905A716955q22267j236055n00227N23033R14423O30772K36960Q5604K4066j95484
33895A377780m82557n18788k17620J19605J83047K9857q5970j21840k12132k94082
33885b22700j30210K40431M43292K97494M2239j30378l37610n42356l39033L38544
33875c40287P76795L97436k67134l01500J65693K14087k89372m62387N9876M84904
$$ plain form
33944 1080543 652541 263734 137209 205110 415487 758356 1013996 866747 369913 -9311
33934 -9311 63549 449807 844712 1134318 1285489 1174862 780509 330528 11073 -275062
33924 -275062 -601405 -711242 -393410 26585 65293 -114120 150307 951092 1485489 1148949
33914 1148949 461572 347512 785839 880800 277677 -206600 277827 1332001 1716955
33905 1716955 894688 -341367 -841594 -318561 595862 1226634 1463594 1549198 1573264 1377780
33895 1377780 895223 376435 158815 278420 461467 491324 405354 283514 71382 -222700
33885 -222700 -352910 -112479 330813 628307 670546 540168 202558 -339798 -678831 -340287
33875 -340287 436508 833944 566810 265310 431003 645090 355718 -106669 -46793 438111
33865D38111K24245j40104M9564L65968J20648l72767l82197p9233j66590n02644
33855d44999k69466N49805R93765N87305j6082j50766j7909n4021j72186j04675
33845I00771P1156J80028K51503K39128o9176n32372n82801o3071L89099K47804
33835A032069j17587j01786J69508J85138j4294J771J66401j6231n31707p34873
33825C8409l21735K17082L62181K42941K28989K98587K19809L9140n2146j40796
33815A132461m26297p15187n47255R9830O39136N98347K01764j8223O3875J56066
33805A184517P2319j03956k84702m18233l21674Q6790M02485J23584m82499n37491
33795b78860J69371P53823N41419Q7114J77941M64468J05063o33015o43341K03866
$$ plain form
33865 438111 662356 522252 571816 937784 1058432 685665 303468 224235 57645 -444999
33855 -444999 -714465 -164660 829105 1416410 1400328 1249562 1231653 1177632 1005446 900771
33845 900771 971927 1151955 1403458 1642586 1573410 1041038 458237 395166 784265 1032069
33835 1032069 914482 812696 982204 1167342 1153048 1154819 1321220 1304989 773282 38409
33825 38409 -283326 -66244 295937 538878 767867 1066454 1286263 1325403 1273257 1132461
33815 1132461 706164 -9023 -556278 -456448 182688 781035 982799 964576 1028451 1184517
33805 1184517 1256836 1152880 868178 449945 128271 215061 617546 741130 258631 -278860
33795 -278860 -109489 644334 1185753 1272867 1450808 1915276 2020339 1387324 743983 947849
33785I47849P58384L58281k46080k14986J60639K26251Q7206J71503L33689K26925
33775B809661P3732K55115N22541M09638J01429R4073K54129N4112m12273m95354
33765C666803m3760L82758L97215J73128j05356m67185p13030m61489J47619M41971
33755C418674J78695p6726J44985M93177M07715J1897j13983J85287M47876K32584
33745E330181l53947p87853o67192j41567K05994K1031l51334k85113L03188Q63093
33735D136481R18817N15949m0910m84409n57386j43787M09174N11660P8006l19825
33725E023770k39257J00873L16677M36491O08779O34510K94857j07311p4732L12278
33715G306935M56858J07059k83923k05099K22857M31526J44780k72948k69916
$$ plain form
33785 947849 1706233 2064514 1818434 1603448 1764087 1990338 2077544 2249047 2582736 2809661
33775 2809661 2883393 3138508 3661049 4070687 4172116 4266189 4520318 4574430 4162157 3666803
33765 3666803 3623043 4005801 4403016 4576144 4470788 4003603 3290573 2829084 2976703 3418674
33755 3418674 3597369 3520643 3665628 4158805 4566520 4578417 4464434 4649721 5097597 5330181
33745 5330181 4976234 4188381 3521189 3379622 3585616 3606647 3255313 2970200 3273388 4136481
33735 4136481 5055298 5571247 5530337 5045928 4488542 4344755 4753929 5265589 5343595 5023770
33725 5023770 4784513 4885386 5202063 5638554 6247333 6881843 7176700 7069389 6994657 7306935
33715 7306935 7763793 7870852 7586929 7381830 7604687 8036213 8180993 7908045 7638129
33706G638129J55848L54549j61432r37421j009994j86239N91274M59163k28530
33697F675347m93555j54265O0701k24386m42527o0850M98464M68987j12987n16374
33687E698555m22050k59427l67892m65094k56767l9460j88166m04698j26094M58461
33677C627368N22595j51913p47995n90038j43642k56905q15239r01423j83219
33668C59589O02314P01480K72848l6162J9016K01932L04250L03887J59772j43102
33658B745824l67810k18848J61727K38090j80984n45219k56042M17899O02826
33649B597463J6357o45069p38063n10993m43557l15309K74634Q41092N18894m33931
33639A161518p80772j56710L96770J76918j28193J37987L45518j68616o61321
$$ plain form
33706 7638129 7793977 8148526 7987094 7049673 6039679 5853440 6444714 6903877 6675347
33697 6675347 6181792 6027527 6088228 5863842 5421315 5360465 5858929 6327916 6214929 5698555
33687 5698555 5276505 5017078 4649186 4184092 3927325 3887865 3699699 3295001 3168907 3627368
33677 3627368 4149963 3998050 3250055 2660017 2516375 2259470 1444231 542808 359589
33668 359589 961903 1663383 1936231 1900069 1919085 2121017 2425267 2729154 2888926 2745824
33658 2745824 2378014 2159166 2320893 2558983 2377999 1832780 1576738 1994637 2597463
33649 2597463 2613820 1968751 1230688 719695 276138 -39171 235463 1076555 1595449 1161518
33639 1161518 380746 224036 620806 797724 669531 807518 1153036 984420 323099
33630C23099j87966N81587L61408m91264m91279M37598Q10098Q1274n46628k65681
33620F12246J26626j18923l97082k4802M94199M77440K07017R6806j99776q31013
33610D42738r54171n2556Q92908P71169N2574j27660J78540J70574p7807O6793
33600A363102L38804j2261o30464m47182M20665P20142J14935l32043n4405Q1817
33590A563110o51121j520675j381608k68826P76538J001808N53867J07491J70686
33581C51270N55026N63587j9498m55969j20051M11273K21297l79388l31880L08806
33571A104473L83983l68637p81065j85501M90465L05421k05783q4047M41895M79473
33561A580677j2159l04515j56200j9524j23631j78024k7081N5359j05382k06978
$$ plain form
33630 323099 135133 716720 1078128 586864 95585 533183 1343281 1424555 877927 612246
33620 612246 738872 619949 222867 198065 692264 1169704 1376721 1473527 1273751 442738
33610 442738 -511433 -563989 328919 1100088 1152662 1025002 1203542 1374116 1296309 1363102
33600 1363102 1701906 1689645 1059181 611999 1032664 1752806 1867741 1535698 1481293 1563110
33590 1563110 911989 -608686 -1990294 -2259120 -1482582 -480774 73093 180584 351270
33581 351270 906296 1469883 1450385 994416 874365 1285638 1506935 1127547 795667 1104473
33571 1104473 1488456 1119819 338754 153253 643718 949139 743356 659309 1101204 1580677
33561 1580677 1568518 1264003 1107803 1088279 964648 786624 759543 814902 709520 502542
33551E02542J16147O80326Q28880K42556m83342m42095L53153Q63065M24654l42259
33541B743627n32963k36139j04702k40256l47602m20392l66322L28133J484228
33532B307612J741510O35110n439J201934K356939J279600L46852L801034R739535
33523B3404687J0071447J269558r235421j1696051o113552p80986o11438k498826
33515C809418k228921m61662J31613m29656m56022J38212K35012k04060l74405
33506A59529k63988m00064o21956m22841K8915K54795L20999M62321M13921p7427
33496a45796n93154o08471k45879J00688L50412M47401J41283l99485m42041K34689
33486a160353P87798M84947k14350m41654j60658J22900L12175N50123N73261
$$ plain form
33551 502542 618689 1299015 2127895 2370451 1887109 1445014 1798167 2661232 3085886 2743627
33541 2743627 2210664 1974525 1869823 1629567 1281965 861573 495251 823384 2307612
33532 2307612 4049122 4684232 4678793 5880727 8237666 9517266 9864118 13665152 23404687
33523 23404687 33476134 34745692 25510271 13814220 7700668 6919682 6308244 3809418
33515 3809418 1580497 1118835 1250448 820792 364770 502982 737994 533934 159529
33506 159529 -104459 -504523 -1126479 -1549320 -1520405 -1265610 -944611 -482290 -68369 -145796
33496 -145796 -738950 -1347421 -1593300 -1492612 -1142200 -694799 -553516 -953001 -1395042 -1160353
33486 -1160353 -372555 112392 -101958 -543612 -704270 -581370 -269195 280928 854189
33477H54189J08786m09695l60943N5316J11111l11674o25229m86172j37319J70828
33467a030802M37090N52581L07559j23413k40780N8525K76155N4985k61143j28562
33457i7805L82232O57366L83274m6562j41144n0923l04616q73485j026103l56184
33447a473950N14152P10181K46816j58670j77075j14018j62820j19195O7782R4718
33437e72079j46464l23850j73115J53132L79190L90639J85293p9964m5153L86739
33427A54368O47962J64819o71088r04520l72470J33058J21521l0516O1097K37020
33417d58749L68717O18459P93895L22938o92950j246646p59692J21086N56938
33408c76004N48649M02053K5999n46723p30859k54720K42104K31855J84354N87425
$$ plain form
33477 854189 962975 553280 192337 247653 358764 47090 -578139 -1064311 -1201630 -1030802
33467 -1030802 -593712 -41131 266428 143015 -97765 -39240 236915 291900 30757 -97805
33457 -97805 284427 941793 1325067 1278505 1137361 1086438 781822 -91663 -1117766 -1473950
33447 -1473950 -959798 -249617 -2801 -161471 -338546 -452564 -615384 -734579 -666797 -572079
33437 -572079 -718543 -1042393 -1215508 -1062376 -683186 -292547 -107254 -187218 -232371 154368
33427 154368 802330 967149 296061 -608459 -980929 -847871 -726350 -756866 -695769 -458749
33417 -458749 -90032 528427 1322322 1645260 952310 -294336 -1054028 -932942 -376004
33408 -376004 172645 574698 600697 53974 -676885 -931605 -689501 -457646 -273292 314133
33398C14133Q53985K74939n61823n26677K61080O33965J86797l18690l56128k80612
33388D80969l73447k89542J41461L97332O1782m32642l84603J83493N81029L88076
33378G53908k7100m3345L38890M62490l0790n88590n41699j80905k67057o30966
33368g55164l32862O34917J038816L25266l63719M5991Q69886Q49122J22032k79804
33358B154481k22806l63298o94527o11119j97744j26774l78622l03453J12819
33349f31043K47281M8016M7103K26952J17612l5400M25878J081810P70583l80228
33339A918564q69514k03935K97567k12193o90794j51262M99361K3333r27341q42107
33329a158321J56847O10165J38825j77528J48772K53011l66293q17128k80582
$$ plain form
33398 314133 1168118 1443057 881234 354557 615637 1249602 1436399 1117709 761581 480969
33388 480969 107522 -182020 -40559 356773 418555 -14087 -398690 -215197 365832 753908
33378 753908 726808 683463 1022353 1484843 1454053 865463 323764 142859 -124198 -755164
33368 -755164 -1088026 -453109 585707 910973 547254 593245 1463131 2312253 2434285 2154481
33358 2154481 1931675 1568377 873850 262731 64987 -61787 -440409 -743862 -631043
33349 -631043 -383762 -335746 -288643 -61691 55921 20521 446399 1528209 2298792 1918564
33339 1918564 1049050 845115 1142682 930489 239695 88433 587794 611127 -316214 -1158321
33329 -1158321 -1001474 -391309 -252484 -430012 -281240 -28229 -394522 -1211650 -1492232
33320a492232N76596O31678K8902j97293J60199K81934j50645l54635J78400O54865
33310C17769J73473o72204n09273O78485J345764N78185o32252r00554k88519
33301I0874K00883K18981J55811J25284q4797l20761k84006k26509m93241o25399
33291a242880Q951Q64016P25797l80406j049631n25929L34728N55018L38676K75797
33281i5863K74450N3208j11956O5333K11294p4708m20391k34389L22748N67256
33271E56982K19491l91239p80257o08404J13409Q07711P55652M1135m44932k47865
33261B1683M7694j28089l97316j71828L20245M81696L05273J34304p2884m39004
33251A01774n41259R401O40208M31968m25592p52548p8766O49381M18126m54196
$$ plain form
33320 -1492232 -915636 -283958 -255056 -452349 -292150 -10216 -160861 -515496 -337096 317769
33310 317769 491242 -180962 -690235 -11750 1334014 1912199 1279947 379393 90874
33301 90874 291757 510738 666549 791833 707036 386275 102269 -124240 -617481 -1242880
33291 -1242880 -1233929 -369913 355884 -24522 -1074153 -1600082 -1265354 -710336 -371660 -95863
33281 -95863 178587 231795 119839 185172 396466 321758 -98633 -333022 -10274 556982
33271 556982 776473 385234 -395023 -1003427 -890018 -82307 673345 714480 269548 21683
33261 21683 69377 -58712 -456028 -627856 -307611 174085 479358 613662 540778 101774
33251 101774 -439485 -430084 210124 642092 216500 -536048 -614814 34567 452693 -1503
33241a503p82965p6482Q51943Q74505r1749r69112q50880j37234J21872j81241
33231a242846j17687O15631R66241J38936r38070q25105K93624R20854M75423
33222B87001r5496m7447J24067j27101l16375J31625O85530M52537l49464o83875
33212F1002k65447J54120J02623K251J63562J05895m68937p74980J3401J203349
33202B96839J215756j71174j330885r73715J67177N85690J40002j17000K09983
33193B2673M03818K7574l65795k44683R2290J86532J62209K55740K14894j98467
33183E56785n64953l62907J22702J70873k10103k34444M12085R50566N49053m46416
33173I43241q92176l43045M09315M57637o4138l58131j52943Q2529P673j54278
$$ plain form
33241 -1503 -784468 -860950 -9007 865498 773749 -195363 -1046243 -1183477 -1061605 -1242846
33231 -1242846 -1360533 -744902 221339 360275 -577795 -1402900 -1109276 -188422 287001
33222 287001 191505 144058 268125 141024 -175351 -43726 641804 1094341 744877 61002
33212 61002 -204445 -50325 52298 54549 218111 324006 -144931 -919911 -906510 296839
33202 296839 1512595 1341421 10536 -963179 -796002 -210312 -70310 -187310 22673
33193 22673 426491 454065 88270 -156413 -64123 122409 284618 540358 755252 556785
33183 556785 -8168 -371075 -248373 -77500 -287603 -522047 -109962 840604 1389657 943241
33173 943241 51065 -291980 117335 574972 510834 152703 -240 82289 89962 -64316
33163f4316j37983l06J89566M40306M76931r434n55600k56544P23805J009820
33153A816245L6284q88417n27039L43700K81031m27743l97283L91416O23306k9727
33143A221773m83649k62412j42539m23696k87782N29241J017691N85820L9193
33134A793640O5047Q6908m55494r23920o13918k4422N8651j22151Q4116N27491
33124D75948O23792L50107O9451j18427k25944j38491r89j81093m96978l25831
33114C1545K18605K92696j44451j12140N75134P63770k8485o43175k99383N5795
33104G09911l52319n45341L19921J065435L96736o77058m79479M11709K65075
33095A114590o14382m12160Q38764J105329k43136j344824p94206M03213P02766
$$ plain form
33163 -64316 -202299 -202605 -13039 427267 904198 894764 339164 82620 806425 1816245
33153 1816245 1852529 964112 437073 780773 1061804 634061 236778 628194 1251500 1221773
33143 1221773 738124 475712 333173 -90523 -378305 150936 1168627 1754447 1793640
33134 1793640 1858687 1945595 1490101 566181 -47737 -72159 -13508 -135659 -51543 475948
33124 475948 1099740 1449847 1519298 1400871 1174927 1036436 1035447 854354 357376 31545
33114 31545 250150 542846 398395 286255 861389 1625159 1596674 953499 654116 709911
33104 709911 357592 -187749 132172 1197607 1594343 917285 437806 849515 1114590
33095 1114590 500208 88048 926812 2032141 1789005 444181 -350025 53188 755954
33086G55954J77814j65367J3357L73933O18506N67450J51114l13651m09410k60289
33076A509411k63896l28703j51635J8190j65341k64508K51238P86462M06441m46990
33066A350669n21431J27790K34762m30241o62151K8392N82123K51771k75351k81508
33056D04825j07123j09955J05319O15992O21359j54883o77668j78200N46561M38348
33046A504575j70711l17165k0151L8715j34098K378L55382K83186k63764o15269
33036F63078m24864r7205o0620j84457j02464K46984N78023N84900K29552k22195
33026A210732m30087k70114Q4849L14634J92531j73491l46411n3977L49349L19142
33016A197157Q10M2628M39405M15748k24464o18938k82704J8875l48336o79792
$$ plain form
33086 755954 933768 768401 781758 1155691 1774197 2341647 2492761 2179110 1769700 1509411
33076 1509411 1245515 916812 765177 783367 618026 353518 604756 1391218 1797659 1350669
33066 1350669 829238 957028 1191790 761549 99398 127790 709913 961684 686333 404825
33056 404825 297702 187747 293066 909058 1530417 1375534 697866 519666 1066227 1504575
33046 1504575 1333864 1016699 996548 1035263 901165 903543 1258925 1542111 1278347 663078
33036 663078 238214 141009 80389 -104068 -206532 40452 618475 1203375 1432927 1210732
33026 1210732 780645 510531 595380 910014 1102545 929054 582643 528666 878015 1197157
33016 1197157 1197967 1240595 1680000 2095748 1871284 1252346 969642 988517 640181 -39611
33006c9611j93919M67365L21709j95393m0922N44121N62577J42966J67018L99708
32996B135619j55323j183542j244797j46846O78277M55252J4076O3925J51601
32987G68242j17414k82563m9560J46413R5910J73992L81204K07617k55807l01141
32977G66893N8150L7818m01413l98462J68235L70836o9558k88436O8890K27891
32967E40844j44488k71919J93265M33531k3336m34660k07197J55702J48028O4164
32957D53934J08369n5947l46724j47931L95956L63357k58895m05521J42596L59242
32947F08436m3957j12425L10566J16191p38936o94655N60035J058666j80888j214489
32937c31456l41718R82246O64425m90856l67427P70126R46677m1906n47976q4396
$$ plain form
33006 -39611 -233530 233835 555544 360151 319229 863350 1425927 1568893 1735911 2135619
32996 2135619 1980296 796754 -448043 -594889 83388 538640 552716 616641 768242
32987 768242 650828 368265 318705 465118 561028 735020 1116224 1323841 1068034 766893
32977 766893 825043 862861 461448 62986 231221 602057 532499 244063 312953 540844
32967 540844 396356 124437 317702 751233 727897 293237 86040 241742 389770 453934
32957 453934 562303 506356 159632 11701 407657 771014 512119 106598 249194 608436
32947 608436 564479 452054 762620 878811 139875 -554780 5255 1063921 883033 -331456
32937 -331456 -673174 309072 973497 482641 115214 885340 1832017 1790111 1242135 1157739
32927A157739J16443m29381o75401p7350M36838P8941n89012o36098n0615M10735
32917b57161J82463m81643o81961R2770J068072R82692j01785p73546l27002L57089
32907E9988M52117L48706M79786L76311k04449n32335k43380j10810n17396n85467
32897d76929R8209M27263k78086q21919j26262Q03981N87662k13059k85770J34735
32887a50175P1037j54470L18316R24999M94789n58584p76039P793N91823L93060
32877A162549k3115j75678j37227P079J62303M4573k58027j88797K18882J93249
32867A005791k74333j61713O31243Q01179R2169J73111J636443K303433N13653
32858F720976j881619k177170p93703o3356m30309n37163p5869Q4474n4152J96725
$$ plain form
32927 1157739 1274182 844801 169400 92050 528888 607829 18817 -617281 -667896 -257161
32917 -257161 -74698 -556341 -1238302 -1145532 -77460 905232 803447 29901 -297101 59988
32907 59988 512105 860811 1340597 1716908 1512459 980124 736744 625934 108538 -476929
32897 -476929 -378720 48543 -229543 -1051462 -1177724 -373743 213919 860 -284910 -150175
32887 -150175 -79138 -233608 84708 1009707 1504496 945912 169873 177666 769489 1162549
32877 1162549 1139434 963756 826529 833608 995911 1040484 782457 593660 812542 1005791
32867 1005791 731458 569745 1200988 2002167 2094336 2267447 3903890 6207323 6720976
32858 6720976 4839357 2662187 1868484 1805128 1374819 837656 761787 846261 792109 988834
32848I88834N24379J67664m54375n02451l19827n49557o47061l91O25076M84758
32838C17049L37345P91655Q20808j73266p12175J94528R28431J31098n92390L37307
32828B380390J177328j05218j795169j213590N13654N85370l95737J04212J502105
32819B753345J181042m72634p91547K27866L20148m25735p761J073781O72590
32810D531095k63426J106906L798277L711783K86786k622941k916679k350855
32802E280946k053578r51628O39421O79527n84957p59992J97135J87705m05284
32793B229295O50229K405625J881858Q636L83771K382473K178089L80359J141700
32784A3642035L719250L470275J587591L996046R344327R423540M391021M953919
$$ plain form
32848 988834 1513213 1680877 1226502 724051 404224 -145333 -792394 -792785 -167709 317049
32838 317049 654394 1446049 2266857 2093591 1381416 1575944 2504375 2635473 2043083 2380390
32828 2380390 3557718 3452500 1657331 443741 957395 1542765 1147028 1251240 2753345
32819 2753345 3934387 3461753 2670206 2898072 3218220 2792485 2784724 3858505 4531095
32810 4531095 4267669 5374575 9172852 12884635 13171421 10548480 7631801 5280946
32802 5280946 3227368 2275740 2915161 3594688 3009731 2249739 2446874 2634579 2229295
32793 2229295 2879524 5285149 7167007 7175643 7559414 9941887 12119976 12500335 13642035
32784 13642035 17361285 20831560 22419151 26415197 35759524 45183064 49574085 54528004
32776E4528004J4129321K0511553J9022612K5575763N6481964R9731649J20701327
32769D10682193R5193744K9341239m7656475j01391256j10358102q1088617m4614312
32762A50108414k7383369k6793923k3526621j1935772m009973o236663r892948
32755D0329145p447733l648203m228676n660509l346253m49692j159719k729989
32747A1658371j250605R07636J4767j962454j434581K07021j39075j348272q33509
32738E819299K39020l98541j375150m26494R45729J80920j504947j387953n9975
32729B031908J88022l05910J04820O60837k44799j459089q22347Q62891J173322
32720B189655J51240k82543J13122R6103k79972n4410L30196j58699q53029m63746
$$ plain form
32776 54528004 68657325 89168878 108191490 133767253 190249217 289980866 410682193
32769 410682193 505875937 535217176 487560701 386169445 275811343 194722726 150108414
32762 150108414 122725045 95931122 72404501 60468729 56458756 50222093 40329145
32755 40329145 32881412 29233209 25004533 19344024 15997771 15548079 14388360 11658371
32747 11658371 10407766 11315402 11330169 9367715 7933134 8140155 8001080 6652808 5819299
32738 5819299 6058319 5659778 4284628 3858134 4803863 4984783 3479836 2091883 2031908
32729 2031908 2219930 1914020 2018840 2679677 2434878 975789 153442 1016333 2189655
32720 2189655 2340895 2058352 2171474 2267577 1987605 1933195 2263391 2104692 1251663 787917
32710G87917L92398K07272o77235p18709J26699N67632K35926j85055m59483o87543
32700d10181m49899L50840P13860J02717l52780K55445Q76206L64754l56900J6843
32690A110905O91733J78198r47054r82195L1602O05077L45042J25055J87506p408
32680A338461l89907m12381k13827k24289j35664L83015O43375J9308o83283l97277
32670g2469M16881O19734K59196R3076K9324l90204o75029j63415N11918L07516
32660I36528m43871o44100k79324j59742l13750j22208L53523N43978M81382N13375
32650H65791L90000j82278o35047l67956J19787R0944j25185J03096L91166R0408
32640G40726l63785k15071J84446Q1103k12661L3701M87587L54211j25891k03583
$$ plain form
32710 787917 1180315 1387587 710352 -8357 118342 685974 921900 736845 277362 -410181
32700 -410181 -860080 -509240 204620 307337 -45443 210002 1086208 1450962 1094062 1110905
32690 1110905 1802638 1980836 1033782 51587 83189 688266 1033308 1158363 1345869 1338461
32680 1338461 948554 536173 322346 98057 -37607 345408 988783 1008091 324808 -72469
32670 -72469 344412 964146 1223342 1316418 1345742 955538 280509 117094 629012 936528
32660 936528 492657 -151443 -430767 -590509 -904259 -1026467 -672944 -128966 352416 865791
32650 865791 1255791 1073513 438466 70510 190297 281241 156056 259152 650318 740726
32640 740726 376941 161870 346316 427419 214758 248459 736046 1090257 964366 760783
32630G60783o7911l22652n88496j42901N35997M11603l12510n56215k06842q9544
32620e78688l21004j86718M05996P13339M29061L5594j15119j06074N0984L59915
32610F87286M82059J96954j24280j84577l18255o54839n35833L02286Q50865K71571
32600I73237o32251o40783j519K63807J52126K98784M88576J09328m50072m04513
32590A56720j00560l89824r02851n55257N06415J034342O10984L0153j28237r022
32580B52863K61908O16556N72889j27169p45730n34669j319n699k34851N6975
32570A11754M69317J87743l17620l8737O31652N11393k25777l96147J790r8650
32560H36718o83354o42421O8591K69501k35775k70279N02615Q68103J53068o67105
$$ plain form
32630 760783 692872 370220 -218276 -361177 174820 586423 273913 -282302 -489144 -578688
32620 -578688 -899692 -1086410 -680414 32925 461986 497580 382461 276387 327371 687286
32610 687286 1169345 1366299 1242019 1057442 739187 84348 -451485 -149199 701666 973237
32600 973237 340986 -299797 -301316 -37509 114617 413401 901977 1011305 561233 156720
32590 156720 56160 -333664 -1236515 -1791772 -1285357 -251015 359969 390122 261885 252863
32580 252863 514771 1131327 1704216 1577047 831317 296648 295329 289630 54779 111754
32570 111754 581071 768814 451194 412457 1044109 1555502 1329725 933578 935368 836718
32560 836718 153364 -489057 -420466 -150965 -386740 -657019 -154404 713699 866767 199662
32550A99662o52988k20652o5903m6824J60960L48136L04883K21725J95595J07115
32540E51709R2329L07055L35639j80581n82115p1620P18158M73554o49526j193047
32530a98445o83152j18279p8838j9417L00611L09594p2296j23653K89347M17419
32520B2891N1504j42647K5213J1343j60275J33956O30858L20968o11936p35111
32510d53236K92503J070075P13869M4070j31511k03368m94588m90789j28591k05332
32500A3102p07637m56118O99268J157309J35522q63278m86640L12651J34607m43764
32490e04978j35926O31817N26420l26431o55686j79819K34830J82785M2163k2169
32480b06994j31528n2038M28598Q02428N03929j01998l14788k39497m03141o73350
$$ plain form
32550 199662 -453326 -673978 -739881 -786705 -625745 -277609 27274 248999 444594 551709
32540 551709 644038 951093 1286732 1106151 524036 452416 1170574 1644128 994602 -198445
32530 -198445 -881597 -999876 -1078714 -1098131 -797520 -487926 -560222 -683875 -394528 22891
32520 22891 74395 -68252 -43039 -31696 -191971 -58015 572843 893811 281875 -453236
32510 -453236 -160733 909342 1623211 1667281 1535770 1332402 837814 347025 218434 13102
32500 13102 -694535 -1150653 -451385 705924 841446 -21832 -508472 -195821 -61214 -504978
32490 -504978 -640904 -9087 517333 190902 -464784 -644603 -409773 -226988 -184825 -206994
32480 -206994 -338522 -390560 38038 840466 1344395 1242397 927609 688112 284971 -388379
32470c88379n08772N9285N24959O49645M50085p0221n72613m12208L37630O48768
32460G18179L1287o18378m83354j41305l68455o38593j35308N88507M62606k03868
32450g88682k28960M33296P19013K82306j55843k13589k40917k87934L3363N48359
32440A00412N68320R8226j01182J69492K41367j71485m51541j80846J48709O140
32430D27612l20898k62500J33462L28591P5237k76370k13641K91813O33228K73373
32420A089907m08289m54616L07161Q80039M83145l43914o33465l63149j63587
32411C93232j77136r3976M1976m9999k19648j43677j902j26468k67427r314L80147
32400b74192L54536M3068n8463k3813j98629l13540O8032N23009L25090k23845
$$ plain form
32470 -388379 -897151 -837866 -312907 336738 786823 716602 143989 -268219 69411 718179
32460 718179 749466 131088 -352266 -493571 -862026 -1500619 -1635927 -1047420 -584814 -788682
32450 -788682 -1017642 -584346 134667 416973 261130 47541 -193376 -481310 -447947 100412
32440 100412 668732 766958 665776 835268 1076635 905150 453609 272763 421472 427612
32430 427612 106714 -155786 -22324 306267 381504 105134 -108507 183306 816534 1089907
32420 1089907 681618 227002 534163 1414202 1897347 1553433 919968 556819 393232
32411 393232 216096 122120 164096 114097 -105551 -249228 -251130 -377598 -645025 -654339 -274192
32400 -274192 80344 123412 64949 41136 -157493 -471033 -403001 120008 445098 221253
32390B21253k50477R8807q8106o88936n35964N48594J223456O56021k81428n08210
32380C95010k09884n8450m9569M3772m805k56243j55722M69703P82165J84094
32370A140071n74646m97220J50324M48352L14646K82443L17994N2934j98627Q5878
32360A522149M14867j12901j067909j013309K18441J030217L93441o46071o44259
32351I4666J57637N16718J66528j28500p8230j75313n53589o56198k62370N5202
32341h63449j44238m81681l98967M6917M34314N98506O08323M63503K01616M3488
32331E08332R1256J18699m2732j89093j33846q9413k52610l29262J817M02021
32321H5169K82570k21603l72790N0579M47020L72414J58946K24939L49995J18255
$$ plain form
32390 221253 -29224 69583 -18523 -707459 -1243423 -694829 528627 1184648 903220 395010
32380 395010 185126 126676 77107 120879 116074 -140169 -295891 173812 955977 1140071
32370 1140071 565425 68205 218529 666881 981527 1263970 1581964 1634898 1436271 1522149
32360 1522149 1937016 1824115 756206 -257103 -38662 991555 1384996 738925 94666
32351 94666 252303 769021 935549 807049 728819 553506 -83 -656281 -918651 -863449
32341 -863449 -1007687 -1489368 -1888335 -1841418 -1407104 -808598 -200275 263228 464844 508332
32331 508332 599588 718287 675555 486462 352616 263203 10593 -318669 -316852 85169
32321 85169 367739 146136 -226654 -176075 270945 643359 802305 1027244 1377239 1495494
32311A495494l27799n09073l45727j70394j33031n9299J24770K43685K05667J44234
32301F68527J26813J1044k56320m27094k53804J13711K56439M984l40656l65815
32291d62171q036L98654M77464J49364l16142n36516l67699n2108Q5508Q1055
32281e50627K28091M76157L37451l29964q76006o86525q7593K19131K75231N54407
32271d40247Q00639L30797n17491n86957J49143K91801o74152j271918l23986
32262b242371J015981J012987M6449k12295M28752O77702J60335j63241K3806
32253G48105p1493n67272m93813L13581O22694j54732q71427m89811L40368N52478
32243g1322L20299L37140M22173L2401n29402n34590r631M08108M29812K10056
$$ plain form
32311 1495494 1167695 658622 312895 142501 9470 -49829 74941 318626 524293 668527
32301 668527 795340 806384 550064 122970 -130834 -17123 239316 244300 -96356 -462171
32291 -462171 -470207 -71553 405911 555275 239133 -297383 -665082 -717190 -631682 -550627
32281 -550627 -322536 153621 491072 161108 -714898 -1401423 -1489016 -1269885 -994654 -440247
32271 -440247 360392 691189 173698 -413259 -264116 27685 -646467 -1918385 -2242371
32262 -2242371 -1226390 -213403 -166954 -379249 49503 727205 887540 724299 748105
32253 748105 676612 109340 -384473 -70892 551802 397070 -474357 -964168 -623800 -71322
32243 -71322 248977 586117 1008290 1040691 511289 -23301 -32932 375176 804988 1015044
32233A015044j33907m79000n56215l52752k33946l06015k22496O9458J38289k1339
32223a082879K12833R01052J136443M61859l08951m34061l77058p00288q63678
32214a054728k52777M94019M46727m2506j1079M54928N30277J52500o6080n8489
32204E92792j97905k99485M6185M30774J52999m55580m65094R7998L80921K06309
32194D89914J33553J45147l16456r64522p71791K81028R10706L98280m47555o62453
32184h04149l66300r6158J21347M15572N55949L58572M4180j78644l48593l72924
32174f71148m6757M05629N07230L37789L69636M45394p3960r59660j075775j40383
32164i02005O06539J84388o78173p31922k8347M24862K56396j7847k3001Q8042
$$ plain form
32233 1015044 881137 402137 -154078 -506830 -740776 -1046791 -1269287 -1199829 -1061540 -1082879
32223 -1082879 -870046 31006 1167449 1629308 1320357 886296 509238 -191050 -1054728
32214 -1054728 -1307505 -813486 -366759 -409265 -420344 34584 564861 717361 651281 592792
32204 592792 394887 95402 141587 572361 725360 269780 -195314 -97316 283605 489914
32194 489914 623467 768614 452158 -512364 -1284155 -1003127 -92421 305859 -141696 -804149
32184 -804149 -1170449 -1266607 -1145260 -729688 -173739 184833 229013 50369 -298224 -671148
32174 -671148 -717905 -312276 194954 532743 902379 1347773 1273813 314153 -761622 -902005
32164 -902005 -295466 -111078 -789251 -1521173 -1549520 -1124658 -868262 -886109 -909110 -821068
32154h21068J50288J76513R1410j67457l54340j90559J53297K70173J15628L235
32144e72880Q9764K35257L13175L17369J93977j18568m68169n64481l22958M6024
32134h51490L26426N10249O42004N89659J83139l86503n69155j28303L65483J74751
32124H56260n07025p15953j39695L54215N7110m43377k11612N19080P30004J98391
32114F97398l06274l01183j09012o2048n8775k0187j9391J08121N25884P74436
32104A228969K55667o38030q64334l21700j5623l61914m93184J99214R33234P46165
32094F68464k7918l81118j05558K15648K36213Q3762r8491j96664k2550K99738
32084F71526K28507l86517q40535n18024J43852L08006m2495k71163j63001n5731
$$ plain form
32154 -821068 -670780 -494267 -402857 -570314 -924654 -1115213 -961916 -691743 -576115 -572880
32144 -572880 -483116 -247859 65316 382685 576662 458094 -10075 -574556 -897514 -851490
32134 -851490 -525064 -14815 627189 1216848 1399987 1013484 444329 316026 681509 856260
32124 856260 349235 -366718 -506413 -152198 -95088 -538465 -750077 -230997 499007 697398
32114 697398 391124 89941 -19071 -81119 -139894 -160081 -179472 -71351 454533 1228969
32104 1228969 1484636 846606 -17728 -339428 -355051 -716965 -1210149 -1010935 -77701 668464
32094 668464 640546 259428 153870 369518 605731 689493 591002 394338 371788 671526
32084 671526 900033 513516 -327019 -845043 -701191 -393185 -435680 -706843 -869844 -925575
32074i25575p4096K5567L00989N32065O39099O70080M73251q9823p06317r00731
32064e5491o58711k92463J18991N91502P54764K32326n66466p82837k96551J40304
32054h14632Q6133k1470K35293N01103K85412j72233k62150P0435L21048K11371
32044D40310k3473j25727j57033k30952k31099j5111K68228L05598M4746k02702
32034G2785j67011J5399J6322j71804j89089J49927N06773M22641n9329m24672
32024A71942l13553J06842M21962M16085J56694j86954m49021m78455k29857J27170
32014b57145L05580J78123q8013k17819j10542R8969J99073O4834k54791n08914
32004e90645l93239R7163N16327L97427j61123n85667n36689k41763m0353N7026
$$ plain form
32074 -925575 -999671 -974104 -673115 -141050 498049 1168129 1641380 1551557 845240 -55491
32064 -55491 -714202 -1006665 -887674 -296172 458592 690918 124452 -658385 -954936 -814632
32054 -814632 -728499 -749969 -514676 -13573 271839 99606 -162544 -92109 228939 440310
32044 440310 416837 291110 134077 -96875 -327974 -343085 -74857 230741 275487 72785
32034 72785 -94226 -78827 -62505 -234309 -423398 -273471 233302 655943 596614 171942
32024 171942 -141611 -34769 387193 803278 959972 773018 323997 -154458 -384315 -257145
32014 -257145 48435 226558 138545 -79274 -189816 -90847 108226 173060 -81731 -590645
32004 -590645 -983884 -886721 -370394 27033 -134090 -719757 -1256446 -1498209 -1538562 -1481536
31994a481536J59323J77066K0284j25226m6350J44851K08258J56932J33322P6779
31984e76297j34114l37712k55305O6569K98907K54797O646l01122m79309k98949
31974a755889K02128N75154M66110J03278o2149J1623P7698J07825K07393K55992
31964A89163J47410J41046L99302M64275q7879p35156o30580K2783K22726k12743
31954g9653l80237J50458O36717M56637N6265m452j3982l65076o46315l40452
31944e30090J81707K50596J4324Q3812M11378M14688K0684k56585k03962j20475
31934B66077j51840r6491Q0651J47628Q6020J25217K27132P5192k99945l99608
31924F0033J8812N08702M93719j3813m95579n48258k20413J59096L13729K01434
$$ plain form
31994 -1481536 -1322213 -1145147 -1124863 -1250089 -1296439 -1151588 -943330 -786398 -653076 -576297
31984 -576297 -710411 -1048123 -1303428 -1236859 -937952 -683155 -676509 -977631 -1456940 -1755889
31974 -1755889 -1553761 -978607 -512497 -409219 -471368 -459745 -382047 -274222 -66829 189163
31964 189163 336573 477619 876921 1341196 1253317 518161 -112419 -89636 133090 -79653
31954 -79653 -459890 -309432 327285 783922 840187 835735 821753 456677 -189638 -530090
31944 -530090 -348383 -97787 -83463 349 411727 826415 847099 590514 386552 266077
31934 266077 114237 17746 98397 246025 332045 457262 684394 759586 459641 60033
31924 60033 78845 587547 1081266 1067453 571874 23616 -196797 -37701 276028 477462
31914D77462k6052j86006j79438j7475J51234Q4250k85777o16163m44150J90362
31904h51753O62432M70169j64566n70329l53654K70931P23925N40656k10169q99120
31894c81478r11895l05090L17371N50744M73577K17098k21422n90514l90816L76195
31884h66230R37634O61895j20485o29340o13826l49189K119M29703O70737L93521
31874E16539k20021n80248m30764q6041J04504J48803J85261J85497L3057k60180
31864d03593m97636m18031M4186N55602O36669K54881p9954j2577J69840O8495
31854C17882j15316J00766N98880O68840j8653q88823j107457m92488L76204Q01736
31844B41571O07755J93395L541O024j47641m76975n63683k56396m2730l14004
$$ plain form
31914 477462 451410 265404 85966 68491 219725 303975 18198 -597965 -1042115 -851753
31904 -851753 -189321 280848 116282 -454047 -807701 -536770 187155 727811 517642 -381478
31894 -381478 -1293373 -1598463 -1281092 -730348 -256771 -39673 -261095 -851609 -1242425 -866230
31884 -866230 71404 733299 612814 -16526 -630352 -979541 -977422 -547719 123018 516539
31874 516539 296518 -283730 -714494 -800535 -696031 -547228 -361967 -176470 -143413 -403593
31864 -403593 -901229 -1319260 -1275074 -719472 -82803 172078 92124 79547 249387 317882
31854 317882 202566 303332 902212 1571052 1552399 663576 -443881 -936369 -560165 241571
31844 241571 849326 1042721 1046262 1052286 904645 427670 -136013 -392409 -435139 -749143
31834g49143o32911l31068L81208O21406J45890k93214j17854K48967J53373k62830
31824h36176m00831j90953n4686o0034J56189N87754O95798K89718o4749P9950
31814B01980L26979J33936k36585j93019R6588q256l86552k56688L66222M55984
31804E00589l24306q34751j85023P33855N69843l66514o50695j4855L96017K944
31794a72896m09525j73067K62231L20959K26367L11874L05680k4262k54756k6462
31784C66143K31990k0983n27747o30927k07752L28068O12764M88485l5836n76120
31774B8085n47197O5439N50052M37215R8965J448k3222k56806m51990l06794n7929
31763d62734r790K1155K15124K58146l5745k07373M2136J59424l19359p62444
$$ plain form
31834 -749143 -1382054 -1713122 -1331914 -710508 -564618 -857832 -975686 -726719 -573346 -836176
31824 -836176 -1237007 -1427960 -1482646 -1542680 -1386491 -798737 -102939 186779 122030 201980
31814 201980 528959 662895 426310 233291 329879 321623 -64929 -321617 44605 500589
31804 500589 176283 -658468 -843491 -109636 460207 93693 -557002 -571857 -175840 -172896
31794 -172896 -582421 -755488 -493257 -172298 54069 365943 671623 647361 392605 366143
31784 366143 598133 577150 49403 -581524 -789276 -461208 151556 640041 604205 28085
31774 28085 -519112 -453673 96379 533594 632559 634007 610785 353979 -98011 -404805 -462734
31763 -462734 -472524 -451369 -236245 21901 -13844 -221217 -179081 -19657 -339016 -1101460
31753a101460l82140L49166L75016k16901l83746J21063M53434J82189j30854
31744g34233q1080k5766j68376n6634M95017Q38783M49517k09015l72818l8945
31734I6450K24155J58153k2520j13813j06616j472K04297L63548K40996k22161
31724H21017p56696r17262m99410J48793M38796K76772J72065L98431M93261M5312
31714F21079m52433k49907M03163M94159k40490q72846o15683R8510L10604j57703
31704f61547n93476m02593J88464M97547K61801l2526J89664P25831P78019J03420
31694A054604n18520l35229L10511N10710P1519l79631l97126j73224r431R7399
31684B31582K57189M61904N85531L88211k70745r68880r06702k7615N63918K3951
$$ plain form
31753 -1101460 -1483600 -1134434 -759418 -976319 -1360065 -1239002 -785568 -603379 -734233
31744 -734233 -815313 -841079 -1009455 -1066089 -571072 267711 717228 508213 135395 96450
31734 96450 320605 478758 456238 342425 235809 234337 438634 802182 1043178 821017
31724 821017 64321 -852941 -1352351 -1203558 -764762 -487990 -315925 82506 575767 621079
31714 621079 168646 -81261 321902 816061 575571 -297275 -912958 -814448 -503844 -661547
31704 -661547 -1255023 -1657616 -1469152 -971605 -709804 -742330 -552666 173165 951184 1054604
31694 1054604 536084 200855 511366 1022076 1093595 713964 316838 143614 134183 231582
31684 231582 488771 950675 1536206 1924417 1653672 684792 -221910 -249525 314393 338344
31674C38344q62831o95635M70848J195872P35157j14137m34074l27880k34710
31665G0954j00792J71967K21412j79371n61823l84315J70610N00332L76835N6332
31655C42141j45801j02285Q2223J17287j41918l94765k84342k3451j01258l95057
31645a047226k63773L62530P33877L95075j43539k20532J00427L71686M30953
31636G19478L08741l7731m66660n64473k27990P0898j7516j84118l2998K33510
31626a98859J93971o0549j06391Q7480J06581k64073o90798o63558r7118M95075
31616a198239N24454P9887j23489K20891M72878P2932l86017k4665P20375N89187
31606I48194m18970q42583q627Q79685O17442k56503n40770j79216J17898K43472
$$ plain form
31674 338344 -524487 -1220122 -749274 446598 1181755 1067618 633544 305664 70954
31665 70954 -29838 142129 363541 184170 -377653 -761968 -591358 -91026 285809 342141
31655 342141 196340 94055 176278 293565 151647 -243118 -527460 -550911 -652169 -1047226
31645 -1047226 -1310999 -948469 -214592 180483 36944 -183588 -83161 288525 719478
31636 719478 1028219 990488 523828 -40645 -268635 -197737 -215253 -399371 -432369 -198859
31626 -198859 -4888 -65437 -171828 -84348 22233 -241840 -932638 -1596196 -1693314 -1198239
31616 -1198239 -673785 -593898 -717387 -496496 -23618 49314 -336703 -361368 359007 948194
31606 948194 529224 -313359 -321986 557699 1175141 918638 377868 198652 316550 560022
31596E60022M77965N09220p9673p35425n79617J00345K08711l98067p03408j91304
31586h31231M00469K99117k47977n38207l36691J36485N91486P34426M04083j22133
31576D89827l44055j79825Q040M2933P6482P9964j71111m73423k49969M76119
31566b45018Q23630K38426n99342o49635N4556N15230J99852k96252k05692K86316
31556A22071L31023k96884p33113j67455Q72269J033843Q192q78978m56983N62078
31546C96063N66588n73041j283995n98218N01083O46775L1585j73608K69392M91678
31536B74302Q9025k55811L5709N17938M65480o7914m60707m12079j29763J21865
31526A78045K15834O6191k58373m21513j66864K99391N65671N24332L09539p7707
$$ plain form
31596 560022 1037987 1547207 1467534 732109 152492 252837 461548 63481 -639927 -831231
31586 -831231 -430762 -131645 -379622 -917829 -1254520 -1118035 -526549 207877 611960 489827
31576 489827 145772 -34053 -26013 16920 93402 173366 2255 -471168 -721137 -245018
31566 -245018 578612 817038 217696 -431939 -377383 137847 337699 41447 -164245 122071
31556 122071 453094 156210 -576903 -744358 127911 1161754 1169946 290968 -166015 396063
31546 396063 962651 389610 -894385 -1492603 -991520 -344745 -313160 -486768 -217376 274302
31536 274302 363327 107516 143225 661163 1126643 1058729 598022 185943 56180 178045
31526 178045 393879 460070 201697 -219816 -386680 -87289 478382 1002714 1312253 1234546
31516A234546o30239r63208o54994L9329M01005K60281J75465M18955M80217k0687
31506G40670n62500m64621O3448K86409M6031j95052k20253k47175k94984p1849
31496i19876L90665O05473L51384L6899Q5385L41858L72059P7734k58754l83492
31486F99335l05799j91947j57137j58875p9950Q4050K04396K17187J91575J39860
31476F42695k9979k69128l44774j83269M937P1533Q3959K7975j99918l61661k8735
31465e86365N92831P09459J97020m7327L84439N27122l65670j283201q72037L01535
31455d42194N35204l17853p17273j5404O21926K77199l67582m01990j1453L18463
31445e20957O76702J006178O63299m16424j139000p56331k3192O9913j88696o602
$$ plain form
31516 1234546 604307 -358901 -1013895 -974566 -573561 -313280 -137815 281140 761357 740670
31506 740670 178170 -286451 -223003 63406 109437 -85615 -305868 -553043 -848027 -919876
31496 -919876 -529211 76262 427646 464545 549930 891788 1263847 1341581 1082827 699335
31486 699335 393536 201589 44452 -114423 -194373 -110323 94073 311260 502835 642695
31476 642695 612716 343588 -1186 -184455 -179518 -107985 -24026 3949 -195969 -557630 -586365
31465 -586365 6466 715925 912945 865618 1250057 1777179 1411509 128308 -743729 -442194
31455 -442194 93010 -224843 -942116 -957520 -335594 -58395 -425977 -827967 -839420 -520957
31445 -520957 155745 1161923 1825222 1408798 269798 -486533 -509725 -439812 -628508 -635110
31435f35110M43420M64575J25786l289O9891j6279j03310J30645L21042p0988
31425G26383p05321p91430l09792J14502K84962M40409M53640K8492m79214m46499
31415f83868p4936q8104m22900l13699K83131N10422J01391r0375M59276R79250
31405F59588O04907k29348m64255j4630K14089k24780o93101m96846Q5021K62685
31395b96670q2721k65682J14628N28136L29143k20167l57095o433K12046J22908
31385G8093K40802O59443O45513j30582q07065n44107J29190J00503o09540q99104
31375a136854k20663P24233J014395N54455p4360l34613j44050J58883J94983
31366G36409r599j03634J832L52j98370k39798n572N8094k70216m70741j27299
$$ plain form
31435 -635110 -191690 272885 398671 395382 465273 448994 345684 476329 797371 726383
31425 726383 21062 -770368 -1080160 -965658 -680696 -240287 213353 241845 -237369 -683868
31415 -683868 -758804 -846908 -1269808 -1583507 -1300376 -789954 -688563 -778938 -319662 659588
31405 659588 1264495 1035147 570892 556262 770351 545571 -147530 -644376 -559355 -296670
31395 -296670 -379391 -645073 -530445 -2309 326834 106667 -250428 -256861 -44815 78093
31385 78093 318895 978338 1623851 1493269 686204 142097 271287 371790 -237750 -1136854
31375 -1136854 -1357517 -633284 381111 935566 861206 526593 382543 541426 736409
31366 736409 726810 623176 625008 625360 426990 187192 181620 239714 -30502 -501243 -628542
31355f28542K91305J85722j63682j25643J97530K69421J28001J87145L21026R6743
31345G59026k68679j52972L46117M77962N7573k81466j65450J8805j02332l29428
31335C59156l42091j57435M6481J44451N2114j35112j08604J53514J40288m02470
31325b49708q16898m11093L52212M65063n3341k32523K48987O12231K89138k81755
31315g7687m55182j81066K54601O02128N75104O6016m42653l50880J20213J95717
31305C06311k17348m05606o5486K54876J57199j9316P9845K71030L07086K42942
31295I11533J05006j65564l29850j10058J54192o2069m16529j15016N89789N57974
31285A119408l51426q95127l95157K80461L21760K02872M52688N13647q0302n55214
$$ plain form
31355 -628542 -337237 -151515 -315197 -440840 -243310 26111 154112 341257 662283 759026
31345 759026 490347 337375 683492 1161454 1219027 937561 772111 790916 688584 359156
31335 359156 17065 -140370 -93889 50562 102676 -32436 -141040 12474 152762 -249708
31325 -249708 -1066606 -1477699 -1125487 -660424 -713765 -946288 -697301 -85070 204068 -77687
31315 -77687 -532869 -713935 -459334 142794 717898 783914 341261 -9619 110594 306311
31305 306311 88963 -316643 -382129 -127253 29946 10630 90475 361505 668591 911533
31295 911533 1016539 850975 521125 411067 565259 503190 86661 -28355 561434 1119408
31285 1119408 767982 -127145 -522302 -241841 79919 282791 735479 1249126 1168824 613610
31275F13610j88240K60253k00229r50361p10106K94014P37254L97404K72241O00974
31265A126814M58952m25868j001627n79128R4288J32966j62463o6582K85479K33932
31255I6763k60456n75444l25133K35360N87471M22060j04139m15102q1876N48293
31245A27797O82671J72790k58475j35412N0777k70533p18546n42435J43004N35927
31235b12435L91285K17061K26214J3802m84620o12000m9158N16046M11750J1885
31225D29830j3104J24988j39772m82355j46139N54642M95773l92411q55304k99211
31215g23063K65621m7593n56077k76238L86384M38238M1983J09991O02467O09038
31205H50751k4403m44022k31437M5710p1489k72148j83072O8431K46416K94688
$$ plain form
31275 613610 425370 685623 485394 -464967 -1175073 -881059 -143805 253599 525840 1126814
31265 1126814 1585766 1159898 158271 -420857 -326569 -193603 -356066 -422648 -137169 96763
31255 96763 -163693 -739137 -1064270 -828910 -241439 180621 76482 -338620 -420496 127797
31245 127797 810468 983258 724783 589371 640148 369615 -348931 -891366 -748362 -212435
31235 -212435 178850 395911 622125 635927 151307 -460693 -509851 6195 417945 429830
31225 429830 416726 541714 401942 -80413 -226552 328090 823863 431452 -423852 -723063
31215 -723063 -457442 -505035 -1061112 -1337350 -950966 -512728 -470745 -360754 241713 850751
31205 850751 826348 382326 150889 196599 125110 -147038 -330110 -261679 -15263 279425
31195B79425J05067l47835o02292j63969N99775P90859K61783k33893k43022j12194
31185C33704j55950k04156j93483l66651o26558m91872M7582M01833L22361J82548
31175g50642J50621k8716k36778L4808O13077O12298j24534o21817k98246J95799
31165d54130K45940K22120M14564K15211o29534j045804j76147R73657Q55915
31156F21792k44701o65771Q2071P27839L05187n22354o29129L4368O17184N37785
31146H64271L1484k46607L9285N02422M57581j77704p23126o64077k91523q9678
31136b97672m327J84925K61546j8114l02849j28467K64495K83380o9818k87937
31126a14838k24194j81678k33730j21787J69097L14611J80329j7056j01047j03576
$$ plain form
31195 279425 384492 36657 -565635 -729604 -129829 661030 922813 688920 445898 333704
31185 333704 177754 -26402 -219885 -586536 -1213094 -1704966 -1657384 -1255551 -933190 -750642
31175 -750642 -600021 -628737 -865515 -830707 -217630 394668 270134 -351683 -649929 -454130
31165 -454130 -208190 13930 428494 643705 14171 -1031633 -1207780 -234123 621792
31156 621792 377091 -288680 -206609 521230 826417 304063 -325066 -290698 326486 864271
31146 864271 895755 649148 688433 1190855 1648436 1470732 747606 83529 -207994 -297672
31136 -297672 -301999 -117074 144472 126358 -176491 -304958 -40463 242917 173099 -114838
31126 -114838 -339032 -520710 -754440 -876227 -707130 -392519 -212190 -229246 -330293 -433869
31116d33869o4155N021J8516l4678K1864K57603M38506L79739K00991l0891m85631
31105B73016j027728j011889j86616O65878O97061K22797J77890O03569O17915
31096A031893j08620p67994n92903P4496L35367l8653l87859j02353N36765O69602
31086F49741K1059n76726k32760O49526P95403j14892r36647p44548j11113k2632
31076f23589l18050j55473M90263Q18965M55048j79582o12779p09175m71348j21126
31066a426846j47896o07061o96444J83026J283996J369172M68505k51395k43066
31057f8009p9413j57684q5250L20467M83514N1167m09013k82030J61652K88470
31047B23871P2315l0743J33242K67265J25001j86068l59782k04473J29305K42251
$$ plain form
31116 -433869 -498024 -493003 -474487 -509165 -487301 -229698 208808 588547 789538 758647 273016
31105 273016 -754712 -1766601 -1953217 -1287339 -590278 -367481 -189591 413978 1031893
31096 1031893 923273 155279 -437624 -363128 -27761 -66414 -454273 -556626 -19861 649741
31086 649741 670800 94074 -138686 510840 1306243 1191351 254704 -489844 -600957 -623589
31076 -623589 -941639 -1097112 -606849 212116 667164 487582 -125197 -834372 -1305720 -1426846
31066 -1426846 -1574742 -2181803 -2878247 -2695221 -1411225 -42053 426452 175057 -68009
31057 -68009 -147422 -305106 -390356 -69889 413625 464792 55779 -226251 -64599 223871
31047 223871 296186 265443 398685 665950 790951 604883 245101 40628 169933 412184
31037D12184l5346l55981l13382n7135n1853l01704l10439J23116N41389M47319
31027I8168m9304m08968k86298J61896M79661L65864l3919l41996m33403m72520
31017i20819m57480j54900L43458M99834R6032l53199l49826r3950L5069J36041
31007a219740L45362L02585j92691m91039L7192Q19708P72454n4636n79180l66535
30997f26520j18825l37408n30605j45120N15503P83295N08811O1232j93891j54620
30987b38148J7888L9135j51705k38556K5425L89796M55463K32922r505j69681
30977C53034j94044P6232M74503M04965k48777o64137k55540K90938P5991n07105
30967a93940m50958J64190M32018K47174K81059N08645K18487m96045o99772k19077
$$ plain form
31037 412184 376838 20857 -292525 -349660 -401513 -703217 -1013656 -890540 -349151 98168
31027 98168 48864 -360104 -646402 -484506 -4845 361019 327100 -14896 -448299 -920819
31017 -920819 -1378299 -1533199 -1189741 -689907 -593875 -947074 -1296900 -1390850 -1355781 -1219740
31007 -1219740 -874378 -571793 -764484 -1255523 -1218331 -398623 373831 319195 -259985 -626520
30997 -626520 -745345 -1082753 -1613358 -1758478 -1242975 -459680 49131 110363 -83528 -238148
30987 -238148 -220260 -181125 -332830 -571386 -545961 -156165 299298 532220 522715 353034
30977 353034 158990 235222 709725 1114690 865913 201776 -53764 237174 313165 -193940
30967 -193940 -644898 -480708 -48690 198484 479543 988188 1206675 710630 10858 -208219
30957b08219R9613p2627j40147N2600q8255m93191k17460Q15298J321258O01607
30947A670477l80194o15567m22538l80677k17851K68422M14407j06340m15859
30938a85720R7755N38002o439p43390m13057N56082P09342j06558o39048k56866
30928d49897L38318M52867K45020O9752o2205j81365k07143j75548j19208J26052
30918C6643N03235M76685j85820p98540o79639k47695l00246o10984l39320M11170
30908a734511O71220K50913O7188N42341Q30918K21850o17014n92967J92044O36756
30898D68738K41992k86262j82418K47359J20625o44361j089851n49783L59056
30889a314905O23797L00251K61848O48637O13924j65332p84651m84598J70822
$$ plain form
30957 -208219 -108606 -181233 -321380 -268780 -357035 -850226 -1067686 -252388 1068870 1670477
30947 1670477 1290283 674716 252178 -128499 -346350 -77928 336479 230139 -185720
30938 -185720 -87965 450037 443598 -299792 -712849 -156767 552575 446017 -193031 -449897
30928 -449897 -111579 341288 586308 656060 593855 412490 205347 29799 -89409 36643
30918 36643 539878 1016563 830743 32203 -647436 -895131 -1195377 -1806361 -2145681 -1734511
30908 -1734511 -1063291 -812378 -745190 -202849 628069 849919 232905 -360062 -168018 468738
30898 468738 710730 424468 242050 489409 610034 -34327 -1124178 -1673961 -1314905
30889 -1314905 -691108 -390857 -129009 519628 1133552 968220 183569 -301029 -130207
30880a30207K61615o2314m4712K93759K55598k59823n35550j37801M97702P22652
30870H60919M04018j23063m58512m09204r9397J51280J44199q4050m13883o35853
30860f63546m07664K74777O65194Q4358q39492p31810N10685J396965R93329J75407
30850A458203M838J21589j85392m83000j33070K52105j46917o36234o1470R71612
30840A162264Q20342m88371j214318o42280L7469o9385l19898j12165J3341k75027
30830a088028j78899P17661J317959O35605m95044o63432m5151R2471m54374o24473
30820g85705O3992P89365P70650K93286j830q1142k81403n97002o85786l73485
30810h89060J68286O24731P19913L46904k56327n63801k67930K67506L36719k26943
$$ plain form
30880 -130207 131408 69094 24382 318141 573739 313916 -221634 -359435 138267 860919
30870 860919 1264937 1141874 683362 274158 174761 326041 470240 386190 -27693 -663546
30860 -663546 -1071210 -796433 -131239 -46881 -886373 -1618183 -1107498 289467 1282796 1458203
30850 1458203 1463041 1584630 1399238 916238 783168 1035273 888356 252122 190652 1162264
30840 1162264 1982606 1494235 279917 -362363 -324894 -394279 -714177 -826342 -813001 -1088028
30830 -1088028 -1266927 -549266 768693 1404298 909254 245822 200671 293142 -161232 -785705
30820 -785705 -721713 67652 838302 1131588 1129758 1048616 767213 170211 -515575 -889060
30810 -889060 -720774 -96043 623870 970774 714447 150646 -117284 150222 486941 259998
30800B59998p76853o60305k1090N12960O47955M68856j8772o81691q21095P2858
30790a017179J135664Q97625m71096j043026O4805J201319O53152p06688q91544
30781a76968N5547M08461k43433n31843J03362M97100m1741n17951q9507M90249
30771d6724K96827k30653k75009n1019j08432j59896K53594O86967M98835J4388
30761H78878q3002K6920k48475p03058o48701j35866J45021j8555k17409k05607
30751a209854n4788K31307N21916L23284m56522r07301k40136Q33947R46685P8520
30741F7058m76041j13639L61831K38251q5784k7671K38117L15250K58529J88129
30731I64030n8595l91013k76285L61770P06551J46069p39307r56757m27992J35133
$$ plain form
30800 259998 -516855 -1177160 -1198250 -685290 -37335 431521 412749 -268942 -1090037 -1017179
30790 -1017179 118485 1016110 545014 -498012 -433207 768112 1421264 714576 -176968
30781 -176968 -121421 287040 43607 -488236 -384874 112226 70485 -447466 -536973 -46724
30771 -46724 250103 19450 -255559 -306578 -415010 -574906 -321312 365655 864490 878878
30761 878878 795876 822796 574321 -128737 -777438 -913304 -768283 -786838 -1004247 -1209854
30751 -1209854 -1264642 -1033335 -511419 -188135 -644657 -1551958 -1792094 -958147 -11462 67058
30741 67058 -408983 -522622 -160791 77460 -8324 -35995 202122 517372 775901 964030
30731 964030 905435 514422 238137 599907 1306458 1452527 713220 -243537 -671529 -536396
30721e36396L11077K27092J7281k62932l42211k4641L21279J95589j98999k23377
30711e16238J40156K50184p4487k02423K20819N81441K53985l29741l01295K79783
30701C02184M93098l9590n82410l68980L27544O42491K95904j72918k44640l8132
30691F14551J8089j85925l70955k95647l4459J72976K01000J07932M219q1168
30681A50613k07672m00690n17527l19281J98974O08201M22493k45389o66956l36667
30671a313901L93470P90314O44227L21539P7581j69030l98159l93326k17000k39636
30661e03921m78009m38978P8629N54172M96719J21635j47711l15698m35844j80742
30651a249748N16644R26571M67519k63887l51649l7532k18755p69822o90355J22570
$$ plain form
30721 -536396 -225319 1773 19054 -243878 -586089 -610730 -289451 -93862 -292861 -516238
30711 -516238 -376082 -125898 -200385 -402808 -181989 399452 653437 323696 22401 302184
30701 302184 795282 755692 173282 -195698 131846 774337 1070241 897323 652683 614551
30691 614551 632640 446715 75760 -219887 -254346 -81370 119630 227562 231781 150613
30681 150613 -57059 -457749 -975276 -1294557 -1095583 -487382 -64889 -310278 -977234 -1313901
30671 -1313901 -920431 -130117 514110 835649 913230 744200 346041 -47285 -264285 -503921
30661 -503921 -981930 -1420908 -1342279 -788107 -291388 -169753 -317464 -633162 -1069006 -1249748
30651 -1249748 -733104 193467 660986 397099 45450 7918 -210837 -980659 -1671014 -1548444
30641a548444O49661M81270L63626O29523N18730k81776p75572k29191N65442
30632C73269N98455J65551J5699l2498m04065n81452Q767O13439J53828q49543
30622F1450q98520J40353Q32810L67819m41958o08243k25282R6673J20557o3193
30612f17534k84021k80486J3322K01147R629j19560K38704N49653J01021o10242
30602g98367m84454L73278P65770K89893k38309l12720k99224l01810Q8892O25439
30592b91612M53788k77891l79365L25590N34376k54922p21769J2138P75904L45991
30582E22228m56938k80117M02729K54781n32068o98190j54761R7251r3202K1934
30572i16353L95156K15504l78067l45369L41213N28725m3216j90193O03490J114557
$$ plain form
30641 -1548444 -898783 -417513 -53887 575636 1094366 812590 37018 -192173 373269
30632 373269 971724 1137275 1152974 1120476 716411 134959 143726 757165 910993 61450
30622 61450 -837070 -696717 136093 503912 61954 -546289 -771571 -674898 -554341 -617534
30612 -617534 -901555 -1182041 -1168719 -967572 -957943 -1077503 -838799 -289146 -188125 -798367
30602 -798367 -1282821 -909543 -143773 146120 -92189 -404909 -704133 -1005943 -917051 -291612
30592 -291612 162176 -115715 -495080 -169490 364886 109964 -611805 -599667 176237 522228
30582 522228 65290 -214827 187902 442683 -89385 -787575 -942336 -845085 -938287 -916353
30572 -916353 -521197 -305693 -683760 -1029129 -687916 -159191 -202407 -392600 210890 1325447
30562A325447L26613q88804j133991n05053p8015j21104m3400K98549M23913K44572
30552a51273K45881N52023O30182J63393m09156n41232l20273j97697k69082k34267
30542e31501J1714J42916j14671n25078o02790k20391K81180N49538N48811M25353
30532c4919K84016J47376l8259l32438n58608l18561L83606P77566K33509o13772
30522g0484n47165L68945P23453o2913p37014k09110O31503L65158n96915o98188
30512h32730K02759O92925J73674l37571r9830K23762m1423m04679k46021O7396
30502f01738o57j26470J41676L78925J1760n39164m74923M3995K06189p5180j28623
30491a164210K28479M11386J43123q2988J15098L85624K62943j22820l32477k49662
$$ plain form
30562 1325447 1652060 763256 -370735 -875788 -953803 -1074907 -1118307 -819758 -395845 -151273
30552 -151273 94608 646631 1276813 1440206 1031050 489818 169545 -28152 -297234 -531501
30542 -531501 -519787 -376871 -491542 -1016620 -1619410 -1839801 -1558621 -1009083 -460272 -34919
30532 -34919 249097 396473 358214 25776 -532832 -851393 -467787 309779 543288 -70484
30522 -70484 -617649 -248704 474749 411836 -325178 -534288 97215 462373 -134542 -832730
30512 -832730 -629971 62954 236628 -100943 -200773 22989 -18434 -423113 -669134 -601738
30502 -601738 -602395 -728865 -587189 -208264 -196504 -735668 -1210591 -1166596 -960407 -1035587 -1164210
30491 -1164210 -935731 -524345 -381222 -464210 -349112 36512 299455 176635 -155842 -405504
30481d05504r0356j6063m005L0122J34519K49517K05091n7439k95060k35628j6792
30470e01598l3030l01569l46382J18696P08340Q28499M20571l0336j33714M415
30460G33892J4171k66801o03445o14559k23209J93919K33858q96m1570K43927
30450c30713M26798J88138j35402o1316K29595J32227l85389o20933j55098N02703
30440b09390O40224K96477K0549k4699j34271l47476k91395J34795M45655K19093
30430G49562l00780n57882l93999j03584M5307L8658m2163j20142p8173J47416
30420f15780L91306L62900J0325l36769l12299J6742J61896j90220o76783o08286
30410a796968J20874P91979P62731K84003J3573Q895j67740m77373l50043K41445
$$ plain form
30481 -405504 -495860 -511923 -515928 -485806 -351287 -101770 103321 45882 -249178 -484806 -501598
30470 -501598 -534628 -836197 -1182579 -1063883 -355543 472956 893527 863191 729477 733892
30460 733892 748063 481262 -122183 -736742 -959951 -766032 -532174 -533070 -574640 -330713
30450 -330713 96085 284223 148821 87505 317100 449327 63938 -556995 -712093 -209390
30440 -209390 430834 727311 747860 723161 588890 241414 -49981 84814 530469 749562
30430 749562 448782 -109100 -503099 -606683 -561376 -522718 -564881 -685023 -763196 -615780
30420 -615780 -224474 138426 148751 -188018 -500317 -483575 -321679 -511899 -1188682 -1796968
30410 -1796968 -1676094 -884115 -121384 162619 176192 185087 17347 -460026 -810069 -568624
30400e68624M73682j21717q25851p13089M9486N73485N53764M45045N16175M85354
30390H67710J37515k90943m62876k86224R5756L35124M9133o33623r24143l12035
30380a424606N76042P38215K23992n0979J69621J86350k57941m16065J17816N43483
30370D05928J28520n02784l38823L80577N95192J13538k84548k77548l39439n53357
30360f72744k89370N24430Q89610J86183p10756o21154K29063O43498K48140j81292
30350B45608j18003J8338j85291l78985j55228J55859M2845k71947j78892K84462
30340e41234M64381J29473k02099j17141J19814J30464M0782J34984K93643K58306
30330G11373J75184L35628N32269K62733m22966q57446o78913k78995p8779J01759
$$ plain form
30400 -568624 -94942 -216659 -1042510 -1755599 -1706113 -1132628 -578864 -133819 382356 867710
30390 867710 1005225 714282 251406 -34818 60938 396062 445195 -188428 -1112571 -1424606
30380 -1424606 -848564 -110349 113643 62664 232285 418635 160694 -255371 -137555 405928
30370 405928 534448 31664 -307159 73418 668610 782148 497600 220052 -119387 -672744
30360 -672744 -962114 -437684 451926 638109 -72647 -693801 -464738 178760 426900 245608
30350 245608 127605 145943 -39348 -418333 -573561 -417702 -374857 -646804 -825696 -541234
30340 -541234 -76853 52620 -149479 -266620 -146806 -16342 24440 159424 453067 711373
30330 711373 886557 1222185 1754454 2017187 1594221 736775 57862 -221133 -299912 -198153
30320a98153N08232P42906K64281n98225q73948k78069L73899L49028k7821m6900
30310B15230K55312L07332M1381n9516J06088P2494k87767m27961n1589K90921
30300D61925M0801m70093n64874k48107j8695K0802J30516K24261k449l12511
30290g38424j28972M36952N90680R3358l07089l4605M50509M13867j23887o24666
30280B7723p99851o33126q8735O52631J018416O47056p4894n03331m89643k68778
30270e12532L6776L42511L79221M9153k76481k60554p6503L6099K37726N76646
30260E32062N33788j82405q28216m91227N22041J059572O83430l3707n73287q50493
30250C71558o71425Q0752P06864L08271o85194q02631L04547J194708P02228m58063
$$ plain form
30320 -198153 310079 1052985 1317266 719041 -154907 -432976 -59077 289951 262130 215230
30310 215230 470542 777874 819255 759739 865827 938321 650554 222593 171004 461925
30300 461925 502726 32633 -532241 -780348 -799043 -778241 -647725 -423464 -425913 -738424
30290 -738424 -867396 -430444 160236 253594 -53495 -88100 362409 776276 652389 27723
30280 27723 -772128 -1405254 -1493989 -841358 177058 824114 749220 245889 -243754 -512532
30270 -512532 -475756 -133245 245976 295129 18648 -241906 -318409 -282310 -44584 532062
30260 532062 1065850 883445 55229 -435998 86043 1145615 1829045 1795338 1222051 371558
30250 371558 -299867 -219115 487749 796020 110826 -691805 -387258 807450 1509678 1051615
30240A051615r28830n74213j71512r269J81593L95739M04475L21522L37100K06968
30230A215188k80568o85786m97244J3583K42154J86055J77182J08600j91550k47909
30220C9705L36859P99920J34083j071342j148569J30853J041081M10405p47889
30211g4894r17785j72396M59469P01878Q49555O28407l27736j245171r21539L48569
30201f71643R17529J05332q47486o32076L68854Q64229M31156k50399m59892p3295
30191b47691N42901P77238K40666o08048p43410P3531P71367M14122m04472m78725
30181C37479J56713L99945q3188m24016r7969K72089Q7003k85872l44879l42972
30171c25667o04498o92174j29023N78137N66762l5815k88935J63583O82915O41471
$$ plain form
30240 1051615 122785 -451428 -622940 -632209 -450616 -54877 349598 671120 1008220 1215188
30230 1215188 934620 248834 -248410 -234827 7327 193382 370564 479164 287614 39705
30220 39705 376564 1176484 1310567 239225 -909344 -778491 262590 672995 -74894
30211 -74894 -992679 -1165075 -705606 -3728 845827 1474234 1146498 -98673 -1020212 -671643
30201 -671643 245886 351218 -496268 -1128344 -759490 104739 535895 285496 -174396 -247691
30191 -247691 295210 1072448 1313114 705066 -38344 35187 806554 1220676 816204 337479
30181 337479 494192 894137 810949 386933 288964 561053 648056 362184 17305 -325667
30171 -325667 -930165 -1622339 -1751362 -1173225 -606463 -642278 -931213 -767630 -84715 556756
30161E56756J62329k45947k83419q764K37379Q9755l58783n26478j50343K13497
30151c14018K0025l21493q3499M95685N00078j75407o16111k94503K58809M58666
30141g1768M47551M75095L08230k08265o48367o10032l20810j68250j03860M5263
30131h55213J53539J28287J77521L03312P0819n83879q83744k54337O25032O50559
30121d68104j01837m88582M6242P86227Q76838M07866L205j44707l31995o49722
30111f4569p31061l26330J71285J49982k84499k97712M28572R68478L86551o75623
30101b74926p28608K98033Q39011J29075n58500j5288Q46135M55294p92653j111994
30091i14421j52634N55524J17780m57082q4474O96824P40644M2522m68461l07564
$$ plain form
30161 556756 719085 473138 189719 180955 418334 508089 149306 -377172 -527515 -314018
30151 -314018 -293993 -615486 -698985 -203300 296778 121371 -494740 -789243 -530434 -71768
30141 -71768 375783 850878 1159108 950843 302476 -307556 -628366 -796616 -900476 -855213
30131 -855213 -701674 -573387 -395866 -92554 -21735 -605614 -1489358 -1743695 -1118663 -468104
30121 -468104 -569941 -1058523 -1012281 -226054 650784 1058650 1061855 917148 585153 -64569
30111 -64569 -795630 -1121960 -950675 -800693 -1085192 -1382904 -954332 14146 400697 -274926
30101 -274926 -1003534 -705501 133510 262585 -295915 -311203 534932 990226 197573 -914421
30091 -914421 -1067055 -511531 -393751 -850833 -935307 -238483 502161 544683 76222 -231342
30081b31342J92232N27353M50170L2110k98073j23783K67189P9503p43727j120580
30071i68948k66168J043047J408677O26462k65762n25849m03089l03646j45259
30062A99465J64950K86059o8639n84048o98521l06810K02444M67829M36427K13735
30052C12891q6630l19088l45096j93066o0954o0194m3418J81826N16989O27903
30042E31163L64406m4803k77565k24759M7126L83166M59986l4646q41332j090719
30032g27977l15181P34903Q97678J21284n16901l53122Q5171J14560p7674L397
30022c3862J83842m1555n19106n51579N1024O70641P18329K97967r7420k01889
30012D76392j32957j30286k46786k58696M1936M36807M27456n1005m03281j68912
$$ plain form
30081 -231342 -39110 488243 938413 970523 672450 548667 815856 895359 151632 -968948
30071 -968948 -1235116 -192069 1216608 1843070 1577308 1051459 648370 344724 199465
30062 199465 364415 650474 581835 -2213 -700734 -1007544 -805100 -337271 99156 312891
30052 312891 226261 -92827 -437923 -630989 -691943 -752137 -795555 -613729 -96740 531163
30042 531163 895569 850766 573201 348442 395568 778734 1238720 1204074 362742 -727977
30032 -727977 -1043158 -308255 589423 710707 193806 -159316 -74145 40415 -37259 -33862
30022 -33862 149980 108425 -410681 -962260 -911236 -240595 477734 775701 678281 476392
30012 476392 343435 213149 -33637 -292333 -250397 186410 613866 562861 159580 -9332
30002i332K88755L20181o5324l22058k40617j11887j12311j10057n7392k4730
29992d44772J11289M25496M80156j42704q57122n68464O16754J200311L50951
29983A171895q01212p52438K68415Q30968M28804j17473k05381j96086m37265
29974A90227n79956l01897N3193N7295j23224r8338R9480J71263O3467m6093o7266
29963e81849k5964M3309N0472q1850j79442M0201M43287M95573L2134m09359l47092
29952e20580l9191O2k07647k99804k51631k73455k39619J34103O27284O95950
29942c74528L54369K04100M17920L83398k62556q47850n28413M07538Q08012J90680
29932G52670o45614p51727k35435J01341K546l38L94439O60954K70898l48148
$$ plain form
30002 -9332 279423 599604 534280 212222 -28395 -140282 -252593 -362650 -420042 -444772
29992 -444772 -333483 92013 572169 429465 -427657 -996121 -379367 820944 1171895
29983 1171895 370683 -381755 -113340 717628 1146432 1028959 823578 627492 190227
29974 190227 -389729 -691626 -638433 -581138 -704362 -802700 -703220 -531957 -468490 -514583 -581849
29963 -581849 -607813 -564504 -514032 -595882 -775324 -735123 -291836 203737 235871 -173488 -520580
29952 -520580 -559771 -559709 -767356 -1067160 -1318791 -1592246 -1831865 -1697762 -1070478 -374528
29942 -374528 -20159 183941 601861 985259 722703 -125147 -653560 -246022 561990 752670
29932 752670 107056 -644671 -880106 -778765 -776219 -776557 -382118 278836 549734 201586
29922B01586l39896K66704N25646l1359p10792p24553k73171q80P6520L43758
29912f66437O48413M72788o2250k39672J09832L19018j0397l55840j31720M07661
29902D91396O19457L81840M4026k13247m61886o56400o25844l70459p2253J14584
29892g48786J04679j09148l05983j40197L70489P08633M80955n1712l49695k65016
29882c05781l0196J83034L24200K71072k0183k70369j48775K55205N25356M31417
29872A214980J05458k08585l52188k93424j57771r6236k7172K19035M12066P5754
29862H91917o19273p62009j3489O57483L38511l44550k04535M92985L96760o29274
29852B04526j129392l49182N96172N87039J68083K80925M95317q2333r31942p59529
$$ plain form
29922 201586 -138310 128394 654040 622681 -88111 -812664 -1085835 -1086715 -1010195 -666437
29912 -666437 -18024 454764 392514 152842 262674 581692 571295 215455 83735 491396
29902 491396 1110853 1492693 1536719 1323472 861586 205186 -420658 -791117 -863370 -748786
29892 -748786 -644107 -753255 -1059238 -1199435 -828946 -120313 360642 308930 -40765 -305781
29882 -305781 -335977 -152943 171257 442329 422146 151777 3002 258207 783563 1214980
29872 1214980 1320438 1111853 759665 466241 308470 212234 185062 404097 816163 891917
29862 891917 272644 -489365 -502854 154629 493140 148590 -55945 437040 833800 204526
29852 204526 -924866 -1274048 -677876 -90837 77246 358171 853488 771155 -160787 -920316
29842i20316L26661Q58157K46703m67124l80039P6579J98957J21657J97163J93440
29832D51838j40831m20706k47991R8388K26182K70188L25667m5761r04856j231278
29822a619160k51247J036014R81357k85120r76716k93238N43975L82805j46611
$$ plain form
29842 -920316 -593655 264502 511205 44081 -335958 -259379 -60422 61235 258398 451838
29832 451838 311007 -109699 -357690 -259302 -33120 237068 562735 516974 -387882 -1619160
29822 -1619160 -1870407 -834393 146964 -138156 -1114872 -1408110 -864135 -481330 -627941
$$ [...]
##END NTUPLES=NMR SPECTRUM
##END=
