##TITLE=31Pdec_LY-16.Dix.1B
 CD3CN, 24 sc
 1.06.2021
##JCAMPDX= 6.0         $$ Bruker NMR JCAMP-DX V2.0
##DATA TYPE= NMR SPECTRUM
##DATA CLASS= NTUPLES
##ORIGIN= UXNMR, Bruker Analytische Messtechnik GmbH
##OWNER= root
$$ XWIN-NMR		Version 3.5
$$ Tue Jun  1 10:42:57 2021 Russian Standard Time (UT+4h)  she@DPX200
##.OBSERVE FREQUENCY= 81.013821
##.OBSERVE NUCLEUS= ^31P
##.ACQUISITION MODE= SIMULTANEOUS
##.ACQUISITION SCHEME= undefined
##.AVERAGES= 24
##.DIGITISER RES= 16
##SPECTROMETER/DATA SYSTEM= spect
##.PULSE SEQUENCE= zgpg30
##.SOLVENT NAME= CD3CN
##.SHIFT REFERENCE= (INTERNAL, CD3CN, 0, 248.564)
##AUDIT TRAIL= $$ (NUMBER, WHEN, WHO, WHERE, WHAT)
$$ ##TITLE= Audit trail, XWIN-NMR		Version 3.5
$$ ##JCAMPDX= 5.01
$$ ##ORIGIN= Bruker BioSpin GmbH
$$ ##OWNER= she
$$ F:/spectra/data/she/nmr/P31/1/pdata/1/auditp.txt
$$ ##AUDIT TRAIL=  $$ (NUMBER, WHEN, WHO, WHERE, WHAT)
(   1,<2021-06-01 10:39:40.76 +0400>,<she>,<DPX200>,
      <created by zg, POWCHK disabled, PULCHK disabled
       configuration hash MD5:
       00 E9 B6 7A A2 85 ED C7 34 08 36 98 17 FE 4E 26
       data hash MD5: 32K
       47 9F 72 C4 02 67 11 A6 66 C4 39 3F 17 F2 78 44>)
(   2,<2021-06-01 10:41:18.18 +0400>,<she>,<DPX200>,
      <Start of raw data processing
       efp BC_mod = 2 LB = 1 FT_mod = 6 PKNL = 1 PHC0 = -5965.812 PHC1 = 272.2726 SI = 64K 
       data hash MD5: 64K
       31 1A 77 C2 1F EE 9C 3F EF 91 D2 50 85 C6 0D 61>)
(   3,<2021-06-01 10:41:58.20 +0400>,<she>,<DPX200>,
      <pk PHC0 = -119.0764 PHC1 = 218.6 
       data hash MD5: 64K
       E3 4E C6 F9 BC A8 05 8A EF 2B F2 C7 0C 48 6E 3A>)
(   4,<2021-06-01 10:42:02.09 +0400>,<she>,<DPX200>,
      <abs ABSG = 5 
       data hash MD5: 64K
       10 5B 3F BE 27 C2 F8 95 A1 F9 AE C9 BC D0 7F D2>)
(   5,<2021-06-01 10:42:14.39 +0400>,<she>,<DPX200>,
      <abs ABSG = 5 
       data hash MD5: 64K
       AB 21 D3 64 A5 0A D8 50 F5 8B 76 4A C3 03 D8 E9>)
$$ ##END=
$$ 
$$ hash MD5
$$ F1 59 9F 5F C8 31 59 C8 D2 8C D7 3E 67 5F BE A7
##$RELAX= 
##$RELAX= 
##$RELAX= 
##$RELAX= 
##$RELAX= 
##$RELAX= 
##$RELAX= 
##$RELAX= 
$$ Bruker specific parameters
$$ --------------------------
##$DU= <F:/spectra>
##$EXPNO= 1
##$NAME= <P31>
##$PROCNO= 1
##$TYPE= <nmr>
##$USER= <she>
##$AMP= (0..31)
100 100 100 100 100 100 100 100 100 100 100 100 100 100 100 100 100 100 
100 100 100 100 100 100 100 100 100 100 100 100 100 100 
##$AQSEQ= 0
##$AQ_mod= 1
##$AUNM= <au_zg>
##$AUTOPOS= <>
##$BF1= 81.014009
##$BF2= 200.13
##$BF3= 200.13
##$BF4= 200.13
##$BF5= 200.13
##$BF6= 200.13
##$BF7= 200.13
##$BF8= 200.13
##$BYTORDA= 1
##$CFDGTYP= 0
##$CFRGTYP= 5
##$CHEMSTR= <none>
##$CNST= (0..31)
1 1 145 1 1 1 1 1 1 1 1 1 1 1 1 1 1 1 1 1 1 1 1 1 1 1 1 1 1 1 1 1 
##$CPDPRG= <waltz16>
##$CPDPRG1= <>
##$CPDPRG2= <waltz16>
##$CPDPRG3= <>
##$CPDPRG4= <mlev>
##$CPDPRG5= <mlev>
##$CPDPRG6= <mlev>
##$CPDPRG7= <mlev>
##$CPDPRG8= <mlev>
##$CPDPRGB= <>
##$CPDPRGT= <>
##$D= (0..31)
0 1 0 0 0 0 0 0 0 0 0 0.03 2e-05 3e-06 0 0 0 0 0 0 0 0 0 0 0 0 0 0 0 0 
0 0 
$$ [...]
##$SUBNAM3= <"">
##$SUBNAM4= <"">
##$SUBNAM5= <"">
##$SUBNAM6= <"">
##$SUBNAM7= <"">
##$SUBNAM8= <"">
##$SUBNAM9= <"">
##$SW= 501.771253377433
##$SWIBOX= (0..15)
0 1 3 0 0 0 0 0 0 0 0 0 0 0 0 0 
##$SW_h= 40650.406504065
##$TD= 32768
##$TD0= 1
##$TE= 0
##$TE2= 300
##$TE3= 300
##$TEG= 300
##$TL= (0..7)
0 120 53 12 22 120 120 120 
##$TP= (0..7)
150 150 150 150 150 150 150 150 
##$TP07= 0
##$TPNAME0= <>
##$TPNAME1= <>
##$TPNAME2= <>
##$TPNAME3= <>
##$TPNAME4= <>
##$TPNAME5= <>
##$TPNAME6= <>
##$TPNAME7= <>
##$TPOAL= (0..7)
0.5 0.5 0.5 0.5 0.5 0.5 0.5 0.5 
##$TPOFFS= (0..7)
0 0 0 0 0 0 0 0 
##$TUNHIN= 0
##$TUNHOUT= 0
##$TUNXOUT= 0
##$USERA1= <user>
##$USERA2= <user>
##$USERA3= <user>
##$USERA4= <user>
##$USERA5= <user>
##$V9= 5
##$VALIST= <valist>
##$VCLIST= <CCCCCCCCCCCCCCC>
##$VD= 0
##$VDLIST= <DDDDDDDDDDDDDDD>
##$VPLIST= <PPPPPPPPPPPPPPP>
##$VTLIST= <TTTTTTTTTTTTTTT>
##$WBST= 1024
##$WBSW= 4
##$XGAIN= (0..3)
0 0 0 0 
##$XL= 0
##$YL= 0
##$YMAX_a= 3626
##$YMIN_a= -5891
##$ZGOPTNS= <>
##$ZL1= 120
##$ZL2= 120
##$ZL3= 120
##$ZL4= 120
##$ABSF1= 248.5645
##$ABSF2= -253.2056
##$ABSG= 5
##$ABSL= 3
##$ALPHA= 0
##$AQORDER= 0
##$ASSFAC= 0
##$ASSFACI= 0
##$ASSFACX= 0
##$ASSWID= 0
##$AUNMP= <proc_1d>
##$AZFE= 0.1
##$AZFW= 0.5
##$BCFW= 0
##$BC_mod= 2
##$BYTORDP= 0
##$COROFFS= 0
##$CY= -3
##$DATMOD= 1
##$DC= 0
##$DFILT= <>
##$DTYPP= 0
##$F1P= 0
##$F2P= 0
##$FCOR= 1
##$FTSIZE= 65536
##$FT_mod= 6
##$GAMMA= 0
##$GB= 0
##$INTBC= 1
##$INTSCL= 5.30512e-09
##$ISEN= 30
##$LB= 1
##$LEV0= 0
##$LPBIN= 0
##$MAXI= 10000
##$MC2= 0
##$MEAN= 0
##$ME_mod= 0
##$MI= 50
##$NCOEF= 0
##$NC_proc= -5
##$NLEV= 6
##$NOISF1= 182.463
##$NOISF2= 159.3651
##$NSP= 0
##$NTH_PI= 0
##$NZP= 0
##$OFFSET= 248.5645
##$PC= 4
##$PHC0= -6084.888
##$PHC1= 490.8726
##$PH_mod= 1
##$PKNL= yes
##$PPARMOD= 0
##$PSCAL= 0
##$PSIGN= 0
##$REVERSE= no
##$SF= 81.014009
##$SI= 65536
##$SIGF1= 159.3651
##$SIGF2= -187.1042
##$SINO= 113.3802
##$SIOLD= 16384
##$SREGLST= <1H.CDCl3>
##$SSB= 0
##$STSI= 65536
##$STSR= 0
##$SW_p= 40650.406504065
##$SYMM= 0
##$S_DEV= 0
##$TDeff= 32768
##$TDoff= 0
##$TI= <>
##$TILT= no
##$TM1= 0
##$TM2= 0
##$TOPLEV= 0
##$USERP1= <user>
##$USERP2= <user>
##$USERP3= <user>
##$USERP4= <user>
##$USERP5= <user>
##$WDW= 1
##$XDIM= 65536
##$YMAX_p= 516113598
##$YMIN_p= -110497425
$$ End of Bruker specific parameters
$$ ---------------------------------
##NTUPLES= NMR SPECTRUM
##VAR_NAME=  FREQUENCY,     SPECTRUM/REAL,   SPECTRUM/IMAG
##SYMBOL=    X,             R,               I
##VAR_TYPE=  INDEPENDENT,   DEPENDENT,       DEPENDENT
##VAR_FORM=  AFFN,          ASDF,            ASDF
##VAR_DIM=   65536,         65536,           65536
##UNITS=     HZ,            ARBITRARY UNITS, ARBITRARY UNITS
##FACTOR=    0.620285442955139, 1,           1
##FIRST=     20137.2065510759, 0,            0
##LAST=      -20513.1999529892, 0,           0
##MIN=       -20513.1999529892, -110497425,  0
##MAX=       20137.2065510759, 516113598,    0
$$ Real data points
##PAGE= N=1
##DATA TABLE= (X++(R..R)), XYDATA
$$ [...]
35637a711804l30692N25441M23885Q3492K24366K68715l26831p07133K3653J007454
35627e19454P63992m51630j028668m48305K59874M42813N47821P18800L52100
35618F37343m10327l62493P30142J261291J28780j321735j167658K40822R82038
35609G18203M97721o184J05469N1924n70084q70579k61852M11364K43074l11010
35599H046l59053n4456q6426l26673j13933M69084O88191L97542K09209L99306
35589A230837N16879K27915k12168n38642q32471j008420o20280L57413J082177
35580B03240P87993j20856n55316k03729J62076n6482m12202k21084K91047L45484
35570B20171j35349m44334k75498j17232j94301L5946P25122R02151q4309j124022
$$ y = [-1711804, -2042496, -1517055, -1093170, -1009678, -785312, -516597, -843428, -1550561, -1526908, -519454, 244538, -207092, -1235760, -1684065, -1424191, -981378, -433557, 285243, 637343, 227016, -135477, 594665, 1855956, 1984736, 663001, -504657, -263835, 718203, 1215924, 1209740, 1315209, 1367133, 797049, -73530, -335382, 75982, 319056, 8046, -351007, -405463, -491889, -818562, -932495, -463411, 224780, 622322, 831531, 1230837, 1747716, 1975631, 1763463, 1224821, 392350, -616070, -1236350, -878937, 203240, 991233, 870377, 315061, 111332, 273408, 216926, -195276, -416360, -125313, 220171, 84822, -359512, -635010, -752242, -946543, -910597, -185475, 716676, 632367, -491655]
35560d91655p19943N93497Q48937k95294r05691J80657J383743P21514j143981
35551A71784j829560n52964J080039J444682O37713k96028p07782n56116j06750
35542g14982J94496O0557k27827j43944L50008P96278Q51866M65557l01665j069755
35532B60589j086134j28836Q39647Q07123K12698K30230P68213N66370o05662
35523A864238j361434q34381L151j3082m97999m79220q8303m8122k00307J28674
35513a526785P24732P43360J69728j73021j0168J18942J9526J49096N58179N67176
35503A340765j03654p39775o36287l5756L60864K71680j25545n15512n20668K0743
35493f83145O12687N25621j13199l64525Q9537M01255o0283o68779o13258j82180
$$ y = [-491655, -1211598, -618101, 230836, -64458, -970149, -789492, 594251, 1315765, 171784, -1657776, -2210740, -1130701, 313981, 951694, 655666, -52116, -608232, -714982, -520486, -459929, -687756, -831700, -481692, 314586, 1166452, 1632009, 1330344, 260589, -825545, -954381, -114734, 692389, 905087, 1135317, 1903530, 2469900, 1864238, 502804, -331577, -328426, -341508, -839507, -1318727, -1407030, -1455152, -1655459, -1526785, -802053, -58693, 111035, -61986, -72154, 46788, 66314, 215410, 773589, 1340765, 1237111, 497336, -138951, -174707, 186157, 457837, 332292, -183220, -703888, -683145, -70458, 455163, 341964, -22561, 66976, 468231, 407948, -260831, -874089, -1056269]
35483a056269l3191Q8457P24875J333775R11072k43085p91928m27390k52676q13515
35473e59875j147369m26008O43600R11881M07327L655R6581L73765M20556j7670
35463G06443q49731j289511m58111J146560J745768O23980o43210l89363O87410
35454A280235P22028l83526r71330l20374M28584K24009n37033r86785q74336
35445a418528k87384O00448J155163P23747k29877n09464M596J42442n56857r71297
35435a347011k19303Q81762J115061O17219L18560M16697M19938J41439k41581
35426B102781o56456r38332o77209P3692N11989J84196k44845m5009L85525K10851
35416I07183m75590q27397m50467K52356O54952L96824k71418m18120N32019J545375
$$ y = [-1056269, -1089460, -1001003, -276128, 1057647, 1968719, 1725634, 933706, 506316, 253640, -559875, -1707244, -2133252, -1489652, -577771, -170444, -166789, -70208, 303557, 724113, 706443, -143288, -1432799, -1890910, -744350, 1001418, 1625398, 982188, 592825, 1280235, 2002263, 1618737, 647407, 327033, 755617, 979626, 442593, -544192, -1418528, -1705912, -1105464, 49699, 773446, 543569, 34105, 38701, 181143, -375714, -1347011, -1566314, -684552, 430509, 1047728, 1366288, 1782985, 2202923, 2344362, 2102781, 1446325, 507993, -169216, -95524, 416465, 600661, 355816, 310807, 696332, 907183, 431593, -395804, -846271, -593915, 61037, 457861, 186443, -231677, 300342, 1845717]
35406A845717R94856p29740j309150P192R81405o5286j340018m84532J359820
35397A260264J387121j22131l82944R51376J252953j24960k47751K353200M441005
35388A0768133K541792j772018m103041l230212j785517j641842j726257p12968
35380a661930O86750J111897N40018j47907n18104o20886m10400R1153M61392
35371d68017L05779j76637m19281j59121L15712M96639J59178l82515n62640k06059
35361a096962K37156K45085j50694m76043l71204J57031Q18163J137868P34987
35352A235387j72215p53426m46060K95919N26698j3129o60044p53460l68123k777
35342a111230J04063J04365J78595L06251L74037L27516J62580j01189l29656
$$ y = [1845717, 2840573, 2110833, 801683, 808875, 1790280, 1724994, 384976, -99556, 1260264, 2647385, 2525254, 2142310, 3093686, 4346639, 4221679, 3973928, 6327128, 10768133, 13309925, 11537907, 7434866, 4204654, 2419137, 777295, -948962, -1661930, -975180, 136717, 676735, 528828, 10724, -610162, -1020562, -929409, -468017, -162238, -338875, -758156, -917277, -601565, -104926, 54252, -328263, -890903, -1096962, -859806, -614721, -765415, -1241458, -1612662, -1455631, -637468, 500400, 1235387, 1063172, 309746, -136314, 159605, 686303, 673174, 13130, -740330, -1108453, -1111230, -1007167, -902802, -724207, -417956, -43919, 283597, 446177, 344988, 15332]
35333A5332k71338J37055N01262L25488k67163n41947j32933L58157J76444m66114
35323a65757o74626j53554M40654M93622J73600l3639k6865j9392j06727j90281
35313b62965j38119J19310M53927M77331o5910p92338r52573l39738M30546O90956
35303c79573M24936M6456j58366j50552M067J66651K13310K20689L52338N00736
35293A240692L29671k32962q14854r90722o29032R9747P31043O45160k75757j165713
35283a062727r95251L9400O67399K98835j88593J16854P49328O83397o223l08914
35273f495J02935M37384J04417m21814m81310k73207l77726o50133l91014M29186
35263a527777R19560N49152n260J09242N54721L49046m53506p30428j08818L38258
$$ y = [15332, -256006, -118951, 382311, 707799, 440636, -101311, -234244, 123913, 300357, -165757, -840383, -993937, -553283, -59661, 113939, 80300, 53435, 34043, -72684, -262965, -401084, -281774, 172153, 649484, 583574, -208764, -1161337, -1501075, -1070529, -379573, 45363, 91819, -66547, -217099, -213032, -46381, 166929, 387618, 739956, 1240692, 1570363, 1337401, 522547, -468175, -1097207, -997460, -266417, 378743, 102986, -1062727, -2057978, -2018578, -1351179, -1052344, -1240937, -1124083, -374755, 308642, 302419, -6495, 96440, 533824, 638241, 216427, -264883, -538090, -915816, -1565949, -1956963, -1527777, -608217, -59065, -64325, 44917, 599638, 948684, 495178, -235250, -344068, -5810]
35253e810j98574q96095n85570L80067P31500K82246K8414L87790O11653J43299
35243H78920n10375o30276k11813K84939M92554K54504k41662l98950J02469O21443
35233F41753L22413m72207o47718q413M64697K18191j56067j20448L8100J00099
35223C80400M53483J111475J213163K75938q72603j169565o57254j13252J0775
35214F32560k79736p79401r58836k96101Q01979J205455O28246N5193J26847K20429
35204A356635j96754n17062k00500J42031p3034k83448p606J0218p12220r67482
35194a449222L05106J759817J320832n17037j321923m12937M11262P338n48782
35185d45546k00028L30887P3612m92743m55408J759K01218J90503L40843M70639
$$ y = [-5810, -204384, -1100479, -1686049, -1305982, -574482, -292236, -263822, 123968, 735621, 878920, 368545, -261731, -473544, -188605, 303949, 558453, 316791, -82159, 20310, 641753, 964166, 491959, -155759, -164172, 300525, 518716, 362649, 242201, 280301, 380400, 833883, 1945358, 3158521, 3434459, 2561856, 1392291, 735037, 621785, 632560, 352824, -426577, -1385413, -1681514, -879535, 325920, 954166, 1009359, 1136206, 1356635, 1159881, 642819, 442319, 584350, 511316, 227868, 220262, 230480, -481740, -1449222, -1144116, 615701, 1936533, 1419496, 97573, -315364, 95898, 103236, -445546, -645574, -314687, -241075, -733818, -1189226, -1187467, -986249, -795746, -454903, 15736]
35175A5736K99961J60841M03404O32945L39606j88418l58590k57063l32710m24980
35165B90732J1182P92573R63723R3558r77423j094477k26505M94452K14846n53872
35155H789o58688R6810P18958N02535r556k6787K14661j7706n98554o88501q7327
35144e45366M64937L87586q3927m12086l14653J79251O59551M61239n05115j276641
35134i85224r44676L3957N21324L84757L86553O30025M75114j3603k2268L85807
35124H51766J39949q74705j278703l72095O18812M63960k09157j67249M21873
35115d05549N70728K16330J8548K9986j22828k10087J66631M80006q6952j104077
35105d47264j242923j73033R61216J060457K10457p38694r93528k70644Q68619
$$ y = [15736, 315697, 476538, 879942, 1512887, 1852493, 1664075, 1305485, 1048422, 715712, 290732, 301914, 1094487, 2058210, 2151768, 1174345, 79868, -146637, 347815, 562661, 8789, -649899, -553089, 165869, 668404, 658848, 632061, 846722, 829016, 230462, -458039, -545366, -80429, 307157, 223230, -188856, -503509, -324258, 335293, 796532, 291417, -985224, -1929900, -1895943, -1374619, -989862, -603309, 26716, 501830, 488227, 465959, 851766, 991715, 117010, -1161693, -1533788, -914976, -451016, -660173, -827422, -405549, 165179, 381509, 400057, 430043, 307215, 97128, 263759, 743765, 656813, -447264, -1690187, -1863220, -902004, 158453, 368910, -369784, -1363312, -1633956, -765337]
35096g65337J274168M90888m71529m35268K39528K70266m89817q52654k02668
35087i42423O13199O37022O4049k66836N2887P34366J068637M42285q39711j456525
35077A06950o17684O04424O20288k88332m42197M42126Q20294Q3984l06679N34328
35067A557502J107464l4115j618210j447173J81371J007738K28066p47666q25913
35058e90936m97865l48832j11364L02547L35241j03403l29942j25079k0938j5239
35048a505810N57512J420961J260786k8822p19957M7820O86191j94773j218713
35039C05195m37809J171704J036040p74359j486591k6041J305013N35872j005269
35030F23755j050546J10269N07655k33670o12613J15850R04284P15747m8558l89555
$$ y = [-765337, 508831, 999719, 528190, 92922, 332450, 602716, 112899, -739755, -942423, -329224, 307798, 371847, 105011, 157898, 892264, 1960901, 2403186, 1563475, 106950, -510734, 93690, 713978, 425646, -16551, 425575, 1245869, 1329853, 1023174, 1557502, 2664966, 2630851, 1012641, -434532, -253161, 754577, 982643, 234977, -590936, -1088801, -1437633, -1548997, -1246450, -911209, -1014612, -1344554, -1469633, -1490571, -1505810, -948298, 472663, 1733449, 1704627, 984670, 1032490, 1718681, 1523908, 305195, -132614, 1039090, 2075130, 1300771, -185820, -211861, 1093152, 1629024, 623755, -426791, -316522, 191133, -42537, -655150, -539300, 364984, 1080731, 1032173, 642618]
35020F42618n5434M12884M42915m4988n66313n21364J2068K19550k72495o38440
35010c68999o8248P11724L42045q80286j104150K83922J454582O92121j025021
35001C7690j396088p0586J038554O03383m83982p31642o8407M97960M24479K0258
34991a28381k45403j36631L29250P13488L73529n96065j081798l37454P54687
34982c54778P58596k24913o99007m6161O13871K83608m07299l86728J33828K00219
34972a28764k45121m25880j10594J87059K66267M39482O42068L57284l59470o90187
34962f7856k34637L67833L94763J0312j39698J51199N10677M77226q0068p80659
34952F09092r54466l80572L05130L99389J08822P7373K14490l5875m17990j08855
$$ y = [642618, 587184, 1000068, 1442983, 1397995, 831682, 310318, 322386, 541936, 269441, -368999, -437247, 274477, 616522, -263764, -1367914, -1083992, 370590, 1062711, 37690, -1358398, -1428984, -390430, 212953, -271029, -1002671, -1071078, -573118, -148639, -128381, -373784, -510415, -181165, 532323, 905852, 309787, -772011, -1109465, -354778, 403818, 178905, -520102, -566263, 47608, 331216, -76083, -462811, -328983, -128764, -373885, -799765, -910359, -723300, -457033, -17551, 624517, 981801, 622331, -67856, -302493, 65340, 460103, 470415, 330717, 481916, 992593, 1469819, 1389751, 609092, -345374, -725946, -420816, -21427, 87395, 164768, 379258, 343383, -74607, -183462]
34942a83462O55454O19232l93483r01621p9131P97823L74322n95559n91316J37320
34932a60421J60612n75736o91943K04232Q36350L46967m43729m52859J64774N79055
34922c2698M66080M7117l57899l59840K72547J031981R67507n7225j029811j093248
34912a45489n47438j33146J9732J70912K63304J12294n1435J27288M75975M71378
34902G63375j7697n81647q03648o14240j84058K35163L95191K34636K549L8339
34892e32037L93588P41951O86744J75393l78220m75284r9142K46031J66000j84957
34882G40067m76444o82268q31207o17731J61304R73975J040756M41804N0104K39072
34872A039432L48480k51395j141923j359373n84957N64022J249046J132891N11153
$$ y = [-183462, 471992, 1091224, 697741, -203880, -283011, 514812, 889134, 293575, -297741, -160421, 191, -575545, -1267488, -1063256, -226906, 120061, -323668, -776527, -611753, -32698, 433382, 480499, 122600, -237240, 35307, 1067288, 2034795, 1977570, 947759, -145489, -692927, -826073, -806341, -635429, -372125, -259831, -311266, -183978, 291997, 763375, 745678, 164031, -639617, -1253857, -1437915, -1202752, -807561, -572925, -570376, -532037, -138449, 603502, 1290246, 1465639, 1087419, 612135, 512993, 759024, 925024, 740067, 263623, -418645, -1249852, -1867583, -1706279, -732304, 308452, 750256, 800360, 1039432, 1387912, 1136517, -5406, -1364779, -1949736, -1385714, -136668, 996223, 1507376]
34863A507376o7657l21514l75429l67064j79921J72646K47040k13508o19724k13340
34853d31095O95058R75578K38192o71887r19821o07357j93143J60454K83400q5959
34843e56580n70533k28654R59594J558322N47895j021747j371888m28628L61196
34834g51023L08459J37026L41249L59594j52464m80857l5989N62823M41839j68449
34824E62208m10179j45747O9384M2479O1055J10125j11147l82500r8016N89515
34814B87177O67027k56656j164529r67367M709O13727N21723K62883K7277n03785
34804e07814j073997p74516M94089J447254J016493j63991o67594j81792L62032
34795d9836K81298j34434l52780k39990J48593P25689J101683P48620k50659j047581
$$ y = [1507376, 1439719, 1118205, 742776, 375712, 195791, 368437, 615477, 401969, -217755, -431095, 263963, 1239541, 1477733, 805846, -113975, -721332, -914475, -754021, -470621, -556580, -1127113, -1355767, -396173, 1162149, 1710044, 688297, -683591, -1112219, -751023, -442564, -305538, 35711, 395305, 242841, -238016, -274005, 288818, 730657, 562208, 152029, 6282, 75666, 118145, 179200, 289325, 178178, -204322, -302338, 287177, 954204, 697548, -466981, -1434348, -1429639, -815912, -294189, -31306, -4029, -507814, -1581811, -2356327, -1862238, -414984, 601509, 437518, -230076, -411868, -49836, 231462, 97028, -255752, -495742, -347149, 378540, 1480223, 2228843, 1978184, 930603]
34785I30603r45556j89699M12174M23923J03242n1275J33999L68445K71305j14250
34775A342911l17041o6709K91891K73733p0118l16030l27193l01722k88869j65574
34765E5279l5212j11200k18755P065L98495L88531m930o1411M62238P66941J80766
34754A827807o95642p60283o11M97970J02153n62148n97485n0184L32220K54711
34744C48508J82684M34034N41889j9399q08361q34647k4788N20781R2794n64979
34734a31484m30961K02730L03342j24073o0511P01854J023812J67820r73071j126435
34724d46977l60740K71560K93040J20985P9701l7587l53737n20760k12333L55633
34714h11215O58042M89084J81516J65008L85397L49366j58142o62193o09449j70413
$$ y = [930603, -14953, -204652, 207522, 631445, 734687, 683412, 817411, 1185856, 1457161, 1342911, 1025870, 959161, 1251052, 1524785, 1454667, 1138637, 811444, 509722, 220853, 55279, 20067, -91133, -309888, -302823, 95672, 484203, 479273, 417862, 880100, 1647041, 1827807, 1132165, 371882, 371271, 869241, 971394, 409246, -188239, -238423, 93797, 348508, 531192, 965226, 1507115, 1487716, 679355, -155292, -180080, 340701, 433495, -131484, -562445, -359715, -56373, -180446, -240957, 460897, 1484709, 1652529, 679458, -446977, -807717, -536157, -243117, -122132, -42431, -80018, -433755, -954515, -1166848, -811215, -153173, 335911, 517427, 682435, 1067832, 1417198, 1259056, 596863, -12586, -182999]
34704a82999L5703j19006j91711p160R3471k2861K5447M41923Q32656P92881M08019
34693B106363q8710o07428r01521o34706q8484q1685p27665j044401m18746L47261
34683b139722L03450q5087K26423R95096J007813R4816n53555k58183K33183J36591
34673c9175j84748q4632K28862K18376L694k0321m0446l91732o25386m4777R14918
34662f5367R49667j86432j042654m23163Q13632Q95702l20498j121598l68490
34653h69201R41575J125629L8786r82544r72018k43487M18870O38475L97869j83364
34643C10590p42020q21778l84751J51415M75547N94496M70876N81n32137n86246
34633a063427j81169K4627k25968l18255K17190Q47321Q23622L29512J14987L23849
$$ y = [-182999, -147296, -266302, -458013, -465173, -371702, -394563, -369116, 72807, 905463, 1698344, 2106363, 2017653, 1410225, 508704, -126002, -214486, -296171, -1023836, -2068237, -2486983, -2139722, -1836272, -1921359, -1694936, -699840, 307973, 402789, -150766, -408949, -175766, -39175, -223923, -308555, -79693, 138683, 142377, 122056, 81610, -310122, -935508, -980285, -65367, 884300, 697868, -344786, -767949, 45683, 941385, 620887, -500711, -869201, 72374, 1198003, 1236789, 254245, -717773, -961260, -542390, 96085, 493954, 310590, -431430, -1253208, -1637959, -1486544, -1010997, -416501, 54375, 54956, -477181, -1063427, -1244596, -1219969, -1445937, -1764192, -1547002, -699681, 123941, 453453, 568440, 892289]
34623H92289M48641K71094R0420M4200j08363m41142o78943o83254o24621n43856
34613a333535k11356L87847Q15893O56838l744o86549q91230l64094O63653J435923
34603D69646J238212J76039q79996j241673r93377n32974K9717O80641J077205
34594B3440Q60033K85014R878J72003J72252l89045j014278r84513m29169j26618
34584a421003l24235m29542l8504L95144L32522L7208Q1652L48445K58525j79752
34574i39540l27472M5506M00341K85523p1456k62758k28634l0971L50613O88109
34564i0739N17450j20409m51830K8533P40417P45740n141p10234q03211m56766
34554f06190q2807J62788L21445M28202M54500L02143q9182n17740n96727k34338
$$ y = [892289, 1340930, 1612024, 1702444, 1746644, 1638281, 1197139, 518196, -165058, -789679, -1333535, -1544891, -1157044, -341151, 315687, 311943, -374606, -1265836, -1629930, -966277, 469646, 1707858, 1883897, 1003901, -237772, -1231149, -1764123, -1734406, -1053765, 23440, 883473, 1168487, 1178365, 1350368, 1522620, 1133575, 119297, -865216, -1294385, -1421003, -1745238, -2174780, -2213284, -1818140, -1485618, -1448410, -1366758, -1018313, -759788, -939540, -1267012, -1221506, -821165, -535642, -607098, -869856, -1098490, -1129461, -778848, -90739, 426711, 306302, -145528, -116995, 623422, 1369162, 1364021, 653787, -149424, -606190, -688997, -526209, -204764, 223438, 677938, 980081, 890899, 373159, -223568, -457906]
34544d57906J90123L34922L00662K74318J30944k01856l26257Q5848N29333J59864
34534A019995q86394j376561n40291P81397J115453K53145n05153j44971O53725
34525C70345M96224o52294j286439m82866P20664Q13751j7922l55839J54973L91432
34515A52029j99512o13713m7877O38504L21160m84705m69536K97721N11444k17908
34505a12393p78285l42812M66373O51478J50753m14160n83096k19892N17561R78336
34495C13863M66221o66540j075024j54756R52798Q48991j96773p73105m18342
34486g02667m2719k53131m25800Q6956P34973N11414n58474j391435j141902j7054
34476c199839J071105J273343M21404o91575q60710K02997J295695J063976k43734
$$ y = [-457906, -267783, 67139, 367801, 642119, 773063, 571207, 244950, 330798, 860131, 1019995, 133601, -1242960, -1783251, -1001854, 113599, 366744, -138409, -283380, 370345, 866569, 214275, -1072164, -1555030, -834366, -20615, -38537, -394376, -239403, 152029, -47483, -661196, -709073, -70569, 250591, -234114, -703650, -405929, 105515, -112393, -890678, -1233490, -767117, -115639, 35114, -379046, -962142, -1182034, -664473, 313863, 780084, 113544, -961480, -1116236, -163438, 685553, 488780, -284325, -702667, -745386, -998517, -1424317, -1337361, -602388, -90974, -649448, -2040883, -3182785, -3199839, -2128734, -855391, -433987, -1125562, -1986272, -1783275, -487580, 576396, 332662]
34467C32662j104637p34466J20076N42640N94310O29225M10470k91627q95440
34458c96787p18963p9905J82424k3391j10675Q3578J74153R5392J87703L98593
34448b07878K53405k66434n97740m86521k67465j15271K15466O88167P85295L41379
34438C42403q8206n9846J29777K5330k71947l63218j57056J18571K53360J97702
34428A26870O4885L0148M0761j86169n69621m67363L47747R81292N74461k40488
34418G02523k21385M01556K02642r94775j580998o11222P13259Q93456K03336
34409b91608j46153Q9796K80783K06178J28409L6913k20885l89495j88212N8133
34399d36141j36390o07458p41337k58462N65295J151529R39922r337o80705j94729
$$ y = [332662, -771975, -1506441, -1386365, -843725, -249415, 379810, 790280, 498653, -396787, -1115750, -1195655, -1013231, -1036622, -1147297, -1063719, -889566, -794174, -606471, -207878, 45527, -220907, -818647, -1305168, -1572633, -1687904, -1472438, -784271, 1024, 342403, 254197, 194351, 324128, 349458, 77511, -285707, -442763, -324192, -70832, 126870, 191755, 221903, 262664, 76495, -493126, -960489, -612742, 368550, 943011, 702523, 481138, 882694, 1085336, 90561, -1490437, -2101659, -1388400, -494944, -291608, -437761, -347965, -67182, 138996, 267405, 304318, 83433, -306062, -494274, -436141, -572531, -1179989, -1921326, -2179788, -1614493, -462964, 476958, 467621, -213084, -407813]
34389d07813P09366M60023q43379j246758O4431J253692N48814j011334j220739
34380a693697r869Q04670M53892m7524M2659J71125k13973p00846o64306j00312
34370a958181N33705P24711K06469o08082p83683k7100P61329P42656L21822K80369
34360A94015M57699L13218R5468K62461L70678j58064p37637m98767M4525k29352
34350A14244r86251q45084K90136J008713N90059j66084m88650m97067k67606
34341a247590M52149J200934R01697m48776j406529r62138K31519R76274R08424
34332F05964L54535k72621n46136k86152K1731j73635m94268j99000L77634K13205
34322c98743n63904o75358K18194R24543O84075K53403L43617L76241k60492q79761
$$ y = [-407813, 301553, 761576, -81803, -1328561, -1264130, -10438, 538376, -472958, -1693697, -1703566, -898896, -445004, -492528, -449869, -278744, -492717, -1193563, -1857869, -1958181, -1424476, -699765, -493296, -1101378, -1885061, -1912161, -1150832, -408176, -86354, 194015, 651714, 964932, 1060400, 1322861, 1693539, 1535475, 797838, 299071, 343596, 114244, -872007, -1717091, -1426955, -418242, 171817, 5733, -482917, -979984, -1247590, -795441, 405493, 1307190, 858414, -548115, -1510253, -1278734, -302460, 605964, 960499, 687878, 141742, -144410, -122679, -296314, -790582, -989582, -611948, -398743, -962647, -1638005, -1419811, -495268, 188807, 442210, 785827, 1162068, 901576, 21815]
34312B1815n36911L81377O69593k3946q45847q38013P2954R98475Q91126k54014
34302E36609j172823q63651L0663K60934q0046M1457O13201O69937K61202L95678
34292F93161Q56781K46296j238601j416921L94231J795681Q29238r56624j041739
34283A61503J41447L05037p75286j141253q2924Q58836N60033j54186k22640J00425
34273b49008J29635q9799k12540k55622k67712p5463K35038K58188n799l7096
34263e70178L13866M94890J27525m04379n84487m31403j92705J07102M23395M67346
34253b49028J81114M7768M01530P24673K76969o76669j003297k67214N39378L54398
34243C29622m03521m68970L30268Q10355K81476m11311k87419K50429K07230l52239
$$ y = [21815, -515096, -133719, 535874, 511928, -333919, -1171932, -1098978, -100503, 790623, 536609, -636214, -1499865, -1469202, -1208268, -1288314, -1246857, -633656, 36281, 297483, 693161, 1549942, 1796238, 557637, -859284, -465053, 1330628, 2159866, 1203242, 161503, 302950, 607987, -167299, -1308552, -1391476, -532640, 27393, -126793, -349433, -249008, -119373, -209172, -421712, -677334, -945046, -1020509, -785471, -527283, -533082, -570178, -256312, 238578, 366103, -38276, -622763, -1054166, -1246871, -1139769, -716374, -249028, -67914, -20146, 381384, 1106057, 1383026, 706357, -296940, -564154, -24776, 329622, -73899, -542869, -212601, 597754, 879230, 467919, 180500, 430929, 638159, 285920]
34233B85920n28919j09314K43192J91619Q4980R2367p7043m64943o77271n23652
34223a483064j82760K32354O07372N40452n5184l63725K83030J072635P17848
34214A368958m00517o36868L12474Q80676R8545j033371j273560p51914j23022
34205a558599M66577P52610J18213j057053j197546K02931J427285R16451m20810
34196c49941p33284J6429M72069K45624R4034K05994L3679l28740j61903M41225
34186f4814N19988k03542q73018q03688k64765K30167N45451O38328M03546J0512
34176A38165j86460j79451k45344l69183k64488N7108K65512K52988K24799K72621
34166c3733K70159J47521o7311l56524n60365l47404L00455Q12266O36759n3952
$$ y = [285920, -242999, -352313, -109121, 82498, 167478, 259845, 182802, -282141, -959412, -1483064, -1665824, -1433470, -826098, -285646, -340830, -704555, -421525, 651110, 1368958, 968441, 331573, 644047, 1524723, 1623268, 589897, -683663, -1435577, -1558599, -1092022, -339412, -221199, -1278252, -2475798, -2272867, -845582, 70869, -349941, -1083225, -1066796, -594727, -349103, -255069, -49075, -15396, -344136, -506039, -64814, 455174, 251632, -621386, -1425074, -1689839, -1459672, -914221, -275893, 127653, 138165, -48295, -227746, -473090, -842273, -1106761, -1049653, -784141, -531153, -306354, -33733, 236426, 383947, 316636, -39888, -600253, -947657, -647202, 165064, 801823, 747871]
34156G47871n97832n85380j14028M34472O29574K96319k18777l96900k32539j18455
34146a55675o8182K29708N30166J67105o60068q14199M5398P40738L25446m79833
34136a39396n44624q0588J1072k05096K841N33051N51685m9898m42937j63598
34126e27488K79877K52837k00867n48730l89199J48399M82925K50581j32405p8755
34116d62825R7033l58661j045245o02444J015702J915093Q62426q05733j121954
34107e06608j93417M98256N47449O74253R32196O37574j06046l86798j4567K36502
34097B318794k5878l55969m08528l33910k07998O2475K88491J88064j03331l13223
34087A108987m78465n48638j65344M84478M50409m46340q69983M8405J065087
$$ y = [747871, 150039, -435341, -549369, -114897, 514677, 810996, 592219, 195319, -37220, -155675, -223857, 5851, 536017, 703122, 43054, -771145, -725747, 14991, 340437, -139396, -684020, -764608, -753536, -958632, -955791, -422740, 128945, 79047, -363890, -527488, -247611, 5226, -195641, -744371, -1133570, -985171, -502246, -251665, -384070, -462825, -365792, -724453, -1769698, -2372142, -1356440, 558653, 1421079, 615346, -506608, -700025, -201769, 345680, 1019933, 1952129, 2589703, 2483657, 2096859, 2082292, 2318794, 2292916, 1936947, 1528419, 1194509, 986511, 1048986, 1337477, 1525541, 1422210, 1108987, 630522, 81884, -83460, 401018, 851427, 405087, -464896, -416491, 648596]
34078F48596O84817l75734m70219J23266j23840j036951r63227J84960O76742
34069f51590J5538k84064M25105P44341r4899p13709r0820N06667k28172j211988
34059a583591p28277O76967J110236L41310j18629L78550P91191K85591n50636
34050F02712q05287m72896r2335J30832L30987M82761L41022j33325n06111k52229
34040c73869M88935Q15914J25417r15600j062083j27559P73004P51920J77191
34031F53270j52981j57797k44633m21831k96245K04139O24363N56716J49201q3555
34021H30647Q6871K70600k3230n94488p09303j74370L24996K92008J41730K81859
34011G27320K12080n44083j231066p85650L89500Q91762M32704J07811M43805
$$ y = [648596, 1333413, 957679, 487460, 610726, 486886, -550065, -1513292, -1328332, -651590, -636052, -920116, -495011, 249330, 154431, -559278, -650098, -143431, -371603, -1583591, -2311868, -1634901, -524665, -183355, -301984, 76566, 867757, 1153348, 602712, -202575, -675471, -767806, -636974, -305987, 176774, 517796, 384471, -121640, -373869, 115066, 930980, 1056397, 140797, -921286, -1048845, -275841, 476079, 653270, 500289, 342492, 97859, -323972, -620217, -416078, 208285, 765001, 914202, 830647, 917518, 1188118, 1164888, 570400, -138903, -313273, 11723, 303731, 445461, 727320, 939400, 395317, -835749, -1621399, -1231899, -340137, 92567, 200378, 644183]
34002F44183O00517l0940p10615n45907J57819M99729K37945k19572n13150m57275
33992c37266K4533N93905O04043k8295n10965j84543N73298Q95662N18994j11587
33982B037779n42441o70812n48124k15796J99285L89083L5383p45396j195474
33973a256513o06817O09178J123100L70724n90979n49776J73725M08956j8944
33964c37346k66573j1294K04770J21944R0098J58467p1768n17748n51899o3715
33954a245064L54074M17395L84127J96879m84541j206289r11919L68726J195817
33945i30795O74494l10296m92312P2742M77065L78387J23243l9603j37619j62280
33935c46974q5632K9603J80131L77643L93588K7622l62377k31001K35772L16503
$$ y = [644183, 1244700, 1213760, 503145, -42762, 115057, 614786, 852731, 633159, 120009, -337266, -312733, 281172, 885215, 856920, 345955, 161412, 734710, 1630372, 2149366, 2037779, 1495338, 824526, 276402, 60606, 259891, 648974, 684357, -61039, -1256513, -1863330, -1254152, -131052, 239672, -351307, -901083, -727358, -318402, -337346, -603919, -615213, -410443, -288499, -198401, -39934, -111702, -629450, -1181349, -1245064, -890990, -473595, -89468, 107411, -377130, -1583419, -2495338, -2126612, -930795, -256301, -566597, -1058909, -986167, -509102, -130715, -7472, -47075, -184694, -346974, -432606, -403003, -222872, 154771, 548359, 575981, 213604, -17397, 218375, 534878]
33925E34878q5453l25663j63448q3266k79692l11969n6958J0995j45579J15120
33915g91035Q28939R99212J56377o64744l88121M84274O95181P8655m25493k85162
33905F88083J9065j21255n96611p60641k29332N44632O17630k64159j087616p68006
33895a958210L00159P48089J98475l42794j91359J01872l3538j82183J69391O46572
33885e43526O46945L06459J12505R9059K1531j30788k55613l25701j75145L42001
33875I7727P95020N19319k74460o16077k77411j38090o27074r11545l00643N85048
33865a148186Q60585O62840N06676K26526m29662q91209n64064L66j33947p08733
33855a618808n85623M57011J271859Q77364k85699r51563n12888L81647O72972
$$ y = [534878, 449425, 123762, -39686, -122952, -402644, -714613, -771571, -760576, -906155, -791035, 37904, 1037116, 1193493, 528749, 140628, 624902, 1320083, 1398738, 973245, 688083, 707148, 585893, -10718, -771359, -1000691, -456059, 161571, -102588, -1190204, -1958210, -1658051, -909962, -711487, -1054281, -1245640, -1143768, -1177306, -1359489, -1190098, -543526, 103419, 409878, 522383, 621442, 642973, 512185, 256572, -69129, -244274, 97727, 892747, 1412066, 1137606, 521529, 244118, 106028, -521046, -1432591, -1733234, -1148186, -287601, 375239, 881915, 1108441, 678779, -212430, -776494, -776128, -910075, -1618808, -2204431, -1747420, -475561, 401803, 116104, -835459, -1348347, -966700, -293728]
33846b93728J72457k95335j52396P1463k92303p77613m90945K73228M31486J231
33836a352455O8776P25696P50964j27889m45679N62946J407014N97036r09816
33827A276593j169914j83691L86704j30843p48333o22962n5206L97269O39739
33818b10644P12298O01756M78260M85206L73326p8592n05206m52685j81546k90280
33808I31893p45195r52315o46028j21016K73075L74903J56434j31179l3965M54954
33798d38439O80516K29898l56081l33482J56937L80308J12548j86840j77369m7386
33788B0610j02567l15436l70046o0678L49161L07760k74766p25760m84677N2574
33778a603825J91173N3083J54713K45093k57340q88989n85669N01135J081009
$$ y = [-293728, -121271, -416606, -569002, -497539, -789842, -1567455, -2058400, -1785172, -1353686, -1352455, -1283679, -557983, 192981, 65092, -380587, 182359, 1589373, 2186409, 1276593, 106679, -77012, 309692, 178849, -569484, -1192446, -1247652, -850383, -210644, 501654, 1103410, 1581670, 2066876, 2440202, 2361610, 1856404, 1403719, 1222173, 931893, 186698, -765617, -1411645, -1532661, -1259586, -884683, -728249, -859428, -893393, -438439, 242077, 471975, 115894, -217588, -60651, 319657, 432205, 245365, 67996, 20610, -81957, -397393, -767439, -828117, -478956, -171196, -445962, -1171722, -1656399, -1603825, -1412652, -1359569, -1204856, -959763, -1217103, -2106092, -2691761, -2190626, -1109617]
33769a109617P41261L65852L30432l9390p90791q83542o2372N10399K52754Q5452
33759e99562N13341N89672j46693n21077J91040P57551M9327r86270r87794l36765
33749a477230l5810J30885O20039P17292r2054o68552l980Q28244M49473l91652
33739G6655k51699M02187K93472j20308L34277R88377M08812p57330p18493K79746
33729I35696M71282j75254r9534O64474M44145p92207j094870K7712O69959j69951
33719H81452r82320m90225L48688L09142j29836l8614L74277N50271N75268N02033
33709A900136k0115p63736q93702m26759l00330n95908l27288N59751Q00345O0284
33699g322l01530M17545R64548K52490q49154j027478m43080j199P6747n0924
$$ y = [-1109617, -368356, -2504, 327928, 288538, -502253, -1385795, -1448167, -937768, -685014, -599562, -86221, 503451, 356758, -164319, 26721, 784272, 833599, -152671, -1140465, -1477230, -1513040, -1382155, -762116, -44824, -136878, -805430, -809410, 18834, 468307, 76655, -175044, 227143, 520615, 400307, 734584, 1722961, 2131773, 1374443, 655950, 935696, 1406978, 1231724, 1132190, 1796664, 2240809, 1448602, 353732, 381444, 1051403, 881452, -100868, -591093, -242405, 66737, -63099, -101713, 272564, 822835, 1398103, 1900136, 1880021, 1116285, 222583, -204176, -504506, -1100414, -1427702, -867951, -67606, -7322, -308852, 108693, 1073241, 1325731, 476577, -550901, -993981, -995180, -918433, -969357]
33689i69357m19980o58368j5356J202996J528368M84343n41648m76849j29738
33680D411m89319r36535n16535K44381K69177k55030l73999M6115M36365O02306
33670i68663O55963M74843P4679j26058o5764k37927n88729l29003N23274P54332
33660A66947n4858o10490m9766N27497M6569n19128J48841J243759J062795j70602
33650A791564p54743k43796K20306K1849k95081l86822m67518l70377K37853P72209
33640E25444L34645o39326q11292l1847M79213J48101k57949k09596k14723n69905
33630a247235o40678k1914O66618P84377N64170M24281K39525r3581j51667K62562
33620G86458N11171K2859o58850n24979M13282J032779N53817m77050r22835m59703
$$ y = [-969357, -1389337, -2047705, -2063061, -860065, 668303, 1152646, 610998, 134149, 4411, -484908, -1421443, -1937978, -1693597, -1424420, -1679450, -2053449, -2007334, -1570969, -968663, -312700, 162143, 236822, 110764, 45000, -192927, -781656, -1110659, -587385, 166947, 112089, -498401, -548167, -20670, 25899, -493229, -344388, 899371, 1962166, 1791564, 1036821, 793025, 1013331, 1035180, 740099, 353277, -114241, -484618, -246765, 525444, 860089, 220763, -590529, -622376, -143163, 4938, -253011, -462607, -677330, -1247235, -1887913, -1909827, -1243209, -458832, 105338, 529619, 769144, 675563, 523896, 786458, 1297629, 1320488, 661638, 136659, 549941, 1582720, 2136537, 1659487, 736652, 276949]
33610B76949J37672R5460l73869m92932p3417K97397K29614P0794K16538M32889
33600H17095K85874j59009n04373n76609m26399p8498L43464N32728L84030J73976
33590G92279R0582l2884k54412k96251j12571j12474m03628m43668K9101L78651
33580c65275N0932m57931m00863J0441P6469j72244j71046J13666K62341K77751
33570g75759M45636N38470J10484n54990p27948l75616j22972j39013K0981M58490
33560a122237P01474N05929J30197j93901l50492m0677P65689J240457N53025
33551B189464p43461j236751o00668Q0532O1292j50748M2962L41472K30868j75280
33541C9682m61273m42798j00467M07897N87953J65007k71380l6860M37127K76781
$$ y = [276949, 414621, 510081, 136212, -356720, -430137, -132740, 96874, 167668, 384206, 817095, 1102969, 943960, 439587, -137022, -563421, -641919, -298455, 234273, 618303, 792279, 882861, 849977, 595565, 299314, 186743, 74269, -329359, -773027, -743926, -365275, -314343, -772274, -1173137, -1162696, -1086227, -1258471, -1429517, -1315851, -1053510, -775759, -330123, 208347, 318831, -236159, -964107, -1339723, -1462695, -1601708, -1580727, -1122237, -420763, 85166, 215363, 21462, -329030, -369707, 395982, 1636439, 2189464, 1446003, 209252, -391416, -310884, -249592, -400340, -357378, -15906, 214962, 39682, -421591, -864389, -964856, -556959, 30994, 196001, -75379, -112239, 324888, 601669]
33531F01669k04111J1601P11045P58331K91221N34223J281335J031224N2270L87679
33521E456487J984495K405782K025088N065816J1911549J4651278O253927q044875
33513D1709547j5369343j1110363l545897j279185k887527k539643L9005Q19940
33505E836534q41264j746357p54601j5985n52529q99747m37732m10530j047068
33496h69279q55694M44193J091545K70329n43591j66986N56384N72316K05995
33487G05212J06k62174n41289k58189K54291j81227j342146j394580J56612J347824
33477a515560P74288k82246k10003L59979J15869m73301k76853K49358L2881m36628
33467a662216j1111Q37507P66238O131p7070M85755L35232o61496j024046j35609
$$ y = [601669, 397558, 409159, 1120204, 1878535, 2169756, 2703979, 3985314, 5016538, 5068808, 5456487, 7440982, 9846764, 11871852, 16937668, 28849217, 43500495, 49754422, 41709547, 26340204, 15229841, 11683944, 10404759, 7517232, 4977589, 5016594, 5836534, 4995270, 3248913, 2494312, 2478327, 1925798, 1026051, 588319, 177789, -869279, -1724973, -1280780, -189235, 81094, -462497, -629483, -73099, 499217, 705212, 705318, 443144, -98145, -356334, -102043, -283270, -1625416, -3019996, -2863384, -1515560, -741272, -1023518, -1233521, -873542, -757673, -1230974, -1507827, -1258469, -1225588, -1662216, -1673327, -835820, -69582, -63451, -140521, 345234, 680466, 18970, -1005076, -1140685]
33457a140685P68118O42768Q3640L3670L28194L03139p5093l80430l98448j62475
33447B398J84512L22761L0210m00302n16292l90645l51905k28476L41601R85217
33437b0921R00218R7530n57341o13698m63527l93697j37417L74063O64655M89062
33427C38927K68472L84741O02707N20030J18759l90104q41840j029526p46982
33418g74816j21890M05243N40774L14363j46761o41014p64338k47830N30236Q11925
33408i4108L59067k40161k84080K33620O34218L34395m01619o70289j20738L90478
33398A40783l8925q41813o96599K89266N38466m56086j135478l21820Q63009Q70277
33388g88920J95933K84292R69246R27112N6231n28682n11885n01824m01173L78189
$$ y = [-1140685, -372567, 270201, 353841, 387511, 715705, 1018844, 943751, 563321, 164873, 2398, 186910, 509671, 539881, 139579, -376713, -767358, -1119263, -1347739, -1006138, -20921, 879297, 976827, 419486, -194212, -657739, -1051436, -1188853, -814790, -150135, 338927, 607399, 992140, 1594847, 2114877, 2233636, 1843532, 1001692, -27834, -774816, -896706, -491463, 49311, 363674, 216913, -424101, -1188439, -1436269, -906033, -94108, 264959, 24798, -259282, -25662, 608556, 942951, 541332, -128957, -249695, 140783, 101858, -739955, -1436554, -1147288, -608822, -1064908, -2200386, -2522206, -1659197, -788920, -592987, -308695, 660551, 1587663, 1643894, 1115212, 603327, 101503, -299670, 78519]
33378G8519J149859M87825j236090j900899p33994N95773O94082L18750N14715
33369c1460O93780K9817o58508j29930J069185J307928L45980m23913j20226N50789
33359B633442N63493q6778o82862p56262l61034K13660O23844N64886L7945m91963
33349B258371n00293p9668P5093l80401q20981m98763K50594M47007K9817o2161
33339G18615M27192N20051k88363r68494n24638L97097N81226Q5929j84252n9058
33329G05305j8868q6888j380J0402k46253k34729L32457N50797k83552j116484
33319c89193o05928N15016M35994p64924j171408m396J366675J589659Q22061
33310A793556j73368q90198q48844L5923P38362J94758r12251r56629J19488P96562
$$ y = [78519, 1228378, 1716203, 480113, -1420786, -2154780, -1559007, -864925, -546175, -31460, 662320, 692137, 33629, -96301, 972884, 2280812, 2626792, 2202879, 2082653, 2633442, 3196935, 3110157, 2427295, 1671033, 1309999, 1523659, 2147503, 2712389, 2750334, 2258371, 1758078, 1678410, 1753503, 1373102, 552121, 53358, 303952, 750959, 780776, 718615, 1145807, 1665858, 1377495, 409001, -115637, 281460, 862686, 948615, 764363, 705305, 686437, 599549, 598169, 608571, 362318, 127589, 460046, 1010843, 727291, -389193, -995121, -480105, -44111, -809035, -1980443, -1984839, -618164, 971495, 1793556, 1620188, 729990, -118854, -82931, 655431, 850189, -62062, -1018691, -899203, -102641]
33300a02641M75621J32683K98244K65961l06647p59091p80964p54535n01002N23426
33290a508945J555872J077003n63011j204840j68002P34933L05164k16418L39516
33281C51272R05672J79717r59602q73801K27313Q00190K41025p44812j343232
33272a216258j116581k6168J135205J158343N9664o16241R3854J170353J155171
33263A797342J08409q61568j136363q13047j79169K98182J55534l56294m47351
33254a434325L0687M33635M78849M68319L14538l13113q04410j64794J062244
33245G1630J194851M5893p43784m35337j82435o40948p68215K3249N97564J39561
33235f97971m49634l68767k52874n22652l18161O63538J192193O69940K95167
$$ y = [-102641, 372980, 505663, 803907, 1069868, 763221, 4130, -776834, -1531369, -2032371, -1508945, 46927, 1123930, 560919, -643921, -811923, -76990, 228174, 11756, 351272, 1256944, 1436661, 477059, -396742, -169429, 630761, 871786, 126974, -1216258, -2332839, -2359007, -1223802, -65459, -5795, -622036, -528182, 642171, 1797342, 1905751, 1044183, -92180, -905227, -1084396, -786214, -630680, -986974, -1434325, -1403638, -970003, -491154, -22835, 291703, -21410, -825820, -990614, 71630, 1266481, 1312374, 568590, 133253, -49182, -690130, -1458345, -1435096, -837532, -697971, -1147605, -1516372, -1769246, -2291898, -2610059, -1946521, -754328, -84388, 210779]
33226B10779P07955O20529o08897j280050j93978R45406K67741j035386p73853
33217a139754N40427P89369j30605n30624k3279J88342k78905n49684k54776J26592
33207a262897M29419P46935O58842o2201o04232l29375J8834k84346m24949M31895
33197f82075J233554N61748q75678j256905l94402M33330O77920O78155L47306
33188G22953m01461o23869L42966J236706N14172j033582j376772l63168M16476
33179e65579M07451M75513P40265K97766p64719j107685k39586P62045R33055
33170I38526M65609j10972o01199q72125q23889n66829n0236R04925J650430R59982
33160A894222q46253j519496j5645J568079J014401o08359q39222K31745N95781
$$ y = [210779, 918734, 1539263, 930366, -349684, -543662, 401744, 669485, -365901, -1139754, -599327, 190042, 59437, -471187, -494466, -306124, -585029, -1134713, -1389489, -1262897, -833478, -86543, 572299, 510098, -94134, -423509, -404675, -689021, -1113970, -682075, 551479, 1113227, 237549, -1019356, -1413758, -980428, -302508, 375647, 722953, 321492, -302377, 40589, 1277295, 1791467, 757885, -618887, -982055, -565579, -158128, 317385, 1057650, 1355416, 590697, -516988, -756574, 5471, 938526, 1404135, 1293163, 691964, -180161, -1004050, -1570879, -1621115, -716190, 934240, 1894222, 1047969, -471527, -487172, 1080907, 2095308, 1486949, 647727, 879472, 1475253]
33151A475253n9083k63515K02548J04781n17422k23136R87871J322922J93320
33142C223539q11881o32041k62903p02717j221710p50002L55389R42444O17537
33133G57655m7923l59650j95636r7026n43382j043260o74670K46185L15410n80273
33123b222570p19416O05576J628557J018557J99491O98259J203904o2850j800475
33114E49033j570679L5941N19006k18223j80343P22516O51051l76257l38162R19812
33104G13695J209176p5671r36482m22755l7643n39398n18202N95369J095136O2198
33094A145423q49954l23675L87137j14623q88982m89398N21054P47042K50298
33085C84322k5877O220j08073k35933p7343N2504j75027m14357k58536J31332
$$ y = [1475253, 1416170, 1152655, 1355203, 1459984, 942562, 719426, 1707297, 3030219, 3223539, 2411658, 1779617, 1516714, 813997, -407713, -1157715, -802326, 140118, 757655, 709732, 350082, 154446, 57420, -485962, -1529222, -2203892, -1957707, -1642297, -2222570, -2941986, -2336410, -707853, 310704, 510195, 1208454, 2412358, 2349508, 549033, -1021646, -985705, -466699, -684922, -865265, -142749, 508302, 132045, -206117, 713695, 1922871, 1847200, 910718, 487963, 450320, -89078, -607280, -11911, 1083225, 1145423, 295469, -28206, 358931, 244308, -644674, -1134072, -613018, 134024, 384322, 358445, 364665, 256592, 20659, -56684, -4180, -179207, -593564, -852100, -720768]
33075g20768M29737M76445R2965n69456o52069L07584J189245O42018p08878j125722
33065f38899n04763k12674l87327J82286J336736J312297j77674j151503n53098
33056g94619J61043k27783o49663Q4269J034080P39506m06436r80153o10432Q2429
33046a567759O74290R70898P17950J31220j16764R306j61386o02740m32923L78492
33036E84O39833o8761n50483K0811P16404M46863l36569n84458k27604J72985
33026B29605M42819N83673L52880j95992m74312k34641L4998o548r3169r2267
33016E47046k85685n85392m24797K25520O63925N73623L92929L21656m0953p43099
33006F44773j103486o68008J75219P62444P53376J96740m08918l63383K95986
$$ y = [-720768, -291031, 185414, 278379, -291077, -943146, -635562, 553683, 1195701, 486823, -638899, -1143662, -1356336, -1743663, -1561377, -224641, 1087656, 909982, -241521, -794619, -633576, -861359, -1511022, -1426753, -392673, 346833, -59603, -1039756, -1650188, -1567759, -893469, 77429, 795379, 926599, 809835, 819141, 657755, 55015, -377908, 584, 640417, 571656, 21173, 41984, 758388, 1205251, 868682, 284224, 56620, 229605, 672424, 1256097, 1608977, 1412985, 938673, 704032, 739030, 732482, 639313, 547046, 261361, -324031, -748828, -523308, 140617, 714240, 1107169, 1428825, 1387872, 644773, -458713, -1126721, -951502, -189058, 564318, 761058, 352140, -11243, 284743]
32997B84743N69753p9385p92896o86361k16692o0124K45969J061778J245905j04512
32987A468178j566872j225273K63945P74275J54337L3660O87056P82575Q7541
32978A459422k04521J07359k3634o20165n54542J72012L55462j02762j33966K08723
32968F63388j76882r89167o62837P80139J471083O36203m91868r51828r86754
32959g08523n91318N06479J327986N65169r02146r36820L76251Q74307P341n14574
32949D152k1194J64806m17846m90336K95005N59714j74736o38758k73385p8360
32939a070938m37653m94174j09403p3537j73307M75639J214932O80052l50084
32930c38473P516J094906N71020j186672j382293K65153R42326k84731j010493
$$ y = [284743, 854496, 775111, -17785, -704146, -920838, -980962, -734993, 326785, 1572690, 1468178, -98694, -1323967, -1060022, -285747, -131410, -97750, 589306, 1371881, 1459422, 1254901, 1362260, 1338626, 718461, 163919, 335931, 691393, 588631, 454665, 663388, 486506, -502661, -1165498, -385359, 1085724, 1721927, 1230059, 278231, -708523, -1299841, -793362, 534624, 1099793, 197647, -739173, -362922, 511385, 518726, 4152, -17042, 147764, -270082, -760418, -465413, 94301, -80435, -719193, -992578, -1070938, -1508591, -2002765, -2112168, -2185705, -2359012, -1883373, -668441, 11611, -338473, -330957, 763949, 1334969, 148297, -1233996, -968843, -26517, -311248, -1321741]
32921a321741J5815R21484M74037K4213L53340K12818o55458n99720N50224P39399
32911G14411m16018o66860O30085J119259k18392j154249l08905N56358J00690
32902C56379l49756J35958L26303k05703O9637J217754R99189r01200j694028
32893d5467l12194N99198n03813j354018k34770R62862N36236L05P29269J210256
32883A587864K66484m57059K08493N69728n13995j197327j35037Q82989K50276
32874A462416o77192m61583j16131n62568o67252J61878N39873K7844K09822J302064
32864A219171J237184l85676j182951k20946N31472K09912L64173J224548J133056
32855D129943N03660J377132K459153M01929l304754l411004M9294J234163j323083
$$ y = [-1321741, -1305926, -384442, 89595, 113808, 467148, 679966, 24508, -575212, -24988, 714411, 298393, -368467, 261618, 1380877, 1162485, 8236, -300669, 255689, 356379, 6623, 142581, 468884, 263181, 332818, 1550572, 2549761, 1648561, -45467, -357661, 241537, -262276, -1616294, -1851064, -888202, -351966, -351661, 377608, 1587864, 1854348, 1397289, 1605782, 2175510, 1661515, 464188, 329151, 1212140, 1462416, 785224, 323641, 207510, -355058, -1022310, -860432, -320559, -292715, -82893, 1219171, 2456355, 2070679, 887728, 666782, 1198254, 1408166, 1772339, 2996887, 4129943, 4633603, 6010735, 8469888, 8871817, 5567063, 2156059, 2205353, 3439516, 2116433]
32846B116433k173646Q28893K402221l37092k481013m67691J583275K3466j631137
32837a36291L2247J737991K73100j190179L31342J565130l21317j757431K13127
32828G47719J795348k39791k034900j02195J736747j77100k024017N1432K255777
32819B009020M68688j772433l29554J570330K60850p77324J670295L131262j27111
32810F104023l040101q66188J730675j70965k061753Q80360L939258K359872J160456
32801A0035637M419673N061378k191274q250398m075097K778748J308209l606274
32793E480602j752656K693509L52805l976565p51182M440398J144634m549541
32785C082004r67472N525170J920847n021376m63156Q491367M457750n360443
$$ y = [2116433, -57213, 771680, 3173901, 2836809, 355796, -111895, 1471380, 1494846, -136291, -104044, 1633947, 1907047, 716868, 1048210, 2613340, 2292023, 534592, 747719, 2543067, 2303276, 268376, 166181, 1902928, 1725828, -298189, -246757, 2009020, 2477708, 705275, 375721, 1946051, 2206901, 1429577, 3099872, 6231134, 6104023, 3063922, 2197734, 3928409, 3757444, 1695691, 2576051, 6515309, 8875181, 10035637, 14455310, 19516688, 17325414, 9075016, 4999919, 7778667, 9086876, 5480602, 3727946, 6421455, 6774260, 2797695, 2046513, 6486911, 7631545, 3082004, 2114532, 7639702, 9560549, 4539173, 4076017, 12567384, 17025134, 11664691]
32777A1664691R086J3934292J0361721o227264k661731K1740828K0860474k9051155
32769D0630942q1644829o9483538K1008505J39996346K14733594J89121924O1750654
32762E16113598r0251627j59911288j16041557l5915803o265653k4024393l0700577
32755E3002700j0068227L111146o162757j2845713l326314L337013m280379r709126
32747A3058343k034807M581828o95326o286640j995951K919862l63886l941869
32739E241554l74001K941555n14301l473922J25214L014062q45095m187672m01686
32730A525708L887665J441511k627161j440623J246696j96811k272768k51224
32722A312993K086652J58750k340176r02745J178019j12978j536599M26673K134175
$$ y = [11664691, 11673777, 25608069, 35969790, 29742526, 27080795, 48821623, 69682097, 40630942, -41013887, -110497425, -89488920, 50507426, 265241020, 454362944, 516113598, 425861971, 265950683, 149909126, 113993323, 107727670, 83703277, 53002700, 42934473, 46045619, 39882862, 27037149, 23710835, 27047848, 22767469, 13058343, 11023536, 15605364, 14910038, 8623398, 6627447, 9547309, 9183423, 5241554, 4867553, 7809108, 7294807, 3820885, 3946099, 6960161, 6115066, 1927394, 1525708, 5413373, 6854884, 4227723, 2787100, 4033796, 3836985, 1564217, 1312993, 3399645, 3558395, 1218219, 315474, 1493493, 1380515, -156084, 270589, 2404764]
32713B404764k4443k218434m21354J906540O66426j124571L25055J984074L6601
32704C534658k499171j373136J156405J025926l25181J66215R31688l87701j564174
32695F65529j57189J314291J45940j218508j1911J383714J49009j436852n17705
32686C16318Q47271K4541q69149O66045K198621Q10317j294748r29274L31637
32677B101579k45719j139179J2229J344498L23565j198791n53319N99486l02442
32668I41907j549846m55685J364410R64403o28193p98318j49133m23293n72525
32659a306273O81867J370524k56873j840873q62261O73190p606j223756j57747
32650b929808J654020J167821n09919l53323J019752R34672k37958k92514L49281
$$ y = [2404764, 2380321, 161887, -259467, 1647073, 2313499, 1188928, 1513983, 3498057, 3534658, 1035487, -337649, 818756, 1844682, 1519501, 1685716, 2617404, 2229703, 665529, 508340, 1822631, 1968571, 750063, 738152, 2121866, 2270875, 834023, 316318, 1163589, 1188130, 318981, 985026, 3183647, 3993964, 2699216, 1769942, 2101579, 1855860, 716681, 728910, 2073408, 2396973, 1198182, 644863, 1244349, 941907, -607939, -1063624, 300786, 1265189, 636996, -161322, -310455, -733748, -1306273, -624406, 746118, 489245, -1351628, -2213889, -1540699, -1548305, -2772061, -2929808, -1275788, -107967, -617886, -971209, 48543, 983215, 745257, 452743, 802024]
32641H02024j27280r73820l89402P31343N27380j88102K00277O69444k22903r57818
32631G1143J72737J301602J36972j528109q44292Q81478O45082p25674l87835
32622b76896J001671O38184r70131r33244O18695R36745k27532n67762J76752
32613C96482M3839r74704q38462M89711Q46949j84345p45639k07381J26217j35002
32603a182335p963M85773L40046j64116J31263Q61006O75979k46086o30871m34182
32593a71486m31819l46546L00337N69053k67952q10757J77299J111864J37864
32584B67857j255294n09189J476043J716207P5582q49398j88823L99309Q9527
32575A221821k26629k66483o11736q29674m2881R64883P68405j18112j91701K78279
$$ y = [802024, 674744, -299076, -688478, 42865, 570245, 382143, 582420, 1251864, 1028961, 71143, 243880, 1545482, 1682454, 154345, -689947, 191531, 836613, 110939, -276896, 724775, 1362959, 392828, -540416, 78279, 1015024, 787492, 219730, 396482, 440321, -534383, -1372845, -883134, -36185, -220530, -966169, -1173550, -1047333, -1182335, -1190298, -704525, -364479, -528595, -397332, 463674, 1139653, 893567, 262696, -171486, -603305, -949851, -649514, -80461, -348413, -1159170, -981871, 129993, 267857, -987437, -1496626, -20583, 1695624, 1771206, 921808, 732985, 1132294, 1221821, 995192, 728709, 116973, -712701, -755582, 209301, 977706, 859594, 667893, 946172]
32565I46172M9324m48440l7007N88153N8886q04518l43873P02559M69179n07290
32555F73145l55385M66269J14008q50980l98827Q34255L33913j589755j925442
32546b698799J2133J552563J156434K90899J76634J00641k57045j9876N84967
32537H98551J42580j037348r05542P35336J592356N98039o30239q28892p14735
32528a49894p35689o6124J157813J341402K39228l28936L85128P64315k07819
32519B399424j170995q37762K7037L13157K30892J99858r286j69652M01066J090097
32509B473836M35784j084286j235243K37685Q62583m22978j346670k03947J161946
32500H78710N50029q69088p05273O07934P98463l84108j098805o35796j43801
$$ y = [946172, 995496, 547056, 510049, 1098202, 1157088, 352570, 8697, 711256, 1180435, 673145, 317760, 784029, 898037, 47057, -351770, 482485, 816398, -773357, -2698799, -2686666, -1134103, 22331, 313230, 489864, 590505, 333460, 313584, 898551, 1041131, 3783, -901759, -166423, 1425933, 2023972, 1393733, 564841, -149894, -885583, -951707, 206106, 1547508, 1786736, 1457800, 1842928, 2607243, 2399424, 1228429, 390667, 417704, 730861, 961753, 1161611, 1152325, 982673, 1383739, 2473836, 2909620, 1825334, 590091, 827776, 1690359, 1267381, -79289, -283236, 878710, 1428739, 559651, -145622, 462312, 1260775, 876667, -222138, -857934, -1001735]
32491a001735k17893j2116Q71075J397114P01110n09593r14717l14648K55015
32482B53612l1902p26370p42737J07922P88898N02310j73818k60972J16611J67609
32472A163r3250k90L76157K74563l49253o80183l96010l0214R2573J68870J18590
32461e17284l53539q24473m97639L93601P65817M16254K51702N49672M27600m49033
32451A62678j000637l56270P49142J069813N43180N7101P5657K53237J52866j83631
32441A523136l35070k0225M21192K67273n90317j242336q56255J66919P39817
32432G4134M77045j04333m43122l32989J81958O62882M65743k79009m86419L09568
32422E25458R57488L01292r32317j138852j86628O08456N09013J0520l24297m36167
$$ y = [-1001735, -1219628, -1231744, -360669, 1036445, 1737555, 1227962, 313245, -1403, 253612, 221710, -504660, -1247397, -1139475, -350577, 151733, -22085, -283057, -166446, 1163, -92087, -92377, 283780, 558343, 209090, -471093, -867103, -897317, -804744, -635874, -517284, -870823, -1695296, -2192935, -1799334, -1033517, -617263, -365561, 184111, 611711, 162678, -837959, -1194229, -445087, 624726, 1167906, 1225007, 1300664, 1553901, 1706767, 1523136, 1188066, 1167841, 1589033, 1856306, 1265989, 23653, -832602, -665683, 74134, 551179, 446846, 3724, -329265, -147307, 515575, 981318, 702309, 215890, 525458, 1482946, 1784238, 851921, -286931, -473559, 134897, 643910, 654430, 330133, -106034]
32412a06034l00592K7732Q5096l36453n61293k5460O44338O13859K38818K61411
32402E41422L55374j07449n83001k60104K52180q1753o74176k26570Q08647Q28093
32392H52663j42436n03849J40482N27797J96586J32601N88781M79506m59501r88274
32382H24356n55876k23418o02997p59909r7010M37199Q0893l89673j52767K33260
32372a205942L5009k76077R412N52730P07619O05341N39969J86894o04347j081353
32362e30745o35960J16109K33582j47425j89946K91942O63045M32781j86233n90096
32352e42946l91369J50227L21669j33638n29266j84855M61515M95280J6281l8679
32342c75781N18323Q27742L95646k34008m65137l96156l11471k13586j03070p1422
$$ y = [-106034, -406626, -378894, -293798, -630251, -1191544, -1217004, -572666, 41193, 280011, 541422, 896796, 789347, 206346, -53758, 198422, 116669, -557507, -784077, 24570, 852663, 710227, 206378, 346860, 874657, 1071243, 1203844, 1792625, 2272131, 1812630, 824356, 268480, 45062, -557935, -1317844, -1414854, -977655, -896762, -1286435, -1439202, -1205942, -1170933, -1447010, -1437598, -884868, -177249, 428092, 968061, 1154955, 550608, -530745, -1166705, -1050596, -817014, -964439, -1154385, -862443, -199398, 233383, 47150, -542946, -934315, -784088, -462419, -596057, -1125323, -1310178, -848663, -353383, -337102, -375781, 142542, 970284, 1365930, 1131922, 666785, 270629, -40842, -254428, -357498, -428920]
32332d28920K143K56096M00145R7267l55048l89612J5127N33040J077780J438671
32322B646689R50802m53092j493437j069857L9655L42049j03464j25274L75466
32313A109537M40131m3035k43142o2207j70015m68612k64116J39709j59419p65364
32303d86533m25353O56927J002709M17918J92190N52939K71690p47501r31356
32294E03630J41035P64439N771o90554j04782O41118J37686r13261j051253m14029
32284i80200r7716k43161k44427j2366K07459N10664Q54205P42076J93120K5532
32274I55186M18104L65483n60322j170145m66771O50478P06095k35520r43507
32265b80919p95900j56005M40752O53773M05623J11282K42182M51099M7657n75061
$$ y = [-428920, -426777, -170681, 229464, 326731, -28317, -417929, -402802, 130238, 1208018, 2646689, 3597491, 3144399, 1650962, 581105, 620760, 962809, 859345, 734071, 1109537, 1549668, 1506633, 1263491, 1201284, 1031269, 562657, 298541, 438250, 278831, -486533, -911886, -254959, 747750, 1165668, 1357858, 1910797, 2182487, 1434986, 503630, 644665, 1409104, 1414875, 724321, 619539, 1260657, 1398343, 485082, -566171, -980200, -1077916, -1321077, -1565504, -1577870, -1370411, -859747, -5542, 736534, 929654, 955186, 1373290, 1738773, 1178451, 8306, -458465, 192013, 898108, 662588, -280919, -1076819, -1232824, -792072, -138299, 267324, 378606, 620788, 1071887, 1119544, 544483]
32255E44483l15725O43873Q56299K4615m38570P0895K69427n81704j209288o46261
32245g81956m4971m93834q53324K09173J572896J323055r1436o90291j55929J14962
32235A08345l28761n33827j94448q9719l58392j59329O78495J224600R80724N07846
32225A835534K19542k26581r51035j313780q34861N5249N57464L51564k40684
32216e47588n96803l25987K81958N42484K85312K7751N4565M0567r0060J48151
32206a79650P18448O98953k16258q96067m45913L15479K53759j84153N4118N65202
32196F83918J53290q99328j064946k5297Q25314N71947n0735j03891K59431M83757
32186H33460M90157K91495l20907j111535j261281n42866Q7374j93076p39098
$$ y = [544483, 228758, 872631, 1728930, 1753545, 1314975, 1385870, 1655297, 1073593, -135695, -781956, -826927, -1320761, -2174085, -1964912, -392016, 931039, 839603, 149312, -6617, 108345, -220416, -754243, -948691, -1038410, -1396802, -1556131, -877636, 346964, 1327688, 1835534, 2055076, 1828495, 877460, -436320, -1271181, -1215932, -658468, -306904, -547588, -1144391, -1470378, -1188420, -645936, -360624, -332873, -278308, -237741, -327801, -179650, 538798, 1237751, 1021493, 125426, -320487, -5008, 248751, 64598, 118716, 683918, 837208, -62120, -1127066, -1152363, -327049, 244898, 194163, 90272, 349703, 833460, 1323617, 1615112, 1294205, 182670, -1078611, -1621477, -1534103, -1727179, -2466277]
32177b466277k90886J123732K046617J446876m647q66741o34141r685K39266N6252
32167F40366k45698m28383k43838M29379J037654O69977n49683j179718l71940
32158b41884P19963N64313l96525m86005N10808J089647M69139m07743o31782
32149A189931n00753m30795j69556K67189K14402m03524o78268j94837L05725
32140d00486K97321J80471P7911n42999j346919r67773O23790J397395K75770
32131d05519q93573j50603J371846J252886l47490j078337j22509Q62394N50480
32122A039575l70433o98169k99029K61286N06415J77165n27080q04361j92394
32113i07025N50756M49685j54253k10170K58024L38407m665J15308P14509O58856
$$ y = [-2466277, -2757163, -1633431, 413186, 1860062, 1855415, 988674, 354533, 344848, 584114, 640366, 394668, -33715, -277553, 151826, 1189480, 1859457, 1309774, 130056, -241884, 478079, 1042392, 645867, 159862, 670670, 1760317, 2229456, 1821713, 1189931, 689178, 258383, 88827, 356016, 570418, 166894, -511374, -706211, -400486, -103165, 77306, 155217, -387782, -1734701, -2702474, -2078684, -681289, -405519, -1299092, -1449695, -77849, 1175037, 827547, -250790, -373299, 489095, 1039575, 669142, -29027, -328056, -66770, 439645, 616810, 89730, -714631, -907025, -356269, 93416, -60837, -271007, -12983, 325424, 320759, 436067, 1150576, 1809432]
32103A809432m14784j295355r75166r4894J80022j41212j84024L12731O98981
32094a04269M57295j08460l67573k14118j52525n09030q17821l61617P41311J530735
32084I3928J423397Q46274L82338m8358o77150j176841j116818o97795m07729
32075a378754k86984r5584J23169J89969K08007L62149N70462O72550O19921K76319
32065A261224m31082r91120p10466J14725L87434p0553j56848N85008J034980
32056A023302M10976k83482j8975L64126l18501j277585r59748J70458K76283
32047f13146p24562r72067K10839J199965P27913k52602l44126K03846L48822
32038b15118M0445q6432r996j04957j18026M76702J274459J161706q3661j240831
$$ y = [1809432, 1394648, 99293, -875873, -970767, -790745, -931957, -1115981, -803250, -104269, 353026, 244566, -123007, -337125, -489650, -998680, -1816501, -2178118, -1436807, 93928, 1517325, 2363599, 2745937, 2697579, 2020429, 843588, -273230, -971025, -1378754, -1665738, -1761322, -1638153, -1448184, -1240177, -878028, -307566, 364984, 984905, 1261224, 830142, -160978, -871444, -756719, -369285, -439838, -596686, -11678, 1023302, 1434278, 1150796, 1131821, 1495947, 1177446, -100139, -1059887, -889429, -613146, -1337708, -2309775, -2098936, -898971, -171058, -423660, -767786, -563940, -215118, -174673, -261105, -271101, -376058, -494084, -17382, 1257077, 2418783, 2335122, 1094291]
32028A094291j127162j18670L82764k00549r65600q64710m9476O01624P64341
32019d83147P16318M66596j70792p51868n54359J49585L07847k18633m24792L5279
32009i27966K39459k00934k78888M93484Q53409j41930j193094o59901O92282
32000a124079Q60989j81918o25929Q8102N36644o2520n50491Q1161R37272O53198
31990F12429m63388q59715J23375J394803J409626m0034j493093j409075m126
31981g29198J030349P53708M9473J550K55884l0014n40412m36998J1458q1948
31971B83852n01053k40418O22735R21829L30978j80074o0865M3725l61663p54287
31961A04759o04812k13112J2006K13799N02193M98912R326m88142n12270k30823
$$ y = [1094291, -32871, -151541, 231223, 30674, -934926, -1799636, -1849112, -1247488, -483147, 233171, 699767, 528975, -222893, -777252, -627667, -319820, -538453, -963245, -927966, -688507, -889441, -1168329, -674845, 178564, 36634, -1156460, -1816361, -1124079, -263090, -445008, -1070937, -982835, -446191, -508711, -1059202, -978041, -40769, 612429, 149041, -710674, -587299, 807504, 2217130, 2177096, 684003, -725072, -729198, 301151, 1054859, 1104332, 1105882, 1361766, 1331752, 791340, 354342, 365800, 283852, -217201, -457619, 165116, 1086945, 1417923, 1237849, 1176984, 1220709, 859046, 104759, -500053, -713165, -701159, -487360, 14833, 513745, 523071, 34929, -477341, -708164]
31951g08164n9462o5150q9668o8626L3304K67731N02098M75375J72797j11323
31941C48912j44680m25N5264j74913n27307m69840K23241Q35731M52532n75655
31931B2860q75314p3018N73050J69421m31858j97642L47835K14147k60954j69495
31921f80968K51615K12453j5150L09395P59260L87091m13948m16667L43242O60294
31911A396617J64612m00830p21766j050260r67142J79318J584800J559870n640
31902A739579j406635j526821q59393l4194Q91374J440207Q49590l76008p42104
31893b4405j2095M82086J29114j60839J02279J43397l29253m00285K23297M57693
31883F10989j79948n85692n8647M16468k3145o32005n32217j46745O33L63097
$$ y = [-708164, -767626, -832776, -922444, -991070, -957766, -690035, -187937, 287438, 460235, 348912, 204232, 203807, 259071, 84158, -443149, -912989, -689748, 145983, 598515, 22860, -852454, -925472, -352422, -183001, -614859, -812501, -464666, -250519, -511473, -680968, -429353, -216900, -232050, 77345, 836605, 1223696, 809748, 393081, 736323, 1396617, 1561229, 1160399, 438633, -611627, -1578769, -1399451, 185349, 1745219, 1739579, 332944, -1193877, -2053270, -2087464, -1196090, 244117, 1093707, 717699, -24405, -36500, 445586, 574700, 413861, 516140, 659537, 330284, -70001, 153296, 610989, 431041, -154651, -213298, 203170, 180025, -451980, -984197, -1130942, -1130309, -767212]
31873g67212J015317Q41652m71022j209610j12434J343277J063371m10544q79471
31864D13324P2300P81296L03003n03926p20941n22940l66926k97512k56182j63170
31854a261674K57727R29572J018630J6100j170725j282245n05552m7242k10001
31845b255410j92850L00397N97064L55312J15780K23747K36178j55192m61975
31836a236949j83022L71592N61864L18447J03094J97784M13949M47548K54717
31827A249024k583k42508m86979n84041k40516M20433P12201K79242k24489n6234
31817H23550L57601P5697o59551o76504Q8227L07545m85436r04680O9386J234048
31807B29883Q84161n77838j282846o10058K54883L24282l190M2429M51271O92444
$$ y = [-767212, 248105, 1089757, 618735, -590875, -703309, 639968, 1703339, 1292795, 413324, 485624, 1266920, 1569923, 1065997, 345056, -177884, -544810, -842322, -1098504, -1261674, -1003947, -74375, 944255, 960355, -210370, -1492615, -1998167, -2045409, -2255410, -2448260, -2147863, -1550799, -1195487, -1079707, -855960, -619782, -774974, -1236949, -1419971, -1048379, -486515, -168068, -64974, 132810, 546759, 994307, 1249024, 1246441, 1003933, 516954, -67087, -307603, 112830, 825031, 1104273, 879784, 823550, 1181151, 1256848, 597297, -79207, 9020, 316565, -168871, -1073551, -1004165, 229883, 1114044, 536206, -746640, -1356698, -1101815, -777533, -780723, -738294, -287023, 405421]
31797D05421N11268J46838J2835K28061L74667m8880q43442j232245r28991m60018
31787a834486j78764K19349P58983P16527j62746q68681n21000K01445J59205
31778a510168l56544j61699P74098J256277P96543K35945J93380J41741m42005
31769I27568j014257q07323j07821J19227l37688n96877O7562J108262J293427
31760F52080L31371o69066o80968j32970p6896m24698j69723O99636R04647p4019
31750C59394r95228p15877J13420K59499j55347j53765L73041P17429O44686M37617
31740H84869P0741n01548o66646r858N61919l7283j103551r31950M56711J139140
31730a37456K22880p76385l42056P45878P85493j98549o75759m5671O08734L41214
$$ y = [405421, 916689, 1063527, 1076362, 1304423, 1679090, 1630210, 786768, -445477, -1374468, -1834486, -2013250, -1793901, -1034918, -318391, -481137, -1349818, -1870818, -1669373, -1510168, -1866712, -2028411, -1254313, 1964, 798507, 1034452, 1227832, 1369573, 927568, -86689, -894012, -1001833, -882606, -1220294, -1817171, -1749609, -641347, 652080, 983451, 314385, -366583, -499553, -576449, -1001147, -1170870, -471234, 433413, 359394, -635834, -1351711, -1238291, -978792, -1134139, -1287904, -914863, -197434, 447252, 884869, 955610, 454062, -212584, -222442, 339477, 302194, -801357, -1733307, -1276596, -137456, 85424, -690961, -1033017, -287139, 498354, 299805, -375954, -421625, 187109, 528323]
31720E28323k83232k34969L14373K67378o31672j227376n56763O57364R29597
31711b36977J11359m84893j40913K69523j05889n96932j50492Q08115R41865P7207
31701D91973n94635l91364r285k29425p47733p83297j80470N66446R64930Q68778
31691d4082M75474J69032J25571O8589k82456o42241n00528N8665M29421L57450
31681B14895J71259J10283J8983j66000j79782J19765M95452O71205N57174J03753
31671B116987o09456j103811q57496n4177N29174N09491K45452O3028k24742o94297
31661g9847q16602j55278P86047J021956L17291n12736o04540j5718M73580L48663
31651G62816r8927k69753q0566o64k87727n73576m16590N6609L86698M25670L75120
$$ y = [528323, 245091, 10122, 324495, 591873, -39799, -1267175, -1823938, -1166574, -236977, -125618, -610511, -751424, -481901, -587790, -1184722, -1335214, -527099, 414766, 491973, -102662, -494026, -503311, -732736, -1480469, -2263766, -2444236, -1877790, -912860, -44082, 431392, 600424, 725995, 794584, 512128, -130113, -630641, -571976, -142555, 214895, 386154, 496437, 515420, 349420, 169638, 289403, 784855, 1456060, 2013234, 2116987, 1507531, 403720, -453776, -507953, 21221, 530712, 776164, 839192, 614450, -79847, -896449, -1051727, -265680, 756276, 1073567, 560831, -43709, -59427, 414153, 762816, 663889, 394136, 313570, 312906, 25179, -548397, -964987, -908378, -521680, -96010, 279110]
31640B79110L44159K60734J34878M3402r5441m00142p24172p79851n18707j34556
31630a590586K07728L95118L06072M8657L6560M17802O56155K10990n32066o49714
31620d93284J6794O06100M23066k12182n48541l41839R8167L99887L24125k32073
31610D0220j034124j449176r46314K87796J401926J626432R49580N0079m20527
31601E05892m22213l34588l27618k24245J5097R4350j23728k94838q0932L28864
31591h63959N26461M65026L78260L44121K84744J97401O2302k37247n93790o14040
31581e0721k54219j01140n15037r27568o40004Q2661M81543M99134N95802O72853
31571a56696K74778k53539l7632P68951R47812J10082n87885k40764M05171K00761
$$ y = [279110, 623269, 884003, 1018881, 1062283, 966842, 566700, -157472, -937323, -1456030, -1590586, -1382858, -987740, -681668, -633011, -596451, -178649, 477506, 688496, 156430, -493284, -476490, 129610, 552676, 340494, -208047, -549886, -451719, -51832, 272293, 40220, -993904, -2443080, -3389394, -3101598, -1699672, -73240, 876340, 926419, 505892, 83679, -250909, -578527, -802772, -787675, -693325, -817053, -1111891, -1192823, -863959, -337498, 127528, 505788, 849909, 1134653, 1332054, 1394356, 1157109, 563319, -50721, -304940, -406080, -921117, -1848685, -2488689, -2406028, -1924485, -1425351, -829549, -156696, 118082, -135457, -173089, 595862, 1543674, 1653756, 1065871, 825107, 1230278, 1431039]
31561A431039o55969j108459q32055l32840Q8200M90467O99091M56443N222k31406
31551I733l46812o13562p39755k90130M00081O37587M93714N27328N71620p38
31541F49066q00874o01679O49034J368708N86086n86653o62274J10450M90004
31532A201868K29503q149j24730n45588r99086p45450K6241L38540K4157r4482
31522f97176K23750K25511l17279m91964K39797J063112J074412N32429J01779
31513A954371k06651n19836m25183K53141P61787M58936j30015k41019j63685
31504A741846n66462j170102j225164p75620l12928K76199J171905J580000O95431
31495A415105o51827q87051o4834K77274l44171o97308m8518O37860L91874k84365
$$ y = [1431039, 775070, -333389, -1165444, -1498284, -1410084, -919617, -220526, 235917, 241139, 9733, -337079, -950641, -1690396, -1980526, -1580445, -942858, -449144, 78184, 649804, 649066, -151808, -753487, -104453, 1264255, 1850341, 1263688, 601414, 711864, 1201868, 1431371, 1423222, 1298492, 752904, -246182, -991632, -965391, -626851, -602694, -697176, -473426, -247915, -565194, -1057158, -817361, 245751, 1320163, 1852592, 1954371, 1747720, 1227884, 802701, 1055842, 1817629, 2276565, 2146550, 1905531, 1741846, 1175384, 5282, -1219882, -1995502, -2308430, -2032231, -860326, 719674, 1415105, 763278, -123773, -188607, 88667, -255504, -952812, -1001330, -363470, 28404, -255961]
31485b55961m74381k57367j86142k21296j5134L45880N22292L98020L2308l77984
31475d89765l93564J51400N79942J98902m31911k16818N93597P17014Q7317j1863
31465G84251N71758L07542j195535j905257m04003J572591J553624l7684p99300
31456D47987l2077P13866M42344n0594P0986M23983L80000M8935k07608l81189
31446A856633n55320o27777m95997j43302L83408P52274M49947m41949j033102
31437A44815p40362j09683Q0768n7591j5888J28826O8597J7345K07852K07542
31427f7779l10458o91464k37367N28231O52475K89297K26307L55210j4660o32079
31417I7713n50235J89649N28404J27059j83814Q5210L34011R648n05209n72573
$$ y = [-255961, -730342, -987709, -1173851, -1395147, -1410281, -1064401, -542109, -144089, -111781, -489765, -883329, -731929, -151987, 46915, -384996, -601814, -8217, 708797, 796114, 784251, 1356009, 1663551, 468016, -1437241, -1841244, -268653, 1284971, 1247287, 447987, 415910, 1129776, 1572120, 1521526, 1592512, 2016495, 2396495, 2445430, 2237822, 1856633, 1301313, 673536, 177539, 34237, 417645, 1169919, 1619866, 1177917, 144815, -595547, -705230, -624462, -682053, -697941, -569115, -500518, -483173, -275321, -67779, -378237, -1069701, -1307068, -778837, -126362, 162935, 389242, 744452, 729792, 97713, -452522, -262873, 265531, 392590, 208776, 293986, 627997, 637645, 132436, -440137]
31407d40137j45721L84743O51968M72891q963l63884m17618m68092n71973k05309
31397a112095P25001J254014O74975j94876j85309L95223L64860l98266r80264
31388E43263r87590p19117j85322O20292R05674J13409o50838M163J297386J211443
31378B152763k73218j116780n40682m4001n62192r61003l17555M34873L55039
31369h72756J14780M60895P40871L33626k1557K29474J15757j009771j708905
31360a617586n01870J405027J567546j19481j364290q07750M72105R24893L99323
31351C57917l20748o36683l84341J83581M21911k8331n59685k92557O19500J157624
31341E18188Q62626K54694j98125o24835j028259q65907J21569J176149J202348
$$ y = [-440137, -585858, -201115, 450853, 923744, 914781, 550897, 133279, -334813, -906786, -1112095, -387094, 866920, 1541895, 1347019, 1161710, 1556933, 1921793, 1523527, 543263, -444327, -1163444, -1348766, -728474, 177200, 290609, -360229, -356066, 941320, 2152763, 1879545, 762765, 222083, 178082, -384110, -1345113, -1662668, -1227795, -872756, -757976, -297081, 443790, 777416, 755859, 985333, 1101090, 91319, -1617586, -2119456, -714429, 853117, 733636, -630654, -1438404, -966299, -41406, 357917, 37169, -599514, -983855, -800274, -378363, -406694, -966379, -1258936, -639436, 518188, 1380814, 1635508, 1437383, 812548, -215711, -1081618, -960049, 216100, 1418448]
31332A418448O3000j166870j299030k66835Q20368R03027J53057l13968J02504
31323D13701P38248O24017j77602o86888l61809J80554K5567p71244j224604p52545
31313a992605L1552K58090J13660M28903J117860J132792K37126l98402m7103
31304H81873L45657j56226p41440k81265M89125J20410q61319o26178P73827J247849
31294A192313L8343j048027n74866M58854O15614K34698K69420M31529J5725n65451
31284A068152n16852n7255J55829J76929K63656J12685l37789l26447L91722O84242
31274A614872k16930j180560q29213K66958O53294L50510L66590N79227Q4371
31265A689119p49558o00065M94196J022056L76373l65716l49765q0485k08035
$$ y = [1418448, 1481448, 314578, -984452, -1251287, -430919, 472108, 625165, 311197, 413701, 1151949, 1775966, 1598364, 911476, 549667, 730221, 755788, -15456, -1240060, -1992605, -1961053, -1702963, -1589303, -1160400, -42540, 1090252, 1327378, 928976, 881873, 1227530, 1071304, 329864, 48599, 537724, 658134, -203185, -829363, -55536, 1192313, 1230656, 182629, -392237, 66617, 682231, 916929, 1186349, 1617878, 1633603, 1068152, 551300, 494045, 649874, 826803, 1090459, 1203144, 865355, 538908, 930630, 1614872, 1397942, 217382, -611831, -344873, 308421, 658931, 1025521, 1604748, 1689119, 939561, 339496, 833692, 1855748, 2232121, 1866405, 1516640, 1436155, 1228120]
31256A228120n05938n54612l91972j25563K05118K57703j80149m50954J57834
31247c60413R82445P27793l91159q24302j63423K74095k26678o43479j67653M18061
31237c74713L45860K54159O91188P01718m93146j626512j071481M50295Q68169
31228b54463j373l60178M49077R15684L3248r61587o15010M80792P97856J97800
31218F81846k86231l04485l38210l37130K65794J126352J023165k41451j194498
31209C95152o49099O28924J040847K57868o70216q44376l05222M01314O78767
31200I33959J55629p82970j036483j11736R49684Q59580o0294m27826L8448K70432
31190G88423j97170m99513o3413M28208L32399P4256J28159J08550k86217m97993
$$ y = [1228120, 722182, 167570, -224402, -349965, -144847, 112856, -67293, -518247, -360413, 622032, 1349825, 958666, 134364, -29059, 245036, 18358, -625121, -792774, -374713, -28853, 225306, 916494, 1618212, 1125066, -501446, -1572927, -1122632, -254463, -255836, -616014, -166937, 748747, 781995, -179592, -794602, -313810, 484046, 681846, 395615, 91130, -247080, -584210, -318416, 807936, 1831101, 1589650, 395152, -253947, 374977, 1415824, 1673692, 1003476, 159100, -146122, 255192, 933959, 1089588, 306618, -729865, -841601, 108083, 967663, 907369, 479543, 517991, 788423, 591253, 91740, 28327, 456535, 788934, 863190, 991349, 1099899, 813682, 315689]
31180C15689j75248N4396j55840j5506Q01436R59587m85136j917897j141579J121993
31170f38105K032849P85172m63416j89787L83372k11342j184467j039878r3062
31161f18664L08109Q5734K12458P55059P97436J35056m10476m19960l66182n06553
31151b7983m23182J5357K35665m9277k72406L4861M26075K80427j99062l86209
31141c65734k12012n4124N1041L32198N63248K22884n43955q71755l56308L27967
31131i06550L76276p8745l09260m3313L17595L35045j1050l70549k77424L95333
31121e72642J020125O94467m97079j242472o26628N25370P71175J02317k18029
31112d3396K99632P44951M29286r1318j56497j17964n29474j004199q03773j02768
$$ y = [315689, 140441, 194837, 38997, 23491, 824927, 1784514, 1299378, -618519, -1760098, -638105, 1394744, 2179916, 1716500, 1526713, 1910085, 1698743, 514276, -525602, -618664, -310555, -224821, -12363, 742696, 1540132, 1675188, 1264712, 844752, 478570, -27983, -451165, -435808, -200143, -249420, -521826, -486965, -60890, 219537, 20475, -365734, -577746, -631870, -580829, -248631, 314617, 537501, -6454, -878209, -1234517, -906550, -530274, -609019, -918279, -961592, -643997, -308952, -320002, -690551, -967975, -572642, 447483, 1141950, 644871, -597601, -1224229, -698859, 72316, 174633, -43396, 256236, 1001187, 1430473, 1339155, 1182658, 1064694, 535220, -468979, -1272752, -1375520]
31102a375520K41309j2155k18331R4211N29816M07509l13883r49866q67290j88263
31092b652463M10384N41637M24697K59138j63782p84635q20165J75254J222116
31083a387819R85683k45369q61803k48732N01280M58824J04963J55805L68543
31074a68625K77036Q9611O6233q1468m07313k77525M78352Q93851K79419n55903
31064E93668n25279P1669K16672j49235k83090j1588J56663j0703k94632m95509
31054g31364l91700K57036J020139Q74671k54281r74903m28554K75555p7855o44872
31044a076128K0013J236547J079097m16832j171890k80913P88724O75309o3044
31035G90883l30313j46179p0722j38150j34208q6614K3478K75696L22882k06083
$$ y = [-1375520, -1134211, -1146366, -1364697, -1270486, -740670, -333161, -647044, -1596910, -2464200, -2652463, -2242079, -1700442, -1275745, -1016607, -1180389, -1965024, -2785189, -2609935, -1387819, -402136, -647505, -1509308, -1758040, -1256760, -797936, -692973, -537168, -168625, 108411, 198022, 264255, 182787, -224526, -502051, -23699, 870152, 1149571, 593668, 68389, 140058, 356730, 207495, -75595, -87183, 69480, 58777, -235855, -731364, -1123064, -866028, 154111, 1028782, 774501, -200402, -628956, -353401, -431256, -1076128, -1056115, 180432, 1259529, 842697, -329193, -610106, 178618, 853927, 790883, 460570, 314391, 243669, 105519, -28689, -115303, -91825, 183871, 506753, 300670]
31025C00670p39069l26627P04591R69382J53554m84672j83440K16964p6716m60180
31015G4457j61058L81957M08819J17279K3831p0817m32559n23950R4241O81908
31005E94108L32500m67812n45877M3421J32167n86133j002145l38516O19215O62085
30995e56987j62000p34105m16984K78438N89017M54919K80768J85890K7704m9091
30985a02431K31581N81957L83816k22826l71579P4781J66871m03741m53580P00093
30975E84942J595835O43763j104832j280987J44562Q49288j13858j001055m61381
30966a43723L65708O3242o94660n75336R6314J94158r9391J81977Q17316O73834
30956H79439l10316r24713n01567K47093L74749j50530o07828l45869N45360J149008
$$ y = [300670, -438399, -765026, -60435, 908947, 1062501, 577829, 394389, 611353, 534637, 74457, -86601, 295356, 704175, 821454, 845285, 774468, 341909, -182041, -87800, 594108, 926608, 458796, -87081, -43660, 88507, -497626, -1499771, -1838287, -1219072, -556987, -718987, -1453092, -1870076, -1591638, -1002621, -547702, -266934, -81044, -53340, -102431, 129150, 711107, 1094923, 872097, 500518, 575299, 742170, 338429, -115151, 584942, 2180777, 2824540, 1719708, 438721, 583283, 1432571, 1318713, 317658, -143723, 221985, 285227, -409433, -984769, -888455, -694297, -793688, -611711, 205605, 879439, 569123, -355590, -857157, -610064, -235315, -385845, -993673, -1339542, -794182, 354826]
30946C54826O45016m89652q77306j63593L97035j05829p81633m47111M11072N56722
30936e00453J32912K37160P73742N15787o38469j206959m01724O31164O14589
30927A57749m2953k13737R6616M2382m22046m27066L04894Q85130N37929k90901
30917F27997o36447l51812r0656j70017j96081Q9326L24929K41901J89994L92843
30907D21977K97312n10390j213789o69211P79953J544820R25252j24533n90185
30898H61206n87978n24750k39067K97742M24174j82231p06100l42476M08995N47737
30888d2748J29672Q256L77010N82472K53224k62968n77467o70211n97838l43478
30878a144076J5207L47434N86863N78864J28655n08328o34815k3386O42459O96317
$$ y = [354826, 999842, 510190, -367116, -530709, -133674, -239503, -1021136, -1468247, -1057175, -500453, -367541, -130381, 643361, 1159148, 520679, -686280, -1088004, -456840, 157749, 114796, -98941, -2325, 40057, -381989, -809055, -504161, 380969, 918898, 627997, -8450, -360262, -450918, -620935, -817016, -727690, -402761, -160860, 29134, 421977, 719289, 208899, -1004890, -1674101, -894148, 650672, 1575924, 1451391, 861206, 273228, -251522, -490589, -192847, 231327, 49096, -657004, -999480, -590485, -42748, 86924, 95180, 472190, 1054662, 1307886, 1044918, 467451, -202760, -800598, -1144076, -1128869, -781435, -194572, 384292, 512947, 4619, -630196, -653582, -11123, 685194]
30868F85194L50733J11089r4278n14693q33962o37012k25565j44127k16324R2255
30858a426690N96855N73559p8395o69226o99552l05352K41248P80957J007601
30849B1005O25203j29983o37263o31127l84935j78311M033K45970N08718O57861
30839A01171N13748N2821l28363j32024M76267P22518K86497k96081n75342p45560
30829G5652q37684l26286P15468J048189n9116j357651j104183M64551J440981
30820E9921P93182n88074j295584q29198L30328J204028R84480o5572o86929k41989
30810c35407L65249K05924j40302K01925N98558p581r45440p45974K36943L43078
30800b23027m36636m36433N55951P21660n35018j300657l47500P27240K48839
$$ y = [685194, 1035927, 1147016, 1052738, 538045, -295917, -932929, -1158494, -1302621, -1518945, -1426690, -829835, -256276, -334671, -1003897, -1703449, -2008801, -1767553, -986596, 21005, 646208, 516225, -121038, -752165, -1137100, -1315411, -1311378, -1065408, -556690, 101171, 614919, 667740, 339377, 207353, 683620, 1406138, 1692635, 1396554, 821212, 75652, -762032, -1088318, -372850, 675339, 616223, -741428, -1845611, -1381060, 59921, 853103, 265029, -1030555, -1859753, -1529425, -325397, 659083, 593511, -93418, -335407, 29842, 235766, 95464, 297389, 895947, 888366, -57074, -803048, -566105, -223027, -659663, -1096096, -540145, 181515, -353503, -1654160, -2001660, -1274420, -1025581]
30791a025581o62249q7008J310896J298684l01581j326230n03031R55216J290357
30782I49473L21994p96805j019370k55036O71863P93282N0407o11813m86866K8935
30772c53936K34949J61817J74429J47320j74698m78436l49060k7199N1244L3007
30762e80563K04059K67125p8120l34193L0465M69801J36134n73063n09933L12497
30752f55791O41922k8962o83774m07380L29368O22483M64376L75583L73620J34922
30742A166367j92201j35833K52831L89049O6733j99104k880K37153j12658p92366
30732F77091q21293N5926P67745K95888q44651j293522p25349q0708L0313N9537
30722a879023L92387N78733K65272k3838K28995O06586M87502Q9399q371J42342
$$ y = [-1025581, -1687830, -1774838, -463942, 834742, 533161, -793069, -1296100, -340884, 949473, 1271467, 474662, -544708, -799744, -127881, 665401, 715808, 103995, -382871, -353936, -118987, 42830, 217259, 364579, 189881, -288555, -637615, -664814, -613570, -580563, -376504, -109379, -187499, -521692, -491227, -21426, 114708, -458355, -968288, -655791, -13869, -42831, -726605, -1133985, -804617, -182134, 282242, 657825, 1031445, 1166367, 974166, 838333, 1091164, 1480213, 1546946, 1347842, 1344962, 1582115, 1469457, 677091, -144202, -88276, 679469, 975357, 130706, -1162816, -1888165, -1968873, -1938560, -1879023, -1486636, -907903, -642631, -666469, -437474, 169112, 656614, 746013, 737642, 879984]
30712H79984J39113M3205J16543J38881k30464p30642q36285m90661P8352P86828
30702a05146J326091J026368j08415r15351n73011J11764K0682m18370r5048O78371
30692I47935O24531k22272m91627K18875P50142L93561j22117j32406m4792k52806
30682A669024l72496j98277k17816n62051n92357j08646K06572J13989L05787
30673B43729R06411Q72860k03139j039382n42453M48819N62868j2631k21637l1981
30663I83464j34671m03969j86399K79594J88958l17989l25267K82321O60838M14300
30653A441180L0111j33492k67023m27289l37238K3989L55973N52124O40110M01437
30643B279882k27452o48575l38470J67595n0730q44585j174280o15435K24939
$$ y = [879984, 1019097, 1062302, 1178845, 1317726, 1087262, 356620, -479665, -970326, -891974, -105146, 1220945, 2247313, 2138898, 1223547, 650536, 762300, 782982, 364612, 269564, 947935, 1572466, 1350194, 858567, 1077442, 1827584, 2221145, 2099028, 1966622, 1921830, 1669024, 1296528, 1098251, 880435, 318384, -273973, -382619, -176047, -62058, 243729, 1150140, 2023000, 1819861, 780479, 238026, 686845, 1249713, 1237082, 1015445, 983464, 848793, 444824, 258425, 538019, 726977, 408988, 83721, 366042, 1026880, 1441180, 1471291, 1337799, 1070776, 643487, 306249, 330238, 686211, 1238335, 1878445, 2279882, 2052430, 1403855, 1065385, 1232980, 1182250, 337665, -836615, -1452050, -1227111]
30634a227111O74680N32456j27746q01348n63794P24938J652941R43058n16491
30625A291583q35548J8377L45233l63317o89736J14269Q43305M79812j97061k05162
30615H01755K6367j79709l64960L1835M69504L63460K11129M47079L65876m71655
30605A700681r71174k14478O88479K61154p86349o99355L35374N79105k39361
30596F54076o22288n5239K59599j62761j68808P09114J079876N1755r96618n25408
30586B23298O26911N31815q40583j669626j007152J16746M27386J742k71745n351
30576a866559M22476N38575L36217K12187M26460O72246L86106m35361j024875
30567c32528o89012L22150J018780O73203m49580j258323q20042N68490J451064
$$ y = [-1227111, -552431, -19975, -147721, -949069, -1512863, -787925, 865016, 1808074, 1291583, 456035, 474412, 819645, 456328, -233408, -119139, 724166, 1203978, 1006917, 801755, 828122, 648413, 283453, 315288, 784792, 1148252, 1359381, 1806460, 2172336, 1700681, 729507, 515029, 1203508, 1464662, 678313, -21042, 314332, 893437, 654076, 31788, -23451, 236148, 73387, -95421, 613693, 1693569, 1745324, 748706, 223298, 850209, 1382024, 541441, -1128185, -2135337, -2018591, -1591205, -1589463, -1861208, -1866559, -1444083, -905508, -569291, -357104, 69356, 741602, 1127708, 692347, -332528, -1021540, -699390, 319390, 992593, 543013, -715310, -1535352, -966862, 484202]
30558D84202Q01751n93468j002681J1154J048620Q15878k74960r83703r37536
30549f30743o54825m11145o556N36342Q62202Q66592P60106N53911O5649n32888
30539A408645p51684m93160k22568k44283k64817M3360M17410L57118o3539j94755
30529h273K72282P42959M22795n41209j100852o45049J84042M26288J29989O6775
30519e0253L95323N29050L32290L84756P30691M73904o81363j495468q52996M00835
30509A66769N80780l38726q14939k27680L00482o1478m99644p1574O23115M52348
30499A09453l32924m71159L51778J111586R92187K89414l75365q11603r28481
30490f5114m84812L49428Q30165N74174J33668Q9358J04180l83738r63604p37228
$$ y = [484202, 1285953, 692485, -310196, -299042, 749578, 1565456, 1290496, 306793, -630743, -1285568, -1696713, -1703269, -1166927, -304725, 561867, 1321973, 1875884, 1941533, 1408645, 656961, 163801, -58767, -303050, -567867, -524507, -107097, 250021, 186482, -8273, 264009, 1006968, 1429763, 888554, -212298, -857347, -673305, -247017, -117028, -50253, 345070, 874120, 1206410, 1591166, 2321857, 2795761, 2114398, 618930, -234066, 166769, 747549, 408823, -406116, -633796, -333314, -394792, -894436, -966010, -342895, 109453, -223471, -694630, -342852, 768734, 1760921, 2050335, 1674970, 863367, -65114, -549926, -200498, 629667, 1203841, 1337509, 1426867, 1531047, 1147309, 183705, -553523]
30480e53523J33216M59495j62888o32611M561J074352J280504N41726j68647l98966
30470A577219n27860o76362m97949j41375k26471n52161p2653J234377J735445
30461A852210M01205j363638j525114k98974M10759M3559n0878P79224J284699
30452A533052N22266m37165k87803L24359j3194r68217r48136K19251R04701J94036
30442A043150q09474p80530K9508N78795O01134M72874K58655j48594m11584j75494
30432F58440J88653P5240l49352m12091m5370J59825l0470j99460q9516K5j75165
30421b19241l81438l43523j39507O7418K91499N00860M79167J36014k91251m97422
30411c97424l75282J5583M92576P42019N41351K9067m43901o67465n94588k37430
$$ y = [-553523, -420307, 39188, -123700, -756311, -751750, 322602, 1603106, 2144832, 1976185, 1577219, 1049359, 372997, -124952, -266327, -492798, -1044959, -1117612, 116765, 1852210, 2253415, 889777, -635337, -934311, -523552, -479993, -530871, 248353, 1533052, 2055318, 1618153, 1330350, 1654709, 1641515, 673298, -274838, -55587, 849114, 1043150, 233676, -546854, -517346, 61449, 662583, 1135457, 1394112, 1245518, 833934, 658440, 847093, 922333, 572981, 160890, 115520, 275345, 244875, 45415, -44101, -44076, -219241, -600679, -944202, -1083709, -1016291, -724792, -223932, 255235, 391249, 99998, -397424, -772706, -757123, -264547, 477472, 1018823, 1047890, 603989, -63476, -658064, -895494]
30401h95494J67737K09076q2584p0757M74987P16220o7714j114358j129123k63716
30391b055726K17185Q4780L48805J171988J365077N09802j79327L0815J46417
30382A639816n45106r46086j64372N31844k65448j413460q50505R30465J534482
30373D51630M17358n55908l67409j19775n15500m99107N17438J176167L77248
30364H82142o83688l54924P69896P89177m96397j274100m03972J014521J216343
30355A458998N4693r24670m68758Q30789J289663L14209q02382o62778L22635
30346A412399O77753M4726n63337n26616l03818k21294O6701N09938L54551m76152
30336I74851q71277j82868O41882M68775l48413o72249l05959k8204k97161p58743
$$ y = [-895494, -727757, -518681, -601265, -672022, -197035, 519185, 451471, -662887, -1792010, -2055726, -1838541, -1753761, -1404956, -232968, 1132109, 1641911, 1462584, 1493399, 1639816, 1094710, 148624, -15748, 516096, 250648, -1162812, -2013317, -1082852, 451630, 868988, 313080, -54329, -174104, -689604, -1188711, -671273, 504894, 882142, 198454, -156470, 613426, 1402603, 906206, -367894, -771866, 242655, 1458998, 1513691, 589021, 120263, 951052, 2240715, 2554924, 1752542, 1089764, 1412399, 2090152, 2134878, 1571541, 1044925, 741107, 519813, 586514, 1096452, 1451003, 974851, 103574, -79294, 562588, 1031363, 682950, 10701, -295258, -323462, -620623, -1379366]
30326a379366q44917l09190O03224J192528R05252J37385j26807K86777M42937
30317I07823k48811j083746j076730k29551P13620J136683P80313j88260r68814
30308b57473p58982J09380N37275L37450L51274O47922K14708r23170j089491
30299h31107L72243J545483O78131j005684j188927o506N13416j58001n65127
30290f46079n958M68097J06212l49179j06368M54741O18731L63302O6203o9424
30280I00278k3471M7136j62964n77645n69712N7334M95341J78350j32154L51988
30270E64481Q29005Q9601j266534j516357m13303O36590Q53030P74291O90687
30261A241491K06246m46602m10573J77387K43962k60225k21992M49105M19105
$$ y = [-1379366, -2224283, -2533473, -1930249, -737721, 167531, 304916, 178109, 464886, 907823, 659012, -424734, -1501464, -1731015, -1017395, 119288, 899601, 711341, -257473, -1016455, -907075, -369800, -32350, 318924, 966846, 1181554, 258384, -831107, -458864, 1086619, 1764750, 759066, -429861, -436367, 77049, -80952, -646079, -652037, -183940, -77728, -426907, -533275, -78534, 540197, 903499, 969702, 900278, 876807, 923943, 760979, 183334, -386378, -329044, 166297, 344647, 212493, 564481, 1393486, 1483087, 216553, -1299804, -1713107, -1076517, -223487, 550804, 1241491, 1447737, 1001135, 590562, 767949, 1011911, 751686, 529694, 978799, 1397904]
30252A397904o47802j204695l27094O85225M34324m00934m19189K27076L98369
30243A43184p7526m12322k30397K08721O83040R93405P71356O3240m28818l22359
30233A391524j35279l21241m93551k30309J62586L42886N37849Q03761O05183
30224B663409j46736o12003l71242k25927p42490j080338l96837N66630N88554
30215B43020j42329n44807l77799j55437Q0841N87778R73846O74490J0003l09048
30205A040558k74039j84809J44037O60318M34492q32203j570663m14109J265907
30196B69489J057735p25166j439407k51463P56277J71449o63676l10289L62074
30187g72977R0365l58114L15193J367173J097142k80245r41337l01151L84445
$$ y = [1397904, 750102, -454593, -781687, -96462, 337862, -63072, -482261, -255185, 143184, 65658, -346664, -577061, -368340, 314700, 1308105, 2079461, 2142701, 1713883, 1391524, 1256245, 935004, 441453, 211144, 373730, 716616, 1254465, 2058226, 2663409, 2516673, 1904670, 1533428, 1307501, 565011, -515327, -912164, -345534, 243020, 100691, -444116, -821915, -977352, -896511, -308733, 665113, 1339603, 1349606, 1040558, 766519, 581710, 725747, 1386065, 1820557, 988354, -582309, -996418, 269489, 1327224, 602058, -837349, -1088812, -332535, -161086, -824762, -1135051, -772977, -682612, -1040726, -725533, 641640, 1738782, 1458537, 517200, 216049, 600494]
30178F00494K61788p6946j11271l18856r21734j049986r6099J028415J020276
30169C36081K3133o43025l34128K53360K87365j19843l09912k6338L96387N15292
30159C78372J74255m04168p35790m82015R3884L36703Q0513k4169N45138J238605
30149A201328J050444n2573j011186j036810m17005J93753N62809O40639K55281
30140A386680m30700p38020l39955J55229Q1084k97328l33339p3737J8292L1486
30130e40308L57213O96884L43547n50969r76320m87560K50216N41170M37865J95583
30120B67321j95320n69869m73803Q0660M46910L35495K47120M90746N79329J70450
30110A379039k09165j00004Q361l96869p63035l62456L10918K37936m25888o32875
$$ y = [600494, 862282, 785336, 674065, 355209, -566525, -1616511, -1712610, -684195, 336081, 359214, -283811, -617939, -364579, -77214, -197057, -506969, -533307, -136920, 378372, 552627, 148459, -587331, -1069346, -975462, -638759, -558246, -582415, -37277, 1201328, 2251772, 2199199, 1188013, 151203, -265802, -72049, 490760, 1131399, 1386680, 955980, 217960, -121995, 33234, 114318, -183010, -516349, -590086, -571794, -540308, -183095, 513789, 857336, 306367, -669953, -1157513, -907297, -366127, 71738, 267321, 72001, -497868, -971671, -891011, -444101, -108606, 138514, 629260, 1208589, 1379039, 1169874, 1069870, 1078231, 681362, -81673, -444129, -133211, 104725, -321163, -954038]
30100i54038k06983L1758j28767P850N51564O79717K08526P3420N96476P15367
30090A574890j34273p72932j88352N69729N6800r85726p24163O15608R22906l98353
30080E36134j423138p48756M59888N98146J24226L99882J195746J106020q1136
30071B167012j039195q48902j6009N29857M39477j44844q09294r03275j37377
30062g62550P62309P32297k09412r49168p79518j50260K60040M22694N45291M81439
30052C53162Q1327l33113l59885j02821M9146J4321J8514J37946J76918P7k10498
30041a74906j05831M06089Q97753P67063k130o57814n69895q5604k6096m50808
30031b179n39514J66283R71956Q55152j90457j012262n45747Q93787J716981P24977
$$ y = [-954038, -1161021, -1129263, -1258030, -1250180, -698616, -18899, 189627, 263047, 859523, 1574890, 1440617, 667685, 479333, 1049062, 1105862, 120136, -604027, 11581, 934487, 536134, -887004, -1635760, -1175872, -577726, -453500, -53618, 1142128, 2248148, 2167012, 1127817, 278915, 262906, 792763, 1232240, 1087396, 278102, -625173, -762550, -241, 732056, 522644, -426524, -1206042, -1356302, -1096262, -673568, -128277, 353162, 434489, 101376, -258509, -361330, -312184, -297863, -279349, -141403, 35515, 35592, -174906, -280737, 125352, 1023105, 1790168, 1788038, 1130224, 560329, 474725, 448629, -2179, -541693, -375410, 596546, 1451698, 1261241, 248979, -296768, 597019, 2314000, 3038977]
30021C038977j318807k290046j176532O45303J211824M50081j45409P5628K02550
30012F93569l99510r17426m30995N81550R34818L06476o31700j167303r81919
30003b012440j07349Q97387J165551N60995K2958J90587K90348o10961j760667
29994a363591j510007J31043J229402O37494m20380l08200O37420R09737K46885
29985A89803k35427n1654M1984l56540n12131L3070M79200R8785m30962j47008
29975h90880M73466K17941q30206j340211p21001K44279Q03476R72415P10408
29966c60313k21959j182061q88524N57072J292621K95756r38377n43540J002177
29957i87148J759482J115317J39859l46814n45385p03196o81773m78763k18300
$$ y = [3038977, 1720170, -569876, -1746408, -1101105, 110719, 560800, 415391, 491019, 693569, 294059, -623367, -1054362, -472812, 462006, 768482, 136782, -1030521, -2012440, -2119789, -1222402, -56851, 504144, 527102, 717689, 1008037, 397076, -1363591, -2873598, -2742555, -1513153, -875659, -1296039, -1604239, -966819, -57082, 189803, -45624, -97278, -55294, -411834, -923965, -890895, -411695, -312910, -743872, -890880, -417414, -199473, -1029679, -2369890, -3090891, -2846612, -2043136, -1070721, -360313, -582272, -1764333, -2652857, -2095785, -803164, -507408, -1445785, -1989325, -987148, 772334, 1887651, 2027510, 1680696, 1135311, 432115, -249658, -728421, -946721]
29948i46721J99182O47110M81435l76416p81947K2798R28702N56956m43871m95370
29938b08142J87529J37302m93960r9179J249023J444675j98947j589348j044543
29929f15590L05208O45976J34107j11963j02747l99082o34713k16401L96128N01804
29919i7273M15762O42298O74858l0810p14257m01668L25818J83632o42171p31123
29909c74934K93672J172561Q87305k6952m42121j16975K57142J05954l53699n31739
$$ y = [-946721, -747539, -100429, 381006, 4590, -777357, -754559, 174143, 731099, 287228, -208142, -20613, 116689, -377271, -476450, 772573, 2217248, 2018301, 428953, -615590, -310382, 335594, 469701, 357738, 254991, -144091, -778804, -995205, -599077, -97273, 318489, 960787, 1635645, 1604835, 890578, 488910, 814728, 998360, 356189, -374934, -81262, 1091299, 1978604, 1951652, 1509531, 1392556, 1649698, 1755652, 1401953, 870214]
$$ [...]
##END NTUPLES=NMR SPECTRUM
##END=
