##TITLE=31Pdec_LY-16Dix.5.B
 CD3CN, 24 sc
 4.06.2021
##JCAMPDX= 6.0         $$ Bruker NMR JCAMP-DX V2.0
##DATA TYPE= NMR SPECTRUM
##DATA CLASS= NTUPLES
##ORIGIN= UXNMR, Bruker Analytische Messtechnik GmbH
##OWNER= root
$$ XWIN-NMR		Version 3.5
$$ Fri Jun  4 11:31:38 2021 Russian Standard Time (UT+4h)  she@DPX200
##.OBSERVE FREQUENCY= 81.013821
##.OBSERVE NUCLEUS= ^31P
##.ACQUISITION MODE= SIMULTANEOUS
##.ACQUISITION SCHEME= undefined
##.AVERAGES= 24
##.DIGITISER RES= 16
##SPECTROMETER/DATA SYSTEM= spect
##.PULSE SEQUENCE= zgpg30
##.SOLVENT NAME= CDCl3
##.SHIFT REFERENCE= (INTERNAL, CDCl3, 0, 248.564)
##AUDIT TRAIL= $$ (NUMBER, WHEN, WHO, WHERE, WHAT)
$$ ##TITLE= Audit trail, XWIN-NMR		Version 3.5
$$ ##JCAMPDX= 5.01
$$ ##ORIGIN= Bruker BioSpin GmbH
$$ ##OWNER= she
$$ F:/spectra/data/she/nmr/P31/1/pdata/1/auditp.txt
$$ ##AUDIT TRAIL=  $$ (NUMBER, WHEN, WHO, WHERE, WHAT)
(   1,<2021-06-04 11:29:20.84 +0400>,<she>,<DPX200>,
      <created by zg, POWCHK disabled, PULCHK disabled
       configuration hash MD5:
       00 E9 B6 7A A2 85 ED C7 34 08 36 98 17 FE 4E 26
       data hash MD5: 32K
       A3 94 B3 D2 D5 A6 1E 13 4B 6E 69 12 1D EC 18 E9>)
(   2,<2021-06-04 11:29:23.35 +0400>,<she>,<DPX200>,
      <Start of raw data processing
       efp BC_mod = 2 LB = 1 FT_mod = 6 PKNL = 1 PHC0 = -5989.261 PHC1 = 302.0715 SI = 64K 
       data hash MD5: 64K
       BC 6D 08 76 85 E1 D1 9E DC 48 06 B0 76 C9 3A FC>)
(   3,<2021-06-04 11:29:44.93 +0400>,<she>,<DPX200>,
      <pk PHC0 = 43.13148 PHC1 = -106.8 
       data hash MD5: 64K
       3F A8 C4 DA CE D6 22 83 13 57 AE 3B 47 40 10 9F>)
$$ ##END=
$$ 
$$ hash MD5
$$ 52 9E A7 C9 5D 8E 62 AE 0C 58 7F 2D 94 D5 78 4E
##$RELAX= 
##$RELAX= 
##$RELAX= 
##$RELAX= 
##$RELAX= 
##$RELAX= 
##$RELAX= 
##$RELAX= 
$$ Bruker specific parameters
$$ --------------------------
##$DU= <F:/spectra>
##$EXPNO= 1
##$NAME= <P31>
##$PROCNO= 1
##$TYPE= <nmr>
##$USER= <she>
##$AMP= (0..31)
100 100 100 100 100 100 100 100 100 100 100 100 100 100 100 100 100 100 
100 100 100 100 100 100 100 100 100 100 100 100 100 100 
##$AQSEQ= 0
##$AQ_mod= 1
##$AUNM= <au_zg>
##$AUTOPOS= <>
##$BF1= 81.014009
##$BF2= 200.13
##$BF3= 200.13
##$BF4= 200.13
##$BF5= 200.13
##$BF6= 200.13
##$BF7= 200.13
##$BF8= 200.13
##$BYTORDA= 1
##$CFDGTYP= 0
##$CFRGTYP= 5
##$CHEMSTR= <none>
##$CNST= (0..31)
1 1 145 1 1 1 1 1 1 1 1 1 1 1 1 1 1 1 1 1 1 1 1 1 1 1 1 1 1 1 1 1 
##$CPDPRG= <waltz16>
##$CPDPRG1= <>
##$CPDPRG2= <waltz16>
##$CPDPRG3= <>
##$CPDPRG4= <mlev>
##$CPDPRG5= <mlev>
##$CPDPRG6= <mlev>
##$CPDPRG7= <mlev>
##$CPDPRG8= <mlev>
##$CPDPRGB= <>
##$CPDPRGT= <>
##$D= (0..31)
0 1 0 0 0 0 0 0 0 0 0 0.03 2e-05 3e-06 0 0 0 0 0 0 0 0 0 0 0 0 0 0 0 0 
0 0 
##$DATE= 1622791760
##$DBL= (0..7)
120 120 120 11 120 120 24 19 
##$DBP= (0..7)
150 150 150 150 150 150 150 150 
##$DBP07= 0
##$DBPNAM0= <>
##$DBPNAM1= <>
##$DBPNAM2= <>
##$DBPNAM3= <>
##$DBPNAM4= <>
##$DBPNAM5= <>
##$DBPNAM6= <>
##$DBPNAM7= <>
##$DBPOAL= (0..7)
0.5 0.5 0.5 0.5 0.5 0.5 0.5 0.5 
##$DBPOFFS= (0..7)
$$ [...]
##$SUBNAM2= <"">
##$SUBNAM3= <"">
##$SUBNAM4= <"">
##$SUBNAM5= <"">
##$SUBNAM6= <"">
##$SUBNAM7= <"">
##$SUBNAM8= <"">
##$SUBNAM9= <"">
##$SW= 501.771253377433
##$SWIBOX= (0..15)
0 1 3 0 0 0 0 0 0 0 0 0 0 0 0 0 
##$SW_h= 40650.406504065
##$TD= 32768
##$TD0= 1
##$TE= 0
##$TE2= 300
##$TE3= 300
##$TEG= 300
##$TL= (0..7)
0 120 53 12 22 120 120 120 
##$TP= (0..7)
150 150 150 150 150 150 150 150 
##$TP07= 0
##$TPNAME0= <>
##$TPNAME1= <>
##$TPNAME2= <>
##$TPNAME3= <>
##$TPNAME4= <>
##$TPNAME5= <>
##$TPNAME6= <>
##$TPNAME7= <>
##$TPOAL= (0..7)
0.5 0.5 0.5 0.5 0.5 0.5 0.5 0.5 
##$TPOFFS= (0..7)
0 0 0 0 0 0 0 0 
##$TUNHIN= 0
##$TUNHOUT= 0
##$TUNXOUT= 0
##$USERA1= <user>
##$USERA2= <user>
##$USERA3= <user>
##$USERA4= <user>
##$USERA5= <user>
##$V9= 5
##$VALIST= <valist>
##$VCLIST= <CCCCCCCCCCCCCCC>
##$VD= 0
##$VDLIST= <DDDDDDDDDDDDDDD>
##$VPLIST= <PPPPPPPPPPPPPPP>
##$VTLIST= <TTTTTTTTTTTTTTT>
##$WBST= 1024
##$WBSW= 4
##$XGAIN= (0..3)
0 0 0 0 
##$XL= 0
##$YL= 0
##$YMAX_a= 2462
##$YMIN_a= -1349
##$ZGOPTNS= <>
##$ZL1= 120
##$ZL2= 120
##$ZL3= 120
##$ZL4= 120
##$ABSF1= 0
##$ABSF2= 0
##$ABSG= 0
##$ABSL= 0
##$ALPHA= 0
##$AQORDER= 0
##$ASSFAC= 0
##$ASSFACI= 0
##$ASSFACX= 0
##$ASSWID= 0
##$AUNMP= <proc_1d>
##$AZFE= 0.1
##$AZFW= 0.5
##$BCFW= 0
##$BC_mod= 2
##$BYTORDP= 0
##$COROFFS= 0
##$CY= -3
##$DATMOD= 1
##$DC= 0
##$DFILT= <>
##$DTYPP= 0
##$F1P= 0
##$F2P= 0
##$FCOR= 1
##$FTSIZE= 65536
##$FT_mod= 6
##$GAMMA= 0
##$GB= 0
##$INTBC= 1
##$INTSCL= 5.30512e-09
##$ISEN= 30
##$LB= 1
##$LEV0= 0
##$LPBIN= 0
##$MAXI= 10000
##$MC2= 0
##$MEAN= 0
##$ME_mod= 0
##$MI= 50
##$NCOEF= 0
##$NC_proc= -8
##$NLEV= 6
##$NOISF1= 182.463
##$NOISF2= 159.3651
##$NSP= 0
##$NTH_PI= 0
##$NZP= 0
##$OFFSET= 248.5645
##$PC= 4
##$PHC0= -5946.13
##$PHC1= 195.2715
##$PH_mod= 1
##$PKNL= yes
##$PPARMOD= 0
##$PSCAL= 0
##$PSIGN= 0
##$REVERSE= no
##$SF= 81.014009
##$SI= 65536
##$SIGF1= 159.3651
##$SIGF2= -187.1042
##$SINO= 113.3802
##$SIOLD= 16384
##$SREGLST= <1H.CDCl3>
##$SSB= 0
##$STSI= 65536
##$STSR= 0
##$SW_p= 40650.406504065
##$SYMM= 0
##$S_DEV= 0
##$TDeff= 32768
##$TDoff= 0
##$TI= <>
##$TILT= no
##$TM1= 0
##$TM2= 0
##$TOPLEV= 0
##$USERP1= <user>
##$USERP2= <user>
##$USERP3= <user>
##$USERP4= <user>
##$USERP5= <user>
##$WDW= 1
##$XDIM= 65536
##$YMAX_p= 395034543
##$YMIN_p= -339628711
$$ End of Bruker specific parameters
$$ ---------------------------------
##NTUPLES= NMR SPECTRUM
##VAR_NAME=  FREQUENCY,     SPECTRUM/REAL,   SPECTRUM/IMAG
##SYMBOL=    X,             R,               I
##VAR_TYPE=  INDEPENDENT,   DEPENDENT,       DEPENDENT
##VAR_FORM=  AFFN,          ASDF,            ASDF
##VAR_DIM=   65536,         65536,           65536
##UNITS=     HZ,            ARBITRARY UNITS, ARBITRARY UNITS
##FACTOR=    0.620285442955139, 1,           1
##FIRST=     20137.2065510759, 0,            0
##LAST=      -20513.1999529892, 0,           0
##MIN=       -20513.1999529892, -339628711,  0
##MAX=       20137.2065510759, 395034543,    0
$$ Real data points
##PAGE= N=1
##DATA TABLE= (X++(R..R)), XYDATA
$$ [...]
$$ plain form
35328 10250710 11831413 9197548 4533023 633068 -180966 2202570 4286230 2203738
35320 2203738 -2877147 -5716501 -4248564 -2184956 -2694593 -3360974 -407246 5126092
35312 5126092 9012618 9541644 8051413 5474711 2127053 -292477 -568079 -1214138 -5516070
35303 -5516070 -11219243 -11863236 -5823796 324457 44510 -5072457 -8691967 -8461582 -7349771
35294 -7349771 -7774812 -8740773 -8932997 -8966106 -9420758 -9346146 -8153848 -7053991 -7117808 -7293163
35284 -7293163 -5772376 -2407631 1414078 4469589 6072084 5450333 2248952 -2292163
35276 -2292163 -5626131 -5676427 -2149055 3474501 8659764 11045167 10078768 7628175 6190762
35267 6190762 6233043 6020656 4444296 2982970 3561567 4921245 3280404 -2327543 -7288935
$$ packed form
35328A0250710J580703k633865m664525l899955q14034K383536K083660k082492
35320B203738n080885k839354J467937K063608n09637o66381K953728N533338
35312E126092L886526N29026j490231k576702l347658k419530k75602o46059m301932
35303e516070n703173o43993O039440O148253k79947n116967l619510K30385J111811
35294g349771m25041r65961j92224l3109m54652P4612J192298J099857o3817j75355
35284g293163J520787L364745L821709L055511J602495o21751l201381m541115
35276b292163l333968n0296L527372N623556N185263K385403r66399k450593j437413
35267F190762M2281k12387j576360j461326N78597J359678j640841n607947m961392
$$ plain form
35258 -7288935 -6408064 -756017 3654187 4105573 4078408 6207226 6779509 1601701 -5637319
35249 -5637319 -6901931 -1085167 4409370 4483227 2734079 4207356 7184541 6806176 3070645
35240 3070645 -104257 -1538457 -3141059 -4717534 -3752744 -548742 1118949 -501495
35232 -501495 -2694650 -2380017 533184 4778718 9534442 13434350 14688400 13501602
35224 13501602 11921634 10373780 7084696 1912678 -2337421 -3853628 -4041839 -4146258
35216 -4146258 -2861412 350369 2581240 1183299 -2062975 -3515868 -2561734 -988974
35208 -988974 647541 2615946 3393126 1209663 -2437237 -4245079 -3651466 -2649930 -1634049
35199 -1634049 717356 3370421 2953545 -1051708 -4825316 -5418466 -4077897 -2688122
$$ packed form
35258g288935Q80871N652047M410204M51386k7165K128818N72283n177808p239020
35249e637319j264612N816764N494537P3857j749148J473277K977185l78365l735531
35240C070645l174902j434200j602602j576475R64790L204002J667691j620444
35232e01495k193155L14633K913201M245534M755724L899908J254050j186798
35224A3501602j579968j547854l289084n172018m250099j516207j88211j04419
35216d146258J284846L211781K230871j397941l246274j452893R54134J572760
35208i88974J636515J968405P77180k183463l646900j807842N93613J001536J015881
35199a634049K351405K653065m16876m005253l773608n93150J340569J389775
$$ plain form
35191 -2688122 -493794 3041333 5375617 4403889 2433271 2731184 3798016 1465319
35183 1465319 -4080937 -8060780 -8141902 -6992335 -6554557 -4679450 -297118 2464903 -139444
35174 -139444 -4642359 -4434311 558441 3779607 1856066 -942282 142841 3494688
35166 3494688 4467433 2091591 -1058200 -3274806 -4532407 -4541501 -3191639 -1789145 -1255776
35157 -1255776 -581872 380490 -1195651 -6817628 -12229251 -11804663 -6310411 -1580613 -150017
35148 -150017 596561 2062636 2120974 323566 -294239 1237114 1735689 -73179 -672460
35139 -672460 1685668 2687951 -1224509 -6154505 -6310336 -3032466 -2434598 -5991045 -9105990
35130 -9105990 -8148902 -3981592 963160 4707165 5372435 2963428 955983 2190828
$$ packed form
35191b688122K194328L535127K334284r71728j970618K97913J066832k332697
35183A465319n546256l979843q1122J149567M37778J875107M382332K762021k604347
35174a39444m502915K08048M992752L221166j923541k798348J085123L351847
35166C494688R72745k375842l149791k216606j257601r094J349862J402494N33369
35157a255776O73904R62362j576141n621977n411623M24588N494252M729798J430596
35148a50017P46578J466075N8338j797408o17805J531353M98575j808868n99281
35139f72460K358128J002283l912460m929996j55831L277870N97868l556447l114945
35130i105990R57088M167310M944752L744005O65270k409007k007445J234845
$$ plain form
35122 2190828 4171937 2855586 -6575 1197731 6772617 10313885 7704033 2287843
35114 2287843 -800345 -836787 177194 1174302 1335539 -697125 -4089940 -5152777 -2098717
35105 -2098717 1855694 2521094 -183376 -3171938 -4089025 -2367250 1353450 4717185
35097 4717185 4562033 563594 -3559877 -4237610 -1836169 1101261 3160966 3796224 2203201
35088 2203201 -932689 -2348848 377115 5380802 8764732 9327259 8985803 9491848 10860000
35079 10860000 12359351 13112892 12154900 9458582 6529573 4885069 4535575 4723971 5180339
35070 5180339 5937641 7041716 8846197 11052685 11435542 8046681 2973092 493061
35062 493061 620575 -1278582 -6596912 -10170587 -8282682 -5008031 -5431918 -6935202 -4062904
$$ packed form
35122B190828J981109j316351k862161J204306N574886L541268k609852n416190
35114B287843l088188l6442J013981R97108J61237k032664l392815j062837L054060
35105b098717L954411O65400k704470k988562r17087J721775L720700L363735
35097D717185j55152l998439m123471o77733K401441K937430K059705O35258j593023
35088B203201l135890j416159K725963N003687L383930N62527l41456N06045J368152
35079A0860000J499351P53541r57992k696318k929009j644504l49494J88396M56368
35070E180339P57302J104075J804481K206488L82857l388861n073589k480031
35062D93061J27514j899157n318330l573675J887905L274651m23887j503284K872298
$$ plain form
35053 -4062904 1118799 1835442 -1533761 -1574168 3199185 4889739 -660553 -6010278 -3630863
35044 -3630863 1643112 80267 -7126526 -8965009 -902517 8693760 10654292 6513803
35036 6513803 3869010 5088773 5792890 2461375 -3101153 -6825201 -6794677 -4179261 -1804983
35027 -1804983 -2223857 -5738438 -9926182 -11968194 -11322133 -9277008 -6657479 -3679728
35019 -3679728 -1600811 -2109314 -4577249 -6074766 -5029849 -2901678 -1189651 867062
35011 867062 3756288 5151082 2864960 -946493 -1837932 971246 3734325 3475949 1317062
35002 1317062 -95683 156740 1576298 3524974 4923202 4386020 1800759 -1401379
34994 -1401379 -3956229 -5373699 -5018294 -2756593 -476346 -265871 -900575 676043 3911329
$$ packed form
35053d062904N181703P16643l369203m0407M773353J690554n550292n349725K379415
35044c630863N273975j562845p206793j838483Q062492R596277J960532m140489
35036F513803k644793J219763P04117l331515n562528l724048L0524K615416K374278
35027a804983m18874l514581m187744k042012O46061K045125K619529K977751
35019c679728K078917n08503k467935j497517J044917K128171J712027K056713
35011H67062K889226J394794k286122l811453q91439K809178K763079k58376k158887
35002A317062j412745K52423J419558J948676J398228n37182k585261l202138
34994a401379k554850j417470L55405K261701K280247K10475o34704J576618L235286
$$ plain form
34985 3911329 4531725 1081480 -2571854 -3214954 -2345683 -1391234 2350455 10302466 16919672
34976 16919672 15334718 6783615 -1147149 -4421517 -5190694 -5417078 -4015131 -949097
34968 -949097 1436581 2627188 4645427 7032071 5935045 365946 -5084706 -6448421
34960 -6448421 -5327019 -4779132 -4265463 -2504905 -1891735 -5054004 -8888787 -7368146 -321612
34951 -321612 5111822 3096206 -4075684 -9447283 -9365974 -5989770 -3242886 -2598386 -2907715
34942 -2907715 -2624268 -1098542 1643356 5069443 7857192 8505617 6899999 4516327
34934 4516327 2401528 -147853 -3904944 -7593998 -8808550 -6558251 -1841966 3461547
34926 3461547 6997434 6511573 2201217 -2217860 -3062229 -889292 891060 763344 -158608
$$ packed form
34985C911329O20396l450245l653334o43100Q69271R54449L741689P952011O617206
34976A6919672j584954q551103p930764l274368p69177k26384J401947L066034
34968i49097K385678J190607K018239K386644j097026n569099n450652j363715
34960f448421J121402N47887N13669J760558O13170l162269l834783J520641P046534
34951c21612N433434k015616p171890n371599Q1309L376204K746884O44500l09329
34942b907715K83447J525726K741898L426087K787749O48425j605618k383672
34934D516327k114799k549381l757091l689054j214552K250299M716285N303513
34926C461547L535887m85861m310356m419077q44369K172937J780352j27716r21952
$$ plain form
34917 -158608 -1216604 -2516737 -2566926 179305 2966696 584263 -6783729 -12066876 -10340711
34908 -10340711 -5234990 -2797704 -2725582 -540590 3996122 6310254 4313690 1110536
34900 1110536 -388417 -1289854 -3621123 -6743841 -8733432 -8886103 -7122936 -3079242
34892 -3079242 2248928 5761456 5470227 3310019 2411369 2405208 279781 -4049834 -6256038
34883 -6256038 -3293075 1960584 4459744 3847191 4070535 6473148 7317893 3743260 -1237507
34874 -1237507 -2536967 338539 3461460 4015691 2727639 1633954 2162106 4661924
34866 4661924 7216501 6075459 514598 -3968863 -1622619 4892071 6833673 1054648
34858 1054648 -5886297 -7143224 -4015882 -1786544 -1499989 -310752 2627025 5011171
$$ packed form
34917a58608j057996j300133n0189K746231K787391k382433p367992n283147J726165
34908a0340711N105721K437286P2122K184992M536712K314132j996564l203154
34900A110536j498953r01437k331269l122718j989591j52671J763167M043694
34892c079242N328170L512528k91229k160208q98650o161k125427m329615k206204
34883f256038K962963N253659K499160o12553K23344K402613Q44745l574633m980767
34874a237507j299460K875506L122921N54231j288052j093685N28152K499818
34866D661924K554577j141042n560861m483461K346244O514690J941602n779025
34858A054648o940945j256927L127342K229338K86555J189237K937777K384146
$$ plain form
34850 5011171 4985293 2625682 -1217170 -4974723 -6349906 -4639751 -2109154 -1145474 -1252797
34841 -1252797 -477671 1820303 5168544 8837623 10826721 8613391 3049406 -1280716
34833 -1280716 -1970883 -1871404 -3468052 -4110317 -1005709 2802337 2911532 1010214 1584775
34824 1584775 3465506 1842540 -2391722 -3146284 577885 2734309 462397 -1234189
34816 -1234189 1662244 5436343 5262372 2919326 2592950 3455943 2276702 192355 692467
34807 692467 2669993 1672795 -2232210 -3618998 79493 4286432 3671264 -401634 -1987409
34798 -1987409 1191141 4754293 3677139 -763552 -2370178 1731260 6913487 6963465
34790 6963465 2057605 -2431363 -3905618 -4898205 -7123785 -8110531 -6104689 -4179540
$$ packed form
34850E011171k5878k359611l842852l757553j375183J710155K530597R63680j07323
34841a252797P75126K297974L348241L669079J989098k213330n563985m330122
34833a280716o90167R9479j596648o42265L104608L808046J09195j901318N74561
34824A584775J880731j622966m234262p54562L724169K156424k271912j696586
34816a234189K896433L774099j73971k343046l26376Q62993j179241k084347N00112
34807F92467J977526r97198l905005j386788L698491M206939o15168m072898j585775
34798a987409L178550L563152j077154m440691j606626M101438N182227M9978
34790F963465m905860m488968j474255r92587k225580r86746K005842J925149
$$ plain form
34782 -4179540 -5806574 -9102425 -9435493 -6096834 -2595978 -1307694 -1454251 -1973555 -2837054
34773 -2837054 -3190696 -1313554 2550038 5526850 5395284 3189635 1823324 3021749
34765 3021749 5867942 7600207 5912617 1232516 -3453686 -5460661 -4379742 -967520
34757 -967520 4081679 9002377 10715999 8188762 4704015 4128214 5932080 6826623 6397409
34748 6397409 7303652 9780219 10083168 6035306 850501 -903990 1078313 3617343
34740 3617343 4741012 5025283 5132675 4608853 3340585 2401768 2743270 3886583 4495195
34731 4495195 4053087 3697867 5022067 7708623 8953673 6444665 1805841 -493941
34723 -493941 1807144 6224591 8765605 8204489 6029793 3704068 1801656 822637 687447
$$ packed form
34782d179540j627034l295851l33068L338659L500856J288284j46557n19304q63499
34773b837054l53642J877142L863592K976812j31566k205649j366311J198425
34765C021749K846193J732265j687590m680101m686202k006975J080919L412222
34757i67520N049199M920698J713622k527237l484747n75801J803866Q94543m29214
34748F397409R06243K476567L02949m047862n184805j754491J982303K539030
34740C617343J123669K84271J07392n23822j268268r38817L41502J143313O08612
34731D495195m42108l55220J324200K686556J245050k509008m638824k299782
34723d93941K301085M417447K541014n61116k174696k325725j902412r79019j35190
$$ plain form
34714 687447 -157573 -2963708 -6073133 -6377703 -3780481 -1774719 -2515712 -3753598 -2622902
34705 -2622902 -390003 -496709 -3044230 -4711542 -4099963 -3461058 -4009244 -3222287 578416
34696 578416 3852268 1847343 -4364686 -8769674 -8055845 -4618300 -1591511 932218
34688 932218 2931583 1632159 -4658763 -11875608 -13392250 -7884444 -1031836 1223553
34680 1223553 -1155653 -3820926 -3902364 -2677055 -2880234 -4881024 -6410222 -5796172 -4219130
34671 -4219130 -3768007 -4166390 -3370193 -1214201 111544 -78975 457546 2706716 3726968
34662 3726968 1174019 -1918242 -982853 2885384 4408440 2522674 1908917 4784149
34654 4784149 6513461 2682425 -3574267 -5644112 -2305527 1823450 3151160 2158189
$$ packed form
34714F87447q45020k806135l109425l04570K597222K005762p40993j237886J130696
34705b622902K232899j06706k547521j667312O11579O38905n48186P86957L800703
34696E78416L273852k004925o212029m404988P13829L437545L026789K523729
34688I32218J999365j299424o290922p216845j516642N507806O852608K255389
34680A223553k379206k665273q1438J225309k03179k000790j529198O14050J577042
34671d219130M51123l98383P96197K155992J325745j90519N36521K249170J020252
34662C726968k552949l092261R35389L868237J523056j885766o13757K875232
34654D784149J729312l831036o256692k069845L338585M128977J327710r92971
$$ plain form
34646 2158189 450866 -941741 -498665 2365307 4436897 1525130 -4835553 -7853248
34638 -7853248 -4575437 -261194 -631665 -3608159 -3155695 1301427 4570254 3821415 1764505
34629 1764505 1146724 816943 -881772 -2400573 -1109167 3045717 7833992 10904842
34621 10904842 10425264 5810233 -549561 -4332063 -3791707 -1429765 187155 1756828
34613 1756828 4336707 5809111 3467803 -1499760 -5275142 -6123962 -5210521 -3993991
34605 -3993991 -3541698 -4933074 -7254659 -6782234 -1767367 3473303 3438347 -820063 -3485658
34596 -3485658 -2465694 -746130 69888 1294309 1976149 -814652 -5020281 -4234867 1874657
34587 1874657 5253013 1807700 -1444290 2208004 7473561 5239907 -2419813 -5252547
$$ packed form
34646B158189j707323j392607M43076K863972K071590k911767o360683l017695
34638g853248L277811M314243l70471k976494M52464M457122L268827p48839k056910
34629A764505o17781l29781j698715j518801J291406M154884M788275L070850
34621A0904842m79578m615031o359794l782502N40356K361942J616920J569673
34613A756828K579879J472404k341308m967563l775382q48820R13441J216530
34605c993991M52293j391376k321585M72425N014867N240670l4956m258410k665595
34596c485658J019964J719564Q16018J224421O81840k790801m205629P85414O109524
34587A874657L378356l445313l251990L652294N265557k233654p659720k832734
$$ plain form
34579 -5252547 -676891 3214168 790163 -3871602 -4979364 -2860387 -617181 1365274
34571 1365274 4011891 6478976 7332058 6208473 2933061 -2205358 -6640106 -7348593
34563 -7348593 -5077940 -3263009 -2549323 -623717 2159795 2031935 -2020130 -6180477
34555 -6180477 -7537230 -7145402 -5739724 -1735149 4023648 6888875 5100440 2923650
34547 2923650 3526281 3773072 484823 -3121074 -2880874 -1455692 -4079780 -9208400 -10239678
34538 -10239678 -5479240 -136611 1505490 379433 -1360370 -3632867 -6477171 -8519078
34530 -8519078 -8633662 -6731258 -2785489 2465866 6350536 6662293 4761643 3422100
34522 3422100 2356469 -739644 -5171846 -6961894 -3915701 1913422 6976751 9058147
$$ packed form
34579e252547M575656L891059k424005m661765j107762K118977K243206J982455
34571A365274K646617K467085Q53082j123585l275412n138419m434748p08487
34563g348593K270653J814931P13686J925606K783512j27860m052065m160347
34555f180477j356753L91828J405678M004575N758797K865227j788435k176790
34547B923650O02631K46791l288249l605897K40200J425182k624088n128620j031278
34538a0239678M760438N342629J642101j126057j739803k272497k844304k041907
34530h519078j14584J902404L945769N251355L884670L11757j900650j339543
34522C422100j065631l096113m432202j790048L046193N829123N063329K081396
$$ plain form
34514 9058147 7899754 5630995 5716903 8628309 9813295 5367544 -1769487 -5466139
34506 -5466139 -4843804 -3999800 -4281509 -3035163 -415509 -833849 -5519847 -9413151 -8372920
34497 -8372920 -4611243 -1954312 -389383 1161373 1092785 -1438050 -2830420 281665
34489 281665 4943810 5311837 1001051 -2408103 -989768 3068473 5070299 3213318
34481 3213318 -304869 -2022907 -627064 1758535 2011592 -97479 -1702079 -877123
34473 -877123 966082 1600646 1046398 905986 2087206 4061838 5077204 2997442 -2094130
34464 -2094130 -6439102 -6731561 -5419284 -7693749 -12881939 -14273632 -9312212 -4067218
34456 -4067218 -4118058 -6583139 -6022794 -3281614 -2451523 -3041193 -2014025 -754504 -2636239
$$ packed form
34514I058147j158393k268759Q5908K911406J184986m445751p137031l696652
34506e466139O22335Q44004k81709J246346K619654m18340m685998l893304J040231
34497h372920L761677K656931J564929J550756o8588k530835j392370L112085
34489B81665M662145L68027m310786l409154J418335M058241K001826j856981
34481C213318l518187j718038J395843K385599K53057k109071j604600Q24956
34473h77123J843205O34564n54248j40412J181220J974632J015366k079762n091572
34464b094130m344972k92459J312277k274465n188190j391693M961420N244994
34456d067218n0840k465081N60345K741180Q30091n89670J027168J259521j881735
$$ plain form
34447 -2636239 -5340475 -3305584 2489878 4821457 1300242 -1994820 -173137 3482073
34439 3482073 3301557 -1095222 -6301614 -10178311 -11931411 -10381356 -5743449 -1282016
34431 -1282016 -460547 -3352311 -6889900 -7251055 -2200890 6010156 10184933 4793085
34423 4793085 -6076548 -11913887 -8612351 -3345312 -4052992 -8935647 -10476262 -6034040
34415 -6034040 380310 4231992 3597580 -1816552 -9813323 -14881074 -12996108 -7125500
34407 -7125500 -3865758 -4660636 -4596123 -528058 3996813 4077881 499331 -1592943 379700
34398 379700 3693492 4604605 3182877 2483100 3815410 5015467 4144499 2669926 2584061
34389 2584061 2033633 -2196095 -8044958 -8879101 -2623828 4242881 4958163 1058619 -1187440
$$ packed form
34447b636239k704236K034891N795462K331579l521215l295062J821683L655210
34439C482073j80516m396779n206392l876697j753100J550055M637907M461433
34431a282016Q21469k891764l537589l61155N050165Q211046M174777n391848
34423D793085j0869633n837339L301536N267039p07680m882655j540615M442222
34415f034040O414350L851682o34412n414132p996771n067751J884966N870608
34407g125500L259742p94878O4513M068065M524871Q1068l578550k092274J972643
34398C79700L313792R11113j421728o99777J332310J200057q70968j474573q5865
34389B584061n50428m229728n848863q34143O255273O866709P15282l899544k246059
$$ plain form
34380 -1187440 175514 2047731 2400311 1867468 253986 -3209412 -6166933 -4819754
34372 -4819754 -50058 2856341 1762268 367734 1718222 3663310 3380681 2219789
34364 2219789 2495255 2742028 296440 -3503926 -4884137 -3348854 -1990803 -2411755 -2868970
34355 -2868970 -1837343 -268120 755456 2115986 4821015 7614945 8159406 6093123
34347 6093123 3652978 3156499 4519110 5532047 4371184 1505233 -967651 -1495366
34339 -1495366 -180556 1874766 3494486 3836812 2903501 1791304 1492981 1401836 257468
34330 257468 -1309849 -1034674 1310513 2427608 -470393 -5327568 -7129945 -3732128
34322 -3732128 2119257 6400742 7404312 5518922 1801960 -1859127 -2875684 -424621
$$ packed form
34380a187440J362954J872217L52580n32843j613482l463398k957521J347179
34372d819754M769696K906399j094073j394534J350488J945088k82629j160892
34364B219789K75466K46773k445588l800366j380211J535283J358051m20952m57215
34355b868970J031627J569223J023576J360530K705029K793930N44461k066283
34347F093123k440145m96479J362611J012937j160863k865951k472884n27715
34339a495366J314810K055322J619720L42326r33311j112197k98323r1145j144368
34330B57468j567317K75175K345187J117095k898001m857175j802377L397817
34322c732128N851385M281485J003570j885390l716962l661087j016557K451063
$$ plain form
34314 -424621 2684110 2701560 -107941 -1169870 2396617 7070062 6808191 1309602 -2869321
34305 -2869321 -913677 3530016 3346562 -2291869 -7410025 -7888144 -5693182 -3448847
34297 -3448847 -145230 4470661 5823461 138960 -8359992 -11656787 -8491155 -5089093
34289 -5089093 -5241084 -5608309 -2653597 1337275 2441644 879184 -1317954 -4746947
34281 -4746947 -10020107 -13326623 -10077052 -2177826 3242095 2547773 -1073008 -3261508
34273 -3261508 -3293486 -2343954 -1000512 -294086 -1968332 -5692358 -8510309 -8779153 -8206727
34264 -8206727 -8331949 -7706937 -4807080 -1297154 251066 -10066 -481033 -1277858 -3235694
34255 -3235694 -5088123 -4663998 -2188988 187649 1441786 1855338 1138435 -891715 -2576200
$$ packed form
34314d24621L108731J7450k809501j061929L566487M673445k61871n498589m178923
34305b869321J955644M443693j83454n638431n118156m78119K194962K244335
34297c448847L303617M615891J352800n684501q498952l296795L165632L402062
34289e089093j51991l67225K954712L990872J104369j562460k197138l428993
34281d746947n273160l306516L249571P899226N419921o94322l620781k188500
34273c261508l1978R49532J343442P06426j674246l724026k817951k68844N72426
34264h206727j25222O25012K899857L509926J548220k61132m70967p96825j957836
34255c235694j852429M24125K475010K376637J254137M13552p16903k030150j684485
$$ plain form
34246 -2576200 -2288688 -1466739 -2807426 -5907828 -7754731 -7119234 -5216236 -2482926 1469960
34237 1469960 4817212 4734455 2166060 953208 1357686 -531599 -5184156 -6923628 -2285452
34228 -2285452 3709921 4277917 269316 -2256994 -1239423 118111 -144812 -512885 -176254
34219 -176254 -567263 -1963489 -2482247 -1482716 -869959 -2095100 -4350323 -6317887 -7518563
34210 -7518563 -7713484 -7019581 -6407578 -6060142 -4169892 -42426 2928444 1198445 -2841802
34201 -2841802 -3275956 853477 4333926 3774993 1664146 747530 -449028 -3501840 -5908091
34192 -5908091 -4785400 -1511823 906852 2277009 3485576 3092498 -240143 -3925485
34184 -3925485 -4244434 -1709334 117512 6987 -529113 -1279217 -3716558 -7443226 -9795456
$$ packed form
34246b576200K87512Q21949j340687l100402j846903O35497J902998K733310L952886
34237A469960L347252q2757k568395j212852M04478j889285m652557j739472M638176
34228b285452N995373N67996m008601k526310J017571J357534k62923l68073L36631
34219a76254l91009j396226n18758R99531O12757j225141k255223j967564j200676
34210g518563j94921O93903O12003L47436J890250M127466K970870j729999m040247
34201b841802m34154M129433L480449n58933k110847r16616j196558l052812k406251
34192e908091J122691L273577K418675J370157J208567l93078l332641l685342
34184c925485l18949K535100J826846j10525n36100p50104k437341l726668k352230
$$ plain form
34175 -9795456 -9258448 -6523306 -2467889 1962829 4375968 2910039 -383158 -1431512
34167 -1431512 497363 2592705 3524692 4742216 6354008 6072788 3641291 2204267
34159 2204267 3276642 4157151 2847208 1945178 4362492 7989371 8280158 4304155 -1046483
34150 -1046483 -5236255 -7256934 -6255807 -2713860 -51489 -1318079 -4611465 -5282058
34142 -5282058 -2566354 -408670 -1327563 -3152869 -2990942 -1157385 456262 1201417 1096626
34133 1096626 -187926 -1929310 -2111390 -557996 -211874 -2966398 -6131462 -5886845 -2847041
34124 -2847041 -983105 -1779744 -2945034 -2994921 -3573894 -6019732 -8497057 -8435944 -6018066
34115 -6018066 -3587351 -2966503 -4670688 -8212432 -11546893 -11657383 -7770600 -3130627
$$ packed form
34175i795456N37008K735142M055417M430718K413139j465929l293197j048354
34167a431512J928875K095342R31987J217524J611792k81220k431497j437024
34159B204267J072375Q80509j309943r02030K417314L626879K90787l976003n350638
34150a046483m189772k020679J001127L541947K662371j266590l293386o70593
34142e282058K715704K157684r18893j825306J61927J833557J613647P45155j04791
34133A096626j284552j741384j82080J553394L46122k754524l165064K44617L039804
34124b847041J863936p96639j165290m9887n78973k445838k477325O1113K417878
34115f018066K430715O20848j704185l541744l334461j10490L886783M639973
$$ plain form
34107 -3130627 -1602415 -3138822 -4502100 -3778288 -1926335 -319351 578951 11945 -2674380
34098 -2674380 -5609599 -5236038 -1187072 2118321 938391 -2664150 -3766973 -1372972
34090 -1372972 642477 -1025027 -5322070 -8646259 -8341528 -4215814 1430608 4939936
34082 4939936 4284807 1412393 113433 1370751 2505885 1063678 -2465056 -6087385
34074 -6087385 -8196493 -7447764 -3325778 1978928 4706223 4098665 3566585 5629352 8263721
34065 8263721 8573501 7431919 7218903 7109803 4641247 666425 -1537844 -1496354 -1476751
34056 -1476751 -1459609 803414 3971403 2885919 -3376480 -8163766 -5745463 687061
34048 687061 3975506 3026468 2675747 5116422 7152192 6344972 4841188 5176612 5905571
$$ packed form
34107c130627J528212j536407j363278P23812J851953J606984Q98302n67006k686325
34098b674380k935219L73561M048966L305393j179930l602541j102823K394001
34090a372972K015449j667504m297043l324189L04731M125714N646422L509328
34082D939936o55129k872414j298960J257318J135134j442207l528734l622329
34074f087385k109108P48729M121986N304706K727295o07558n32080K062767K634369
34065H263721L09780j141582k13016j09100k468556l974822k204269M1490J9603
34056a476751J7142K263023L167989j085484o262399m787286K418303O432524
34048F87061L288445r49038l50721K440675K035770q07220j503784L35424P28959
$$ plain form
34039 5905571 3958757 -703335 -5047285 -6531931 -5075407 -2084692 1117964 3876059
34031 3876059 5875037 6617673 5583713 3028752 -6209 -2782871 -5094741 -6190782
34023 -6190782 -5145571 -3146644 -3272406 -6259148 -8613703 -7338697 -4406890 -3347041
34015 -3347041 -3426866 -1573013 1199824 509216 -4161653 -8083086 -8069964 -5821263 -3299047
34006 -3299047 8924 3257726 3098594 -646835 -3284327 -2770183 -3632694 -8745167 -12581408
33997 -12581408 -9173653 -2458514 -771586 -3791038 -3834079 734313 2872658 -821551
33989 -821551 -4211922 -1942494 1917032 1056806 -2914812 -3886460 -1257709 -83899 -2714675
33980 -2714675 -5859815 -5836790 -2519141 2006377 5219211 4548149 -657203 -6943640 -9334822
$$ packed form
34039E905571j946814m662092m343950j484646J456524K990715L202656K758095
34031C876059J998978P42636j033960k554961l034961k776662k311870j096041
34023f190782J045211J998927j25762k986742k354555J275006K931807J059849
34015c347041p9825J853853K772837o90608m670869l921433J3122K248701K522216
34006c299047L307971L248802j59132l745429k637492N14144q62511n112473l836241
33997a2581408L407755O715139J686928l019452m3041M568392K138345l694209
33989h21551l390371K269428L859526q60226l971618r71648K628751J173810k630776
33980b714675l145140K3025L317649M525518L212834o71062n205352o286437k391182
$$ plain form
33971 -9334822 -6941649 -3787949 -3298762 -4228652 -3464219 -1049406 -84735 -1890013 -3521834
33962 -3521834 -1523851 2926534 4938878 2411554 -876817 -564495 2082825 2553702
33954 2553702 423889 -82478 2862592 5712548 5327191 3476764 2839517 2309295 -4543
33945 -4543 -2170815 -1317620 873802 333323 -2666280 -3637627 -757068 2657304 3208170
33936 3208170 1343806 -493150 -318845 3328682 10076660 15463010 13947393 6163133
33928 6163133 -236024 612908 6027787 9349296 8280793 5297976 2231552 -1082664
33920 -1082664 -3636858 -3239662 -433426 978806 -1298026 -5103442 -6953381 -6244709
33912 -6244709 -4951707 -4581122 -4930369 -5021299 -4022323 -1820815 358470 569312 -1545766
$$ packed form
33971i334822K393173L153700M89187r29890P64433K414813R64671j805278j631821
33962c521834J997983M450385K012344k527324l288371L12322K647320M70877
33954B553702k129813n06367K945070K849956l85357j850427o37247n30222k313838
33945d543k166272Q53195K191422n40479k999603r71347K880559L414372N50866
33936C208170j864364j836956J74305L647527O747978N386350j515617p784260
33928F163133o399157Q48932N414879L321509j068503k982817l066424l314216
33920a082664k554194L97196K806236J412232k276832l805416j849939P08672
33912f244709J293002L70585l49247r0930R98976K201508K179285K10842k115078
$$ plain form
33903 -1545766 -3659962 -3316161 -1258382 -582022 -2334242 -3805383 -2366800 561449
33895 561449 1544768 402036 467490 2885952 3872693 311318 -4214999 -3176270 3556265
33886 3556265 8738492 7494239 3535656 2526101 3161607 53456 -6566673 -10317727
33878 -10317727 -8199502 -4637135 -3860004 -3653648 -404542 4059593 5587116 4566267
33870 4566267 4179641 3817037 354577 -4681696 -5732851 -1871890 1357085 762432 152923
33861 152923 2990282 6149072 5654422 3738155 4311100 5185039 1742058 -3836085 -4518472
33852 -4518472 671160 4830050 3342309 -641600 -2797569 -3428174 -3655004 -1647335
33844 -1647335 2934120 5333334 1795004 -3781716 -4573743 -332601 2969232 1981302
$$ packed form
33903a545766k114196L43801K057779O76360j752220j471141J438583K928249
33895E61449R83319j142732O5454K418462R86741l561375m526317J038729O732535
33886C556265N182227j244253l958583j009555O35506l108151o620129l751054
33878a0317727K118225L562367P77131K06356L249106M464135J527523j020849
33870D566267l86626l62604l462460n036273j051155L860961L228975n94653o09509
33861A52923K837359L158790m94650j916267N72945Q73939l442981n578143o82387
33852d518472N189632M158890j487741l983909k155969o30605k26830K007669
33844a647335M581455K399214l538330n576720p92027M241142L301833r87930
$$ plain form
33836 1981302 -599850 -1482683 -880532 38570 1823394 4744244 6848586 6412094 4824538
33827 4824538 4802292 6298268 6226882 2814503 -1145895 -1057285 3307876 6300580 2888523
33818 2888523 -4510527 -8581440 -6352567 -2352398 -1506466 -2753945 -2277645 360178
33810 360178 3087601 5782029 9303701 11499042 9083854 3317188 -847460 -1748643
33802 -1748643 -2623356 -5182667 -6332808 -3648095 49910 937414 -140181 -69442 766862
33793 766862 -476289 -3347770 -3919182 -830919 2363400 2336608 408175 -185449 934019
33784 934019 1840189 2152248 3289089 5119935 5282452 2771431 31177 6724 2511731
33775 2511731 4930217 5339994 3488466 -35855 -3595329 -4511707 -1877838 1023765
$$ packed form
33836A981302k581152q82833O02151R19102J784824K920850K104342m36492j587556
33827D824538k2246J495976p1386l412379l960398Q8610M365161K992704l412057
33818B888523p399050m070913K228873M000169Q45932j247479M76300K637823
33810C60178K727423K694428L521672K195341k415188n766666m164648r01183
33802a748643q74713k559311j150141K684713L698005Q87504j077595P0739Q36304
33793G66862j243151k871481n71412L088263L194319k6792j928433n93624J119468
33784I34019R06170L12059J136841J830846J62517k511021k740254k4453K505007
33775B511731K418486M09777j851528l524321l559474r16378K633869K901603
$$ plain form
33767 1023765 -70850 -4518811 -6950362 -4271669 185186 1116328 -2214694 -5749985
33759 -5749985 -5644246 -1958734 1854937 2390013 35587 -920424 2294653 6143848 4770088
33750 4770088 -1304988 -5072650 -2779150 1479884 3372952 4721516 7869030 9282782
33742 9282782 5452056 1108361 3517473 10560350 12782639 7019492 -60340 -2907084
33734 -2907084 -3717312 -5867697 -7974287 -7947848 -6946853 -5656187 -2073342 3235577 5038633
33725 5038633 1041262 -3305948 -2623970 184798 -691560 -4085478 -4056537 114270 3014729
33716 3014729 1806819 -311409 -136927 1195286 1402997 572684 -272309 -1185975 -2284349
33707 -2284349 -2780332 -2184327 -977251 412326 1846994 2548360 1507942 -906922 -2944744
$$ packed form
33767A023765j094615m447961k431551K678693M456855R31142l331022l535291
33759e749985J05739L685512L813671N35076k354426r56011L215077L849195j373760
33750D770088o075076l767662K293500M259034J893068J348564L147514J413752
33742I282782l830726m343695K409112P042877K222289n763147p079832k846744
33734b907084q10228k150385k106590K6439J000995J290666L582845N308919J803056
33725E038633l997371m347210O81978K808768q76358l393918K8941M170807K900459
33716C014729j207910k118228J74482J332213K07711q30313q44993r13666j098374
33707b284349m95983N96005J207076J389577J434668P01366j040418k414864k037822
$$ plain form
33698 -2944744 -3093549 -1000180 2465047 5207209 5390095 4220648 5372917 9697541
33690 9697541 12695905 10187698 4561014 1598128 2368001 2654780 58360 -3001648
33682 -3001648 -4070219 -4035036 -4052762 -2811338 785466 4769228 6201289 4560352 1687384
33673 1687384 -117259 792474 4252357 7663559 8719029 8955705 11507562 14968370
33665 14968370 13886672 7167918 1251284 1444932 4269079 3193378 -1324485 -3522196
33657 -3522196 -2150206 -1824708 -4514693 -6283808 -4206326 -593476 2359712 6495729
33649 6495729 12202117 14049188 7853071 -966160 -2749190 3592566 9409023 8337916
33641 8337916 3369126 69103 -1358617 -3362350 -4729205 -2204244 3382770 7302699
$$ packed form
33698b944744j48805K093369L465227K742162J82886j169447J152269M324624
33690I697541K998364k508207n626684k962886P69873K86779k596420l060008
33682c001648j068571L5183j7726J241424L596804L983762J432061j640937k872968
33673A687384j804643R09733L459883L411202J055470K36676K551857L460808
33665A4968370j081698o718754n916634J93648K824147j075701m517863k197711
33657c522196J371990L25498k689985j769115K077482L612850K953188M136017
33649F495729N706388J847071o196117q819231j783030O341756N816457j071107
33641H337916m968790l300023j427720k003733j366855K524961N587014L919929
$$ plain form
33633 7302699 7001852 4453607 2305207 691981 -1489201 -4408675 -7158327 -8361254
33625 -8361254 -6837060 -3092944 111853 442551 -942258 -790913 2006632 5539991
33617 5539991 7896283 8623488 7281344 3554878 -403387 -738703 3263766 7305050
33609 7305050 6962833 2844354 -945100 -1998685 -1159474 109044 1412707 2332004 1641469
33600 1641469 -1129326 -3890903 -3033845 2727573 9704707 11891135 7216389 22679
33592 22679 -3843432 -2994474 37006 3210129 5638819 5344592 939055 -4275594 -4495157
33583 -4495157 905003 5910974 5862196 2924110 1263345 857855 -376715 -1644371 -780941
33574 -780941 1360728 2235814 2051579 2992448 4813590 4932823 2630340 -134427 -1893818
$$ packed form
33633G302699l00847k548245k148400j613226k181182k919474k749652j202927
33625h361254J524194L744116L204797L30698j384809J51345K797545L533359
33617E539991K356292P27205j342144l726466l958265l35316M002469M041284
33609G305050l42217m118479l789454j053585Q39211J268518J303663R19297o90535
33600A641469k770795k761577Q57058N761418O977134K186428m674746p193710
33592B2679l866111Q48958L031480L173123K428690k94227m405537n214649k19563
33583d495157N400160N005971m8778k938086j660765m05490j234570j267656Q63430
33574g80941K141669Q75086j84235R40869J821142J19233k302483k764767j759391
$$ plain form
33565 -1893818 -2479528 -823480 4425347 11232004 14352651 11038415 4622949 629057
33557 629057 522988 1189267 101563 -1238899 -244721 1884612 1124261 -3037993 -5541337
33548 -5541337 -2551981 2518728 3863168 2071446 2695691 6983662 10377256 10594438
33540 10594438 10347641 10525136 8033011 3211521 1745977 5089432 6750643 3438661
33532 3438661 1827503 7246547 13744424 14335803 13418597 18048146 23956140 23578350 22111802
33523 22111802 29772752 42421774 49204030 58393205 91807024 145851605 180514425
33516 180514425 163185524 108813760 59792140 37034400 29124236 21732586 15537119
33509 15537119 14084890 12798253 7206977 772333 -1902333 -2234793 -3460044 -5184232
$$ packed form
33565a893818n85710J656048N248827O806657L120647l314236o415466l993892
33557F29057j06069O66279j087704j340462R94178K129333p60351m162254k503344
33548e541337K989356N070709J344440j791722O24245M287971L393594K17182
33540A0594438k46797J77495k492125m821490j465544L343455J661211l311982
33532C438661j611158N419044O497877N91379r17206M629549N907994l77790j466548
33523B2111802P660950J2649022O782256R189175L3413819N4044581L4662820
33516A80514425j7328901n4371764m9021620k2757740p910164p391650o195467
33509A5537119j452229j286637n591276o434644k674666l32460j225251j724188
$$ plain form
33501 -5184232 -5688129 -4880815 -2578156 1717293 5823766 6299893 3976229 3209314 4689276
33492 4689276 4363477 805695 -2068920 -1662273 -474670 -638249 -117388 2276412 3156062
33483 3156062 169346 -2710662 -348799 5811412 9828600 9361491 7379134 6700892
33475 6700892 6787088 6075168 4537690 3241880 2941118 3371664 3262217 1580528 -768084
33466 -768084 -1666685 -706521 340216 679080 1854096 4588007 6657115 6036427 4160360
33457 4160360 3577573 4056541 3878156 3695690 5698641 9197065 10306442 6810737 1056796
33448 1056796 -2799461 -2724768 426626 4105862 5260472 2329812 -2450674 -4053417
33440 -4053417 244284 7183629 10389486 6950201 125504 -4534803 -4627621 -1968419
$$ packed form
33501e184232n03897Q07314K302659M295449M106473M76127k323664p66915J479962
33492D689276l25799l557782k874615M06647J187603j63579N20861K393800Q79650
33483C156062k986716k880008K361863O160211M017188m67109j982357o78242
33475F700892Q6196p11920j537478j295810l00762M30546j09447j681689k348612
33466g68084q98601R60164J046737L38864J175016K733911K069108o20688j876067
33457D160360n82787M78968j78385j82466K002951L498424J109377l495705n753941
33448A056796l856257P4693L151394L679236J154610k930660m780486j602743
33440d053417M297701O939345L205857l439285o824697m660307r2818K659202
$$ plain form
33432 -1968419 653824 2337163 3602430 4398792 3778545 1478338 -1111469 -2147692
33424 -2147692 -1310382 -88673 118778 -139448 900280 3416643 4917424 3163014 -316010
33415 -316010 -1526575 733064 2991838 1875867 -1033788 -1405856 1804150 5243238
33407 5243238 5927104 4376874 2458763 775931 -444026 -148343 1774268 2907921
33399 2907921 682332 -4179773 -8257814 -9114373 -7006641 -3482667 3840 2227243
33391 2227243 2682806 2282544 2284080 2417773 1539453 246857 765536 3269959 4402698
33382 4402698 1458077 -3291429 -4905890 -1841650 2870776 6329700 8434910 9021524
33374 9021524 6076156 -297736 -4909762 -2810823 3364379 5907158 2274794 -1675914
$$ packed form
33432a968419K622243J683339J265267P96362o20247k300207k589807j036223
33424b147692Q37310J221709K07451k58226J039728K516363J500781j754410l479024
33415c16010j210565K259639K258774j115971k909655l72068L210006L439088
33407E243238O83866j550230j918111j682832j219957K95683J922611J133653
33399B907921k225589m862105m078041q56559K107732L523974L486507K223403
33391B227243M55563m00262J536J33693q78320j292596N18679K504423J132739
33382D402698k944621m749506j614461L064240M712426L458924K105210N86614
33374I021524k945368o373892m612026K098939O175202K542779l632364l950708
$$ plain form
33366 -1675914 -320931 4219088 6316899 5004052 3460117 2549798 172627 -3182812
33358 -3182812 -3339901 1558302 7718391 10438829 9402054 7228638 5296247 3522126
33350 3522126 2446080 2687261 3203750 2557941 1458117 1838507 3632504 4637652 3843978
33341 3843978 2959648 3890149 6092623 7349590 6381738 3968405 1941755 1584756 2746690
33332 2746690 4200192 4934024 5033187 5052559 4777530 3236960 86143 -3462201 -5380059
33323 -5380059 -4469014 -1342706 2021095 3670643 2805158 -53496 -3332281 -4733033
33315 -4733033 -2527973 2152156 5136722 3410567 -611369 -1500773 1917803 4647305
33307 4647305 2489079 -2076169 -3883801 -2470252 -1427441 -1844140 -1164476 1490201
$$ packed form
33366a675914J354983M540019K097811j312847j543935r10319k377171l355439
33358c182812j57089M898203O160089K720438j036775k173416j932391j774121
33350C522126j076046K41181N16489o45809j099824L80390J793997J005148p93674
33341C843978q84330R30501K202474J256967r67852k413333k026650l56999J161934
33332B746690J453502P33832R9163J9372k75029j540570l150817l548344j917858
33323e380059R11045L126308L363801J649548q65485k858654l278785j400752
33315d733033K205060M680129K984566j726155m021936q89404L418576K729502
33307D647305k158226m565248j807632J413549J042811m16699O79664K654677
$$ plain form
33299 1490201 3629372 3999188 4421773 5474155 4835113 2318108 2004842 5777993 8790623
33290 8790623 6077034 511943 -1317093 908267 1394689 -2430019 -6768302 -7971264
33282 -7971264 -6573828 -3879993 -35924 2915995 1589531 -2644184 -3305438 2120290
33274 2120290 7417223 5933064 -359580 -4500083 -3834483 -950141 1752158 3209876
33266 3209876 1615871 -3266185 -6925186 -4660461 1192991 3749433 1181714 -1307691
33258 -1307691 289876 3513117 3804312 191993 -4894689 -8415986 -8481954 -6186084 -5747857
33249 -5747857 -9532659 -13437944 -11589285 -5252574 -1596303 -3186005 -5050199 -3816322
33241 -3816322 -2904904 -5291972 -7567657 -5989085 -3012219 -2365579 -2369577 -194829 1463686
$$ packed form
33299A490201K139171L69816M22585J052382o39042k517005l13266L773151L012630
33290H790623k713589n565091j829036K225360M86422l824708m338283j202962
33282g971264J397436K693835L844069K951919j326464m233715o61254N425728
33274B120290N296933j484159o292644m140503O65600K884342K702299J457718
33266C209876j594005m882056l659001K264725N853452K556442k567719k489405
33258a307691J597567L223241K91195l612319n086682l521297o5968K295870M38227
33249e747857l784802l905285J848659O336711L656271j589702j864194J233877
33241c816322R11418k387068k275685J578572K976866O46640l998K174748J658515
$$ plain form
33232 1463686 -1062173 -4491411 -3031663 1239174 836133 -4583579 -6706020 -1312556
33224 -1312556 5325879 6229653 3276905 2344777 3913885 3930444 967870 -2706761 -5690704
33215 -5690704 -8493959 -10550638 -10077942 -7228863 -4411675 -2851617 -1148532 1927124
33207 1927124 5033389 5833750 3993664 1537432 579217 1455999 3000658 3951841 3800098
33198 3800098 2769047 1613412 1263241 1980083 2925687 3239892 3219428 3310284 2455820
33189 2455820 -414507 -3187792 -1852162 3627974 7663577 5843978 1081788 -300642
33181 -300642 3011210 6608979 7283210 6570722 6987505 8374005 9226492 8916749 7316841
33172 7316841 4436962 1562208 748861 2063083 3025102 1818371 -388741 -1119684 624814
$$ packed form
33232A463686k525859l429238J459748M270837m03041n419712k122441N393464
33224a312556O638435R03774k952748r32128J569108J6559k962574l674631k983943
33215e690704k803255k056679M72696K849079K817188J560058J703085L075656
33207A927124L106265Q00361j840086k456232r58215Q76782J544659R51183j51743
33198C800098j031051j155635l50171P16842R45604L14205k0464R0856q54464
33189B455820k870327k773285J335630N480136M035603j819599m762190j382430
33181c00642L311852L597769O74231p12488M16783J386500Q52487l09743j599908
33172G316841k879879k874754q13347J314222R62019j206731k207112p30943J744498
$$ plain form
33163 624814 3607407 5151331 2957401 -2040790 -5063653 -2340889 3451850 5674392
33155 5674392 2092330 -2612882 -3705985 -2017418 -662674 219315 2076942 3722526
33147 3722526 2342549 -2107869 -6444190 -7758816 -5426461 -757944 3092239 2309263
33139 2309263 -3388303 -8543474 -7410454 -1572661 1446788 -2039741 -7087315 -7033727
33131 -7033727 -2153365 1703752 1256898 -1197768 -2533073 -2590370 -1988018 322381 4412133
33122 4412133 6622290 3455693 -2388747 -4027079 725863 6264760 6755824 3323099
33114 3323099 1055120 1920145 4158411 6307246 7699232 6586100 2225470 -2052498
33106 -2052498 -2324911 -52072 120434 -1860452 -1402809 2482418 4979451 3462460 1776454
$$ packed form
33163F24814K982593J543924k193930m998191l022863K722764N792739K222542
33155E674392l582062m705212j093103J688567J354744Q81989J857627J645584
33147C722526j379977m450418m336321j314626K332355M668517L850183p82976
33139B309263n697566n155171J133020N837793L019449l486529n047574N3588
33131g033727M880362L857117m46854k454666j335305n7297O02352K310399M089752
33122D412133K210157l166597n844440j638332M752942N538897M91064l432725
33114C323099k267979Q65025K238266K148835J391986j113132m360630m277968
33106b052498k72413K272839J72506j980886M57643L885227K497033j516991j686006
$$ plain form
33097 1776454 3406585 5842712 5850905 5367174 6954437 7567616 3157557 -3121973 -3969959
33088 -3969959 1721502 7691272 9509303 9207851 9667325 9647541 6895107 2600376 -64722
33079 -64722 -85664 673404 95732 -1716488 -2296986 399947 4515098 5226032 721544
33070 721544 -4822046 -6664227 -5553705 -4807650 -3737717 632385 6234625 6674319 595525
33061 595525 -5179236 -4435780 770129 4067356 2915867 -210628 -2145658 -1619812 692689
33052 692689 2500555 1741532 -562365 -1199148 639983 2389847 2676215 3279656 4906174
33043 4906174 5027371 2510937 387840 674108 406157 -2994636 -6259860 -5438339 -3171854
33034 -3171854 -4365818 -6924168 -4353898 2956130 6954294 3799304 -812134 -996015
$$ packed form
33097A776454J630131K436127Q193m83731J587263O13179m410059o279530q47986
33088c969959N691461N969770J818031l01452M59474j9784k752434m294731k665098
33079f4722k0942P59068n77672j812220n80498K696933M115151P10934m504488
33070G21544n543590j842181J110522P46055J069933M370102N602240M39694o078794
33061E95525n774761P43456N205909L297227j151489l126495j935030N25846K312501
33052F92689J807866p59023k303897o36783J839131J749864K86368O03441J626518
33043D906174J21197k516434k123097K86268k67951l400793l265224Q21521K266485
33034c171854j193964k558350K570270P310028L998164l154990m611438j83881
$$ plain form
33026 -996015 1219013 1206458 -398547 -353834 618077 -480961 -2869818 -2747650 867184
33017 867184 5141142 7510307 7304660 4280755 -854520 -5068920 -5556360 -3263630 -939187
33008 -939187 1258786 4510337 6722631 4084492 -2344442 -6454993 -5081483 -1898848
33000 -1898848 -1193662 -1844672 -732990 1144691 191904 -3712990 -6578782 -5505632 -1693455
32991 -1693455 1694307 2419224 73408 -3692918 -5682211 -3807391 331940 2944517
32983 2944517 2364386 517865 -181588 125959 -263949 -1574313 -1938758 -118684 2192589
32974 2192589 2139785 -73876 -482386 3572125 9008968 10364726 7229575 5044137 7659626
32965 7659626 12381442 14231886 12260637 9143911 6857580 5552336 4927506 4031358
$$ packed form
33026i96015K215028j2555j605005M4713R71911j099038k388857J22168L614834
33017H67184M273958K369165k05647l023905n135275m214400m87440K292730K324443
33008i39187K197973L251551K212294k638139o428934m110551J373510L182635
33000a898848P05186o51010J111682J877681r52787l904894k865792J073150L812177
32991a693455L387762P24917k345816l766326j989293J874820M139331K612577
32983B944517n80131j846521o99453L07547l89908j310364l64445J820074K311273
32974B192589n2804k213661m08510M054511N436843J355758l135151k185438K615489
32965G659626M721816J850444j971249l116726k286331j305244o24830q96148
$$ plain form
32957 4031358 1418885 -1929447 -2124292 2003745 5470725 3817637 791056 3304569
32949 3304569 10004586 12226958 7168495 2420734 4301261 8718722 8686749 5113097
32941 5113097 3436044 3481441 471403 -5258850 -7290935 -3035041 1659579 452340
32933 452340 -5285296 -9033147 -6796319 350339 8760121 14340041 13980243 8116467
32925 8116467 1573971 -564190 1662916 3241266 -1770 -6752302 -11746542 -11279335
32917 -11279335 -6653098 -2236362 -625043 -567422 44191 554525 -1162003 -4331835 -5173907
32908 -5173907 -2399379 -105262 -2385726 -6634216 -5926937 1806266 10484122 13029383
32900 13029383 8962329 3023656 -1125671 -3019648 -3054930 -1587163 -52124 -147471 -1714396
$$ packed form
32957D031358k612473l348332j94845M128037L466980j653088l026581K513513
32949C304569O700017K222372n058463m747761J880527M417461l1973l573652
32941E113097j677053M5397l010038n730253k032085M255894M694620j207239
32933D52340n737636l747851K236828P146658Q409782N579920l59798n863776
32925H116467o542496k138161K227106J578350l243036o750532m994240M67207
32917a1279335M626237M416736J611319N7621O11613N10334j716528l169832q42072
32908e173907K774528K294117k280464m248490P07279P733203Q677856K545261
32900A3029383m067054n938673m149327j893977l5282J467767J535039r5347j566925
$$ plain form
32891 -1714396 -3403752 -4894847 -6104909 -5220485 -1106028 2679426 760321 -6091905
32883 -6091905 -10240475 -6651948 593821 4002257 1788825 -1724458 -2326750 603013
32875 603013 4999870 7782269 7132980 4956316 4918770 6696920 5750533 905398 -2449233
32866 -2449233 -265753 3826728 4896317 4727498 7240561 10040947 8209178 3706413
32858 3706413 2725901 5331006 6252848 5124022 6838306 11387726 12596659 8643666
32850 8643666 5020646 4581821 3257336 -1055741 -3638732 -1190960 2475859 3373993
32842 3373993 3176305 3925264 3774842 2424069 3835253 8694961 11108337 8037317 5009275
32833 5009275 6677001 8906225 6935531 4320874 5920345 8314952 5858622 974323
$$ packed form
32891a714396j689356j491095j210062Q84424M114457L785454j919105o852226
32883f091905m148570L588527P245769L408436k213432l513283o02292K929763
32875F03013M396857K782399o49289k176664l7546J778150r46387m845135l354631
32866b449233K183480M092481J069589j68819K513063K800386j831769m502765
32858C706413r80512K605105R21842j128826J714284M549420J208933l952993
32850H643666l623020m38825j324485m313077k582991K447772L666819Q98134
32842C373993j97688P48959j50422j350773J411184M859708K413376l071020l028042
32833E009275J667726K229224j970694k614657J599471K394607k456330m884299
$$ plain form
32825 974323 -467957 451472 -1070883 -3736121 -2649416 1250521 2972894 2272994 2507830
32816 2507830 3171257 1635304 -68942 1845546 5666630 7491184 8793041 12704729
32808 12704729 16219059 14929018 12271989 14876847 22021859 29022911 36688294 46372467
32800 46372467 50250775 40121681 23187470 14739172 16455547 16580919 10893830 7467510
32792 7467510 9438137 9525299 5052948 2934567 5610716 6876401 5658877 8536947
32784 8536947 14410792 13443578 6513418 7528510 19272644 26362542 21796976 19932470
32776 19932470 30029576 38195720 33629555 32272846 49363172 63342238 37381072
32769 37381072 -25595131 -72469898 -46349284 67365191 229670739 363555746 395034543
$$ packed form
32825I74323j442280R19429j522355k665238J086705L899937J722373o99900K34836
32816B507830O63427j535953j704246J914488L821084J824554J301857L911688
32808A2704729L514330j290041k657029K604858P145012P001052P665383R684173
32800D6372467L878308j0129094j6934211q448298J716375J25372n687089l426320
32792G467510J970627Q7162m472351k118381K676149J265685j217524K878070
32784H536947N873845r67214o930160J015092J1744134P089898m565566j864506
32776A9932470J0097106Q166144m566165j356709J7090326J3979066k5961166
32769C7381072o2976203m6874767K6120614J13714475J62305548J33885007L1478797
$$ plain form
32762 395034543 311610088 182110409 94249665 70542573 66461656 45437222 20476042
32755 20476042 15057934 20509817 15345016 1962194 -2548387 2295886 2815017 -3283085
32747 -3283085 -5576348 -1441850 477060 -3631530 -7935846 -8324144 -6884044 -5175019
32739 -5175019 -2816680 -2189699 -5977402 -11042238 -12217566 -10118823 -7947298 -3984542
32731 -3984542 4009962 10252597 7173624 -1426367 -4210930 738474 3585205 -1023986
32723 -1023986 -6115132 -4872409 -1562297 -3584000 -9273153 -10979686 -6680383 -1610413
32715 -1610413 433469 1389834 3686228 5283122 2670264 -3316571 -7827674 -8157131
32707 -8157131 -6784771 -6820200 -6953156 -4102306 449588 2017816 -286292 -1913411 307959
$$ packed form
32762C95034543q3424455j29499679q7860744k3707092m080917k1024434k4961180
32755B0476042n418108N451883n164801j3382822m510581M844273N19131o098102
32747c283085k293263M134498J918910m108590m304316l88298J440100J709025
32739e175019K358339O26981l787703n064836j175328K098743K171525L962756
32731c984542P994504O242635l078973q599991k784563M949404K846731m609191
32723a023986n091146J242723L310112k021703n689153j706533M299303N069970
32715a610413K043882R56365K296394J596894k612858n986835m511103l29457
32707h157131J372360l5429j32956K850850M551894J568228k304108j627119K221370
$$ plain form
32698 307959 4076324 6190871 6833489 6778389 4736668 822054 -1392396 -141185 953759
32689 953759 -1200676 -3350748 -991091 3921845 6034859 4979561 4617661 5425743 3973623
32680 3973623 -235773 -3227156 -2493934 287760 2990464 5052976 5313423 2219896
32672 2219896 -2938081 -6762671 -8252678 -9022648 -9060774 -6585411 -2598701 -1013716 -2992989
32663 -2992989 -5266205 -5496754 -5370108 -6654824 -7948408 -7408492 -5531140 -3327230 -812086
32654 -812086 946618 -306534 -3850985 -5082121 -1724275 1974382 816075 -3717723
32646 -3717723 -5341411 -1397455 4409340 7585172 7624578 6364742 4533604 1912286
32638 1912286 -626170 -1565326 -1266557 -2303988 -6166257 -10367060 -10430491 -5139710 1429656
$$ packed form
32698C07959L768365K114547O42618n5100k041721l914614k214450J251211J094944
32689I53759k154435k150072K359657M912936K113014j055298l61900Q08082j452120
32680C973623m209396k991383P33222K781694K702704K062512K60447l093527
32672B219896n157977l824590j490007p69970l8126K475363L986710J584985j979273
32663b992989k273216k30549J26646j284716j293584N39916J877352K203910K515144
32654h12086J758704j253152l544451j231136L357846L698657j158307m533798
32646c717723j623688L943956N806795L175832L9406j259836j831138k621318
32638A912286k538456r39156K98769j037431l862269m200803o3431N290781O569366
$$ plain form
32629 1429656 3969065 1241742 -3335664 -5383617 -2972782 2352375 6546111 6109198
32621 6109198 1706237 -2219561 -2842514 -2369906 -3952054 -6195397 -5524649 -3030942 -4027256
32612 -4027256 -9611729 -13229269 -8768704 693672 5955243 2550304 -4691867 -8194161
32604 -8194161 -6043873 -2412582 -1184107 -1670545 -1183694 242478 13136 -2646286 -5135571
32595 -5135571 -5089290 -3252343 -1485706 -124031 890998 339495 -2456099 -5711832 -7371533
32586 -7371533 -7719672 -7692104 -6649437 -4542984 -3956333 -6368726 -8498607 -6712485 -3258870
32577 -3258870 -2956923 -4959265 -3901022 841565 3508219 861447 -3310825 -4743164
32569 -4743164 -4159141 -3470482 -1769311 1423766 3404171 2476857 1111350 1473379 1596323
$$ packed form
32629A429656K539409k727323m577406k047953K410835N325157M193736m36913
32621F109198m402961l925798o22953M72608j582148k243343O70748K493707r96314
32612d027256n584473l617540M460565R462376N261571l404939p242171l502294
32604h194161K150288L631291J228475m86438M86851J426172k29342k659422k489285
32595e135571M6281J836947J766637J361675J015029n51503k795594l255733j659701
32586g371533l48139K7568J042667K106453N86651k412393k129881J786122L453615
32577c258870L01947k002342J058243M742587K666654k646772m172272j432339
32569d743164N84023O88659J701171L193077J980405r27314j365507L62029J22944
$$ plain form
32560 1596323 -404156 -2149645 -1161695 298894 -910104 -3083237 -2504884 365787
32552 365787 2067367 1376866 -821402 -4437643 -8414841 -8746731 -3595142 1862131 1495587
32543 1495587 -2749639 -4170612 -2019779 -1542806 -3769960 -3353700 1916708 6928050
32535 6928050 7260557 4850975 2652270 78920 -2425643 -671064 6121534 10798045
32527 10798045 7325422 524787 -162284 5703617 9285451 5130407 -2648482 -7613830
32519 -7613830 -8383852 -6801611 -3860482 -633538 225848 -2527183 -5948790 -5934869 -2151974
32510 -2151974 2116382 4290461 4678598 4631013 4386290 3344210 1544896 193792 793819
32501 793819 3798524 7912458 10700681 10239286 6685179 2471265 523897 1593385
$$ packed form
32560A596323k000479j745489R87950J460589j208998k173133N78353K870671
32552C65787J701580o90501k198268l616241l977198l31890N151589N457273l66544
32543A495587m245226j420973K150833M76973k227154M16260N270408N011342
32535F928050L32507k409582k198705k573350k504563J754579O792598M676511
32527A0798045l472623o800635o87071N865901L581834m155044p778889m965348
32519g613830p70022J582241K941129L226944Q59386k753031l421607J3921L782895
32510b151974M268356K174079L88137m7585k44723j042080j799314j351104O00027
32501G93819L004705M113934K788223m61395l554107m213914j947368J069488
$$ plain form
32493 1593385 3462987 3573369 2216543 1765008 2652042 2287797 -763268 -3710101 -3208200
32484 -3208200 -743946 -945710 -4664525 -7398315 -5735161 -1938305 137674 795118
32476 795118 2805474 5811138 6481382 3946579 1209981 427406 315789 -264405 460854
32467 460854 3722632 6576334 5350343 1632102 1107014 6062063 11981299 12768646 7530222
32458 7530222 1079160 -1184282 1746104 5722496 5476945 338577 -4432098 -3470780
32450 -3470780 2117480 6329692 6177501 4877081 6321634 9692335 11530214 10370092
32442 10370092 6777326 1166366 -5286426 -9295354 -8532690 -5216930 -3510441 -4038148
32434 -4038148 -4173280 -3083308 -2677330 -3451073 -3320386 -1457439 364813 1456131 3494739
$$ packed form
32493A593385J869602J10382j356826m51535Q87034l64245l051065k946833N01901
32484c208200K464254k01764l718815k733790J663154L796856K075979O57444
32476G95118K010356L005664O70244k534803k736598p82575j11617n80194P25259
32467D60854L261778K853702j225991l718241n25088M955049N919236P87347n238424
32458G530222o451062k263442K930386L976392k45551n138368m770675R61318
32450c470780N588260M212212j52191j300420J444553L370701J837879j160122
32442A0370092l592766n610960o452792m008928P62664L315760J706489n27707
32434d038148j35132J089972M05978p73743J30687J862947J822252J091318K038608
$$ plain form
32425 3494739 6310736 6189110 1321269 -4112471 -4842725 -1303334 2033987 3152566
32417 3152566 3128855 1654201 -2902901 -8539210 -9676311 -4320729 2375032 4238490
32409 4238490 1185445 -2328985 -3780166 -4438218 -5920158 -7863458 -8942025 -8165111
32401 -8165111 -5364089 -2074489 -1368979 -4726620 -9313088 -10506744 -7193862 -2652173
32393 -2652173 -284995 -619478 -2378354 -3820928 -2789273 1380146 5045702 2752125
32385 2752125 -5697745 -13827373 -16268655 -14572162 -12480662 -9414890 -3428569 2446421
32377 2446421 3170235 -51753 -894601 2390704 4642747 2600275 69088 1584763
32369 1584763 5950973 9282695 10264428 9280351 6417710 3634034 4801307 9916415
$$ packed form
32425C494739K815997j21626m867841n433740p30254L539391L337321J118579
32417C152566k3711j474654m557102n636309j137101N355582O695761J863458
32409D238490l053045l514430j451181o58052j481940j943300j078567P76914
32401h165111K801022L289600P05510l357641m586468j193656L312882M541689
32393b652173K367178l34483j758876j442574J031655M169419L665556k293577
32385B752125q449870q129628k441282J696493K091500L065772N986321N874990
32377B446421P23814l221988q42848L285305K252043k042472k531187J515675
32369A584763M366210L331722R81733r84077k862641k783676J167273N115108
$$ plain form
32361 9916415 13377548 12066219 10608670 13387250 15914978 11345759 2433360 -1362114
32353 -1362114 2309230 6052520 4557825 1203071 638737 1715588 1302041 -171930
32345 -171930 -801078 -1059283 -2300109 -4203286 -5991348 -7527248 -7768686 -5321857 -1747202
32336 -1747202 -644515 -2287507 -3413223 -3543056 -6132083 -11147040 -12526591 -7141513
32328 -7141513 -880373 -395182 -3132565 -1910058 3568997 6626162 3835652 -1028577
32320 -1028577 -3493858 -3549850 -3372432 -3998275 -5391967 -6903305 -7060372 -5228073 -3348164
32311 -3348164 -3698353 -5463480 -6007933 -4702923 -2711415 -38770 3756580 6556549
32303 6556549 5187668 140419 -4447383 -5795721 -4599040 -2260819 595434 2459337
$$ packed form
32361I916415L461133j311329j457549K778580K527728m569219q912399l795474
32353a362114L671344L743290j494695l354754n64334J076851m13547j473971
32345a71930o29148k58205j240826j903177j788062j535900k41438K446829L574655
32336a747202J102687j642992j125716j29833k589027n014957j379551N385078
32328g141513O261140M85191k737383J222507N479055L057165k790510m864229
32320a028577k465281n5992J77418o25843j393692j511338j57067J832299J879909
32311c348164l50189j765127n44453J305010J991508K672645L795350K799969
32303F556549j368881n047249m587802j348338J196681K338221K856253J863903
$$ plain form
32295 2459337 1248110 -2472556 -5205825 -4703656 -2440354 -1028238 -995649 -1004598 105555
32286 105555 2120760 3537617 3110424 1999057 3007902 6266077 7638714 3952776
32278 3952776 -2007895 -4916277 -3750646 -1596651 -126938 1235393 1635701 -449245
32270 -449245 -2664779 -409599 5828458 9809539 8005908 4069647 2619802 3017515
32262 3017515 2288627 506983 -120392 1117514 3635182 7153739 10715396 12330780
32254 12330780 11696608 10869526 10381381 7679573 1815207 -3414633 -4056558 -1179336 1533257
32245 1533257 2860532 3562364 3401595 2374511 2737767 5743529 8092900 6009545 1625565
32236 1625565 621341 3948349 6714551 5820601 4002304 4510236 5666664 3597167
$$ packed form
32295B459337j211227l720666k733269N02169K263302J412116L2589q949J110153
32286A05555K015205J416857m27193j111367J008845L258175J372637l685938
32278C952776n960671k908382J165631K153995J469713J362331M00308k084946
32270d49245k215534K255180O238057L981081j803631l936261j449845L97713
32262C017515p28888j781644o27375J237906K517668L518557L561657J615384
32254A2330780o34172q27082m88145k701808n864366n229840o41925K877222K712593
32245A533257J327275P01832j60769j027084L63256L005762K349371k083355m383980
32236A625565j004224L327008K766202q93950j818297N07932J156428k069497
$$ plain form
32228 3597167 -1777712 -6263004 -6252907 -2307990 1981682 3665181 2812164 1627877 1609665
32219 1609665 2155221 2004631 1014413 -50364 -475177 277277 2212093 3868418 3208592
32210 3208592 365280 -2162306 -3094903 -4023475 -5995992 -7067304 -5639186 -3570444
32202 -3570444 -2594861 -176380 6319818 12841003 11883041 3001055 -5427864 -6829574
32194 -6829574 -4016723 -3363170 -5622517 -6563187 -3977388 377237 4573572 8148276
32186 8148276 10161418 9281110 6500516 4880258 5443805 5596284 3053861 -487787 -1574003
32177 -1574003 60190 922720 -1607528 -5640333 -6684614 -2627944 3855415 7629685
32169 7629685 5522712 -993902 -6834016 -7431290 -2930221 1644655 1293087 -3721654
$$ packed form
32228C597167n374879m485292J0097L944917M289672J683499q53017j184287j8212
32219A609665N45556j50590r90218j064777m24813P52454J934816J656325o59826
32210C208592k843312k527586r32597r28572j972517j071312J428118K068742
32202c570444R75583K418481O496198O521185r57962q881986q428919j401710
32194f829574K812851O53553k259347r40670K585799M354625M196335L574704
32186H148276K013142q80308k780594j620258N63547J52479k542423l541648j086216
32177a574003J634193Q62530k530248m032805j044281M056670O483359L774270
32169G629685k106973o516614n840114n97274M501069M574876l51568n014741
$$ plain form
32161 -3721654 -8431097 -9016018 -6616059 -4582010 -3719956 -2338643 -212560 266196 -2266798
32152 -2266798 -5437437 -5889564 -3831176 -2811614 -4835490 -7451931 -6691367 -1869384
32144 -1869384 3705800 6229398 4459282 -98788 -4413759 -5557333 -3133345 -461814
32136 -461814 -1293807 -4717906 -5793923 -2460286 1149929 670795 -2136114 -2757670 -1528461
32127 -1528461 -2911667 -7806038 -11783397 -11863750 -10304333 -9855365 -9448752 -7157011 -4082164
32118 -4082164 -2450619 -2273947 -2368787 -2527703 -2459498 -726323 3021065 6633511 8151958
32109 8151958 7889463 6383429 3111283 -814883 -1927234 883067 3926033 3974613 2871005
32100 2871005 3413874 3913391 1405197 -2226767 -2488673 735528 3206200 2477811 -172106
$$ packed form
32161c721654m709443n84921K399959K034049Q62054J381313K126083M78756k532994
32152b266798l170639m52127K058388J019562k023876k616441P60564M821983
32144a869384N575184K523598j770116m558070m314971j143574K423988K671531
32136d61814q31993l424099j076017L333637L610215m79134k806909o21556J229209
32127a528461j383206m894371l977359q0353J559417M48968M06613K291741L074847
32118d082164J631545J76672r4840j58916O8205J733175L747388L612446J518447
32109H151958k62495j506034l272146l926166j112351K810301L042966M8580j103608
32100B871005N42869M99517k508194l631964k61906L224201K470672p28389k649917
$$ plain form
32091 -172106 -2878920 -4093184 -1770807 3652869 6793977 3023700 -4275704 -7541512
32083 -7541512 -5262644 -2452314 -1594671 -159369 2398349 2717106 473657 -123614 1372949
32074 1372949 -744596 -8233872 -13409361 -9575847 -1259177 2659357 1591651 1659009
32066 1659009 4429619 5194388 1857270 -1534164 -1184242 1864426 4859073 6876478
32058 6876478 7944517 7903539 7227105 6576684 5336527 3004333 1496869 2840310 4965828
32049 4965828 3797342 -40460 -872098 4005260 9622375 9274874 2782474 -3722786
32041 -3722786 -4784451 -345453 5306823 7418588 4413858 -766073 -3553075 -2959577
32033 -2959577 -2724036 -6000678 -10551972 -11680594 -9021934 -7093234 -8451388 -9568930
$$ packed form
32091a72106k706814j214264K322377N423676L141108l770277p299404l265808
32083g541512K278868K810330Q57643J435302K557718L18757k243449n97271J496563
32074A372949k117545p489276n175489L833514Q316670L918534j067706O7358
32066A659009K770610P64769l337118l391434L49922L048668K994647K017405
32058F876478J068039m0978o76434o50421j240157k332194j507464J343441K125518
32049D965828j168486l837802q31638M877358N617115l47501o492400o505260
32041c722786j061665M438998N652276K111765l004730n179931k787002N93498
32033b959577K35541l276642m551294j128622K658660J928700j358154j117542
$$ plain form
32025 -9568930 -5877468 1199034 5681032 5067617 3273836 4242605 5839601 3184380
32017 3184380 -3535607 -8360987 -7053144 -2217266 519496 -687394 -2872557 -2837144
32009 -2837144 -622984 1484334 1794927 458643 -1320576 -2522661 -2758893 -2062607 -871069
32000 -871069 -134519 -548633 -1358679 -973461 616927 1377794 322093 -473589 1110704
31991 1110704 3529359 3604634 1591836 1084365 3722788 7027553 8167670 7115387 5221671
31982 5221671 3412455 2854114 4619883 7302823 7607810 4862544 2351227 2561607 3902351
31973 3902351 4052511 3559567 3610019 3204153 1689955 1380939 3902650 6208274 4473478
31964 4473478 279333 -1600648 -373880 687898 678569 2110359 5040816 5736501 3102642
$$ packed form
32025i568930L691462P076502M481998o13415j793781R68769J596996k655221
32017C184380o719987m825380J307843M835878K736762j206890k185163L5413
32009b837144K214160K107318L10593j336284j779219j202085k36232O96286J191538
32000h71069P36550m14114q10046L85218J590388P60867j055701p95682J584293
31991A110704K418655P5275k012798n07471K638423L304765J140117j052283j893716
31982E221671j809216n58341J765769K682940L04987k745266k511317K10380J340744
31973C902351J50160m92944N0452m05866j514198l09016K521711K305624j734796
31964D473478m194145j879981J226768J061778r329J431790K930457O95685k633859
$$ plain form
31955 3102642 1386749 3401169 5221791 1700426 -5457466 -9427944 -6846522 -927024
31947 -927024 3474433 4509273 2855935 -275510 -3268577 -4025195 -1486978 2857680
31939 2857680 5600861 4036604 -1090428 -5300727 -4090351 2137103 7903658 8615530
31931 8615530 5564279 3304940 3216076 2419950 -1019095 -4919440 -6185508 -4753990 -2685066
31922 -2685066 -1313059 -1235523 -3205061 -6338782 -6906090 -2414295 3521171 4213694 -1464439
31913 -1464439 -7114612 -7027651 -2925622 -63149 238958 538395 1849612 2540551 1989239
31904 1989239 1399775 799514 -1271375 -4441998 -6024900 -4791869 -2490464 -654973
31896 -654973 1305526 3559076 4126877 1646008 -2046636 -3888845 -2872502 -298767
$$ packed form
31955C102642j715893K014420J820622l521365p157892l970478K581422N919498
31947i27024M401457J034840j653338l131445k993067p56618K538217M344658
31939B857680K743181j564257n127032m210299J210376O227454N766555P11872
31931H615530l051251k259339q8864p96126l439045l900345j266068J431518K068924
31922b685066J372007P7536j969538l133721n67308M491795N935466O92523n678133
31913a464439n650173Q6961M102029K862473L02107K99437J311217O90939n51312
31904A989239n89464o00261k070889l170623j582902J233031K301405J835491
31896f54973J960499K253550N67801k480869l692644j842209J016343K573735
$$ plain form
31888 -298767 1703742 1219845 -1767872 -3904345 -1352684 4470972 7051839 2843103
31880 2843103 -3700518 -6000835 -3557378 -596404 1131532 3208884 4956264 2478985
31872 2478985 -5061118 -12295995 -13488593 -9285458 -5229987 -4899086 -6805075 -7634368
31864 -7634368 -6487817 -5214527 -5461186 -6407075 -5782544 -2800180 661581 2073257 909253
31855 909253 -1051050 -1552770 304352 3364854 5070187 3501165 -595812 -4225930
31847 -4225930 -4940531 -2859013 -84029 998326 -846687 -4368830 -5941134 -3096269
31839 -3096269 1519994 2086254 -3316598 -9835410 -11738742 -9047022 -6056641 -5113325
31831 -5113325 -4828009 -3674395 -2401354 -2534897 -4368674 -6793841 -8009273 -6567111
$$ packed form
31888b98767K002509m83897k987717k136473K551661N823656K580867m208736
31880B843103o543621k300317K443457K960974J727936K077352J747380k477279
31872B478985p540103p234877j192598M203135M055471L30901j905989q29293
31864g634368J146551J273290k46659r45889O24531K982364L461761J411676j164004
31855I09253j960303n01720J857122L060502J705333j569022m096977l630118
31847d225930p14601K081518K774984J082355j845013l522143j572304K844865
31839c096269M616263N66260n402852o518812j903332K691720K990381R43316
31831e113325K85316J153614J273041j33543j833777k425167j215432J442162
$$ plain form
31823 -6567111 -2763468 1287052 3759254 4764797 5341400 5859827 6155063 5924212 4258314
31814 4258314 572935 -3048398 -2931566 915783 3209433 -45881 -5464843 -6302079
31806 -6302079 -1247270 4641652 7164503 6979673 5997234 3987271 770371 -1219351
31798 -1219351 550795 4703724 6793145 4315800 -413904 -2962591 -1713673 872577
31790 872577 1951770 1632494 1279165 154389 -3248906 -7161166 -7705364 -4775191 -2782621
31781 -2782621 -4054522 -5549552 -4384683 -2367221 -1760483 -716908 2584874 4766254
31773 4766254 1677129 -4309495 -7063117 -5333228 -3080084 -2164228 -664833 1436489
31765 1436489 865148 -3120777 -6336884 -5237757 -1443578 1103358 899487 -599048
$$ packed form
31823f567111L803643M050520K472202J005543N76603N18427K95236k30851j665898
31814D258314l685379l621333J16832L847349K293650l255314n418962q37236
31806f302079N054809N888922K522851j84830r82439k009963l216900j989722
31798a219351J770146M152929K089421k477345m729704k548687J248918K586250
31790H72577J079193l19276l53329j124776l403295l912260n44198K930173J992570
31781b782621j271901j495030J164869K017462O06738J043575L301782K181380
31773D766254l089125n986624k753622J729889K253144R15856J499395K101322
31765A436489n71341l985925l216107J099127L794179K546936k03871j498535
$$ plain form
31757 -599048 -1328926 -700677 -410506 -2558394 -5840808 -5837942 -1388373 2296114 557048
31748 557048 -3734252 -4982450 -3650768 -3959338 -5122731 -2503150 3230483 5963364
31740 5963364 3753188 1220985 1271381 1660651 1192683 1898396 3128065 1062829 -3373078
31731 -3373078 -3865053 798898 3424837 -293470 -4955690 -5043355 -3811459 -6234535 -9659262
31722 -9659262 -8768992 -4730897 -2176021 -1267768 315558 1298861 -423085 -2339841 -1463445
31713 -1463445 -837261 -5013534 -11620139 -14242709 -11586306 -7400289 -3616943 -89836
31705 -89836 1231158 -1175982 -3757797 -2724055 -1289831 -4466492 -8847787 -6612428
31697 -6612428 1181691 4956848 1075301 -3423752 -2657270 436631 1626820 2429679
$$ packed form
31757e99048p29878O28249K90171k147888l282414K866M449569L684487j739066
31748E57048m291300j248198J331682l08570j163393K619581N733633K732881
31740E963364k210176k532203N0396L89270m67968P05713J229669k065236m435907
31731c373078m91975M663951K625939l718307m662220q7665J231896k423076l424727
31722i659262Q90270M038095K554876R08253J583326R83303j721946j916756Q76396
31713a463445O26184m176273o606605k622570K656403M186017L783346L527107
31705h9836J320994k407140k581815J033742J434224l176661m381295K235359
31697f612428P794119L775157l881547m499053P66482L093901J190189Q02859
$$ plain form
31689 2429679 5024562 6872142 5556001 3758796 4438087 5300309 2869909 -1353137
31681 -1353137 -3387060 -2942841 -3071446 -5280294 -8045091 -8879620 -6023906 110850 5883983
31672 5883983 7248508 4764575 2868782 3189003 2460018 -1288648 -4847566 -4840933 -2692439
31663 -2692439 -1419995 -1052206 -654542 -1371413 -3311338 -2526412 3870124 11461927 12638497
31654 12638497 6528624 317284 209631 4721887 7873746 6270488 1772465 -1258272
31646 -1258272 -401078 2586243 3988835 2765529 1752712 3479067 6476727 7340758
31638 7340758 5040851 1346234 -1801998 -3297774 -2279912 1128245 4788900 6090085
31630 6090085 4442779 1224022 -1860103 -3007194 -295150 6117716 12141980 12550809
$$ packed form
31689B429679K594883J847580j316141j797205O79291Q62222k430400m223046
31681a353137k033923M44219j28605k208848k764797q34529K855714O134756N773133
31672E883983J364525k483933j895793L20221p28985l748666l558918O633K148494
31663b692439J272444L67789L97664p16871j939925P84926O396536P591803J176570
31654A2638497o109873o211340j07653M512256L151859j603258m498023l030737
31646a258272Q57194K987321J402592j223306j012817J726355K997660Q64031
31638G340758k299907l694617l148232j495776J017862L408157L660655J301185
31630F090085j647306l218757l084125j147091K712044O412866O024264M08829
$$ plain form
31622 12550809 6326599 -2053379 -7096948 -7264679 -5356467 -4632531 -4891459 -2778349
31614 -2778349 3342364 9548992 9643554 2725160 -5082839 -7828242 -6048452 -3817087
31606 -3817087 -2331090 -123451 2143354 1849647 -517093 -849644 2596392 6177447
31598 6177447 5867764 2622224 333150 370966 844739 255521 -709055 -783005 540219
31589 540219 3221311 6392436 7887388 6102286 2778105 1878938 4667309 7689519
31581 7689519 7069305 3152644 -988558 -4055431 -6675996 -7971013 -5677497 -331595
31573 -331595 4075505 5160402 4940451 5648556 5754231 3054546 -797737 -2597136 -2708240
31564 -2708240 -3714396 -4976579 -3308864 800253 2598728 160703 -2423901 -1402196
$$ packed form
31622A2550809o224210q379978n043569j67731J908212P23936k58928K113110
31614b778349O120713O206628R4562o918394p807999k745403J779790K231365
31606c817087J485997K207639K266805k93707k366740l32551L446036L581055
31598F177447l09683l245540k289074L7816M73773n89218r64576p3950J323224
31589E40219K681092L171125J494952j785102l324181q99167K788371L022210
31581G689519o20214l916661m141202l066873k620565j295017K293516N345902
31573c31595M407100J084897k19951P08105J05675k699685l852283j799399j11104
31564b708240j006156j262183J667715M109117J798475k438025k584604J021705
$$ plain form
31556 -1402196 971230 510460 -2024521 -2244073 951353 3685426 2520261 -1324461
31548 -1324461 -4009766 -3573420 -1419787 -91333 -418824 -1255829 -1887155 -3358313 -6064046
31539 -6064046 -7381251 -4605739 169839 1836240 -412442 -1710079 697663 2733135
31531 2733135 2432 -4803607 -5840328 -2872543 -664446 -929489 -593910 1939962
31523 1939962 4311359 4975191 5403363 5920307 4234445 502179 -877073 1981560 4009391
31514 4009391 106486 -6490660 -8256544 -4423279 -2099821 -5641975 -10212636 -8714220
31506 -8714220 -1676834 3484710 1908246 -3279293 -5479071 -2465654 1826645 2804125
31498 2804125 689573 -721541 212295 1038179 -293819 -1762370 -635218 1406415
$$ packed form
31556a402196K373426m60770k534981k19552L195426K734073j165165l844722
31548a324461k685305M36346K153633J328454l27491q37005o31326j471158k705733
31539f064046j317205K775512M775578J666401k248682j297637K407742K035472
31531B733135k730703m806039j036721K967785K208097k65043L35579K533872
31523A939962K371397O63832M28172N16944j685862l732266j379252K858633K027831
31514D009391l902905o597146j765884L833265K323458l542154m570661J498416
31506h714220P037386N161544j576464n187539k199778L013417M292299R77480
31498B804125k114552j411114R33836Q25884j331998j468551J127152K041633
$$ plain form
31490 1406415 268342 -3896973 -6222338 -4261795 -1429631 -994727 -454429 4228579
31482 4228579 11345240 15143212 13792447 10858538 8764132 5759436 943397 -2281825
31474 -2281825 -827906 3184974 5569221 5957638 7058441 9440540 10755517 9810536
31466 9810536 8080984 6728975 4849466 1655408 -1471191 -2186434 387644 4670276
31458 4670276 7382034 5883843 1029251 -2928346 -2825281 -401141 65443 -2776660
31450 -2776660 -6296717 -7631165 -6082891 -2315447 2022189 4083338 2363269 -399733
31442 -399733 -173954 2202212 1761126 -2640600 -5622492 -3067363 1456722 1795748 -2251907
31433 -2251907 -5692627 -5617229 -3372115 -631789 2259227 4160745 3344152 425054 -2029576
$$ packed form
31490A406415j138073m165315k325365J960543K832164M34904N40298M683008
31482D228579P116661L797972j350765k933909k094406l004696m816039l225222
31474b281825J453919M012880K384247L88417J100803K382099J314977r44981
31466I810536j729552j352009j879509l194058l126599p15243K574078M282632
31458D670276K711758j498191m854592l957597J03065K424140M66584k842103
31450b776660l520057j334448J548274L767444M337636K061149j720069k763002
31442c99733K25779K376166m41086m401726k981892K555129M524085L39026m047655
31433b251907l440720P5398K245114K740326K891016J901518q16593k919098k454630
$$ plain form
31424 -2029576 -3283093 -4874895 -6852227 -6746613 -3466000 491396 2242819 1992132
31416 1992132 1960148 3370098 5552331 6818160 5670382 2510233 309845 1726628
31408 1726628 5327992 6970170 5406784 3843733 4899171 6896898 6994261 5430412
31400 5430412 4218297 3524335 2011982 -415823 -2625128 -4157331 -5138290 -5217362 -4462883
31391 -4462883 -4248914 -5374174 -6495001 -6284536 -5516415 -4783115 -2299025 2750394 6680588
31382 6680588 5497655 1394453 111493 2343546 3398758 1846962 2157710 6581213
31374 6581213 10552322 9825029 6757336 4896954 2316795 -3640773 -8888063 -7163221
31366 -7163221 -188758 4067665 2887078 1398074 2810866 3147894 -1437913 -7799722
$$ packed form
31424b029576j253517j591802j977332J05614L280613L957396J751423k50687
31416A992132l1984J409950K182233J265829j147778l160149k200388J416783
31408A726628L601364J642178j563386j563051J055438J997727R7363j563849
31400E430412j212115o93962j512353k427805k209305j532203r80959p9072P54479
31391d462883K13969j125260j120827K10465P68121P33300K484090N049419L930194
31382F680588j182933m103202j282960K232053J055212j551796L10748M423503
31374F581213L971109p27293l067693j860382k580159n957568n247290J724842
31366g163221O974463M256423j180587j489004J412792L37028m585807o361809
$$ plain form
31358 -7799722 -10194307 -7797033 -4245307 -2411856 -2765565 -4744817 -6852329 -6914979 -4573338
31349 -4573338 -2290175 -2248785 -3604298 -4023891 -2415899 648487 3291227 2745303 -1789353
31340 -1789353 -6257047 -5413961 -437961 1508246 -2666292 -7057525 -5104913 1541003
31332 1541003 6556375 7383551 5419647 1458090 -3323574 -4622853 248634 6257536
31324 6257536 5582482 -1763718 -8041266 -8362294 -5362111 -3035450 -1947718 -1823076 -3176180
31315 -3176180 -4271417 -1453349 4962615 9298343 7496716 1963631 -2589696 -4479341
31307 -4479341 -4184842 -2099361 133676 -449449 -3770881 -5214454 -1677799 3340996
31299 3340996 4009213 -295597 -4847370 -5785033 -3702219 -1686826 -1902406 -3817555 -4708639
$$ packed form
31358g799722k394585K397274L551726J833451l53709j979252k107512o2650K341641
31349d573338K283163M1390j355513m19593J607992L064386K642740n45924m534656
31340a789353m467694Q43086M976000J946207m174538m391233J952612O645916
31332A541003N015372Q27176j963904l961557m781664j299279M871487O008902
31324F257536o75054p346200o277548l21028L000183K326661J087732J24642j353104
31315c176180j095237K818068O415964M335728j801627n533085m553327j889645
31307d479341K94499K085481K233037n83125l321432j443573L536655N018795
31299C340996O68217m304810m551773r37663K082814K015393k15580j915149q91084
$$ plain form
31290 -4708639 -2523172 1440662 4070350 4572324 4707751 4857146 3316928 527873 101991
31281 101991 3377513 6367458 5061538 1021821 -1416996 -1206247 -531023 -531937 -578844
31272 -578844 -816892 -2261581 -4590284 -6031811 -5214426 -1927668 2812943 6341547 5925404
31263 5925404 2468928 575679 2836063 6108874 5908990 2524566 -44379 363945
31255 363945 2524449 4616694 5714551 5313075 3826882 2830515 2930457 2702564 1576772
31246 1576772 1731145 4545777 7257341 6357571 2595102 -808895 -3175975 -5592258
31238 -5592258 -6598889 -3564219 1890685 4708678 3429790 2056402 3517365 5268639
31230 5268639 3616844 -653556 -3564588 -2938240 87586 3161494 4407307 2979856
$$ packed form
31290d708639K185467L963834K629688N01974J35427J49395j540218k789055m25882
31281A01991L275522K989945j305920m039717k438817K10749O75224r14m6907
31272e78844k38048j444689k328703j441527Q17385L286758M740611L528604m16143
31263E925404l456476j893249K260384L272811j99884l384424k568945M08324
31255C63945K160504K092245J097857m01476j486193r96367R9942k27893j125792
31246A576772J54373K814632K711564q99770l762469l403997k367080k416283
31238e592258j006631L034670N454904K817993j278888j373388J460963J751274
31230E268639j651795m270400k911032O26348L025826L073908J245813j427451
$$ plain form
31222 2979856 -238705 -2784866 -2724967 -642165 1167684 1409441 1110997 2067110 4384148
31213 4384148 6219081 6098395 4620283 3119668 1665161 -167295 -1517564 -1472546 -1389639
31204 -1389639 -3100432 -5083115 -4002949 -460388 864569 -1904065 -4888602 -4265748
31196 -4265748 -964486 2611693 6011124 7890173 4699115 -3302951 -9108065 -7552520
31188 -7552520 -3272639 -3893175 -8191456 -8263177 -2076360 3712698 3989315 1490168 1075623
31179 1075623 3016410 4375656 3492237 1202106 -181863 1337602 4664203 5559471
31171 5559471 2009558 -2098831 -2155159 513270 1623742 1181310 1997229 2978379 841426
31162 841426 -2482580 -1785001 1966273 2040309 -2908162 -6013346 -2994471 1655429 2654013
$$ packed form
31222B979856l218561k546161N9899K082802J809849K41757k98444R56113K317038
31213D384148J834933j20686j478112j500615j454507j832456j350269M5018Q2907
31204a389639j710793j982683J080166L542561J324957k768634k984537O22854
31196d265748L301262L576179L399431J879049l191058q002066n805114J555545
31188g552520M279881o20536m298281p1721O186817N789058K76617k499147m14545
31179A075623J940787J359246q83419k290131j383969J519465L326601Q95268
31171E559471l549913m108389n6328K668429J110472m42432Q15919R81150k136953
31162H41426l324006O97579L751274P4036m948471l105184L018875M649900R98584
$$ plain form
31153 2654013 1350840 1123124 1239978 -222326 -2004860 -2184945 -1187143 526619 3399738
31144 3399738 5166364 1756700 -5365491 -8674485 -4875757 264311 1255141 564811
31136 564811 2041922 3178081 263456 -4282994 -6532668 -8072138 -11302649 -12454039
31128 -12454039 -7454199 -1022711 -913646 -5239656 -4634860 3413723 10851840 10585589
31120 10585589 4677804 -329305 -590896 3511424 8051920 7402224 199777 -6651571
31112 -6651571 -5062457 3360885 8964820 6530823 262017 -4162437 -6295080 -7962358
31104 -7962358 -9007787 -8461104 -6278711 -2554647 1684977 2870869 -1447041 -7166484
31096 -7166484 -7144529 -1063880 3601730 1994799 -2149383 -3138229 -819490 1495463 2318336
$$ packed form
31153B654013j303173k27716J16854j462304j782534j80085R97802J713762K873119
31144C399738J766626l409664p122191l308994L798728N140068R90830o90330
31136E64811J477111J136159k914625m546450k249674j539470l230511j151390
31128a2454039M999840O431488J09065m326010O04796Q048583P438117k66251
31120A0585589n907785n007109k61591M102320M540496o49696p202447o851348
31112f651571J589114Q423342N603935k433997o268806m424454k132643j667278
31104g962358j045429N46683K182393L724064M239624J185892m317910n719443
31096g166484K1955O080649M665610j606931m144182r88846K318739K314953Q22873
$$ plain form
31087 2318336 2067038 1242876 1182054 3620629 7426043 8898676 7064268 5081374 4601921
31078 4601921 2936993 -1566048 -5454485 -4959597 -1626200 386885 91030 -562817 -580055
31069 -580055 -441347 -220753 355096 1202012 2649909 5086726 6970797 5936064 2744332
31060 2744332 647917 -115517 -2630751 -6556954 -6721421 -1526806 3076056 2502901 767610
31051 767610 2975433 5942709 3965443 -113297 1257409 7330060 9415272 4479717
31043 4479717 -702305 -874882 653841 -387675 -2122507 -1665657 -1230817 -3651159 -6364165
31034 -6364165 -5408720 -2080467 -290269 36470 1537492 3426210 2660616 188722 259244
31025 259244 3102527 3677458 -591109 -5292519 -4895524 -24949 3992423 3921951 1345407
$$ packed form
31087B318336k51298q24162o0822K438575L805414J472633j834408j982894m79453
31078D601921j664928m503041l888437M94888L333397K013085k95855o53847j7238
31069e80055J38708K20594N75849Q46916J447897K436817J884071j034733l191732
31060B744332k096415p63434k515234l926203j64467N194615M602862n73155j735291
31051G67610K207823K967276j977266m078740J370706O072651K085212m935555
31043D479717n182022j72577J528723j041516j734832M56850M34840k420342k713006
31034f364165R55445L328253J790198L26739J501022J888718p65594k471894P0522
31025B59244K843283N74931m268567m701410L96995M870575M017372p0472k576544
$$ plain form
31016 1345407 -229302 1262031 5165484 8224059 6656640 256722 -5883416 -6021720
31008 -6021720 -471878 4461564 4007214 175924 -2078715 -1808760 -2141526 -4186637 -4698635
30999 -4698635 -1216618 3434339 4484926 1494814 -1716253 -2813276 -3356251 -4896274
30991 -4896274 -5840221 -4169947 -1091463 668436 1129902 2855906 6548025 9372339
30983 9372339 8521079 4732215 1322982 926641 3803092 7882863 9542738 6036546
30975 6036546 -1074571 -6065535 -4759215 462962 3587299 2614499 1475813 3637896
30967 3637896 6877352 6798183 3580309 1894011 4313451 7931177 8719763 6929894 5855893
30958 5855893 6222913 4706822 -931646 -7383732 -9006169 -5048028 -779385 -374851
$$ packed form
31016A345407j574709J491333L903453L058575j567419o399918o140138j38304
31008f021720N549842M933442m54350l831290k254639K69955l32766k045111n11998
30999d698635L482017M650957J050587k990112l211067j097023n42975j540023
30991d896274r43947J670274L078484J759899M61466J726004L692119K824314
30983I372339q51260l788864l409233l96341K876451M079771J659875l506192
30975F036546p111117m990964J306320N222177L124337r72800j138686K162083
30967C637896L239456p9169l217874j686298K419440L617726P88586j789869j074001
30958E855893L67020j516091n638468o452086j622437L958141M268643M04534
$$ plain form
30950 -374851 -1509843 358638 4557477 6208172 3991230 1975745 2567846 2626603 -421507
30941 -421507 -2979533 -449245 4890264 6593313 3233515 -650477 -2396159 -4149943
30933 -4149943 -6969569 -7740218 -4563170 -546054 1004632 1291895 2375517 2383152 -1063099
30924 -1063099 -5046594 -4120272 1811680 6837657 6474847 2168117 -1946873 -3379536
30916 -3379536 -1725962 1958769 4830549 3785167 -1024467 -5741928 -7063942 -5694256
30908 -5694256 -4766778 -6201370 -9459527 -12591295 -13512360 -11258468 -6982920 -3195875
30900 -3195875 -1558588 -1966263 -3644639 -5777811 -6805116 -4861917 -102350 4448561
30892 4448561 5565665 2908350 -1209936 -4435260 -5947599 -6004667 -4966476 -2953059
$$ packed form
30950c74851j134992J868481M198839J650695k216942k015485N92101N8757l048110
30941d21507k558026K530288N339509J703049l359798l883992j745682j753784
30933d149943k819626p70649L177048M017116J550686K87263J083622P635l446251
30924a063099l983495R26322N931952N025977l62810m306730m114990j432663
30916c379536J653574L684731K871780j045382m809634m717461j322014J369686
30908e694256R27478j434592l258157l131768r21065K253892M275548L787045
30900c195875J637287m07675j678376k133172j027305J943199M759567M550911
30892D448561J117104k657315m118286l225324j512339n7068J038191K013417
$$ plain form
30884 -2953059 -220077 2173397 2529813 276088 -2448462 -2321346 1181010 4219537
30876 4219537 2327387 -4277917 -10121008 -9876849 -4106809 1234360 1503704 -1275896
30868 -1275896 -1317232 2959870 6606844 5296575 2004535 2936589 8036980 10247624 5232755
30859 5232755 -2392687 -5223311 -2452103 429707 -292673 -2667751 -3268738 -1844714
30851 -1844714 -337087 618027 2075622 4103873 4467801 1008050 -4980563 -8958169
30843 -8958169 -7625163 -2615567 1490820 2448377 1966635 2116013 2361717 1117428 -1596303
30834 -1596303 -4312568 -5543445 -4162736 -220653 3509700 3170140 -1069645 -3894493
30826 -3894493 -1563593 2358321 1609616 -3808740 -7607357 -5960107 -1813073 676025
$$ packed form
30884b953059K732982K393474L56416k253725k724550J27116L502356L038527
30876D219537j892150o605304n843091K44159N770040N341169K69344k779600
30868a275896m1336M277102L646974j310269l292040R32054N100391K210644n014869
30859E232755p625442k830624K771208K881810p22380k375078o00987J424024
30851a844714J507627R55114J457595K028251L63928l459751n988613l977606
30843h958169J333006N009596M106387R57557m81742J49378K45704j244289k713731
30834a596303k716265j230877J380709L942083L730353l39560m239785k824848
30826c894493K330900L921914p48705n418356l798617J647250M147034K489098
$$ plain form
30818 676025 1892382 4386544 7430343 7167345 1670134 -6132722 -10899118 -9877336
30810 -9877336 -5655036 -3554501 -5653479 -8440513 -7824879 -4869106 -3678143 -4828911
30802 -4828911 -5125042 -3843513 -4201414 -6920343 -7241167 -1788404 5325489 7559004 4714560
30793 4714560 2191104 2837383 4149302 3520742 2124699 2406019 4610202 7230791 9104826
30784 9104826 9906868 9650210 8447900 6244026 2799903 -1423838 -4789509 -5823003
30776 -5823003 -4790118 -3286096 -2665096 -3192432 -3855488 -2828751 347357 2830140 1123569
30767 1123569 -3537763 -5563539 -2555743 929464 132971 -2682970 -2030768 2236646
30759 2236646 5264142 4784553 3044264 1587631 -335506 -1541658 1375274 8073823
$$ packed form
30818F76025J216357K494162L043799k62998n497211p802856m766396J021782
30810i877336M222300K100535k098978k787034O15634K955773J190963j150768
30802d828911k96131J281529l57901k718929l20824N452763P113893K233515k844444
30793D714560k523456O46279J311919o28560j396043K81320K204183K620589J874035
30784I104826Q02042k56658j202310k203874l444123m223741l365671j033494
30776e823003J032885J504022O21000n27336o63056J026737L176108K482783j706571
30767A123569m661332k025776L007796L485207p96493k815941O52202M267414
30759B236646L027496m79589j740289j456633j923137j206152K916932O698549
$$ plain form
30751 8073823 12644783 10359493 3205652 -3163233 -5163721 -2674690 1911367 4329414
30743 4329414 1480091 -4198300 -6504631 -3424552 232689 339148 -498398 2025607
30735 2025607 6286969 6894014 2714028 -1783407 -2644615 -215677 2974888 4918716
30727 4918716 4567605 2180241 -397231 -1530599 -1743384 -2424220 -3388313 -3674373 -4041923
30718 -4041923 -6215069 -9546343 -10604886 -6974160 -419555 4489081 4828937 2259891
30710 2259891 1053242 2717409 3693076 49660 -6723659 -11541584 -12533249 -11909630 -10101334
30701 -10101334 -4627489 3247557 6651380 2174422 -3868402 -3653589 1105023 2427965
30693 2427965 -1728959 -5077497 -2479728 3983370 9247524 10978681 9969754 8334639
$$ packed form
30751H073823M570960k285290p153841o368885k000488K489031M586057K418047
30743D329414k849323n678391k306331L080079L657241J06459q37546K524005
30735B025607M261362O07045m179986m497435q61208K428938L190565J943828
30727D918716l51111k387364k577472j133368k12785o80836r64093k86060l67550
30718d041923k173146l331274j058543L630726O554605M908636L39856k569046
30710B259891j206649J664167R75667l643416o773319m817925r91665O23619J808296
30701a0101334N473845P875046L403823m476958o042824K14813M758612J322942
30693B427965m156924l348538K597769O463098N264154J731157j008927j635115
$$ plain form
30685 8334639 8093565 8973299 7947030 3687694 138835 1805303 6759383 9025501
30677 9025501 7085819 4741224 3885542 2425808 62241 -101581 2358902 3196657 203769
30668 203769 -3135244 -3548424 -2748749 -3070131 -2864377 -114587 3151843 4120054 3808323
30659 3808323 4606246 5894836 5792893 4801135 4175465 3024754 421140 -2032641 -3121529
30650 -3121529 -4778253 -8180250 -10036157 -7373462 -3426103 -3290402 -5501405 -4068777
30642 -4068777 1552782 4794884 1501627 -4163872 -5629402 -1945032 2488715 3674867
30634 3674867 1449836 -1322978 -1716497 282185 1745164 694707 -1127700 -1167017 15741
30625 15741 615464 1602592 4843648 8481200 9048747 7607584 8248162 10298398 8410239
$$ packed form
30685H334639k41074Q79734j026269m259336l548859J666468M954080K266118
30677I025501j939682k344595q55682j459734k363567j63822K460483Q37755k992888
30668B03769l339013m13180P99675l21382K05754K749790L266430R68211l11731
30659C808323P97923J288590j01943r91758o25670j150711k603614k453781j088888
30650c121529j656724l401997j855907K662695L947359J35701k211003J432628
30642d068777N621559L242102l293257n665499j465530L684370M433747J186152
30634C674867k225031k772814l93519J998682J462979j050457j822407l9317J182758
30625A5741N99723R87128L241056L637552N67547j441163O40578K050236j888159
$$ plain form
30616 8410239 2072711 -1674874 1362590 5422484 3239087 -3035488 -5493546 -1974318
30608 -1974318 2602495 4843793 6246284 7788058 7102419 2888816 -1989858 -3940583
30600 -3940583 -2741184 -995675 -1263260 -3934541 -6194574 -3887638 3082147 8575759
30592 8575759 7166825 1986277 520262 3120086 2336025 -4870587 -11432499 -10571092
30584 -10571092 -5593153 -3654533 -4687453 -3512320 198351 1757182 124697 -695377
30576 -695377 607591 280450 -3481131 -6999201 -6958024 -4961332 -3816526 -3504694 -3207673
30567 -3207673 -3308390 -3017389 -149534 4086466 4356777 -1470568 -8298155 -10700975 -9797999
30558 -9797999 -9103180 -7895153 -4356874 -1672699 -3983713 -8234704 -7405305 -1439556
$$ packed form
30616H410239o337528l747585L037464M059894k183397o274575k458058L519228
30608a974318M576813K241298J402491J541774o85639m213603m878674j950725
30600c940583J199399J745509k67585k671281k260033K306936O969785N493612
30592H575759j408934n180548j466015K599824p84061p206612o561912Q61407
30584a0571092M977939J938620j032920J175133L710671J558831j632485q20074
30576f95377J302968l27141l761581l518070M1177J996692J144806L11832K97021
30567c207673j00717K91001K867855M236000K70311n827345o827587k402820R02976
30558i797999O94819J208027L538279K684175k311014m250991Q29399N965749
$$ plain form
30550 -1439556 2211288 -238242 -3995864 -3928824 -1594567 -1036266 -2527734 -3922429 -4421248
30541 -4421248 -3860402 -1540561 1333082 1183504 -2978278 -6950011 -6625047 -3186039 -107943
30532 -107943 2072676 4342518 5135788 2157195 -2951731 -5927625 -5435435 -3799422 -2585880
30523 -2585880 -1031223 998255 1964741 1480304 1317090 2278046 2241772 -1017966 -6301823
30514 -6301823 -9822842 -9281724 -6198999 -4056101 -4513616 -6000250 -6276144 -5455733 -5120557
30505 -5120557 -5104495 -3643361 -1084303 -559345 -3413354 -6473439 -6085399 -2855381 46932
30496 46932 1355781 1482088 -485047 -5599844 -11284766 -12670681 -8605293 -3412709 -1589216
30487 -1589216 -3032013 -4478056 -3549136 -303871 3348102 4652048 2073229 -2532515
$$ packed form
30550a439556L650844k449530l757622O7040K334257N58301j491468j394695m98819
30541d421248N60846K319841K873643j49578m161782l971733L24964L439008L078096
30532a07943K180619K269842P93270k978593n108926k975894M92190J636013J213542
30523b585880J554657K029478R66486m84437j63214R60956l6274l259738n283857
30514f301823l521019N41118L082725K142898m57515j486634k75894Q20411L35176
30505e120557J6062J461134K559058N24958k854009l060085L88040L230018K902313
30496D6932J308849J26307j967135n114797n684922j385915M065388N192584J823493
30487a589216j442797j446043R28920L245265L651973J303946k578819m605744
$$ plain form
30479 -2532515 -5260769 -4597219 -2854489 -2111254 -859388 3134082 8241019 10339288
30471 10339288 8457064 5955503 5362841 5003252 2587134 -444768 -1237259 -561668 -1540685
30462 -1540685 -3642764 -2604307 2223992 5136819 1978681 -3067152 -3237489 1030157
30454 1030157 3652425 2576962 1501434 2187835 1958745 185403 378401 3053034 3190304
30445 3190304 -1030883 -3259426 1518583 7720492 6467653 -1388261 -6957067 -5922814
30437 -5922814 -2147169 190323 747341 -475312 -3614031 -5319205 -1584093 4635490
30429 4635490 5587222 326927 -3068685 149988 4186722 2537524 -1590289 -1270080
30421 -1270080 2489787 2622647 -2784584 -8246412 -9295297 -7119579 -4476142 -2154080
$$ packed form
30479b532515k728254O63550J742730P43235J251866L993470N106937K098269
30471A0339288j882224k501561n92662l59589k416118l031902p92491O75591r79017
30462a540685k102079J038457M828299K912827l158138n045833j70337M267646
30454A030157K622268j075463j075528O86401k29090j773342J92998K674633J37270
30445C190304m221187k228543M778009O201909j252839p855914n568806J034253
30437e922814L775645K337492N57018j222653l138719j705174L735112O219583
30429D635490R51732n260295l395612L218673M036734j649198m127813L20209
30421a270080L759867J32860n407231n461828j048885K175718K643437K322062
$$ plain form
30413 -2154080 -465530 58751 708148 3733033 8213085 10084406 7730288 4400641
30405 4400641 3080332 1821647 -2745155 -8835417 -10141997 -3722340 5284768 8809182
30397 8809182 4929902 -335652 -902864 1837639 1681685 -3219059 -7549598 -6390758
30389 -6390758 -2096244 -404028 -1749314 -849236 4896011 10667884 9954519 2545560
30381 2545560 -5711127 -9919184 -10308971 -9517443 -8247770 -5240698 -585028 3011256
30373 3011256 3140148 917600 -197114 1081716 2012067 -424384 -4868058 -6502105
30365 -6502105 -2839713 3013787 5925785 4565925 2188879 1897759 2927428 2483975
30357 2483975 -8290 -2116263 -1640183 749405 2444115 1526691 -1783886 -5389106
$$ packed form
30413b154080J688550N24281O49397L024885M480052J871321k354118l329647
30405D400641j320309j258685m566802o090262j306580O419657R007108L524414
30397H809182l879280n265554n67212K740503j55954m900744m330539J158840
30389f390758M294514J692216j345286R00078N745247N771873p13365p408959
30381B545560q256687m208057l89787P91528J269673L007072M655670L596284
30373C011256J28892k222548j114714J278830R30351k436451m443674j634047
30365f502105L662392N853500K911998j359860k377046k91120J029669m43453
30357B483975k492265k107973M76080K389588J694710r17424l310577l605220
$$ plain form
30349 -5389106 -6762672 -5172536 -2767947 -2330659 -3722803 -4222964 -2952474 -2682462 -5579771
30340 -5579771 -9261459 -9752903 -7096990 -4964585 -5155783 -5656867 -4564578 -3059867 -3262613
30331 -3262613 -5067886 -6368503 -5417195 -2502517 -108169 -976493 -4641545 -6812089
30323 -6812089 -4400321 -124762 1045021 -806983 -1122296 1182387 1634731 -2175900
30315 -2175900 -6164704 -6196467 -4317148 -4234179 -4625734 -2436346 195500 -1165091 -4867898
30306 -4867898 -4633271 308425 3267164 185142 -4402317 -4759756 -2165197 -1240057 -1822589
30297 -1822589 52003 4760157 8019755 7363261 5281493 4640645 4418646 2231938 -1021467
30288 -1021467 -1788426 1251042 5078208 5884865 3585328 1584256 2299999 4277215 4457647
$$ packed form
30349e389106j373566J590136K404589M37288j392144n00161J270490K70012k897309
30340e579771l681688m91444K655913K132405j91198n01084J092289J504711k02746
30331c262613j805273j300617R51308K914678K394348q68324l665052k170544
30323f812089K411768M275559J169783j852004l15313K304683M52344l810631
30315b175900l988804l1763J879319Q2969l91555K189388K631846j360591l702807
30306d867898K34627M941696K958739l082022m587459l57439K594559R25140n82532
30297a822589J874592M708154L259598o56494k081768o40848k21999k186708l253405
30288a021467p66959L039468L827166Q06657k299537k001072P15743J977216J80432
$$ plain form
30279 4457647 2335336 510041 1369292 4485619 7294734 7161094 2890371 -4133014
30271 -4133014 -9963406 -11039678 -7959699 -4796747 -3969055 -3866360 -2758784 -2284042 -4227228
30262 -4227228 -6000461 -3520122 2001145 4632188 1970231 -1422730 -934223 1474465
30254 1474465 877955 -3047688 -6187098 -6465447 -5949488 -6446921 -6909923 -6366889 -6267168
30245 -6267168 -7973091 -9946402 -9399485 -5710353 -887928 2467547 2746790 -34756
30237 -34756 -4090201 -7053466 -8043492 -7924304 -7442296 -6462990 -5274889 -4790043 -4816280
30228 -4816280 -4176403 -3420142 -4912379 -8608688 -10388028 -7265433 -2242338 -704532
30220 -704532 -3199253 -5199786 -3535944 290346 3254582 4112376 3022989 702960
$$ packed form
30279D457647k122311j825295Q59251L116327K809115j33640m270723p023385
30271d133014n830392j076272L079979L162952Q27692J02695J107576M74742j943186
30262d227228j773233K480339N521267K631043k661957l392961M88507K408688
30254A474465n96510l925643l139410k78349N15959m97433m63002N43034R9721
30245f267168j705923j973311N46917L689132M822425L355475K79243k781546
30237c4756m055445k963265r90026J19188M82008R79306J188101M84846k6237
30228d816280O39877P56261j492237l696309j779340L122595N023095J537806
30220g04532k494721k000533J663842L826290K964236Q57794j089387k320029
$$ plain form
30212 702960 -1162386 -1008747 253175 94969 -1689667 -2226843 78713 2572151 1547283
30203 1547283 -2772725 -6128406 -4827765 379113 5011774 5374991 2305864 -416728
$$ packed form
30212G02960j865346J53639J261922j58206j784636n37176K305556K493438j024868
30203A547283m320008l355681J300641N206878M632661L63217l069127k722592
$$ [...]
##END NTUPLES=NMR SPECTRUM
##END=
