##TITLE=31Pdec_LY-16Dix.4.B
 CD3CN, 24 sc
 3.06.2021
##JCAMPDX= 6.0         $$ Bruker NMR JCAMP-DX V2.0
##DATA TYPE= NMR SPECTRUM
##DATA CLASS= NTUPLES
##ORIGIN= UXNMR, Bruker Analytische Messtechnik GmbH
##OWNER= root
$$ XWIN-NMR		Version 3.5
$$ Thu Jun  3 13:50:23 2021 Russian Standard Time (UT+4h)  she@DPX200
##.OBSERVE FREQUENCY= 81.013821
##.OBSERVE NUCLEUS= ^31P
##.ACQUISITION MODE= SIMULTANEOUS
##.ACQUISITION SCHEME= undefined
##.AVERAGES= 24
##.DIGITISER RES= 16
##SPECTROMETER/DATA SYSTEM= spect
##.PULSE SEQUENCE= zgpg30
##.SOLVENT NAME= CD3CN
##.SHIFT REFERENCE= (INTERNAL, CD3CN, 0, 248.564)
##AUDIT TRAIL= $$ (NUMBER, WHEN, WHO, WHERE, WHAT)
$$ ##TITLE= Audit trail, XWIN-NMR		Version 3.5
$$ ##JCAMPDX= 5.01
$$ ##ORIGIN= Bruker BioSpin GmbH
$$ ##OWNER= she
$$ F:/spectra/data/she/nmr/P31/1/pdata/1/auditp.txt
$$ ##AUDIT TRAIL=  $$ (NUMBER, WHEN, WHO, WHERE, WHAT)
(   1,<2021-06-03 13:49:14.03 +0400>,<she>,<DPX200>,
      <created by zg, POWCHK disabled, PULCHK disabled
       configuration hash MD5:
       00 E9 B6 7A A2 85 ED C7 34 08 36 98 17 FE 4E 26
       data hash MD5: 32K
       43 5A 63 14 EA 33 FB 40 1D 26 15 E8 95 DD 64 C1>)
(   2,<2021-06-03 13:49:20.79 +0400>,<she>,<DPX200>,
      <Start of raw data processing
       efp BC_mod = 2 LB = 1 FT_mod = 6 PKNL = 1 PHC0 = -5881.391 PHC1 = 102.0725 SI = 64K 
       data hash MD5: 64K
       0A BA 35 D8 F6 CA CE ED B7 07 BE 06 A2 E1 B8 AE>)
(   3,<2021-06-03 13:49:51.57 +0400>,<she>,<DPX200>,
      <pk PHC0 = 431.4398 PHC1 = -909.0001 
       data hash MD5: 64K
       A3 39 65 B7 95 DD 14 47 A6 ED D2 40 C0 3E B4 70>)
(   4,<2021-06-03 13:49:54.56 +0400>,<she>,<DPX200>,
      <abs ABSG = 5 
       data hash MD5: 64K
       49 B0 DF F7 7B B2 7E 5A C0 0E A5 EE BC E0 83 CB>)
$$ ##END=
$$ 
$$ hash MD5
$$ 5E 04 33 BF 98 C6 22 54 F7 A0 8C E7 A7 F5 76 0C
##$RELAX= 
##$RELAX= 
##$RELAX= 
##$RELAX= 
##$RELAX= 
##$RELAX= 
##$RELAX= 
##$RELAX= 
$$ Bruker specific parameters
$$ --------------------------
##$DU= <F:/spectra>
##$EXPNO= 1
##$NAME= <P31>
##$PROCNO= 1
##$TYPE= <nmr>
##$USER= <she>
##$AMP= (0..31)
100 100 100 100 100 100 100 100 100 100 100 100 100 100 100 100 100 100 
100 100 100 100 100 100 100 100 100 100 100 100 100 100 
##$AQSEQ= 0
##$AQ_mod= 1
##$AUNM= <au_zg>
##$AUTOPOS= <>
##$BF1= 81.014009
##$BF2= 200.13
##$BF3= 200.13
##$BF4= 200.13
##$BF5= 200.13
##$BF6= 200.13
##$BF7= 200.13
##$BF8= 200.13
##$BYTORDA= 1
##$CFDGTYP= 0
##$CFRGTYP= 5
##$CHEMSTR= <none>
##$CNST= (0..31)
1 1 145 1 1 1 1 1 1 1 1 1 1 1 1 1 1 1 1 1 1 1 1 1 1 1 1 1 1 1 1 1 
##$CPDPRG= <waltz16>
##$CPDPRG1= <>
##$CPDPRG2= <waltz16>
##$CPDPRG3= <>
##$CPDPRG4= <mlev>
##$CPDPRG5= <mlev>
##$CPDPRG6= <mlev>
##$CPDPRG7= <mlev>
##$CPDPRG8= <mlev>
##$CPDPRGB= <>
##$CPDPRGT= <>
##$D= (0..31)
0 1 0 0 0 0 0 0 0 0 0 0.03 2e-05 3e-06 0 0 0 0 0 0 0 0 0 0 0 0 0 0 0 0 
0 0 
##$DATE= 1622713753
##$DBL= (0..7)
120 120 120 11 120 120 24 19 
##$DBP= (0..7)
150 150 150 150 150 150 150 150 
##$DBP07= 0
##$DBPNAM0= <>
##$DBPNAM1= <>
$$ [...]
##$SUBNAM3= <"">
##$SUBNAM4= <"">
##$SUBNAM5= <"">
##$SUBNAM6= <"">
##$SUBNAM7= <"">
##$SUBNAM8= <"">
##$SUBNAM9= <"">
##$SW= 501.771253377433
##$SWIBOX= (0..15)
0 1 3 0 0 0 0 0 0 0 0 0 0 0 0 0 
##$SW_h= 40650.406504065
##$TD= 32768
##$TD0= 1
##$TE= 0
##$TE2= 300
##$TE3= 300
##$TEG= 300
##$TL= (0..7)
0 120 53 12 22 120 120 120 
##$TP= (0..7)
150 150 150 150 150 150 150 150 
##$TP07= 0
##$TPNAME0= <>
##$TPNAME1= <>
##$TPNAME2= <>
##$TPNAME3= <>
##$TPNAME4= <>
##$TPNAME5= <>
##$TPNAME6= <>
##$TPNAME7= <>
##$TPOAL= (0..7)
0.5 0.5 0.5 0.5 0.5 0.5 0.5 0.5 
##$TPOFFS= (0..7)
0 0 0 0 0 0 0 0 
##$TUNHIN= 0
##$TUNHOUT= 0
##$TUNXOUT= 0
##$USERA1= <user>
##$USERA2= <user>
##$USERA3= <user>
##$USERA4= <user>
##$USERA5= <user>
##$V9= 5
##$VALIST= <valist>
##$VCLIST= <CCCCCCCCCCCCCCC>
##$VD= 0
##$VDLIST= <DDDDDDDDDDDDDDD>
##$VPLIST= <PPPPPPPPPPPPPPP>
##$VTLIST= <TTTTTTTTTTTTTTT>
##$WBST= 1024
##$WBSW= 4
##$XGAIN= (0..3)
0 0 0 0 
##$XL= 0
##$YL= 0
##$YMAX_a= 2776
##$YMIN_a= -3629
##$ZGOPTNS= <>
##$ZL1= 120
##$ZL2= 120
##$ZL3= 120
##$ZL4= 120
##$ABSF1= 248.5645
##$ABSF2= -253.2056
##$ABSG= 5
##$ABSL= 3
##$ALPHA= 0
##$AQORDER= 0
##$ASSFAC= 0
##$ASSFACI= 0
##$ASSFACX= 0
##$ASSWID= 0
##$AUNMP= <proc_1d>
##$AZFE= 0.1
##$AZFW= 0.5
##$BCFW= 0
##$BC_mod= 2
##$BYTORDP= 0
##$COROFFS= 0
##$CY= -3
##$DATMOD= 1
##$DC= 0
##$DFILT= <>
##$DTYPP= 0
##$F1P= 0
##$F2P= 0
##$FCOR= 1
##$FTSIZE= 65536
##$FT_mod= 6
##$GAMMA= 0
##$GB= 0
##$INTBC= 1
##$INTSCL= 5.30512e-09
##$ISEN= 30
##$LB= 1
##$LEV0= 0
##$LPBIN= 0
##$MAXI= 10000
##$MC2= 0
##$MEAN= 0
##$ME_mod= 0
##$MI= 50
##$NCOEF= 0
##$NC_proc= -6
##$NLEV= 6
##$NOISF1= 182.463
##$NOISF2= 159.3651
##$NSP= 0
##$NTH_PI= 0
##$NZP= 0
##$OFFSET= 248.5645
##$PC= 4
##$PHC0= -5449.951
##$PHC1= -806.9276
##$PH_mod= 1
##$PKNL= yes
##$PPARMOD= 0
##$PSCAL= 0
##$PSIGN= 0
##$REVERSE= no
##$SF= 81.014009
##$SI= 65536
##$SIGF1= 159.3651
##$SIGF2= -187.1042
##$SINO= 113.3802
##$SIOLD= 16384
##$SREGLST= <1H.CDCl3>
##$SSB= 0
##$STSI= 65536
##$STSR= 0
##$SW_p= 40650.406504065
##$SYMM= 0
##$S_DEV= 0
##$TDeff= 32768
##$TDoff= 0
##$TI= <>
##$TILT= no
##$TM1= 0
##$TM2= 0
##$TOPLEV= 0
##$USERP1= <user>
##$USERP2= <user>
##$USERP3= <user>
##$USERP4= <user>
##$USERP5= <user>
##$WDW= 1
##$XDIM= 65536
##$YMAX_p= 528746896
##$YMIN_p= -231948587
$$ End of Bruker specific parameters
$$ ---------------------------------
##NTUPLES= NMR SPECTRUM
##VAR_NAME=  FREQUENCY,     SPECTRUM/REAL,   SPECTRUM/IMAG
##SYMBOL=    X,             R,               I
##VAR_TYPE=  INDEPENDENT,   DEPENDENT,       DEPENDENT
##VAR_FORM=  AFFN,          ASDF,            ASDF
##VAR_DIM=   65536,         65536,           65536
##UNITS=     HZ,            ARBITRARY UNITS, ARBITRARY UNITS
##FACTOR=    0.620285442955139, 1,           1
##FIRST=     20137.2065510759, 0,            0
##LAST=      -20513.1999529892, 0,           0
##MIN=       -20513.1999529892, -231948587,  0
##MAX=       20137.2065510759, 528746896,    0
$$ Real data points
##PAGE= N=1
##DATA TABLE= (X++(R..R)), XYDATA
$$ [...]
35380A9902847J275237m278705n113257l785490k422476o31919J016223P75994
35372F738454q38764j438457n95901L281j82187l03140m96457j404967k067129
35363e85267j298016k17462l49668m56807J315145L408223K809997P4344j576889
35354C123600j440449j580935k421609k231499q55966l701J51789R19034J849286
35345b490450J352594K09717M72473J322081L99980j252818o13337J257206L81385
35336A038831k500529j987689K678646N129502J745298k373896j689360J157518
35328C198321N60656k637445l347885j058432J19752r62132j048166J216377K937237
35319a021717K051708L62371q8178j27729j092572k139051j899287p93812J39919
$$ y = [19902847, 21178084, 16899379, 11786122, 8000632, 5578156, 4946237, 5962460, 6738454, 5899690, 4461233, 3865332, 3868613, 3686426, 3383286, 2886829, 1481862, -585267, -1883283, -2100745, -2450413, -2907220, -1592075, 1816148, 4626145, 4700489, 3123600, 1683151, 102216, -2319393, -4550892, -5406858, -5410559, -5258770, -4339736, -2490450, -1137856, -928139, -455666, 866415, 1266395, 13577, -599760, 657446, 1038831, -1461698, -3449387, -770741, 4358761, 6104059, 3730163, 2040803, 3198321, 3758977, 1121532, -2226353, -3284785, -3165033, -4127165, -5175331, -3958954, -1021717, 1029991, 1392362, 1304184, 1176455, 83883, -2055168, -3954455, -4748267, -4608348]
35310d608348J092637K339187K632270Q81242j319302j163696J255467K470531
35302C579988K23013l149470l549465m44491K592184K566975L51699j320028j434865
35293e84460j045938j109897j352878r44504M90732K208270K479456L66006k333385
35284a826598k402005P15835L682566L255863Q4112k698268l125417j254613J889159
35275a679366M334200L679385j88626l970789m496825k286186J12704J661912
35267b833591K560986K254969M48216j296253j593213j394000j631021q72184
35259d356091J545229K606690M1078k742656j292845K272388K349566p73931j630541
35250a981113O15682Q67695k117746k713576J709485N436876L524945k98004m55881
$$ y = [-4608348, -3515711, -1176524, 1455746, 2336988, 1017686, -146010, 1109457, 3579988, 3803001, 653531, -2895934, -3340425, -748241, 1818734, 2170433, 850405, -584460, -1630398, -2740295, -4093173, -5037677, -4546945, -2338675, 140781, 506787, -1826598, -4228603, -3512768, 169798, 3425661, 3509773, 811505, -2313912, -3568525, -1679366, 2654834, 6334219, 6145593, 2174804, -2322021, -4608207, -4495503, -2833591, -272605, 1982364, 2430580, 1134327, -458886, -1852886, -3483907, -4356091, -2810862, -204172, -163094, -2905750, -4198595, -1926207, 423359, -350572, -1981113, -1365431, -497736, -2615482, -5329058, -3619573, 1817303, 5342248, 5044244, 4588363]
35241D588363J314253J74799k692653k401225P28623J691614p17442k357129q07436
35232d78233J492151J919207J000075J40417l82178m42302m4000m41931k427553
35223C35653l853908k182037R26658J473297m60968n97052K436191M500278K418154
35214D996266j105800j936001n42739p2465p67718k83495J550285K181312O33009
35205D652654r41266q18642j41938m79938j122329o70759J68365k96402j445298
35196a095553p23379K222178M104573K170426j773579l484163j651921R12092
35188F80674J295803l06043j786863j818561o17714P11088R14960k99927j439744
35179b666327o32266J692296K841714J265115j347133k250892q73319J069161
$$ y = [4588363, 5902616, 6077415, 3384762, 983537, 1712160, 3403774, 2686332, 329203, -478233, 1013918, 2933125, 3933200, 4073617, 3691439, 3249137, 3205137, 2763206, 335653, -3518255, -5700292, -4773634, -3300337, -3761305, -4358357, -1922166, 2578112, 4996266, 3890466, 1954465, 1411726, 1339261, 571543, 288048, 1838333, 4019645, 4652654, 3711388, 2892746, 2750808, 2270870, 1148541, 477782, 646147, 349745, -1095553, -1818932, 403246, 4507819, 6678245, 4904666, 1420503, -231418, 680674, 1976477, 1670434, -116429, -1934990, -2552704, -1841616, -926656, -1226583, -2666327, -3298593, -1606297, 1235417, 2500532, 1153399, -1097493, -1970812, -901651]
35171i01651J795718R30237n55136j170458k66981J086176J307614M01086k81931
35162B344674k57730k12184p7633R47734K031649J053187j598758k469360j15918
35153A645661K141357J181146r00598l35452J821364J292327k093647l584977
35145A167181q66147K157143J096363k612017l953001j091496K775684L666472
35137B340182R75517k445653l184237m00904L247601M166975J682105j353600
35129E027986k142523j020536j66155l72059n08750K73560J249861J256658K70427
35120C868469n49619j91100R17418J114110m63335k183044j494936J291831K406734
35111D716528o35547m904797n143807p23746L322159L010308L19590n21863P77273
$$ y = [-901651, 894067, 1824304, 1269168, 98710, -168271, 917905, 2225519, 2626605, 2344674, 2086944, 1874760, 1797127, 2744861, 4776510, 5829697, 4230939, 1761579, 1645661, 3787018, 4968164, 4067566, 3732114, 5553478, 6845805, 4752158, 1167181, 301034, 2458177, 3554540, 942523, -3010478, -4101974, -1326290, 2340182, 3315699, 870046, -2314191, -2715095, 532506, 4699481, 6381586, 5027986, 2885463, 1864927, 1698772, 1326713, 817963, 1091523, 2341384, 3598042, 3868469, 3318850, 3127750, 4045168, 5159278, 4695943, 2512899, 1017963, 2309794, 4716528, 4080981, -823816, -5967623, -6691369, -3369210, -358902, -39312, -561175, 216098]
35102B16098J195781j35367q31093L11366J353496Q23402J49759O58915Q75776
35093D618133o61099k095596r30712J401485J226691j561236l046414j182394
35085b231142J314123J390075k0048l25935L54206O0715j005170n12993J938204
35076I62035L598388K387804j83352j439748j364797j956160l446475l513421
35068d955726p27079L062076M794165L442531L26579k536313l415855j708426
35060a718048Q31281J251417n75903j069142J611163L710738J299970k690093
35052B651383k362230J352183J710964k416276l969291N35843M492095J780130
35044C774801k999565k143552K569800L472127j81297k129701l75087N52775j212704
$$ y = [216098, 1411879, 1276512, 445419, 756785, 2110281, 2933683, 3083442, 3742357, 4618133, 3957034, 1861438, 930726, 2332211, 3558902, 1997666, -1048748, -2231142, -917019, 473056, 453008, 127073, 481279, 541994, -463176, -976169, 962035, 4560423, 6948227, 6764875, 5325127, 3960330, 2004170, -1442305, -4955726, -5682805, -2620729, 2173436, 5615967, 5942546, 3406233, -9622, -1718048, -886767, 364650, -211253, -1280395, 330768, 4041506, 5341476, 2651383, 289153, 1641336, 3352300, 936024, -3033267, -2497424, 1994671, 3774801, 775236, -1368316, 1201484, 4673611, 4492314, 2362613, 1987526, 2540301, 1327597]
35035A327597j966304j17005R78444p3796j13141J816905J955259j033175k926679
35026a51895j272861M07913o14407j521478j26995M13633j845025k353347K414084
35017d650378P267074N330578j005191l717867j223824Q33123l98951j738405
35009F96159r45223q3896n65053n45878Q08294J130786q88860k701166j627383
35000d722220J165476K426665R86084j249495j674680J64623J835689Q37112j560694
34991a791440j379001K010846L903049R38020l284769l269110J07938J402721
34983a361746o48033j769589L70194K707262K168194K2541j075674q35199j44114
34974e66164R10188J889630J323785r32452k600857j894559M7959R98211N04763
$$ y = [1327597, -638707, -755712, 222732, 148936, 35795, 1852700, 3807959, 2774784, -151895, -1424756, -1016843, -1631250, -3152728, -3279723, -2866090, -4711115, -7064462, -4650378, 2616696, 7947274, 6942083, 3224216, 2000392, 2833515, 2434564, 696159, -249064, -332960, -898013, -1443891, -635597, 495189, -393671, -3094837, -4722220, -3556744, -1130079, -143995, -1393490, -3068170, -2903547, -1067858, -230746, -1791440, -3170441, -1159595, 2743454, 3681474, 396705, -2872405, -2764467, -1361746, -2009779, -3779368, -3409174, -701912, 1466282, 1488823, 413149, -422050, -566164, 344024, 2233654, 3557439, 2624987, 24130, -1870429, -1822470, -824259, -319496]
34965c19496k66511m23867j11330j05705r75555j964315j238439J413218L018699
34956i73301Q59989l020521l655888J98512M167594L994578O04156k004729j833408
34947a663018j28850J025536P01119n64802j316822n28128J040091J523954L75103
34938D64183q42059o10273M58017M76269j183056k886538k447141K46880K692852
34929c630866K473950K78326q94509L86275K335022K556163P21855j836595l411653
34920a022032k340664J466938M666233L147111k023701m724866j988814J649341
34912a170454J180608j346028r21381J932475K526046J10965j414594m57728L21548
34903G61457n58306j172958l33796N20538N55899O76500P41377l97034j600686
$$ y = [-319496, -586007, -1009874, -1121204, -1226909, -2202464, -4166779, -5405218, -3992000, -973301, -113312, -3133833, -6789721, -6591209, -2423615, 1570963, 2175119, 170390, -1663018, -1791868, -766332, -65213, -630015, -1946837, -2474965, -1434874, 89080, 464183, -377876, -988149, -530132, -53863, -1236919, -4123457, -6570598, -6323718, -3630866, -1156916, -878590, -1773099, -1386824, 948198, 3504361, 4226216, 2389621, -1022032, -3362696, -1895758, 2770475, 5917586, 3893885, -830981, -2819795, -1170454, 10154, -1335874, -2257255, -324780, 2201266, 2312231, 897637, 439909, 761457, 203151, -969807, -1303603, -783065, -227166, 449334, 1190711, 793677, -807009]
34894h07009l99529K253785K646808L73584j024631l71718o14941k763991l455233
34885d162875r24203J644342J573109P70057J227653J080065j140072k565149
34877b497073n78763K178049J771332r22545k302385j726288j021713n65949J87309
34868e478026L65270l69530K03321L012931M337206Q76544m039632m526546q31171
34859f449633J641374J071912R46424K784238L263364M20223k446733j816675
34851e85506R47470K366254J797376Q62815J55552p50878j438203j188116n78920
34842A587844p00996j349766j398599m80383P66592J598526J454712K8588k002022
34833d95504k924980j737153M01920J434073Q95035J15468k4646k61905j261009
$$ y = [-807009, -1206538, 1047247, 3694055, 4067639, 3043008, 2671290, 2056349, -707642, -4162875, -5087078, -3442736, -1869627, -1099570, 128083, 1208148, 68076, -2497073, -3075836, -897787, 873545, -49000, -2351385, -4077673, -5099386, -5665335, -5478026, -5112756, -5482286, -5278965, -2266034, 2071172, 2947716, -1091916, -5618462, -6449633, -4808259, -3736347, -2789923, -5685, 3257679, 3677902, 1231169, -585506, 361964, 2728218, 4525594, 5388409, 5543961, 4793083, 3354880, 2166764, 1587844, 886848, -462918, -1861517, -2341900, -1575308, 23218, 1477930, 1506518, -495504, -3420484, -5157637, -4755717, -3321644, -2426609, -2311141, -2335787, -2597692, -3858701]
34824c858701j921815p92354J295662J844963L20339p55902M83879K230505J708471
34815E55047m08387j011322N06444J330054l12079k505957k581828n37127J703070
34806c262085K730646K225592N55008j190240j914343j748310j329017j42705
34798d075454K210589L455131P77873l880972m668320K00825N062045M191419
34790C273136o06457l180592j320621J830220K976458J697180p40274k522645
34782A406405k020681J49221R40121r41900k431853n07368K770619L208805Q62386
34773C435755o47376j62456N2231r67758j567885j173631j249506j892312j212507
34764e385445R62786K177799J167247m45452j106001j042780m26208J009334J929312
$$ y = [-3858701, -5780516, -6572870, -5277208, -3432245, -3111906, -3867808, -3383929, -1153424, 555047, 146660, -864662, -358218, 971836, 659757, -1846200, -4428028, -4965155, -3262085, -531439, 1694153, 2249161, 1058921, -855422, -2603732, -3932749, -4075454, -1864865, 1590266, 2368139, -1512833, -6181153, -5980328, -918283, 3273136, 2666679, -513913, -1834534, -4314, 2972144, 4669324, 3929050, 1406405, -614276, -465055, 475066, -466834, -2898687, -3406055, -635436, 2573369, 3435755, 2788379, 2625923, 2678154, 1710396, 142511, -1031120, -2280626, -4172938, -5385445, -4422659, -2244860, -1077613, -1523065, -2629066, -3671846, -4098054, -3088720, -1159408]
34755a159408M93035j790588j229614J901312K761663n51492l443977j825571
34747d844640J521945J709157n00394o94330J511081K177125r8039k008620j006395
34738b233110J070349J299376k99653j634567j464909j39386J204894J294818
34730i02188k33965j867134j494210Q52907K746748K330835L87803j036613r59559
34721a75376J12798J043793P80465q76919k665554k807017j011137J192103K338594
34712b068250K279983J373321j74654j531997j294239N53115J928004J240262
34704B305545l56889q26543l64194o70659j736632j736458k12014R69165M72100
34695b156579p20858j210334r53728j89837J397966L150346L089782Q29984j056406
$$ y = [-1159408, -666373, -2456961, -3686575, -1785263, 976400, 424908, -3019069, -4844640, -3322695, -1613538, -2113932, -2808262, -1297181, 879944, 781905, -1226715, -2233110, -1162761, 136615, -163038, -1797605, -3262514, -3401900, -2197006, -902188, -1136153, -3003287, -4497497, -3644590, -897842, 1432993, 1820796, 784183, -175376, -62578, 981215, 1761680, 884761, -1780793, -4587810, -5598947, -4406844, -2068250, 211733, 1585054, 1410400, -121597, -1415836, -862721, 1065283, 2305545, 1948656, 1122113, 757919, 87260, -1649372, -3385830, -3597844, -2628679, -2156579, -2877437, -4087771, -5041499, -5231336, -3833370, -683024, 2406758, 3236742, 2180336]
34686B180336o00122N03569j36290j435091q60797Q05781O66687j022693j129622
34677a028242O36334Q57630j582533l130435j327994J165826J209281J86061P82214
34668b231858J794701M69805j998666j916080Q59995K670637J781476L90806L86555
34659B207371O53665k35807j478835j635373q22572r4573M8561k19978l98422
34650a975963J19330J174290J444648J38314j440510j516075l66543M96687P93740
34641a132082J010002M98105j248917k349876q61430J292229O31313j826264j465329
34632e452249K226624L995703J003047k315838j153771K094610J884657j727785
34624E54998l662632j769820R16633J712173J438964J322926P18598o47393j251323
$$ y = [2180336, 1580214, 2083783, 1947493, 512402, -348395, 457386, 1124073, 101380, -1028242, -391908, 465722, -1116811, -4247246, -5575240, -4409414, -3200133, -3014072, -2231858, -437157, 32648, -1966018, -3882098, -3022103, -351466, 1430010, 1820816, 2207371, 2861036, 2625229, 1146394, -488979, -1311551, -1406124, -1357563, -1577541, -1975963, -1856633, -682343, 762305, 900619, -539891, -2055966, -2422509, -1925822, -1132082, -122080, 376025, -872892, -3222768, -4084198, -2791969, -2160656, -3986920, -5452249, -3225625, 770078, 1773125, -542713, -1696484, 398126, 2282783, 554998, -3107634, -4877454, -3960821, -2248648, -809684, 513242, 1231840, 584447, -666876]
34615f66876k53192Q21846L57387j057442j718900q10007J349656L527597L644651
34606E194720O03805l273557l885841o02851K322628J233190k103340l313946
34598c825192j370102R74506J667551J327616R16718K39385o88990j032153o86649
34589b477310o36936j038547p01095P03705J701466J353076Q22937J266755J753388
34580B747439R64911m01235q59761o57769r26198j171331m8746J775909K123822
34571C547041P46464k64701J6943k6189j442022k562950j527818Q01873K112089
34562A400730J581270R1530j399917k251289j831862k87143J020481J027451L30965
34553c17784P7572K79032K70975N9560R8646L39369M25899K50036k85456j167019
$$ y = [-666876, -920068, -98222, 259165, -798277, -2517177, -3327184, -1977528, 1550069, 5194720, 5798525, 2524968, -1360873, -1963724, 358904, 1592094, -511246, -3825192, -5195294, -4220788, -2553237, -1225621, -308903, -69518, -758508, -1790661, -2477310, -3114246, -4152793, -4853888, -4150183, -2448717, -1095641, -272704, 994051, 2747439, 3712350, 3311115, 2451354, 1793585, 867387, -303944, -352690, 1423219, 3547041, 4293505, 4028804, 4045747, 4019558, 2577536, 14586, -1513232, -711359, 1400730, 2982000, 3073530, 1673613, -577676, -2409538, -2696681, -1676200, -648749, -317784, -240212, 38820, 309795, 369355, 468001, 807370, 1233269, 1483305, 1197849, 30830]
34543C0830j509102k90005J576435J755924Q783j014133R2248J057533j80533
34534A527980j663239n52098J913300K260383L09503r84975n17859K828k03431
34525B092392j46005j7505j097500k336975j032449K310306L777444J852875n20740
34516D881843j036589j002365j413870n36802J845461K118755j501807m753623
34508a398997l154209J031547K476917R23343K21314J001461L45100j701812j477397
34499a732733J493947K779005J62518k528420j592846P97837N83352j708835k431243
34490d177418o39665J416254K355805K621116K068607M2191k214252k292813j83798
34481a003973J432772R39899m34514j046855p73682R0474J522283K448762J144963
$$ y = [30830, -1478272, -1768277, -191842, 1564082, 1572865, 558732, 650980, 1708513, 1527980, -135259, -687357, 1225943, 3486326, 3795829, 2810854, 2292995, 2295823, 2092392, 1946387, 1928882, 831382, -1505593, -2538042, -227736, 3549708, 5402583, 4881843, 3845254, 2842889, 1429019, 892217, 2737678, 4856433, 3354626, -1398997, -4553206, -3521659, -1044742, -121399, 99915, 1101376, 1446476, -255336, -1732733, -238786, 2540219, 2702737, 174317, -1418529, -620692, -37340, -1746175, -4177418, -4817083, -3400829, -1045024, 1576092, 3644699, 3686890, 1472638, -820175, -1003973, 428799, 1368698, 934184, -112671, -886353, -795879, 726404, 3175166, 4320129]
34472D320129j702847k729374n90444J372921j41457k928822k211447J787044
34464b824297L484412o154m385323m027799M59765L608353K577981P8476j35796
34455a170382J944243L270252J791904j266384k883529j571770R15240J585671
34447B615245r3204j522561n51182J512119J764912k61284k125389j805869O6052
34438d01161J512424J506470N44926k60142k53280K65574N63607N40615P08799
34429D727832R36887L05626j186064k096563j705127j211344j437696j122732
34421b789181M91946J313597l73197j956718K05626M301893M620443Q9936l651958
34412B252387k496823N18516P93565p95540n92643J152335J231646m40515o89577
$$ y = [4320129, 2617282, -112092, -702536, 670385, 528928, -2399894, -4611341, -2824297, 660115, 653961, -3731362, -7759161, -7299396, -3691043, -1113062, -1034586, -1170382, 773861, 4044113, 5836017, 4569633, 1686104, 114334, 1029574, 2615245, 2522041, 999480, 448298, 1960417, 3725329, 3464045, 1338656, -467213, -401161, 1111263, 2617733, 3162659, 2902517, 2649237, 2914811, 3478418, 4019033, 4727832, 5664719, 5970345, 4784281, 2687718, 982591, -228753, -1666449, -2789181, -2297235, -983638, -1356835, -3313553, -3107927, 1193966, 5814409, 5904345, 2252387, -244436, 274080, 1067645, 272105, -320538, 831797, 2063443, 1622928, 933351]
34403I33351J163280J942027j09377k440198k133175M5789J278789M73493j158801
34394d822k047126j596966m22494J51972l57076n39222J049060L084212K617764
34385A935302n38491k922823k070823J94237R01221L74013J000075K793714L190332
34376D856757J186258j032434j314880k57471L79179K36970n2409n56151j590003
34367A855816k216671j009836J557487K985984J681284r27723k061203r36214
34359I28924M69944R1140j579085k207500p53842J147220J505401P43904P58117
34350A104223J608799J229637r47365k293125o54376K017589K230904O5677j303723
34341C058240q15234p76290k333012l252231j867648n1144J34547K1252J590037
$$ y = [933351, 2096631, 4038658, 3929281, 1489083, -644092, -598303, 680486, 1153979, -4822, -2051948, -3648914, -4071408, -3919436, -4276512, -4815734, -3766674, -682462, 1935302, 1396811, -1526012, -3596835, -3402598, -2501377, -2127364, -1127289, 1666425, 4856757, 6043015, 5010581, 3695701, 3438230, 3817409, 4054379, 4001970, 3445819, 1855816, -360855, -1370691, 186796, 3172780, 4854064, 3926341, 1865138, 928924, 1398868, 1490008, -89077, -2296577, -3050419, -1903199, -397798, 346106, 1104223, 2713022, 3942659, 2995294, 702169, 47793, 2065382, 4296286, 4361963, 3058240, 2243006, 1466716, -866296, -4118527, -5986175, -6037319, -5902772, -5881520, -4291483]
34332d291483L315568K293516p78890k359520j213109N82873J504544K037760
34324A091259K154470Q02602j368071j929918l51096J085339J050210R30063J532201
34315D997059J109712j326235l439144k816478o67843L69473L77513J181435K429808
34306B215300J883922n92629k270860j376715N67226J149762J59586q83019j159804
34297c07231j123468j015177k68787J070497J453877k73585k507684k332198K60131
34288e043625J805206L22574j508339m59332K105921K602661J188022J056969
34280B070057K388167J864335j204304l211201k256217j086046j747180j895706
34272e078095M17840K520952J613151j37781N30352K019624P62066k188585k743475
$$ y = [-4291483, -975915, 1317601, 538711, -1820809, -3033918, -2451045, -946501, 1091259, 3245729, 4048331, 2680260, 750342, 399246, 1484585, 2534795, 3464858, 4997059, 6106771, 4780536, 1341392, -1475086, -2142929, -1773456, -1395943, -214508, 2215300, 4099222, 3506593, 1235733, -140982, 426244, 1576006, 1735592, 852573, -307231, -1430699, -2445876, -2714663, -1644166, -190289, -463874, -2971558, -5303756, -5043625, -3238419, -2915845, -4424184, -4883516, -2777595, -174934, 1013088, 2070057, 4458224, 6322559, 5118255, 1907054, -349163, -1435209, -3182389, -5078095, -4660255, -2139303, -526152, -663933, -133581, 1886043, 2648109, 459524, -2283951]
34263b283951n92918Q21640M64423O31147J745847J352664r11350k014613n73429
34254a360540Q57223J62502j200445j236322n29380m51503p36913n70003r1070
34245e156451M82793J358353J881265Q10934j305611k173898q90247J139837K809617
34236a043408M102862L852985L07263m702890n908850j379561L973462M555662
34228C757525J108679j619146j847850j518286j574149p96861Q27309J426219
34220b36560N78800J73164R95412J302912J07824p52279K48722J332251J86718
34211C936964j767240j197463J460055J954427j027305k894791R1361M136381
34203D692389K675987l512960o624790k983215J852843J809695j102276j324015
$$ y = [-2283951, -2876869, -2055229, -1590806, -959659, 786188, 2138852, 1227502, -787111, -1360540, -503317, -340815, -1541260, -2777582, -3306962, -3758465, -4495378, -5065381, -5156451, -4673658, -3315305, -1434040, -623106, -1928717, -4102615, -4992862, -3853025, -1043408, 3059454, 6912439, 7219702, 2516812, -3392038, -4771599, -798137, 3757525, 4866204, 3247058, 1399208, -119078, -1693227, -2490088, -1662779, -236560, 342240, 515404, 1510816, 2813728, 2921552, 2169273, 2417995, 3750246, 3936964, 2169724, 972261, 2432316, 4386743, 3359438, 464647, 556008, 4692389, 7368376, 3855416, -2769374, -5752589, -3899746, -2090051, -3192327, -4516342]
34195d516342J207668K226692Q56528O4077M76305k35641j834224j198356J663370
34186a289923K755269O47419j248072o97249J04007m97079m05829J534289K350658
34177C253490J0277k429841j660416M71971N20683p58003n47260P00281N92854
34168A54036n26604n64919K62882L93631L81021J428132K028229K31267k130398
34159A657277j804582M26578J040771m06549j242913p32114n33309n75437P26159
34150a444119K282618J364544r08258l32114L202402M578632J284837k567553
34142G460989k625847m25396k3165j851998l230879k730874j150694L54393J037148
34133c186323P17971L91423J131581J869037N91190j798040j965615N72851K208365
$$ y = [-4516342, -3308674, -1081982, -225454, -161377, 314928, 79287, -1754937, -2953293, -1289923, 1465346, 2112765, 864693, 167444, 271451, -225628, -631457, 902832, 3253490, 3263767, 833926, -826490, -354519, 166164, -591839, -1139099, -438818, 154036, -372568, -937487, -674605, -280974, 100047, 1528179, 3556408, 3787675, 1657277, -147305, 279273, 1320044, 913495, -329418, -1061532, -1594841, -2170278, -1444119, 838499, 2203043, 1294785, 962671, 4165073, 8743705, 10028542, 7460989, 4835142, 4409746, 4386581, 2534583, -696296, -3427170, -4577864, -4223471, -3186323, -2468352, -2076929, -945348, 923689, 1514879, -283161, -2248776, -1675925, 532440]
34124E32440Q01215j164637j061600r4173j36841j03803J245115J980251K57955
34115B255922j622061m63563K386939K925223N52392j643706j834841j014347
34107A541958j50455P71007J112241J03607j149352r05868L06461O08330n6327
34098B181602l95712n68858j399690j644503L36535K696947J910369j494415l138070
34089a515795j280424J081542J620972J803249K742174K225564j116129m089994
34081A471159l042711N62340K271844R06282p62518q08396k50611k90138l71096
34072c13845J63281N59034j7310p89446j97816J811670L120928J624470j886012
34063D074954l890976k154077J137059J955273j15574j402523L17305K495958
$$ y = [532440, 1333655, 169018, -892582, -986755, -1123596, -1227399, 17716, 1997967, 2255922, 633861, 170298, 2557237, 5482460, 6034852, 4391146, 2556305, 1541958, 1391503, 2162510, 3274751, 3378358, 2229006, 1323138, 1629599, 2237929, 2181602, 1785890, 1217032, -182658, -1827161, -1490626, 1206321, 3116690, 1622275, -1515795, -2796219, -1714677, -93705, 1709544, 4451718, 6677282, 5561153, 1471159, -1571552, -1009212, 1262632, 2168914, 1406396, 598000, 347389, 57251, -313845, -150564, 408470, 391160, -398286, -596102, 1215568, 4336496, 5960966, 4074954, 183978, -1970099, -833040, 1122233, 1006659, -395864, -78559, 2417399]
34055B417399J778548r45699k096584p61151M36883l31341j571350j063480Q79133
34046a257642K000259J101496o12128j115025L7396J232244Q61962n49367j077372
34037F21823j16996Q66256O09757l31268r43136j238791j289281l08279J658532
34028d71383K470834M92916k388503k793248n83115J020778L09320o21889M45336
34019b118954K249063K095141O9100j088841M775J448191O66146k211217m380499
34010c267095l431365J22842L375939L868383J783398o35877j591059j316664
34002a091498j154382j485419j171646O86852K878153K924668K51144k395986
33994e58114j922578J091598K946955J601511q96737j603416n33627K42126l5563
$$ y = [2417399, 4195947, 3250248, 1153664, 392513, 829396, 498055, -1073295, -2136775, -1257642, 742617, 1844113, 1231985, 116960, 154356, 1386600, 2248562, 1699195, 621823, 504827, 1371083, 1980840, 1649572, 706436, -532355, -1821636, -2129915, -471383, 1999451, 2492367, 103864, -2689384, -3272499, -2251721, -1942401, -2564290, -2118954, 130109, 2225250, 2294350, 1205509, 1210284, 2658475, 3324621, 1113404, -3267095, -6698460, -6575618, -3199679, 668704, 2452102, 1816225, 225166, -1091498, -2245880, -3731299, -4902945, -4216093, -1337940, 1586728, 1837872, -558114, -2480692, -1389094, 1557861, 3159372, 2262635, 659219, 125592, 367718, 332155]
33985C32155m59821p03714j312347j873993j116978Q01606K055305J763851J036886
33976E22950P20488M0413j351776j841867j88561J880536J591850q50446k308906
33967a785319r86101J222123J488277j52247j058552M03113K699864K943693K90551
33958E065402l054984m217742k568501j6415J205464N27627r24081j547793n24086
33949f055109J370815K094814L75925k293642k792513k11974K528180K145478
33941b838026p24704k409440j094815J137374J673182Q42349O58184J421953J523178
33932A89235K43324j076595r88718K87074J515459J809374Q88955r52667k517534
33923f02093k341109m82339J149615J101559K01914J31607R86080J454568Q08656
$$ y = [332155, -127666, -831380, -2143727, -4017720, -5134698, -4333092, -2277787, -513936, 522950, 1243438, 1283851, -67925, -1909792, -2098353, -217817, 1374033, 523587, -1785319, -2771420, -1549297, -61020, -213267, -1271819, -868706, 1831158, 4774851, 5065402, 2010418, -2207324, -4775825, -4792240, -3586776, -3059149, -3983230, -5531023, -6055109, -4684294, -2589480, -2213555, -4507197, -7299710, -7511684, -4983504, -2838026, -3562730, -5972170, -7066985, -5929611, -4256429, -3414080, -2755896, -1333943, 189235, 432559, -644036, -1632754, -1345680, 169779, 1979153, 2868108, 1915441, -602093, -2943202, -3425541, -2275926, -1174367, -972453, -840846, 145234, 1599802, 2408458]
33914B408458n31613j890478k552507j695929M43051J912429J193905m91302q11095
33905b015081L10854J088221J073609J303751J533714M96753r09344k95230J646036
33896D233283J273816j796999l032551j49237K469605M97719l078504k657423
33888b240291Q60675J816252p38629j897564M98262K439366P26068k042248k211551
33879b789660n41256K03199j15422N8992P65257J121828J345583J714192J128363
33870B891076r74723k711975k056359M3923R64902J8916j104530r34095L20800
33861c542065J530975J753914R58081K71467Q31855K028985J974888J17343j929029
33852C996414k642229k289612j840076j552199j135612j43364J789456L766804
$$ y = [2408458, 1876845, -13633, -2566140, -4262069, -3819018, -1906589, -712684, -1203986, -2015081, -1704227, -616006, 457603, 1761354, 3295068, 3791821, 2882477, 2587247, 4233283, 5507099, 3710100, 677549, 528312, 2997917, 3495636, 417132, -2240291, -1379616, 436636, -301993, -2199557, -1701295, 738071, 1464139, -578109, -2789660, -3330916, -3127717, -3243139, -3184147, -2418890, -1297062, 48521, 1762713, 2891076, 1916353, -795622, -2851981, -2808058, -1843156, -1824240, -2928770, -3862865, -3542065, -2011090, -257176, 700905, 972372, 1804227, 3833212, 5808100, 5925443, 3996414, 1354185, -935427, -2775503, -4327702, -5463314, -5606678, -3817222, -50418]
33844e0418L432819J67058k497919r78125K508593K507110j279596l364198j265370
33835h20046Q61783k36295j585555M4413K183026J455640k76255M4969N60854
33826B232534j601698l833405k046141J614416K090294K87413J050381L649528
33818C443322K583712k123877l913957m87035K412543O99078j912435j077155
33810c75804J375567K044524J731943K070665J312130j696002l584738j529932
33802A348353J347823P05585j990068k340729l60326M44797m81662n69743O72782
33793a223188J265200R35545J075549J038205q78947l039787j937999J628355
33785a137067K796886J22652k022810m77419J820568R76367j537140j619832P50645
$$ y = [-50418, 3382401, 3549459, 1051540, 73415, 2582008, 5089118, 3809522, 445324, -820046, 41737, -194558, -1780113, -1735700, 447326, 1902966, 1626711, 1671680, 2232534, 630836, -3202569, -5248710, -3634294, -1544000, -1256587, -206206, 3443322, 6027034, 3903157, -10800, -497835, 1914708, 2613786, 701351, -375804, 999763, 3044287, 4776230, 6846895, 8159025, 6463023, 2878285, 1348353, 2696176, 3401761, 1411693, -929036, -1289362, -844565, -1326227, -1895970, -1223188, 42012, 977557, 2053106, 3091311, 2212364, -827423, -2765422, -1137067, 1659819, 1782471, -240339, -717758, 1102810, 2079177, 542037, -1077795, -327150]
33776c27150J820268J99706j296101l83771J413431J611257N16379J64824Q45416
33767D564259Q69591m75237j708310j397455j56559M79618J54424l60396n93181
33758A376754o58600n66616k48921O4502L09661Q81100J619839J376767k40307
33749C914179j689013j611442j059077j610294k358692j401025M94602R10970
33741d409792J37030Q45686L075875L456977O53255k166622k153936o61221o4377
33732a287125J02777J123251J966462J209578q0155k94774j91047j031925j730373
33723b13331q04888N83965O24003K27211J187600K468994J794380k28317j082713
33714D556904n53965m81662j022550o81851L93673O12827J20162M16182J090088
$$ y = [-327150, 1493118, 1692824, 396723, 12952, 1426383, 3037640, 3554019, 3718843, 4564259, 5433850, 4958613, 3250303, 1852848, 1696289, 2175907, 2330331, 1969935, 1376754, 718154, 151538, -97383, -32881, 276780, 1157880, 2777719, 4154486, 3914179, 2225166, 613724, -445353, -2055647, -4414339, -5815364, -5320762, -4409792, -4272762, -3427076, -351201, 3105776, 3759031, 1592409, -561527, -1222748, -1287125, -1184348, -61097, 1905365, 3114943, 3034788, 2740014, 2548967, 1517042, -213331, -1018219, -434254, 189749, 416960, 1604560, 4073554, 5867934, 5639617, 4556904, 4002939, 3521277, 2498727, 1816876, 2210549, 2823376, 2943538, 3359720, 4449808]
33705D449808L70757j230956j349163J34064Q62254q678r79767j374396j810367
33696i36444j603982L80231K273245R85181k197639k591204M86810K476318J192914
33687D65430J28299J692794K778982O94557j623314q56725O97159m56786k411726
33678A108670j447072Q23113K07988k208021j611365K070197L834635J819952
33670D598097m29530o72244q41718j757778r64096J760856K305031j123794m128537
33661a253713k710201N10429R32416p79582q94132P07363J183545K88922K00314
33652a814639P98595K6096j502388j032175J187471K001481R27765P46903J694391
33643C033500M14262l340080m389157J9285M710909L591590j334454l319157j004465
$$ y = [4449808, 4820565, 3589609, 2240446, 2374510, 3236764, 3228086, 2248319, 873923, -936444, -2540426, -2160195, 113050, 1098231, -1099408, -3690612, -3203802, -727484, 465430, 593729, 2286523, 5065505, 5760062, 4136748, 3280023, 3977182, 3520396, 1108670, -338402, 484711, 692699, -1515322, -3126687, -1056490, 2778145, 4598097, 4168567, 3496323, 2654605, 896827, -67269, 1693587, 3998618, 2874824, -1253713, -3963914, -3453485, -2521069, -3300651, -4194783, -3487420, -2303875, -2014953, -1814639, -1016044, -989948, -2492336, -3524511, -2337040, -335559, 592206, 1339109, 3033500, 3447762, 107682, -4281475, -4262190, 448719, 4040309, 2705855, -613302, -1617767]
33634a617767O99299p71563k067902k07578K499944K323022l93167k325411j820073
33625c681196q5196J164888J382798R73688O01781N65570N07418J04144j54117
33616A379778K91914Q84827O82439l9530k50618J23190M08045O05439R18344N01672
33606E505500j226297k657554j871108P1898N51068k94130P056J583478J752018
33597C421929k52715j919987j760616j118423o07899J064658L192649K497285
33589D516881j255200l511492j677806P18040J8072j663215p07294J604007J724095
33580b33912n2095q71713l40499J77773R60918K333310K156481o69182k843452
33571F17629j462672P11498q0280j744767j38468L102429L244022O85938n27741
$$ y = [-1617767, -918468, -1690031, -3757933, -3965511, -1465567, 857455, 464288, -1861123, -3681196, -3766392, -2601504, -1218706, -245018, 356763, 922333, 1429751, 1533895, 1379778, 1671692, 2556519, 3238958, 3199428, 2948810, 3072000, 3480045, 4085484, 5003828, 5505500, 4279203, 1621649, -249459, -177561, 373507, 79377, 86433, 1669911, 3421929, 3169214, 1249227, -511389, -1629812, -2237711, -1173053, 2019596, 4516881, 3261681, -249811, -1927617, -1209577, -1191505, -2854720, -3562014, -1958007, -233912, -286007, -1157720, -1498219, -1320446, -359528, 1973782, 4130263, 3461081, 617629, -845043, -133545, -213825, -1958592, -2097060, 1005369, 4249391, 4935329, 4407588]
33562D407588l90289j609315k495117M44888M139862K398527k785310l273675
33554H37159J421622L038307r20072k763987J539665N051604K019684k543673
33546G680309k327421r7214r48594k644619q72416J929372J123153j656643k092649
33537I3278q23361n56454j6809K406272L468488L78410l125918k667099m72961
33528a316154j38971L65415L275153M713919J879187L4450L432296O784386O341027
33519B5370708J0351791K3643052L0218368J1558909k1231524l6078627k2645136
33512B1187541m314979j762444o829895l931744K877443J302682n307248m708927
33504a487571K096924L665098j507691l944949o23613J504222m69879j153963
$$ y = [4407588, 4017299, 2407984, -87133, 357755, 4497617, 6896144, 4110834, 837159, 2258781, 5297088, 4377016, 1613029, 3152694, 8204298, 10223982, 7680309, 5352888, 5255674, 4307080, 1662461, 790045, 2719417, 3842570, 2185927, 93278, -730083, -1286537, -1303346, 1102926, 4571414, 4949824, 1823906, -843193, -1316154, -1455125, -1089710, 2185443, 6899362, 8778549, 8812999, 12245295, 19029681, 25370708, 35722499, 59365551, 89583919, 101142828, 79911304, 43832677, 21187541, 16872562, 15110118, 8280223, 4348479, 7225922, 8528604, 3221356, -1487571, 609353, 4274451, 2766760, -1178189, -1801802, -297580, -767459, -1921422]
33496a921422J713416L029933J76369k486527j863191p12375j187005j033301
33488d284103R15997J908366P65066M07115K098680K548562k18268k907419k168481
33479i34485K23565P17062o41201j348451o52213J65853J89318m70165j268044
33470d018761j291074O9806J862149K349938J327029J35662n54449j152623j535034
33461b807357j137401n06869n98744p95657P1891J184547Q70143j75362J24046
33452c770763J256026O01975j872136l018872j429364M95318O68403L52774J385057
33443e331582K988336L220686J732161l71798j887368j859345k21570J364387
33435c66093J147593K4704M15726K236935K760033R82273q97992j252441j168274
$$ y = [-1921422, -208006, 2821927, 2998296, 511769, -1351422, -2063797, -3250802, -4284103, -3368106, -1459740, -694674, -287559, 1811121, 4359683, 4141415, 1233996, -934485, -710920, 6142, -635059, -1983510, -2635723, -2469870, -2280552, -2750717, -4018761, -5309835, -5240029, -3377880, -1027942, 299087, 434749, -119700, -1272323, -2807357, -3944758, -4451627, -5050371, -5846028, -5774137, -4589590, -3719447, -3894809, -3770763, -2514737, -1912762, -3784898, -6803770, -8233134, -7737816, -7069413, -6716639, -5331582, -2343246, 877440, 2609601, 2237803, 350435, -1508910, -1730480, -366093, 781500, 806204, 1221930, 3458865, 6218898, 7201171, 6303179, 5050738, 3882464]
33426C882464j634201j701161r31659o13103r00791M1353K183174K435635k02849
33417B558862j951333l3987K281374P17448k796344l112964k29351J097692m58155
33408a926758r42949J600936L569374J811836j348503k175403j075644o77911
33400a165022j026278l90546Q58719Q90582K6930K51994J469730J530468O3755
33391B510332q87061n16279l82822r82032m37879J727312K601260J70038k897829
33382I05040k816502j98684J361982R25572O73596J316635J020417p11779j802626
33373F73651j224114n41970o46503j61303J366061J832996J11126j621341j250852
33364a462249J35731O84622P57235J093751O53965r52559j488310L18394J716132
$$ y = [3882464, 2248263, 547102, -384557, -997660, -1898451, -1857098, 326076, 2761711, 2558862, 607529, 573542, 2854916, 3572364, 776020, -2336944, -2566295, -1468603, -1926758, -2869707, -1268771, 2300603, 4112439, 2763936, 588533, -487111, -1165022, -2191300, -2581846, -1723127, -832545, -805615, -553621, 916109, 2446577, 2510332, 1623271, 1106992, 724170, -257862, -695741, 1031571, 3632831, 3802869, 905040, -1911462, -2110146, -748164, 177408, 851004, 2167639, 3188056, 2476277, 673651, -550463, -1092433, -1738936, -1900239, -534178, 1298818, 1409944, -211397, -1462249, -1326518, -641896, 115339, 1209090, 1863055, 910496, -577814, -259420, 1456712]
33355A456712N4539k361948j639348J415701K824940J769393O95600K15771j060122
33346C371238k176723o16449K416456K698759l22227k531003j808213o70822q86709
33337e25693n86096J179476J885094K21270j033482K37660J817417J235537k37962
33328D193221p99905j557153l256098l232920K03823L455985K302408j457538
33320a48177k679345m55416J644419J773602J558072J915199J402788o91890k840080
33311A479172l467698k412707k20246J985338K460089Q28658o34459N5198J391784
33302A465129O89369j463685k075467l97910J397470J845186J472810O37766r02482
33293B668186k141501j427643O72957J622036M30193j264776j866149j450199
$$ y = [1456712, 1511251, -850697, -2490045, -1074344, 1750596, 3519989, 4215589, 4431360, 3371238, 1194515, 578066, 2994522, 5693281, 5371054, 2840051, 1031838, 361016, -525693, -1111789, 67687, 1952781, 2174051, 1140569, 1378229, 3195646, 4431183, 4193221, 3393316, 1836163, -1419935, -4652855, -4449032, -993047, 1309361, -148177, -2827522, -3282938, -1638519, 135083, 1693155, 3608354, 5011142, 4319252, 1479172, -1988526, -4401233, -4621479, -2636141, -176052, 652606, 18147, 73345, 1465129, 2154498, 690813, -1384654, -1782564, -385094, 1460092, 2932902, 3570668, 2668186, 526685, -900958, -228001, 1394035, 1824228, 559452, -1306697, -2756896]
33285b756896o05928L17029P60443O06280R24492K134462K288949k05669l054128
33276D09034k609151M68016J866863J63397j329352k73105J100646J06770j955634
33267b052516k064161K4412J935310J933263K45876j663589j929575K14953K829298
33258e26729K866455K92333j462559l11283J579190J340087m78770j585852j721489
33249h617j994075j886585n2424K445107K718085K12440k154334j788425M68153
33240b040675J964217J636315O40521K87726M77249K79818n11244r05762L7498
33231A865663J756000K500393J208049j384246l618800m387407l531789j445649
33223g037786J098161K951054L058830J326379r13232j631172o83K255036K270500
$$ y = [-2756896, -3362824, -3045795, -2285352, -1679072, -754580, 1379882, 3668831, 3463162, 409034, -2200117, -1732101, 134762, 298159, -1031193, -1304298, -203652, -96882, -2052516, -4116677, -4092265, -2156955, -223692, 22184, -1641405, -3570980, -3356027, -526729, 2339726, 2632059, 1169500, 858217, 2437407, 3777494, 3298724, 1712872, -8617, -2002692, -3889277, -3941701, -1496594, 1221491, 1433931, -720403, -2508828, -2040675, -76458, 1559857, 2200378, 2488104, 2965353, 3245171, 2733927, 1828165, 1865663, 3621663, 6122056, 7330105, 5945859, 2327059, -2060348, -5592137, -7037786, -5939625, -2988571, 70259, 1396638, 483406, -1147766, -1148449, 1106587, 3377087]
33214C377087n61961l411705l238688n24093J574626J386024L93878O07954J842433
33205A445555K329012J067420j151249k597828k144921l18727J123345R91889
33197G44496j59945r83822q85118q9629R76446J482653L73914j943082l081153
33188c565240j527491Q58178J224469j49605n91061N40601J125732K83862L3664
33179a766891J757273L565029K908226P7116k481051l064159j726899M08151J814204
33170A490999J622026P30934O73231J090521K04596j768883k235761m12316Q77193
33161B272540l88945j841337m32853K331696K503382j14778j838396j033463j50408
33152A307438q80031j116770J010455L099197J722648j923745l193554n23140
$$ y = [3377087, 2815126, -596579, -3835267, -4359360, -2784734, -1398710, -1004832, -396878, 1445555, 3774567, 4841987, 3690738, 1092910, -1052011, -1370738, -247393, 744496, 584551, -399271, -1284389, -1374018, -397572, 1085081, 1458995, -484087, -3565240, -5092731, -4234553, -3010084, -3159689, -3750750, -3210149, -2084417, -1800555, -1766891, -9618, 3555411, 6463637, 6540753, 4059702, 995543, -731356, -323205, 1490999, 3113025, 3843959, 4517190, 5607711, 5812307, 4043424, 1807663, 1395347, 2272540, 1883595, 42258, -390595, 1941101, 4444483, 4329705, 2491309, 1457846, 1307438, 427407, -689363, 321092, 3420289, 5142937, 3219192, 25638, -497502]
33144d97502K560769K733235J129830N05224O14605o70813k942208l377422j384973
33135a329255P6913j055532k856980k492563k78093J409720J664417J265711O12926
33126b982736k23282l02985R57449K026923J097171q39762j196783K91735J424303
33117B52033J141258N87868M51306O572o86561l24095J078036J601380L74554
33108D482351j093342j448546j201024r70053k62661Q44987R41131m58853j724178
33099h90188j454577l49960L15231L51914j13381j109667j608344q1783K588502
33090b352253L186359O11956k170629k335746q46811R6593O24389J580195J755942
33081A49995j3607j805439j124637Q47868J104167o1181K92357K255047K436607
$$ y = [-497502, 2063267, 4796502, 5926332, 6431556, 7046161, 6375348, 3433140, 55718, -1329255, -1252342, -2307874, -5164854, -7657417, -7935510, -6525790, -4861373, -3595662, -2982736, -3206018, -3509003, -2551554, -524631, 572540, -267222, -1464005, -1172270, 252033, 1393291, 1981159, 2432465, 2439037, 1752476, 1428381, 2506417, 4107797, 4482351, 3389009, 1940463, 739439, -230614, -493275, 351712, 1292843, 833990, -890188, -2344765, -2694725, -2379494, -2027580, -2140961, -3250628, -4858972, -4940755, -2352253, 834106, 1446062, -724567, -3060313, -3907124, -3810531, -3186142, -1605947, 149995, 136388, -1669051, -2793688, -1945820, -841653, -902834, -610477, 1644570, 4081177]
33072D081177l49690k667034j569297R44060J063148j351874l159913k630068
33064e639491r58516O22047K499081M617044N009091K272054j597474l001479
33056C822357j247963P44724O18437o58569j201586j204124j610120j579277R5257
33047b220864K116135K106865M10770m27844K05199M27099l92668n25167P36057
33038B435582J654439J132692L97075L66710J09199p00154o20134N55741M63552
33029E794702k010055m093136k799427P61088L145767K954309J222753q70936
33021D105065k402500k283857o85432L81174j93700p74002K15722J396315O95777
33012D54562j009128j131599O88624K249313J820304k54442k326719k583101n64310
$$ y = [4081177, 3731487, 1064453, -504844, 439216, 1502364, 150490, -3009423, -5639491, -6598007, -5975960, -3476879, 1140165, 6149256, 8421310, 6823836, 3822357, 2574394, 3319118, 3937555, 3278986, 2077400, 873276, -736844, -2316121, -2220864, -104729, 2002136, 2412906, 1985062, 2190261, 2617360, 2224692, 1699525, 2435582, 4090021, 5222713, 5619788, 5986498, 6095697, 5395543, 4775409, 5331150, 5794702, 3784647, -308489, -3107916, -2346828, 798939, 3753248, 4976001, 4105065, 1702565, -581292, -1266724, -885550, -1079250, -1853252, -1637530, -241215, 454562, -554566, -1686165, -997541, 1251772, 3072076, 2817634, 490915, -2092186, -2656496]
33003b656496J454732M34292k905034l998596o43856L500689M133287K226637
32995A545655J389689J735181N49572k272401l722732k370405p4699J082661Q51834
32986a285645r6300q06171j36494J698859K473381R11796r04168m91014J104290
32977B468534J182912j41918o04156J35826M78072K06610M03049N67278p40307
32968C955900k670857k839564j168553J85725N37879J082555J783359J234454
32960B100898k92815r52332o51436j076659k222753k170487o18623O51282J185414
32951d047511K316931L714980L115627M77195j174139m85370J1411j681918l442668
32942a195462k334301P10623K175539P62640j348987j682753l37140N37639l99221
$$ y = [-2656496, -1201764, -767472, -3672506, -7671102, -8314958, -4814269, -680982, 1545655, 2935344, 4670525, 5220097, 2947696, -775036, -3145441, -3220140, -2137479, -1285645, -1381945, -2188116, -2324610, -625751, 1847630, 2759426, 1855258, 1364244, 2468534, 3651446, 3509528, 2905372, 3041198, 3519270, 3725880, 4128929, 4696207, 3955900, 1285043, -1554521, -2723074, -2537349, -1999470, -916915, 866444, 2100898, 1808083, 855751, 204315, -872344, -3095097, -5265584, -5884207, -5232925, -4047511, -1730580, 1984400, 5100027, 5577222, 4403083, 3917713, 3929124, 2247206, -1195462, -3529763, -2819140, -643601, 119039, -1229948, -2912701, -3249841, -2712202, -3111423]
32933c111423j697045p13173K485884M347851K433176p38047r18896J754585K981472
32924F824384N54966k723200l226884j050300R74784J093983O8693m16529J20095
32915B219992L83009r89632l084073l218307n28728K375246K665435Q67533m26412
32906B64063j85176N40044P53282M03483k01861n75225l54100j08695o31457j197289
32896a292931n29676N15888J98036k75375J602805L914235J999564k814857l221610
32887I6079K296781N428252Q03249m929116l787310J003483J909785J50849J419763
32878D391815L562142L94329n202940m456023K096591M820943P72001k675889
32870C702969j433200j49685j392692p87896L055402M314496M63280k541333o97500
$$ y = [-3111423, -4808468, -5521641, -3035757, 1312094, 3745270, 3007223, 2088327, 3842912, 6824384, 7379350, 4656150, 1429266, 378966, 1353750, 2447733, 2516426, 2099897, 2219992, 2603001, 1613369, -1470704, -4689011, -5217739, -2842493, -177058, 690475, 264063, 78887, 618931, 1372213, 1775696, 1573835, 998610, 644510, 535815, -95642, -1292931, -1822607, -1306719, -1108683, -1384058, 218747, 4132982, 6132546, 3317689, 96079, 2392860, 7821112, 8624361, 3695245, -92065, 911418, 2821203, 2972052, 4391815, 7953957, 8348286, 3145346, -1310677, 785914, 5606857, 6378858, 3702969, 2269769, 2120084, 727392, -60504, 2994898, 7309394, 7772674, 5231341, 4533841]
32861D533841J387482k34285j471058J711715N375886M329529M17051k000612
32853A4049549l091132m389298m102986j150459J132536M09768m13031J089859
32845C534806K141153K99891j687165j208664n27396j576491j634928R98222K710723
32836C050151R76903o54913Q31857K108301j63371k830950j944855L69647N69637
32827B312407J0510Q11552P58133j646257k461158R32516L655670P93903l855947
32818A311329l682525L93454K640885J844116R39908N67384m43045q86768O93301
32809C378039K286830J628827K30747L87723J805731M042574P214294P933531
32801B8908296J686051p776237j0151209l703664J189247j451061m443039j770504
$$ y = [4533841, 5921323, 5687038, 4215980, 5927695, 11303581, 15633110, 16050161, 14049549, 10958417, 6569119, 2466133, 1315674, 2448210, 2857978, 2444947, 3534806, 5675959, 5975850, 4288685, 3080021, 2552625, 976134, -658794, 339428, 3050151, 4027054, 3372141, 4203998, 6312299, 6148928, 3317978, 1373123, 1742770, 2312407, 2322917, 3134469, 3892602, 2246345, -214813, 717703, 4373373, 5167276, 1311329, -2371196, -1977742, 663143, 2507259, 3447167, 4014551, 3571506, 2684738, 3378039, 5664869, 7293696, 7524443, 7912166, 9717897, 13760471, 20974765, 28908296, 30594347, 22818110, 12666901, 8963237, 10152484, 8701423, 4258384, 2487880]
32793B487880P63747j867017l189855J907797N635458J057219m258816j909499
32785F26914J757494j290507m165702J393995O864355J878571m243520J657182
32777D478782R982470L778855q087119l848085R430601K086626k5277892k8601125
32769c6056887K5396109J13757182J77151971J68404087Q0094434m8560730j44674234
32762C35511932j52051053q6736037k2066551o230920j8226787j7250081k813919
32755C0136584N40105q476641j0483516k709140j88155n302224n191270K153065
32747D78808M575957r48778l778601M0561K293660m42088j702558O89834R49298
32738B156093j932197j926960J595819K280383q37975j782580M29753M32555k026739
$$ y = [2487880, 3251627, 1384610, -1805245, 102552, 5738010, 6795229, 2536413, 626914, 2384408, 1093901, -3071801, -1677806, 5186549, 7065120, 2821600, 4478782, 14461252, 18240107, 10152988, 6304903, 15735504, 17822130, -7455762, -36056887, -10660778, 103096404, 280248375, 448652462, 528746896, 480186166, 335511932, 183460879, 96724842, 74658291, 68427371, 50200584, 32950503, 30136584, 30676689, 22200048, 11716532, 9007392, 8819237, 3517013, -1674257, 478808, 5054765, 4105987, 327386, 367947, 2661607, 2219519, 516961, 1206795, 2156093, 223896, -1703064, -107245, 2173138, 1335163, -447417, -17664, 414891, -1611848]
32729a611848j327101K372589K672214p71664j339105J842092K132060j874664
32721B094573l519598m03576J652557k12069j392220M31486J120456j075861j963203
32712c267455Q4898R97972o29953p77468J582276J978080p87205j956232J78474
32703b596613J120315r74273j806007M75475J637947k01898q63052J420742K067160
32694B79796j088597l068668n09579K261582R22717j769084j633298K13627J066716
32685c324788J524651K269965J276339j631685k590215N3960K379764J375821
32677A333812l97328j54631L75632p93716j965034j559334j017950r20187O37933
32668d460803L110467K730058n53146j712820P03586J576314j368904k716482
$$ y = [-1611848, -2938949, -566360, 2105854, 1334190, -4915, 1837177, 3969237, 2094573, -1425025, -1828601, -176044, -388113, -1780333, -1348847, -228391, -1304252, -3267455, -3182557, -2184585, -2814538, -3592006, -2009730, -31650, -818855, -2775087, -2596613, -1476298, -2450571, -4256578, -3781103, -2143156, -2345054, -3208106, -1787364, 279796, -808801, -3877469, -4387048, -2125466, -1202749, -2971833, -4605131, -4391504, -3324788, -1800137, 469828, 1746167, 114482, -2475733, -2421773, -42009, 1333812, 936484, 781853, 1157485, 363769, -1601265, -3160599, -4178549, -5098736, -4460803, -1350336, 1379722, 826576, -886244, -182658, 1393656, 24752, -2691730]
32660b691730J025684M424076K076167k126077j955337O11504k61030l727957
32652b624700m163344p66645K168504K709136K450531J711838n21872k902272
32644a938824k960356j073464O88083J918263K596067J166964k195908l507767
32636e306942n42317K652679J586996j454076j312853J747192L371303K483370
32628C225352J472419O93351j365356l440699k606549L61022J641574K21576j150351
32619i47661o03277R52697K076620J781256o89175m074376m755307j373731K277577
32610e355377K398727P04861Q56190K114250J365186q19866j381023l87454l72432
32601h76938j388831j563211j217719j688080j586611Q20376L165831K157522
$$ y = [-2691730, -1666046, 2758030, 4834197, 2708120, 752783, 1364287, 1103257, -2624700, -6788044, -7554689, -5386185, -2677049, -226518, 1485320, 963448, -1938824, -4899180, -5972644, -5284561, -3366298, -770231, 396733, -1799175, -5306942, -5849259, -3196580, -1609584, -3063660, -4376513, -2629321, 741982, 3225352, 4697771, 5391122, 4025766, 585067, -2021482, -1660460, -18886, 202690, -947661, -1550938, -598241, 1478379, 3259635, 2570460, -1503916, -6259223, -7632954, -5355377, -2956650, -2251789, -1395599, 718651, 2083837, 1263971, -117052, -504506, -876938, -2265769, -3828980, -5046699, -6734779, -8321390, -7501014, -4335183, -2177661]
32593b177661m30749n02210J209140P46472j629178k073920m01856Q889q40654
32584f091727L58550L086633L023960r443j183288R57377K179292M41776q03629
32575A959501L75485P93887j302125k351449J09144K701976J907074l40344p79997
32566C073152k01928o47832j116404j06659Q44165o6193j448820j315185l87716
32557a373420l2657J86379M13083p06581k668663k298779R93262L162189J736912
32548e88275k15091K19198P55183j145424k815654j096974J430274P35627j441180
32539d162316q44489J522781J441200o79898q05297J051825J052983r39482r39143
32530c301836J572973K314350j96698j955327m48094J364400O47640p81236n32361
$$ y = [-2177661, -2608410, -3110620, -1901480, -1155008, -2784186, -4858106, -5259962, -5251073, -6091727, -5733177, -2646544, 377416, 367973, -815315, 142062, 2321354, 2763130, 1959501, 2334986, 3128873, 1826748, -524701, -415557, 2286419, 4193493, 3853149, 3073152, 2871224, 2223392, 1106988, 1000329, 1844494, 1778301, 329481, -985704, -1373420, -1406077, -1219698, -806615, -1513196, -4181859, -6480638, -5487376, -2325187, -588275, -803366, -584168, 171015, -974409, -3790063, -4887037, -3456763, -2721136, -4162316, -5006805, -3484024, -2042824, -2722722, -3528019, -2476194, -1423211, -2362693, -3301836, -1728863, 585487, 388789, -1566538, -2014632, -650232, -2592, -783828, -1316189]
32521a316189J57053m31505q93429L78204J767081J233358p9971j92995J29685
32512G51292o85966j629033r58881K74971l3992j102770n14643J390010J890239
32503f18773M87731k27974J144143K608331J964961m2049j170338p20025K60015
32494C686022P91023O81882j6833j107086j912681j745361q47334k48335m01803
32485a120506m74208M29841J625924J424709l41127j478312k13477J945701J835813
32476C634358r00289k884747j376519K033933L584547K159451O7558o84408q12641
32467D821243j714698k679091j832371O50361K140985R68844j155328j433046
32459b33101R8732P63097o25126j886480p69461J612412K443137J237098K3017
$$ y = [-1316189, -1159136, -1590641, -2484070, -2105866, -338785, 894573, 814602, 621607, 751292, 65326, -1563707, -2522588, -2247617, -2281609, -3384379, -3899022, -2509012, -618773, -131042, -359016, 785127, 3393458, 5358419, 5316370, 4146032, 3426007, 3686022, 4477045, 5158927, 5142094, 4035008, 2122327, 376966, -470368, -718703, -1120506, -1594714, -1164873, 461051, 1885760, 1544633, 66321, -147156, 1798545, 3634358, 2734069, -150678, -1527197, 506736, 4091283, 6250734, 6318292, 5633884, 4821243, 3106545, 427454, -1404917, -754556, 1386429, 2355273, 1199945, -233101, -134369, 628728, 3602, -1882878, -2652339, -1039927, 1403210, 2640308, 2663325]
32450B663325j07979k52499j110429j437593k80002R73341M44228j306723j939666
32441b353997o12048R42347Q40527n84799j433694o53231Q69352J562785R96736
32432d26022R0613k78188k15467j38678J11000P89241J361001J012173j11688
32423B193985j021673j162164p92971k50915K75017L69022j77817o00181N9127
32414a108570J330712J644704M66243j020876j584415j188844m04896K34544J54224
32405a477174o85188j081206j9042J226008N14626j417028j360769J299297K968856
32396c1620J186737j334233q80689J431028J663996n97369j994875r98957L05187
32387a250795M00396M47457J126918R03350q31473j911674q15341O34172L66002
$$ y = [2663325, 2555346, 2302847, 1192418, -245175, -525177, 448164, 892392, -414331, -2353997, -2966045, -2023698, -1183171, -1767970, -3201664, -3854895, -2985543, -1422758, -426022, -335409, -613597, -829064, -967742, -856742, -67501, 1293500, 2305673, 2193985, 1172312, 10148, -782823, -1033738, -758721, -389699, -567516, -1167697, -1108570, 222142, 1866846, 2333089, 1312213, -272202, -1461046, -1865942, -1631398, -1477174, -2162362, -3243568, -3262610, -2036602, -1521976, -2939004, -4299773, -3000476, -31620, 1155117, -179116, -1059805, 371223, 2035219, 1437850, -557025, -1555982, -1250795, -850399, -402942, 723976, 1627326, 795853, -1115821, -1931162, -1296990, -930988]
32378i30988m05318M33445J810602J155231q70207j058513R20384J550243r19134
32369A685745l267296j993091J302511K292070K77630j323451o45865J36788p83991
32360b318950j282209J150061M432433M085304j71607l561733k651624M69305
32352A50980J824385P60072n24494p14649k84384J16442j774j264563l027206
32343b965191k838240K52460K986237J630310k206928l206879q185K799531J687712
32334a869173p78838n35492J623010J897695l23767k042098j568141k17543Q02649
32325c011698J816813K535573J606007p08393k081666j554339r48708j514604
32317c861015j710610k16430J273668Q06766l30895N8827R24742j36862j875369
$$ y = [-930988, -1336306, -902861, 907741, 2062972, 1192765, 134252, 1054636, 2604879, 1685745, -1581551, -3574642, -2272131, 19939, 297569, -1025882, -1671747, -1534959, -2318950, -3601159, -2451098, 1981335, 6066639, 5895032, 2333299, -318325, 150980, 1975365, 2735437, 2210943, 1496294, 1211910, 1328352, 1326578, 62015, -2965191, -5803431, -5550971, -2564734, -934424, -3141352, -6348231, -6356416, -3556885, -1869173, -2648011, -3183503, -1560493, 337202, 13435, -2028663, -3596804, -3814347, -3011698, -1194885, 1340688, 2946695, 2238302, 156636, -1397703, -2346411, -3861015, -5571625, -5788055, -4514387, -3707621, -4038516, -3979689, -3054947, -3191809, -5067178]
32308e067178p52215K637219L387541o2570k885703j178876K039860K041146r6776
32299F2448k11942J339668P82411j549515j207099K330400L796900L40139l798260
32290A885150l770064q42501Q43873O21551N70793J122942J159853O76504J80952
32281B449053q44554k139858j449974J870964M266123K486654j245008k352680
32273C040720n38985P23599O1425p00805o40655p64228j045542k18921J317237
32264A233845J677723O43402k76121o41609j069706j061804O3237Q83966j59320
32255A293613j480811o26928J270019J304193j20843m86479k38850j581797l185159
32246c853042j822680J277891J891262L32424P67311K846799J685115k660338
$$ y = [-5067178, -5819393, -3182174, 205367, 142797, -2742906, -3921782, -1881922, 159224, 62448, -149494, 1190174, 1972585, 423070, -784029, 1546371, 5343271, 5683410, 1885150, -1884914, -2727415, -1883542, -1261991, -691198, 431744, 1591597, 2268101, 2449053, 1604499, -535359, -1985333, -114369, 4151754, 6638408, 5393400, 3040720, 2501735, 3225334, 3286759, 2585954, 1945299, 1181071, 135529, -83392, 1233845, 2911568, 3554970, 3278849, 2637240, 1567534, 505730, 568967, 1452933, 1293613, -187198, -814126, 455893, 1760086, 1639243, 1152764, 913914, -667883, -3853042, -5675722, -4397831, -2506569, -2174145, -1406834, 1439965, 3125080, 464742]
32238D64742l916857k36949K212373q5318k055904L05384K402756l39213l506548
32229d755534j181501L339777K910260j489745k889151J36833K510872J921813
32221E03624J194910J694546J372552j98823q11277j75898m21998j754444k183264
32212g80072j585100j687150k178468j047820J427009K949081K978257K545001
32204B620738J303811j272772l027975j807084K10567n21276k761712k222907
32196g478610J352370L861414L184618J171834l45556j144345p80203O62119R63973
32187A447614j018445k274771k41525K009898O31394j814104p21796J775077M63717
32178B57059k725222j572302K483634J810060l530617m565847J474578N940022
$$ y = [464742, -3452115, -3689064, -1476691, -1562009, -3617913, -3312529, -909773, -1248986, -4755534, -5937035, -2597258, 313002, -1176743, -4065894, -3929061, -1418189, 503624, 1698534, 3393080, 4765632, 4566809, 3755532, 3579634, 3157636, 1403192, -780072, -2365172, -4052322, -6230790, -7278610, -5851601, -2902520, 75737, 2620738, 3924549, 2651777, -376198, -2183282, -1972715, -2493991, -5255703, -7478610, -6126240, -2264826, 919792, 2091626, 1746070, 601725, -178478, 483641, 1447614, 429169, -1845602, -2087127, -77229, 554165, -1259939, -1981735, -206658, 257059, -2468163, -4040465, -1556831, 253229, -3277388, -7843235, -6368657, -428635]
32170d28635K950814j595068r84608J744981J140403r21186m76604L86458j438109
32161C78446k723235L20974L859767K307825j621242j212702K851509L911666
32153H073008M60487k312713j640916m34953r23384j412466n65902J51065l94827
32144I99399j190361j247769p92439j69173K32466k60892r80908R4728K516433
32135g98516K395989j574020m446973j744698L180498L873480N15655j173140
32127B28275N45467J533278m59895k268970j022795J516128K277811R87539p27060
32118B609778j658938j314156R92Q82765M30408j47249M94179J172285N5471j804771
32108G20764j886831m13406R3243r41672j548548p54018K04819K49674l62470
$$ y = [-428635, 2522179, 927111, -57497, 1687484, 2827887, 1906701, 1430097, 1816555, 378446, -2344789, -2023815, 1835952, 4143777, 2522535, 1309833, 4161342, 8073008, 8533495, 6220782, 4579866, 4144913, 3221529, 1809063, 1243161, 1394226, 999399, -190962, -1438731, -2231170, -2400343, -2167877, -2428769, -3409677, -3314949, -798516, 1597473, 23453, -4423520, -6168218, -2987720, 885760, 1401415, 228275, 773742, 2307020, 1847125, -421845, -1444640, 71488, 2349299, 3336838, 2609778, 950840, -363316, -362324, 520441, 950849, 803600, 1297779, 2470064, 2525535, 720764, -1166067, -1579473, -1486230, -2427902, -3976450, -4730468, -4525649, -4275975, -4638445]
32099d638445j008125q61309J001372L626087L911123Q15212k161913j740884
32091a056882K56155N77629M37453K609550M774759K194782l646704n825545k164149
32082a842952J731223J344880q04407p70805N77190N17693m37755l41170J75498
32073A49395o10066j901377j536697L76548J642169J195438J76057M5416Q69366
32064D06249J416433O08304r44748j378017k23900N68117k92345r56263N02521
32055b93649K110848O33913k688329l261390j28659K459252J535177n49576m75423
32046f57836J062043J286766l4858o06700P05543K197390J433947j592488l772105
32037B1702k237950J438763K558887p4516j954002J07509K365750J23081l797222
$$ y = [-4638445, -5646570, -6507879, -5506507, -1880420, 2030703, 2845915, 684002, -1056882, -800727, -223098, 214355, 2823905, 7598664, 9793446, 6146742, 321197, -1842952, -111729, 1233151, 428744, -342061, 235129, 752822, 315067, -26103, 149395, -460671, -2362048, -3898745, -3522197, -1880028, -684590, -508533, -463117, 406249, 1822682, 2430986, 1486238, 108221, -115679, 452438, 160093, -796170, -293649, 1817199, 2451112, -237217, -3498607, -3627266, -1168014, 367163, -182413, -657836, 404207, 1690973, 1656115, 1049415, 1754958, 3952348, 5386295, 3793807, 21702, -2216248, -777485, 1781402, 1706886, -247116, -139607, 2226143, 2349224, -1447998]
32028a447998k922911K186283M446507J418097j580931r31547K23138q26107j237375
32019f72844J104485K447868m45280l833811k702808R31491J463949j245477k341367
32010e293794j04839K039238J470827l08384p96698M47103K297542L239413K140901
32001E131309k78624j444589j43933J468690J008199n82974r94194m72426r02382
31992B789076k101186k091900n66407O91418P08828L25732K85258K44607j79580
31983A05846p34947r17671l20820Q88414J480565L60057j379342j390455L97291
31974a511062J506755R87908Q58608K025073K007465q82498m031466m116331j771221
31965d926769K90592J456426K336050K016177j76726k024264j190828R32154J650430
$$ y = [-1447998, -4370909, -2184626, 2261881, 3679978, 2099047, 1167500, 1390638, 564531, -672844, 431641, 2879509, 2434229, -1399582, -4102390, -3170899, -1706950, -2952427, -5293794, -5398633, -3359395, -1888568, -2196952, -2993650, -2546547, -249005, 2990408, 5131309, 4852685, 3408096, 3264163, 4732853, 5741052, 5158078, 4163884, 3691458, 2789076, 687890, -1404010, -1970417, -1278999, -570171, -244439, 40819, 285426, 105846, -629101, -1546772, -1867592, -979178, 501387, 861444, -517898, -1908353, -1511062, -4307, 983601, 1842209, 3867282, 5874747, 4992249, 960783, -3155548, -4926769, -4636177, -3179751, -843701, 1172476, 995750, -1028514, -2219342, -1287188, 363242]
31956C63242J393905J849658J650345j322318m699968m004652J50945K536352
31948b082491J265279L1601J350256K683249J362131r64069j432905k65531N37291
31939B484811K98500n79007j757454k247776q03442J540549J765706p73026k834244
31930b905383j882306L47712R38498M9921l17380K16853P77609J428588K385285
31921A039397K356355L20126k028595k205819n85365M10759J61732J81345Q59313
31912E09248P39306n73634j449876j005871m46298n10795J20457K175953L516682
31903C075172J852844j444816k805297j292348N31853O59878m2604l42732q83848
31894f91898k222166k688694o25440K450386L491711K165032Q80397P45276K63898
$$ y = [363242, 1757147, 3606805, 5257150, 3934832, -765136, -4769788, -4618843, -2082491, -817212, -785611, 564645, 3247894, 4610025, 3645956, 2213051, 1947520, 2484811, 2783311, 2204304, 446850, -1800926, -2604368, -1063819, 701887, -71139, -2905383, -4787689, -4439977, -3501479, -3451558, -3768938, -3552085, -2774476, -1345888, 1039397, 3395752, 3715878, 1687283, -518536, -1103901, -693142, -531410, -350065, 509248, 1248554, 674920, -774956, -1780827, -2227125, -2737920, -2617463, -441510, 3075172, 4928016, 3483200, 677903, -614445, -82592, 577286, 534682, 191950, -691898, -2914064, -5602758, -6228198, -3777812, -286101, 1878931, 2759328, 3504604, 3768502]
31885C768502j391450k515913j588652K55761J020391M85310m27074j395630k150112
31876c938867j554470P78346K876224K470892K29022j014050j71517P74603j91534
31867B58649k214638k669800o11876J843091J984055n3286j356311j80249J532806
31858a467559J039871r94147j596532k04711P50822J46823k61410N46367J024012
31849a016464K99423o1551O24424N15944p44428j01160L580053N877233K807507
31840A1780981k567448m481663k927904k174784k729429j331693J651721J844660
31832i35559j158514k148524J113558L808095J854254j610978j785081J95453
31824f67296J90174j550311j317480J290840K626904Q54870j576122j905087m06009
$$ y = [3768502, 2377052, -138861, -1727513, -1471752, -451361, 33949, -393125, -1788755, -3938867, -5493337, -4714991, -1838767, 632125, 861147, -152903, -324420, 450183, 258649, -1955989, -4625789, -5237665, -3394574, -1410519, -1463805, -2820116, -3000365, -1467559, -427688, -1421835, -3018367, -3223078, -2472256, -2325433, -2586843, -2040476, -1016464, -717041, -778592, -154168, 361776, -382652, -483812, 3096241, 8973474, 11780981, 9213533, 4731870, 1803966, -370818, -3100247, -4431940, -2780219, -935559, -2094073, -4242597, -3129039, 679056, 2533310, 922332, -862749, -667296, -477122, -2027433, -3344913, -2054073, 572831, 1427701, -148421, -2053508, -2459517]
31815b459517J037725J406650P57937m09485j237889r43525L28140J541811J745038
31806A766885Q44485k31405j79927J043504J417712q16204l977656m242848p92548
31797e168002K705393L037540J442294P69405J021645M75228n49642l66976N17179
31788C884064p2457j962523k336056j28974K014472J416594j034677k394125j410649
31779b024331O18331J952503K113843J667992J140798M66402n36458j405500j366038
31770B627542n91832k80460r33264j494633r94840j0651N73373J075584J801929
31761A772748J564500m69585k419601j841575K65517O84037p64190p90113J544388
31752d53874K483532n07175l880423k798627J440452L199712Q06107j628838j095171
$$ y = [-2459517, -1421792, -15142, 742795, 333310, -904579, -1848104, -1519964, 21847, 1766885, 2611370, 2379965, 2200038, 3243542, 4661254, 3845050, -132606, -4375454, -5168002, -2462609, 574931, 2017225, 2786630, 3808275, 4283503, 3733861, 3366885, 3884064, 3811607, 1849084, -486972, -615946, 1398526, 2815120, 1780443, -613682, -2024331, -1406000, 546503, 2660346, 4328338, 5469136, 5935538, 5399080, 3993580, 2627542, 2035710, 1755250, 821986, -672647, -1667487, -1678138, -1104765, -29181, 1772748, 3337248, 2867663, 448062, -1393513, -1127996, -443959, -1208149, -1998262, -453874, 2029658, 1522483, -2357940, -5156567, -3716115, -516403, 289704, -1339134, -2434305]
31743b434305K36073l54053j438790m35525J588583J754594K98235j21232P95016
31734a11404P32510o99980j001846P34614J900650O28376j111592r76575j78502
31725h3749r72894k189404q79563K406254L699046J328122j625522j725894M25654
31716C82050J724946P73255j114182k149656j855459r30421k83414j72708k8622
31707c654211O44495J319255J057232l3744q41238p50785j66260M46137R32757
31698a046362Q69534p2729j012134n91999P56171Q86647r48283k597135j779550
31689e535840Q63272K793596K727467J429644O6581q31819j086667p57513k85893
31680f17172r390K67275O90188Q61255N61076L12655M32517K56568o53784j257719
$$ y = [-2434305, -2198232, -2552285, -3991075, -4426600, -2838017, -1083423, -785188, -906420, -111404, 621106, -78874, -1080720, -346106, 1554544, 2182920, 1071328, 94753, -83749, -1056643, -3246047, -4125610, -1719356, 1979690, 3307812, 1682290, -43604, 382050, 2106996, 2880251, 1766069, -383587, -2239046, -3169467, -3452881, -3625589, -3654211, -3009716, -1690461, -633229, -666973, -1508211, -2258996, -2425256, -1979119, -1046362, -176828, -249557, -1261691, -1853690, -1097519, -210872, -1159155, -3756290, -5535840, -4672568, -1878972, 848495, 2278139, 2344720, 1512901, 426234, -331279, -617172, -626562, -359287, 330901, 1192156, 1753232, 2065887, 2498404, 2754972, 2101188, 843469]
31670H43469l77216J139567J206185n19586k002050j614640j95214M46236j0238
31661a083487m37411o0334Q99252K013324K900045K693537N52981k679106m361841
31652D36960k778092M27961J804259J74008k015494j837125P20974L198646L547821
31643C679918J682806j029572k749712k232884k3551J805023J931994J131601
31635D195623N14566k93104j667574k075354j55776K096217J328773j963252l499250
31626a519131j296626J497246J431160m96048j201598l16619K10482j41788o2598
31617a895520P73901J040162L4404j218244j450365n76724M78708P06019K5732
31608b081927k74454J013427K797577K466492l15458k525872j897926o8851L89030
$$ y = [843469, 466253, 1605820, 2812005, 2292419, 290369, -1324271, -1519485, -1073249, -1083487, -1520898, -1581232, -681980, 1331344, 4231389, 6924926, 7477907, 4798801, 436960, -2341132, -1913171, -108912, 65096, -1950398, -3787523, -3066549, 132097, 3679918, 5362724, 4333152, 1583440, -649444, -672995, 1132028, 3064022, 4195623, 4710189, 4417085, 2749511, 674157, 518381, 2614598, 3943371, 1980119, -1519131, -2815757, -1318511, 112649, -383399, -1584997, -1901616, -1691134, -1832922, -1895520, -1121619, -81457, -47053, -1265297, -2715662, -3292386, -2813678, -2107659, -2081927, -2356381, -1342954, 1454623, 3921115, 3605657, 1079785, -818141, -886992, -497962]
31599d97962L0186Q24466K025925J261059j017907j834458m85050M52369m82347
31590B76281j495356r45726L0769r1639n92266q7789J004923J363875Q70384L09795
31580F43251p7097n03168q61241r60059q55096m38982M39004J220557J168143
31571b24688P12578P29225N02158j400057l922703l949435r35823J770752J874452
31562d843541J378977K443206L004536L02073l325873k841675J832198N145295
31554C095196L606192L5375j405782q08254o90185j343544j144661r5233j244
31545A247860j372200k495566j871488N3281J833637K426430J478894n36916k146992
31536a383060j931951k52271R52164N74979k95222j08010Q24580Q32098n19056
$$ y = [-497962, -467776, 356690, 2382615, 3643674, 2625767, 791309, 306259, 758628, 276281, -1219075, -2164801, -2134032, -2225671, -2817937, -2905726, -1900803, -536928, 333456, 643251, 566154, 62986, -798255, -1758314, -2613410, -3052392, -2613388, -1392831, -224688, 487890, 1217115, 1719273, 319216, -3603487, -7552922, -8488745, -6717993, -4843541, -3464564, -1021358, 1983178, 2285251, -1040622, -3882297, -2050099, 3095196, 6701388, 6736763, 5330981, 4522727, 3832542, 2488998, 1344337, 1249104, 1247860, -124340, -2619906, -4491394, -4438113, -2604476, -178046, 1300848, 763932, -1383060, -3315011, -3567282, -2615118, -2040139, -2335361, -2443371, -1618791, -786693, -1305749]
31527a305749j517578m85192J813113K745140Q50086k235703l367441j374932
31519d878256J570974K494401J092556k66774m5456L62803r47952k972678k721492
31510f311874M69273L523236L410323Q95217q24954l32351P17873L34138j157505
31501G23376j730448l75163J402018J181661j182228k824067j413933J296998
31493b921786J630049m18539q28898J966410L744922O65677m001015l826444J293436
31484b696188M636953K117252k480178l550277j042995R87735N15466q24127q61149
31475c197508P80581K822060L325457J327190j671004l017435k220284j200173
31467c051116q63074n841J510915J660303l3207r28414L01501R64410r89918k881275
$$ y = [-1305749, -2823327, -3308519, -1495406, 1249734, 2099820, -135883, -3503324, -4878256, -3307282, -812881, 279675, 12901, -32555, 330248, -617704, -3590382, -6311874, -5842601, -2319365, 1090958, 1986175, 1161221, 828870, 1546743, 1880881, 723376, -1007072, -1382235, 19783, 1201444, 19216, -2804851, -4218784, -2921786, -1291737, -1710276, -2539174, -572764, 3172158, 3837835, -163180, -3989624, -2696188, 1940765, 4058017, 1577839, -1972438, -3015433, -2027698, -1512232, -2336359, -3197508, -2416927, 405133, 3730590, 5057780, 3386776, 369341, -1850943, -3051116, -3914190, -3920031, -2409116, -748813, -782020, -1710434, -1408933, -444523, -1434441, -4315716]
31457d315716j629301P88175P09084q45829l39917J571462J265544q50481o98342
31448d345321K020083K896957M05776j551459n58310N45816n66528j515214j66636
31439b834836J009170m61039k191663j070193J158480J063142n16846m86292P55421
31430c574656N59950n47045K18455K385153K631790N79665n89066K54225N26901
31421B445372j009379j801839k0255K002797J307184j190828k249416q69106Q97058
31412d88412R93032m44791j774636j755840o57067L17870N81974N86680N11542
31403b129648k41452j404516j221263R53039K867725K292597M13962k30855P771
31394A307360j035085k775226k272476N87225K217494P34587j325087j310424
$$ y = [-4315716, -5945017, -5156842, -4447758, -5293587, -5633504, -4062042, -2796498, -3646979, -4345321, -2325238, 571719, 977495, -573964, -1132274, -586458, -1152986, -2668200, -2834836, -1825666, -2286705, -4478368, -5548561, -4390081, -3326939, -3843785, -4330077, -3574656, -3014706, -3561751, -3343296, -958143, 1673647, 2253312, 1664246, 1918471, 2445372, 1435993, -365846, -386101, 1616696, 2923880, 1733052, -516364, -1385470, -488412, 504620, 59829, -1714807, -3470647, -4127714, -3809844, -3227870, -2641190, -2129648, -2371100, -3775616, -4996879, -4043840, -1176115, 1116482, 1530444, 1299589, 1307360, 272275, -2502951, -4775427, -4188202, -1970708, -1236121, -2561208, -3871632]
31386c871632k34534j26446m18640M19830J733597J871437J129613J006949J460219
31377B970393J152661j36921j259878j489933j089234m81839m8125j99456o25446
31368a207778k00806J325126K423615J724213K1r84430p82134k03267K14841L65723
31358B675124n4671r96605j487673q39995J95226O04042O40282R32658R75747
31349B644135P0603r70087p89256L21493R12488P07148O61667Q64473K59390j302324
31339C379730k418944k046787p47335L92193R12869P13246j68713j032126q80232
31330a896099J39184O61215N9318n16935J41554J375919J499841J60811j206952
31321D17856j319644n29837K4097J05789M24387J107511J097025l09735j950263
$$ y = [-3871632, -4106166, -4232612, -4651252, -4231422, -2497825, -626388, 503225, 1510174, 2970393, 4123054, 3986133, 2726255, 1236322, 147088, -334751, -382876, -582332, -1207778, -1408584, -83458, 2340157, 4064370, 4064391, 3079961, 2297827, 2094560, 2309401, 2675124, 2620453, 1623848, 136175, -703820, -508594, 95448, 735730, 1668388, 2644135, 2714738, 1744651, 955395, 1276888, 2189376, 2896524, 3558191, 4422664, 4682054, 3379730, 960786, -1086001, -1833336, -1441143, -528274, 184972, 16259, -1015867, -1896099, -1756915, -1095700, -1036382, -1553317, -1411763, -35844, 1463997, 1624808, 417856, -901788, -1431625, -1407528, -1301739, -877352, 230159, 1327184, 1017449, -932814]
31312i32814j916346j15841J420664J139215j89121q68496n70913k31748k95706
31303b561106k59477K05004P02754P90179M49292k10886j081736j739993j563372
31294e269341m20742J052690K013027K050557J289810J43159r16343j492182j347991
31285b897356m96347O81821J511860J492481P67247J0730j49923M25868J296885
31276B643266J657245J002328k13731j029938j261587j563585j895222j160962
31268a822186P19499J787137P01204p92686k67179J370060J051915j458073k864341
31259a574650j286867J057575J445866L21878l56732k42754n9836L00833J035995
31250F41308J137683r9721j350116r93468K97686N94752l87072j256980j269728
$$ y = [-932814, -2849160, -2965001, -1544337, -405122, -594243, -1462739, -2033652, -2265400, -2561106, -2820583, -2615579, -1912825, -1122646, -673354, -884240, -1965976, -3705969, -5269341, -5690083, -4637393, -2624366, -573809, 716001, 859160, -57183, -1549365, -2897356, -3393703, -2711882, -1200022, 292459, 1059706, 1070436, 920513, 1346381, 2643266, 4300511, 5302839, 5089108, 4059170, 2797583, 1233998, -661224, -1822186, -1102687, 684450, 1385654, 592968, 325789, 1695849, 2747764, 1289691, -1574650, -2861517, -1803942, -358076, -36198, -392930, -635684, -695520, -394687, 641308, 1778991, 1679270, 329154, -664314, -366628, 228124, -158948, -1415928, -2685656]
31241b685656r09648m56127M31272J681581K484255K059004L18274j799479k548594
31232a425118j075525Q80917P02194j217511j589813O97527K368352O70714k087827
31223b076090j913072Q62631K437231J376360M514J28031O65120J32159j060413
31214E56471j642441j096936K88242J701878K028354R25406m75710r28544o03401
31205G53319l23296k10118j68170m78759p28279K52514K026261K221287L19499
31196C664258q14050L67120Q35200k015585m978990l419871R99633K502332R5538
31187b764415j529241N360J689307J072981j00137M1471M81194L27211P03436
31178g2833J720722J433170l47344r95357L45544R60939o95610k280870j705290
$$ y = [-2685656, -3595304, -4051431, -3620159, -1938578, 545677, 2604681, 2922955, 1123476, -1425118, -2500643, -1619726, -917532, -2135043, -3724856, -3027329, -658977, 11737, -2076090, -3989162, -3126531, -689300, 687060, 691574, 819605, 1484725, 1616884, 556471, -1085970, -2182906, -1894664, -192786, 1835568, 2760974, 2285264, 1356720, 753319, 430023, 219905, 51735, -427024, -1155303, -902789, 1123472, 3344759, 3664258, 2850208, 3217328, 4052528, 2036943, -2942047, -6361918, -5362285, -2859953, -2764415, -4293656, -4288296, -2598989, -1526008, -1626145, -1584674, -1103480, -776269, -72833, 1647889, 3081059, 2733715, 1738358, 2083902, 3044841, 2349231, 68361, -1636929]
31169a636929k92235L54099R15690J633757R20913r78390j051233J196807J919986
31160B982465o06884k432353o01658J435459j32368k537315j329093J564026J262089
31151c95632j337242j322080J351062J946215n12212j779588p1718J321688N08316
31142b91191P2639J561777K248682J59690k134207j798579k03612k6016p64522
31133a175339k68904J268498J726071L54053j414045j771846p7457K478630L263931
31124D383592P56831k880807l652193p25597K388496K375460j39742k208003k042687
31115a744650l1909K087737K430695Q32851l97789N70998J866407M45334k484502
31106C575172k495328J013361L243616J249290j667635j684282m77785j512201
$$ y = [-1636929, -1929164, -1575065, -659375, 974382, 1895295, 916905, -134328, 1062479, 2982465, 2375581, -56772, -658430, 777029, 644661, -1892654, -3221747, -1657721, -395632, -1732874, -3054954, -1703892, 242323, -269889, -2049477, -2121195, -799507, -291191, -218552, 1343225, 3591907, 3751597, 1617390, -181189, -384801, -410817, -1175339, -1444243, -175745, 1550326, 1904379, 490334, -1281512, -1358969, 1119661, 4383592, 5140423, 2259616, -1392577, -2118174, 270322, 2645782, 2506040, 298037, -1744650, -1776559, 311178, 2741873, 3574724, 3176935, 3747933, 5614340, 6059674, 3575172, 1079844, 2093205, 5336821, 6586111, 4918476, 3234194, 2756409, 1244208]
31098A244208l567151k842416M07620K310026J611768Q02847J106743P98822q27099
31089A045368j816882j086677j94157j83987K76098J949073K935964J507477j080487
31080C351790k482492k202877r86707Q43076K567701K427358L5288k061854j598281
31071a06998j0840k0703j040600k92426K040476K519931r5581k567085j820078
31062a393904R19642K472668J922629M79141r72087j980659j688318j33541P58310
31053C83881l31309j726023j159196N17027P28670n07859p66593N44457J407592
31044i09353J018655J055729K118034K112235q2326k140179j745861k83617m47653
31035F95664j797349j645303L75677J590155M08615j223535o33555J699453K593602
$$ y = [1244208, -2322943, -5165359, -4757739, -2447713, -835945, -33098, 1073645, 1872467, 1045368, -771514, -1858191, -2052348, -2236335, -1960237, -11164, 2924800, 4432277, 3351790, 869298, -1333579, -2320286, -1477210, 1090491, 3517849, 3553137, 1491283, -106998, -117838, -138541, -1179141, -1471567, 568909, 3088840, 2993259, 426174, -1393904, -474262, 1998406, 3921035, 4400176, 3428089, 1447430, -240888, -374429, 383881, 52572, -1673451, -2832647, -2315620, -1586950, -2094809, -2861402, -2316945, -909353, 109302, 1165031, 3283065, 5395300, 5312974, 3172795, 1426934, 1143317, 695664, -1101685, -2746988, -2371311, -781156, -372541, -1596076, -2229631, -530178, 2063424]
31026B063424M37916k235631j714750J587920K918634l69659m314363l318775
31018d945284J663705M129164J276387k457030k611368p14987j47043k62621J105398
31009b963679K483539J090431j613255j774410M90283J539725N52636L58784J668746
31000A832800J628037o06555j691359L02903K257908Q11662k461471l735111k305962
30991c967148k20166J519863L161120L832882K182729q56112k481516j451117
30983A720535O67349J811580J490455L19061j155543k506395l014155k014491
30975b681604J38288J803309J518915L9319j25345J828711L162121J061185k895178
30966C849721m322732j946403J006383J859676J707790K109817J786653o76566
$$ y = [2063424, 2501340, 265709, -1449041, 138879, 3057513, 2687854, -1626509, -4945284, -3281579, 847585, 2123972, -333058, -2944426, -3659413, -3806456, -4069077, -2963679, -480140, 610291, -1002964, -2777374, -2287091, -747366, -194730, 164054, 1832800, 3460837, 2854282, 1162923, 1465826, 3723734, 4535396, 2073925, -1661186, -3967148, -4187314, -2667451, 493669, 4326551, 6509280, 5653168, 3171652, 1720535, 2387884, 4199464, 5689919, 6008980, 4853437, 2347042, -667113, -2681604, -2543316, -740007, 778908, 818227, 692882, 2521593, 5683714, 6744899, 3849721, -473011, -2419414, -1413031, 446645, 2154435, 4264252, 6050905, 5374339]
30958E374339l204353k703138O0772J427243K62271q52683j36515Q20337J82085
30949A230358j011790p55305N61686Q85600j44534p10518K00954J147611M02784
30940A806846j441867k276652j311127J95695R52773J054382J028602P46891Q5390
30931H40933l43667j46456m2636o90887j303905p00091P75027J697677J553365
30922A639360R76261L83259k63395o81746o51637p51481j272317j078422O11786
30913a088332K079843J166253j032587j385999M91797J869440J514653J069496
30905D684564J049737m61039l379112l998969o52089K624463J696761j366389
30897A97927j773832N34203J611559K68180q15444l22627O0383m31811m08167
$$ y = [5374339, 2169986, -533152, -472380, 954863, 1217134, 364451, 227936, 1048273, 1230358, 218568, -536737, 24949, 910549, 766015, 55497, 256451, 1404062, 1806846, 364979, -1911673, -3222800, -3027105, -2074332, -1019950, 8652, 755543, 840933, 497266, 350810, 308174, -382713, -1686618, -2386709, -1611682, 85995, 1639360, 2615621, 2998880, 2735485, 2053739, 1402102, 650621, -621696, -1700118, -1088332, 991511, 2157764, 1125177, -260822, 230975, 2100415, 3615068, 4684564, 5734301, 5273262, 1894150, -2104819, -2756908, -132445, 1564316, 197927, -1575905, -1041702, 569857, 838037, 22593, -300034, -239651, -671462, -1079629]
30888a079629K39146k88282j824084j675493O31878J874886L03784j357261n05788
30879c680843J113827P74898n36250k79716J002397R71526r7181l3767R52738
30870A87629N55768j258003j842769l12413R38588J52623j151932p62080J177857
30861b314732K921663L201485J673459r81972k704709j729534O67691J281204
30853B014555l24050q73257J387230L399978J757348j906422l217463j264171
30845I73748R11354J218703M69000m10120j723874l034802k772505p33115J350393
30836c751218K405894K926684K829608J122158j445707k278624q46461R3413j097203
30827d1456k147602q19964J049566N50646j337251j380359N72473J635322P70187
$$ y = [-1079629, -840483, -1128765, -2952849, -4628342, -3996464, -2121578, -1817794, -3175055, -3680843, -2567016, -1792118, -2328368, -2608084, -1605687, -634161, -731342, -765109, 187629, 743397, -514606, -2357375, -2669788, -1731200, -1578577, -2730509, -3492589, -2314732, 606931, 3808416, 5481875, 4499903, 1795194, 65660, 733351, 2014555, 1690505, 817248, 2204478, 5604456, 7361804, 5455382, 2237919, 973748, 1885102, 3103805, 3572805, 3162685, 1438811, -1595991, -4368496, -5101611, -3751218, -1345324, 1581360, 4410968, 5533126, 4087419, 1808795, 962334, 1055747, -41456, -2189058, -3009022, -1959456, -1408810, -2746061, -4126420, -3553947, -1918625, -1148438]
30818a148438n6218K18629J92289q02210j055652N23302K238056K084594N64363
30809B758715n68257r00384j126050j307915q96112J31147J273325K140557K282633
30800C787659J112602j061806k556345j930887J68703J658742J400906K18204
30792B797778m95386n10378o62967j243017j222651K53333K003748J765043n97894
30783B087609k291029j122792J408160K181420O60433j007006j537341j758303
30775a378849k201496j867820k28746J440449J775992J010413J54183k46876K7798
30766a514952Q49450J080177l98231k392837k135218O72156K685913J385468j304698
30757a072772j975616n90804K79159j05914q0654R00729J295693N36543K39633
$$ y = [-1148438, -1204656, -986027, -793738, -1595948, -2651600, -2128298, 109758, 2194352, 2758715, 2190458, 1290074, 164024, -1143891, -2040003, -1908856, -635531, 1505026, 3787659, 4900261, 3838455, 1282110, -648777, -480074, 1178668, 2579574, 2797778, 2302392, 1792014, 1129047, -113970, -1336621, -1083288, 920460, 2685503, 2087609, -203420, -1326212, 81948, 2263368, 2923801, 1916795, 379454, -1378849, -3580345, -5448165, -5676911, -4236462, -2460470, -1450057, -1295874, -1542750, -1514952, -665502, 414675, 16444, -2376393, -4511611, -3839455, -1153542, 231926, -1072772, -3048388, -3639192, -3360033, -3465947, -3546601, -2645872, -1350179, -813636, -574003]
30748e74003J203364J583271k54617k809539l293530j303169J151360K451144
30740a845719K388617J119226p26010j223687R86216L722109K953265j382485
30732E991532m173121j977964J624089J053565k821019l986190n78396K512454
30724b355050J677236j28237P19296K039144J08827k960876k133103J781753K667049
30715A416039j207551m129082j632623K931567L794945Q27901j700363j811800
30707a510967j167130j048767q57156m26939o84173j515986j324096N77489K721534
30698e236191L281584K029604J28798j132860j124064j24789R25092J334827J271712
30689A353713J099348N31723p55550j943741j650976M110R74479j88914j999199
$$ y = [-574003, 629361, 2212632, 1958015, -851524, -4145054, -5448223, -4296863, -1845719, 542898, 1662124, 936114, -287573, 698643, 4420752, 7374017, 5991532, 1818411, -159553, 1464536, 2518101, -302918, -4289108, -4867504, -2355050, -677814, -806051, -86755, 1952389, 2061216, -899660, -3032763, -1251010, 1416039, 208488, -3920594, -5553217, -2621650, 1173295, 2001196, 300833, -1510967, -2678097, -3726864, -4584020, -5010959, -5695132, -7211118, -8535214, -7957725, -5236191, -1954607, 74997, 203795, -929065, -2053129, -2177918, -1252826, 82001, 1353713, 2453061, 2984784, 2229234, 285493, -1365483, -1361373, -386894, -575808, -2575007]
30680b575007j576954J348311L533242K370297m13668j171107L83598J091318
30672B990030l84754j549397o06769L87893o18418j660338m8349K597132K679623
30663C786653M75336p49220n35973j366952l187964k855826J61958K367855J935217
30654C1084J290862K188847K625813J001056p75799r96545j107599k133913k042885
30645H0921P6842J058668j259926l531310j845159J890678L207791K008969J223827
30636B911301R45787n35886j726253j6832K350894Q68971k996615l007419J557245
30627C51193L877849K62019l849134k540881J558604K247624l42483j004960J406738
30618A966569K357371o83609m150666l695134l5576K718992K459646O02517p15631
$$ y = [-2575007, -4151961, -2803650, 729592, 3099889, 2686221, 1515114, 1898712, 2990030, 2605276, 1055879, 449110, 837003, 218585, -1441753, -1490102, 1107030, 3786653, 4261989, 3512769, 2976796, 1609844, -1578120, -4433946, -4271988, -1904133, 31084, 1321946, 3510793, 6136606, 7137662, 6361863, 5365318, 4257719, 2123806, 80921, 157763, 1216431, -43495, -3574805, -5419964, -3529286, -321495, 1687474, 2911301, 3857088, 3321202, 1594949, 1578117, 3929011, 4797982, 1801367, -1206052, 351193, 4229042, 4491061, 641927, -1898954, -340350, 1907274, 1564791, 559831, 1966569, 4323940, 3640331, -510335, -4205469, -4241045, -1522053, 937593, 1540110, 824479]
30609H24479r58903p36205m11343J93047J120817J793077J329507n29925k700545
30600g5994l258238j352024J333870K023652K96913j114891j44211J383623N22088
30591c85212j852442k111383K54931J750414Q66251P01659L174041M686733J506978
30582H591970l599615m901338k018407L00015j94669r79912k03077N75329J29019
30573b300685k56208J72760J11394p77867p23088P68877J676944J129668R09624
30564G11419J629199J068627j447273k731351p49923J474873N93602j433591p22928
30555a607346J791507J896335p81388k215345n67584J313887R30881l69557n10586
30546a19196L6618Q883k79778l37267j038509k631355l062773p08883K530864
$$ y = [824479, -134424, -870629, -1281972, -1088925, 31892, 1824969, 3154476, 2624551, -75994, -3334232, -4686256, -3352386, -1328734, -1031821, -2146712, -2290923, -907300, -385212, -2237654, -4349037, -4094106, -2343692, -1477441, -775782, 2398259, 7084992, 8591970, 4992355, 91017, -1927390, -1627375, -1822044, -2801956, -3005033, -2429704, -2300685, -2556893, -2384133, -2272739, -3050606, -3773694, -3004817, -1327873, -198205, 711419, 2340618, 3409245, 1961972, -769379, -1519302, -44429, 549173, -884418, -1607346, 184161, 2080496, 1299108, -916237, -1483821, -169934, 760947, 391390, -119196, -82578, -73695, -353473, -690740, -1729249, -4360604, -7423377, -8132260, -5601396]
30537e601396L398575J802725O39292J283843J846610N19722j602777k337773
30529e1179j435217k26759O68228J530822J989031J173296m51685j112939j83222
30520A900376P94254L88948o34348p10799k6113j28076j332412k083344j184252
30511c015766N11787J228286M21239p42779q28531K48550J103315N41422p33942
30502a266419p73268R43232K456446J842726j29383j221333r08913n20173m90304
30493f7389K35409J564273J392205j162290l514902k705388L56999K064174J098860
30484g38049k30121K7570O63666j55004j566931j408777J57123R07049K63555
30475b079919J94027J713494K835441J562403q27946j531931k13743R03078M33660
$$ y = [-5601396, -2202821, -400096, 239196, 1523039, 3369649, 3889371, 2286594, -51179, -1486396, -1713155, -1044927, 485895, 2474926, 3648222, 3196537, 2083598, 1900376, 2694630, 3083578, 2449230, 1738431, 1712318, 1584242, 251830, -1831514, -3015766, -2503979, -1275693, -854454, -1597233, -2425764, -2177214, -1073899, -532477, -1266419, -2039687, -1096455, 1359991, 3202717, 3073334, 1852001, 943088, 422915, -67389, 168020, 1732293, 3124498, 1962208, -1552694, -4258082, -3901083, -1836909, -738049, -968170, -940600, -276934, -431938, -1998869, -3407646, -3250523, -2343474, -2079919, -1885892, -172398, 2663043, 4225446, 3397500, 1865569, 1651826, 2554904, 2988564]
30466B988564p86562j572317j595143o27722J366697L039278K565629L04782j400808
30457D282398j629330j817034k447432j542828J683731M141907K606089j418339
30449C859162l565948k488871p92289l46209O8538J601073K674414J357290j293801
30440A073359k354889r02240J006343J276892K51544m01249k08660r2779m20395
30431g72074l37164N53303J213548P79819l1464l02009n31218j344475j746195
30422b517929o79143O48161L83809p84235p34066M65037J041218R94557J536630
30413C54039J631353m98031k566397l76506M358235M567041j376058n791688k757517
30404b455529K880274L230888q05333k380717n4554J337164k10098j241548L55937
$$ y = [2988564, 2202002, 629685, -965458, -1593180, -226483, 2812795, 5378424, 5683206, 4282398, 2653068, 836034, -1611398, -3154226, -1470495, 2671412, 5277501, 3859162, 293214, -2195657, -2987946, -3334155, -3265617, -1664544, 1009870, 2367160, 1073359, -1281530, -2183770, -1177427, 99465, 351009, -50240, -258900, -351679, -772074, -1109238, -555935, 657613, 1437432, 1405968, 1103959, 572741, -771734, -2517929, -3197072, -2548911, -2165102, -2949337, -3683403, -3218366, -2177148, -1182591, 354039, 1985392, 1487361, -1079036, -1455542, 2902693, 7469734, 6093676, 301988, -2455529, 424745, 3655633, 2850300, 469583, 415029, 1752193, 1542095, 300547, 656484]
30395F56484K114964J695749K9294j251777j629462n64982J759118K701505R8877
30386E609770l398093l196607L52137K558910J689175N45659N13322m31802k592452
30377A650019k848815j56392J964271Q46359j422668j882984r02607j87059K00778
30368b739098O22111M74895q5847L49951J741892K076436P54918l70031m07138
30359B418089p33932j777191j815347l12090P92096L91387l66699r39284k102077
30350d445048k875405q31897L171806M825948K637106J10964j66163p2018j278839
30341A076454j756348J1982J635416J038295J85374J122721K014910P88980p74746
30332E343038m61229R6103j384433l169687k239223N29704J835305Q79748n46930
$$ y = [656484, 2771448, 4467197, 4496491, 3244714, 1615252, 1050270, 2809388, 5510893, 5609770, 2211677, -984930, -632793, 1926117, 3615292, 4160951, 4674273, 4242471, 1650019, -1198796, -1355188, 609083, 1455442, 32774, -1850210, -2752817, -2939876, -2739098, -2116987, -1642092, -1727939, -1377988, 363904, 2440340, 3195258, 2825227, 2418089, 1684157, -93034, -1908381, -2220471, -1428375, -1036988, -1403687, -2342971, -4445048, -7320453, -8152350, -4980544, -154596, 2482510, 2593474, 2427311, 2355293, 1076454, -679894, -667912, 967504, 2005799, 2191173, 3313894, 5328804, 6117784, 5343038, 4881809, 4977912, 3593479, 423792, -1815431, -1285727, 549578, 1429326, 882396]
30323H82396j265471j118830N4380J434815J241391l14766p53260K95654P2105
30314E28414j895581j903915J370057L331032O27161k838977k080999J000620
30306a862188J466774m52717j056567j44061j10813m27085Q80105K227841R76937
30297A498226r19892J24457K434283J527644j858937k823802n99564Q30304J42977
30288C55696J46348J556570J588419m52352j839553j487187j164784j238671l50834
30279b886348N76188n19282j805534K66296L730893K934231j647997k883006J729878
30270e04681N689595L705274o02833j606833l43712j003991l243907l600033j769727
30261c280848m39713m07294N7554J748292L298074L012161N00381k648917l467608
$$ y = [882396, -383075, -1501905, -1447525, -12710, 1228681, 913915, 160655, 456309, 528414, -1367167, -3271082, -1901025, 1430007, 2057168, -781809, -2862808, -1862188, -395414, -848131, -1904698, -2048759, -2159572, -2586657, -1706552, 521289, 1498226, 578334, 702791, 3137074, 4664718, 2805781, -18021, -617585, 212719, 355696, 502044, 2058614, 3647033, 3194681, 1355128, -132059, -1296843, -2535514, -2886348, -2310160, -2829442, -4634976, -4368680, -637787, 2296444, 648447, -2234559, -504681, 5184914, 8890188, 8287355, 6680522, 6336810, 5332819, 2088912, -1511121, -3280848, -3720561, -4127855, -4070301, -2322009, 976065, 3988226, 4488607, 1839690, -1627918]
30252a627918p27895K538693K350120m78763j459030N42967J773974j5857k317462
30243E78829k627383j932228j399905l3417K000226K044134l56575j600344K88134
30234c038529K237895J421067k40436k81660k07949j801507k835768j010007J239735
30225d517159O82810q89736J24490K525437K290761m12823j529463K78195K129953
30216F82465J846961K33218j443871k592216k168631J10991J788874L37300k561389
30207c766298k908306k29657K158459K597772K799331L577256K893204k87229
30199F834532l391780l521258j218070P80232J001352q400j170446j721390j235340
30190c650568J33892J574059K188099J605570K01477j010098j083686j67649N94626
$$ y = [-1627918, -2355813, 182880, 2533000, 2054237, 595207, 1138174, 2912148, 2896291, 578829, -2048554, -3980782, -5380687, -5414104, -3413878, -1369744, -1726319, -3326663, -3038529, -800634, 620433, 379997, 98337, -109612, -1911119, -4746887, -5756894, -4517159, -3834349, -4724085, -4599595, -2074158, 216603, -196220, -1725683, -1447488, 682465, 2529426, 2762644, 1318773, -1273443, -3442074, -3331083, -1542209, -1204909, -3766298, -6674604, -6904261, -4745802, -2148030, 651301, 4228557, 7121761, 6834532, 3442752, -78506, -1296576, -516344, 485008, 476608, -693838, -2415228, -3650568, -3516676, -1942617, 245482, 1851052, 2052529, 1042431, -41255, -208904, 385722]
30181C85722N12569Q5053R864K84808N96925O79301J41774q82676j051267M65481
30171A227554J746129K02085k835111k935996Q70559L961438K620397q22771k195963
30162A838321j504212j094434p48470Q54289J864988m55412m148017m327172n55988
30153h276107K296756J306159p60294l56964J895932L104816K193750K55321j268603
30144C90766j431250l34856M77373k58456j313286m99536J658886K395933J014711
30135B100285k12663K5056L73834r9827l80714k54853j127166k472762j268443
30126c317253K579028M168181O20576l378729j976362K537032K899027j710068
30118B421432m248805q53294L361107K669422p58140j518795M7776m26181k906061
$$ y = [385722, 898291, 983344, 993208, 1278016, 1874941, 2554242, 2696016, 1813340, 762073, 1227554, 2973683, 3175768, 340657, -2595339, -1724780, 2236658, 4857055, 4034284, 1838321, 334109, -760325, -1508795, -654506, 1210482, 755070, -3392947, -7720119, -8276107, -5979351, -4673192, -5433486, -5790450, -3894518, -789702, 1404048, 1659369, 390766, -1040484, -1375340, -897967, -1156423, -2469709, -2969245, -1310359, 1085574, 2100285, 1887622, 1912678, 2286512, 2186685, 1805971, 1551118, 423952, -2048810, -3317253, -738225, 3429956, 4050532, 671803, -1304559, 1232473, 4131500, 2421432, -1827373, -2680667, 680440, 3349862, 2591722, 1072927, 1120703, 694522, -2211539]
30109b211539k797294Q98398L394697J617788j313243j571629j57337K29067R2071
30100a819021J053648J776301K93730j643889j077634P08109K0332k660075l006215
$$ y = [-2211539, -5008833, -4110435, -715738, 902050, -411193, -1982822, -2140159, -1911092, -1819021, -765373, 1010928, 1304658, -339231, -1416865, -708756, -688424, -3348499, -6354714]
$$ [...]
##END NTUPLES=NMR SPECTRUM
##END=
