##TITLE=31Pdec_LY-16Dix.3.B
 CD3CN, 24 sc
 2.06.2021
##JCAMPDX= 6.0         $$ Bruker NMR JCAMP-DX V2.0
##DATA TYPE= NMR SPECTRUM
##DATA CLASS= NTUPLES
##ORIGIN= UXNMR, Bruker Analytische Messtechnik GmbH
##OWNER= root
$$ XWIN-NMR		Version 3.5
$$ Wed Jun  2 13:46:32 2021 Russian Standard Time (UT+4h)  she@DPX200
##.OBSERVE FREQUENCY= 81.013821
##.OBSERVE NUCLEUS= ^31P
##.ACQUISITION MODE= SIMULTANEOUS
##.ACQUISITION SCHEME= undefined
##.AVERAGES= 24
##.DIGITISER RES= 16
##SPECTROMETER/DATA SYSTEM= spect
##.PULSE SEQUENCE= zgpg30
##.SOLVENT NAME= MeOD
##.SHIFT REFERENCE= (INTERNAL, MeOD, 0, 248.564)
##AUDIT TRAIL= $$ (NUMBER, WHEN, WHO, WHERE, WHAT)
$$ ##TITLE= Audit trail, XWIN-NMR		Version 3.5
$$ ##JCAMPDX= 5.01
$$ ##ORIGIN= Bruker BioSpin GmbH
$$ ##OWNER= she
$$ F:/spectra/data/she/nmr/P31/1/pdata/1/auditp.txt
$$ ##AUDIT TRAIL=  $$ (NUMBER, WHEN, WHO, WHERE, WHAT)
(   1,<2021-06-02 13:44:56.60 +0400>,<she>,<DPX200>,
      <created by zg, POWCHK disabled, PULCHK disabled
       configuration hash MD5:
       00 E9 B6 7A A2 85 ED C7 34 08 36 98 17 FE 4E 26
       data hash MD5: 32K
       94 CE 54 30 84 EC 3F B3 67 23 DB 54 95 FC FF E9>)
(   2,<2021-06-02 13:45:02.29 +0400>,<she>,<DPX200>,
      <Start of raw data processing
       efp BC_mod = 2 LB = 1 FT_mod = 6 PKNL = 1 PHC0 = -6085.903 PHC1 = 474.2701 SI = 64K 
       data hash MD5: 64K
       56 C6 B6 47 FD 3C 8B 72 34 C3 45 9D 13 A2 DA 6F>)
(   3,<2021-06-02 13:45:45.34 +0400>,<she>,<DPX200>,
      <pk PHC0 = 448.9776 PHC1 = -892.9998 
       data hash MD5: 64K
       E0 12 04 D0 B3 C6 B8 5F 1E 1B 0B 7A DA 8D E3 CD>)
(   4,<2021-06-02 13:45:49.39 +0400>,<she>,<DPX200>,
      <abs ABSG = 5 
       data hash MD5: 64K
       81 B4 D0 08 38 AB 74 08 26 2E 8A EC 01 4E AD E8>)
$$ ##END=
$$ 
$$ hash MD5
$$ 28 6C 9F 4E 06 D6 23 A5 4A EB 38 01 BC DE 52 D4
##$RELAX= 
##$RELAX= 
##$RELAX= 
##$RELAX= 
##$RELAX= 
##$RELAX= 
##$RELAX= 
##$RELAX= 
$$ Bruker specific parameters
$$ --------------------------
##$DU= <F:/spectra>
##$EXPNO= 1
##$NAME= <P31>
##$PROCNO= 1
##$TYPE= <nmr>
##$USER= <she>
##$AMP= (0..31)
100 100 100 100 100 100 100 100 100 100 100 100 100 100 100 100 100 100 
100 100 100 100 100 100 100 100 100 100 100 100 100 100 
##$AQSEQ= 0
##$AQ_mod= 1
##$AUNM= <au_zg>
##$AUTOPOS= <>
##$BF1= 81.014009
##$BF2= 200.13
##$BF3= 200.13
##$BF4= 200.13
##$BF5= 200.13
##$BF6= 200.13
##$BF7= 200.13
##$BF8= 200.13
##$BYTORDA= 1
##$CFDGTYP= 0
##$CFRGTYP= 5
##$CHEMSTR= <none>
##$CNST= (0..31)
1 1 145 1 1 1 1 1 1 1 1 1 1 1 1 1 1 1 1 1 1 1 1 1 1 1 1 1 1 1 1 1 
##$CPDPRG= <waltz16>
##$CPDPRG1= <>
##$CPDPRG2= <waltz16>
##$CPDPRG3= <>
##$CPDPRG4= <mlev>
##$CPDPRG5= <mlev>
##$CPDPRG6= <mlev>
##$CPDPRG7= <mlev>
##$CPDPRG8= <mlev>
##$CPDPRGB= <>
##$CPDPRGT= <>
##$D= (0..31)
0 1 0 0 0 0 0 0 0 0 0 0.03 2e-05 3e-06 0 0 0 0 0 0 0 0 0 0 0 0 0 0 0 0 
0 0 
##$DATE= 1622627095
##$DBL= (0..7)
120 120 120 11 120 120 24 19 
##$DBP= (0..7)
150 150 150 150 150 150 150 150 
##$DBP07= 0
##$DBPNAM0= <>
##$DBPNAM1= <>
$$ [...]
##$SUBNAM3= <"">
##$SUBNAM4= <"">
##$SUBNAM5= <"">
##$SUBNAM6= <"">
##$SUBNAM7= <"">
##$SUBNAM8= <"">
##$SUBNAM9= <"">
##$SW= 501.771253377433
##$SWIBOX= (0..15)
0 1 3 0 0 0 0 0 0 0 0 0 0 0 0 0 
##$SW_h= 40650.406504065
##$TD= 32768
##$TD0= 1
##$TE= 0
##$TE2= 300
##$TE3= 300
##$TEG= 300
##$TL= (0..7)
0 120 53 12 22 120 120 120 
##$TP= (0..7)
150 150 150 150 150 150 150 150 
##$TP07= 0
##$TPNAME0= <>
##$TPNAME1= <>
##$TPNAME2= <>
##$TPNAME3= <>
##$TPNAME4= <>
##$TPNAME5= <>
##$TPNAME6= <>
##$TPNAME7= <>
##$TPOAL= (0..7)
0.5 0.5 0.5 0.5 0.5 0.5 0.5 0.5 
##$TPOFFS= (0..7)
0 0 0 0 0 0 0 0 
##$TUNHIN= 0
##$TUNHOUT= 0
##$TUNXOUT= 0
##$USERA1= <user>
##$USERA2= <user>
##$USERA3= <user>
##$USERA4= <user>
##$USERA5= <user>
##$V9= 5
##$VALIST= <valist>
##$VCLIST= <CCCCCCCCCCCCCCC>
##$VD= 0
##$VDLIST= <DDDDDDDDDDDDDDD>
##$VPLIST= <PPPPPPPPPPPPPPP>
##$VTLIST= <TTTTTTTTTTTTTTT>
##$WBST= 1024
##$WBSW= 4
##$XGAIN= (0..3)
0 0 0 0 
##$XL= 0
##$YL= 0
##$YMAX_a= 3654
##$YMIN_a= -5318
##$ZGOPTNS= <>
##$ZL1= 120
##$ZL2= 120
##$ZL3= 120
##$ZL4= 120
##$ABSF1= 248.5645
##$ABSF2= -253.2056
##$ABSG= 5
##$ABSL= 3
##$ALPHA= 0
##$AQORDER= 0
##$ASSFAC= 0
##$ASSFACI= 0
##$ASSFACX= 0
##$ASSWID= 0
##$AUNMP= <proc_1d>
##$AZFE= 0.1
##$AZFW= 0.5
##$BCFW= 0
##$BC_mod= 2
##$BYTORDP= 0
##$COROFFS= 0
##$CY= -3
##$DATMOD= 1
##$DC= 0
##$DFILT= <>
##$DTYPP= 0
##$F1P= 0
##$F2P= 0
##$FCOR= 1
##$FTSIZE= 65536
##$FT_mod= 6
##$GAMMA= 0
##$GB= 0
##$INTBC= 1
##$INTSCL= 5.30512e-09
##$ISEN= 30
##$LB= 1
##$LEV0= 0
##$LPBIN= 0
##$MAXI= 10000
##$MC2= 0
##$MEAN= 0
##$ME_mod= 0
##$MI= 50
##$NCOEF= 0
##$NC_proc= -5
##$NLEV= 6
##$NOISF1= 182.463
##$NOISF2= 159.3651
##$NSP= 0
##$NTH_PI= 0
##$NZP= 0
##$OFFSET= 248.5645
##$PC= 4
##$PHC0= -5636.925
##$PHC1= -418.7297
##$PH_mod= 1
##$PKNL= yes
##$PPARMOD= 0
##$PSCAL= 0
##$PSIGN= 0
##$REVERSE= no
##$SF= 81.014009
##$SI= 65536
##$SIGF1= 159.3651
##$SIGF2= -187.1042
##$SINO= 113.3802
##$SIOLD= 16384
##$SREGLST= <1H.CDCl3>
##$SSB= 0
##$STSI= 65536
##$STSR= 0
##$SW_p= 40650.406504065
##$SYMM= 0
##$S_DEV= 0
##$TDeff= 32768
##$TDoff= 0
##$TI= <>
##$TILT= no
##$TM1= 0
##$TM2= 0
##$TOPLEV= 0
##$USERP1= <user>
##$USERP2= <user>
##$USERP3= <user>
##$USERP4= <user>
##$USERP5= <user>
##$WDW= 1
##$XDIM= 65536
##$YMAX_p= 452035417
##$YMIN_p= -66931644
$$ End of Bruker specific parameters
$$ ---------------------------------
##NTUPLES= NMR SPECTRUM
##VAR_NAME=  FREQUENCY,     SPECTRUM/REAL,   SPECTRUM/IMAG
##SYMBOL=    X,             R,               I
##VAR_TYPE=  INDEPENDENT,   DEPENDENT,       DEPENDENT
##VAR_FORM=  AFFN,          ASDF,            ASDF
##VAR_DIM=   65536,         65536,           65536
##UNITS=     HZ,            ARBITRARY UNITS, ARBITRARY UNITS
##FACTOR=    0.620285442955139, 1,           1
##FIRST=     20137.2065510759, 0,            0
##LAST=      -20513.1999529892, 0,           0
##MIN=       -20513.1999529892, -66931644,   0
##MAX=       20137.2065510759, 452035417,    0
$$ Real data points
##PAGE= N=1
##DATA TABLE= (X++(R..R)), XYDATA
$$ [...]
$$ plain form
35538 1821610 1536492 1759489 1731499 1208884 512343 -199891 -840077 -952022 -292807 383665
35528 383665 106024 -790281 -883710 399374 1918132 2278168 1534888 904756 1085999
35519 1085999 1453884 1088295 250637 236412 1497435 2565318 1771401 -263303 -1195252
35510 -1195252 -188443 981618 754283 54072 373982 1072590 621658 -379023 113687
35501 113687 2048981 2886364 1293831 -875024 -1309073 -268246 357384 -210995 -1164456
35492 -1164456 -1605338 -1314837 -424339 706077 1423493 1241439 359554 -468535 -445248
35483 -445248 709180 2184656 2369100 612953 -1519312 -1939588 -817222 -158311 -623511
35474 -623511 -763130 52900 185462 -1502179 -3408082 -3545681 -2589009 -2509361 -3370249
$$ packed form
35538A821610k85118K22997k7990n22615o96541p12234o40186j11945O59215O76472
35528C83665k77641q96305r3429J283084J518758L60036p43280o30132J81243
35519A085999L67885l65589q37658j4225J261023J067883p93917k034704r31949
35510a195252J006809J170061k27335p00211L19910O98608m50932j000681M92710
35501A13687J935294Q37383j592533k168855m34049J040827O25630n68379r53461
35492a164456m40882K90501Q90498J130416P17416j82054q81885q28089K3287
35483d45248J154428J475476J84444j756147k132265m20276J122366O58911m65200
35474f23511j39619Q16030J32562j687641j905903j37599R56672P9648q60888
$$ plain form
35465 -3370249 -3736619 -3427640 -3426887 -3480652 -2311842 -272059 687006 158583 59270 1394347
35455 1394347 2414838 1371574 -636875 -1296793 -429348 98380 -699091 -1747705 -1732678
35446 -1732678 -857758 -344835 -796396 -1506457 -1351062 -231289 624559 94987 -1364293
35437 -1364293 -2302032 -2146216 -1609019 -1231869 -700206 -2827 -59576 -1326048 -2671345
35428 -2671345 -2689026 -1544670 -492180 20578 647936 1690345 2431377 2187224 1299522
35419 1299522 724300 964617 1623668 1915250 1602540 1350278 1818671 2482490 2073807
35410 2073807 431473 -965709 -875653 146036 843603 1046699 1239252 1102684 -2653
35401 -2653 -1460943 -1914441 -1332709 -1003127 -1320091 -1263737 -486450 -104934 -550356 -391499
$$ packed form
35465c370249l66370L08979P53n3765J168810K039783R59065n28423r9313J335077
35455A394347J020491j043264k008449o59918Q67445N27728p97471j048614J5027
35446a732678Q74920N12923m51561p10061J55395J119773Q55848n29572j459280
35437a364293r37739J55816N37197L77150N31663O97379n6749j266472j345297
35428b671345j7681J144356J052490N12758O27358J042409P41032k44153q87702
35419A299522n75222K40317O59051K91582l12710k52262M68393O63819m08683
35410B073807j642334j397182R0056J021689O97567K03096J92553j36568j105337
35401b653j458290m53498N81732L29582l16964N6354P77287L81516m45422J58857
$$ plain form
35391 -391499 1322080 3010388 2622201 724984 -379244 79431 1099926 2604232 5821838
35382 5821838 10352784 13148803 11944406 8308260 5688652 5281287 5423211 4624114 3482001
35373 3482001 3285935 3970960 4217605 3132446 1319638 313547 998274 2538334 3110476
35364 3110476 1917537 109154 -732896 -597042 -741527 -1589543 -1978717 -858576 1101319
35355 1101319 2253572 1868803 673424 -202869 -174822 711005 1843928 2072836 461975
35346 461975 -2397823 -4302547 -3459798 -575053 1774096 1978949 895747 189050 75056
35337 75056 -392832 -1397624 -2031996 -1863441 -1520408 -1355131 -744384 592568 1671564
35328 1671564 1611515 1050166 1044948 1270743 705593 -307865 -287895 1019868 1983988 1273051
$$ packed form
35391c91499J713579J688308l88187j897217j104228M58675J020495J504306L217606
35382E821838M530946K796019j204397l636146k619608m07365J41924p99097j142113
35373C482001j96066O85025K46645j085159j812808j006091O84727J540060N72142
35364C110476j192939j808383q42050J35854j44485q48016l89174J120141J959895
35355A101319J152253l84769j195379q76293K8047Q85827J132923K28908j610861
35346D61975k859798j904724Q42749K884745K349149K04853j083202p06697j13994
35337G5056m67888j004792o34372J68555L43033J65277O10747J336952J078996
35328A671564o0049n61349n218K25795n65150j013458J9970J307763R64120p10937
$$ plain form
35318 1273051 -432533 -1472683 -1074031 303238 1673991 2096278 1300684 275806 511031
35309 511031 2097813 3262495 2441995 286451 -1079880 -437501 1446440 2835840 2677941
35300 2677941 1439709 549270 812588 1460442 1265652 394336 175574 1002904 1695744
35291 1695744 1324065 410301 -291366 -921709 -1560501 -1414903 -140154 1067159 963342
35282 963342 -29947 -828605 -1427019 -2208585 -2496826 -1562008 -342481 -245209 -769581 -397646
35272 -397646 509805 62553 -1825973 -2875997 -1834825 -258554 18667 -726159 -1334733
35263 -1334733 -1625125 -1692401 -853771 1152260 2952277 3015104 1690078 595837 597139
35254 597139 1411149 2529588 3429118 3428381 2413387 1311334 970437 1017412 620115 -163557
$$ packed form
35318A273051j705584j040150L98652J377269J370753M22287p95594j024878K35225
35309E11031J586782J164682q20500k155544j366331O42379J883941J389400j57899
35300B677941j238232q90439K63318O47854j94790q71316k18762Q27330O92840
35291A695744l71679r13764p01667o30343o38792J45598J274749J207313j03817
35282I63342r93289p98658n98414p81566k88241R34818J219527R7272n24372L71935
35272c97646R07451m47252j888526j050024J041172J576271K77221p44826o08574
35263a334733k90392o7276Q38630K006031J800017O2827j325026j094241J302
35254E97139Q14010J118439Q99530p37j014994j102053l40897M6975l97297p83672
$$ plain form
35244 -163557 -655831 -664504 -472551 -208563 -19093 -329405 -1127647 -1578108 -1192722 -735252
35234 -735252 -1013531 -1475046 -1146411 -338580 -96106 -422448 -490817 -324208 -703733 -1416725
35224 -1416725 -1197557 204107 1299055 870606 -356581 -842601 -282541 301064 158237
35215 158237 -228571 147733 1484561 2766039 2809398 1619467 341988 -138617 35073
35206 35073 454564 1069406 1561158 1113474 -274086 -1149763 -501582 489679 101121 -1113304
35196 -1113304 -1041247 565490 1464846 277495 -1397362 -1310081 382629 1733079 1796792
35187 1796792 1391640 1395487 1566083 1264243 531536 -5074 -36249 -16795 -570465 -1544005
35177 -1544005 -1985704 -1245511 249361 1614995 2456144 2696742 2023867 412689 -1094101
$$ packed form
35244a63557m92274q673J91953K63988J89470l10312p98242m50461L85386M57470
35234g35252k78279m61515L28635Q07831K42474l26342o8369J66609l79525p12992
35224a416725K19168J401664J094948m28449j227187m86020N60060N83605j42827
35215A58237l86808L76304J336828J281478M3359j189931j277479m80605J73690
35206C5073M19491O14842M91752m47684j387560q75677O48181R91261l88558j214425
35196a113304P2057J606737Q99356j187351j674857Q7281J692710J350450O3713
35187A796792m05152L847J70596l01840p32707n36610l1175J9454n53670r73540
35177a544005m41699P40193J494872J365634Q41149K40598o72875j611178j506790
$$ plain form
35168 -1094101 -1241004 -259736 309797 -238227 -762831 85707 1918464 2953603 2038984
35159 2038984 -117971 -1713171 -1685787 -720300 -249277 -600653 -811660 -411385 -287730
35150 -287730 -1062132 -1732546 -1185417 -132557 68289 -173856 591538 2045932 2243038
35141 2243038 812485 -156855 772828 2239688 2138613 432727 -1203573 -1544373 -704931
35132 -704931 316659 369435 -780308 -1803222 -1267875 123079 217547 -1405022 -2744291
35123 -2744291 -2449492 -1573582 -1282454 -904221 243019 1000698 289759 -643179 -42074
35114 -42074 1429641 1775735 873320 356388 724360 723024 -392054 -1774544 -2350041 -1905310
35104 -1905310 -771560 456516 1004320 686852 264638 195420 -221166 -1404651 -2221532
$$ packed form
35168a094101j46903R81268N69533n48024n24604Q48538J832757J035139r14619
35159B038984k156955j595200K7384R65487M71023l51376k11007M00275J23655
35150b87730p74402o70414N47129J052860K00846k42145P65394J454394J97106
35141B243038j430553r69340R29683J466860j01075j705886j636300l40800Q39442
35132g04931J021590N2776j149743j022914N35347J390954R4468j622569j339269
35123b744291K94799Q75910K91128L78233J147240P57679p10939r32938O01105
35114d2074J471715L46094r02415n16932L67972j336j115078j382490n75497M44731
35104a905310J133750J228076N47804l17468m22214o9218m16586j183485q16881
$$ plain form
35095 -2221532 -1592373 -359401 142605 325705 1111632 1502528 23175 -2006704 -1634964
35086 -1634964 1205008 3244722 2487331 526373 -574315 -1031919 -1676536 -1937142 -1218399
35077 -1218399 -478739 -723914 -1305802 -1195797 -670870 -368304 32783 760643 872821
35068 872821 -167776 -967935 -32136 1703014 1979306 402931 -1162055 -1205634 -129311
35059 -129311 783635 759109 -149499 -1201796 -1420828 -573320 485832 974237 1174614
35050 1174614 1598300 1859593 1366001 538825 221378 325867 232416 127499 653188 1497916
35040 1497916 1746886 1575362 2112193 3385874 3862140 2624346 818004 132246 744207
35031 744207 1613881 2103946 2320153 2229576 1480257 198331 -759706 -677043 214224 1000855
$$ packed form
35095b221532O29159J232972N02006J83100P85927L90896j479353k029879L71740
35086a634964K839972K039714p57391j960958j100688m57604o44617k60606P18743
35077a218399P39660k45175n81888J10005N24927L02566M01087P27860J12178
35068H72821j040597q00159R35799J735150K76292j576375j564986m3579J076323
35059a29311R12946k4526r08608j052297k19032Q47508J059152M88405K00377
35050A174614M23686K61293m93592q27176l17447J04489r3451j04917N25689Q44728
35040A497916K48970j71524N36831J273681M76266j237794j806342o85758O11961
35031G44207Q69674M90065K16207r0577p49319j281926r58037Q2663Q91267P86631
$$ plain form
35021 1000855 980908 165335 -895557 -1534204 -1310398 -293045 857924 1382825 1275586
35012 1275586 1411661 2415226 3574090 3488354 1865405 52534 -490774 256066 1188597
35003 1188597 1468986 1134630 648511 374734 400599 515057 428942 209719 278903 754078
34993 754078 1109050 840806 188761 -254035 -423344 -734324 -1226623 -1358390 -835425 -174711
34983 -174711 -62214 -375036 -300929 510774 1346846 1332914 666905 335507 597535 564611
34973 564611 -272877 -913563 -167714 1358204 1772083 355921 -1602427 -2640390 -2700955
34964 -2700955 -2441411 -1980342 -1108716 -99363 503182 608371 549698 566403 648375 575086
34954 575086 -88004 -1495403 -2773317 -2495428 -422699 1866502 2681504 1981867 840053
$$ packed form
35021A000855j9947q15573j060892o38647K23806J017353J150969N24901j07239
35012A275586J36075J003565J158864q5736j622949j812871n43308P46840R32531
35003A188597K80389l34356m86119k73777K5865J14458q6115k19223O9184M75175
34993G54078L54972k68244o52045m42796j69309l10980m92299j31767N22965O60714
34983a74711J12497l12822P4107Q11703Q36072j3932o66009l31398K62028l2924
34973E64611q37488o40686P45849J525918M13879j416162j958348j037963o0565
34964b700955K59544M61069Q71626J009353O02545J05189n8673J6705Q1972p3289
34954E75086o63090j407399j277914K77889K072729K289201Q15002o99637j141814
$$ plain form
34945 840053 -146067 -978653 -1331231 -704722 515175 1199974 944859 629465 1146120
34936 1146120 2113167 2322540 1249916 -266732 -912721 -301804 680639 997852 683778
34927 683778 616626 1223230 1943481 2052561 1473121 564003 -398102 -1213044 -1600618 -1355167
34917 -1355167 -491189 761366 1806414 1758305 357740 -1275514 -1658531 -762942 111348
34908 111348 344819 674675 1508697 1892440 960590 -635086 -1647820 -1743247 -1270153
34899 -1270153 -379564 748452 1550243 1742853 1600210 1025678 -465353 -2114255 -1878008
34890 -1878008 663677 2942788 2728485 1345575 1322384 2146011 1305777 -1107481 -2207591
34881 -2207591 -964809 203786 -510599 -1594195 -1125178 76796 225362 -404497 -418905
$$ packed form
34945H40053r86120q32586l52578O26509J219897O84799k55115l15394N16655
34936A146120R67047K09373j072624j516648o45989O10917R82443L17213l14074
34927F83778o7152O06604P20251J09080n79440r09118r62105q14942l87574K45451
34917a355167Q63978J252555J045048m8109j400565j633254l83017Q95589Q74290
34908A11348K33471L29856Q34022L83743r31850j595676j012734r5427M73094
34899a270153Q90589J128016Q01791J92610j42643n74532j491031j648902K36247
34890a878008K541685K279111k14303j382910k3191Q23627q40234k413258j100110
34881b207591J242782J168595p14385j083596M69017J201974J48566o29859j4408
$$ plain form
34872 -418905 88886 120209 42597 995362 2434508 2476314 815899 -615850 -420187 418462
34862 418462 260275 -782942 -1253909 -608903 1708 -687525 -2363301 -3461117 -3022496
34853 -3022496 -1741681 -929693 -844069 -632181 228615 1215221 1647235 1556506 1303469 961166
34843 961166 568690 484356 939927 1592726 1951828 1881147 1329256 114779 -1480545 -2461300
34833 -2461300 -2202821 -1403032 -1190156 -1597613 -1746942 -1284785 -682323 -200481 411787
34824 411787 1069580 1230542 946372 1079024 1988939 2895355 3118232 3010203 2833141 1726892
34814 1726892 -831440 -3219443 -3126165 -800865 963050 567669 -435394 -111317 812620
34805 812620 351458 -1387543 -2316607 -1492088 -184857 335404 376797 691225 1157826
$$ packed form
34872d18905N07791L1323p7612R52765J439146M1806j660415j431749J95663Q38649
34862D18462j58187j043217m70967O45006O10611o89233j675776j097816M38621
34853c022496J280815Q11988Q5624K11888Q60796R86606M32014r0729k53037l42303
34843I61166l92476q4334M55571O52799L59102p0681n51891j214477j595324r80755
34833b461300K58479P99789K12876m07457j49329M62157O02462M81842O12268
34824D11787O57793J60962k84170J32652R09915R06416K22877j08029j77062j106249
34814A726892k558332k388003R3278K325300J763915l95381j003063L24077R23937
34805H12620m61162j739001r29064Q24519J307231N20261M1393L14428M66601
$$ plain form
34796 1157826 1252622 833620 13602 -836215 -794001 691785 2389488 2276739 356723
34787 356723 -1166827 -1137230 -943419 -1713954 -2092090 -606566 1456943 1812805 631402
34778 631402 -97047 190348 440827 480124 1128520 1977150 1601948 224443 -261765 610131
34768 610131 1094285 251657 -530225 -87069 534069 -10439 -1180724 -1740901 -1714966 -1712241
34758 -1712241 -1505972 -759267 -213177 -727078 -1842006 -2512699 -2586308 -2440471 -1882715
34749 -1882715 -599185 893621 1852232 2315353 2523142 2020292 498943 -1059279 -1346074
34740 -1346074 -449476 517575 1099388 1620375 2000505 1788126 1273282 1308798 1928790 2219050
34730 2219050 1688789 812143 101192 -400966 -546456 11639 995191 1429361 855473
$$ packed form
34796A157826R4796m19002q20018q49817M2214J485786J697703j12749j920016
34787C56723j523550K9597J93811p70535l78136J485524K063509L55862j181403
34778F31402p28449K87395K50479L9297O48396Q48630l75202j377505m86208Q71896
34768F10131M84154q42628p81882M43156O21138n44508j170285n60177K5935K725
34758a712241K06269P46705N46090n13901j114928o70693p3609J45837N57756
34749a882715J283530J492806R58611M63121K07789n02850j521349j558222k86795
34740a346074Q96598R67051N81813N20987L80130k12379n14844L5516O19992K90260
34730B219050n30261q76646p10951n02158j45490N58095R83552M34170n73888
$$ plain form
34721 855473 -28818 -383254 -309582 -396466 -606245 -283176 778848 1816424 1895587 1005185
34711 1005185 37226 -312253 -248214 -265971 -265832 125938 577833 257171 -830262 -1545041
34701 -1545041 -1087408 -52620 560157 765369 1248590 2030044 2381116 2013222 1543098
34692 1543098 1550535 1731118 1356897 318795 -682045 -1013274 -859567 -780429 -698638 25745
34682 25745 1294409 1806434 607150 -1417641 -2498082 -2102470 -1138384 -334309 376304
34673 376304 938657 970931 672384 710904 957269 580131 -322428 -584214 91548 526879
34663 526879 36832 -504582 -400219 -393725 -1096671 -1621384 -1147447 -552092 -930205 -1590221
34653 -1590221 -1187426 52658 955166 1447420 2149693 2516761 1392135 -771890 -2120243
$$ packed form
34721H55473q84291l54436P3672q6884k09779L23069J062024J037576P9163q90402
34711A005185r67959l49479O4039j7757J39L91770M51895l20662j087433p14779
34701a545041M57633J034788O12777K05212M83221P81454L51072l67894m70124
34692A543098P437J80583l74221j038102j000840l31229J53707P9138Q1791P24383
34682B5745J268664N12025j199284k024791j080441L95612R64086Q04075P10613
34673C76304N62353L2274k98547L8520K46365l77138r02559k61786O75762M35331
34663E26879m90047n41414J04363O494p02946n24713M73937N95355l78113o60016
34653a590221M02795J240084R02508M92254P02273L67068j124626k164025j348353
$$ plain form
34644 -2120243 -1901328 -1144543 -715356 -260129 614840 1502033 1964440 2096002 2022463 1747136
34634 1747136 1609641 2000810 2593287 2728337 2454482 2232823 1837796 714726 -686707
34625 -686707 -1179485 -492107 448918 881427 773845 160254 -854714 -1504030 -1077468
34616 -1077468 -192547 10485 -149462 665477 2310129 2941883 1804242 447234 333272
34607 333272 785168 373756 -932138 -2161141 -2913156 -3410070 -3652736 -3488804 -3043172
34598 -3043172 -2418320 -1508661 -616329 -535695 -1436050 -2350796 -2383814 -1788382 -1295190 -1036881
34588 -1036881 -746589 -436151 -267724 -176049 -38243 177387 595240 1192195 1360527 571239
34578 571239 -480630 -510918 381497 686660 -170803 -928997 -668930 -400980 -1310199 -2663336
$$ packed form
34644b120243K18915P56785M29187M55227Q74969Q87193M62407J31562p3539k75327
34634A747136j37495L91169N92477J35050k73855k21659l95027j123070j401433
34625f86707m92778O87378R41025M32509j07582o13591j014968o49316M26562
34616a077468Q84921K03032j59947Q14939J644652O31754j137641j357008j13962
34607C33272M51896m11412j305894j229003p52015m96914k42666J63932M45632
34598c043172O24852R09659Q92332Q0634r00355r14746l3018N95432M93192K58309
34588a036881K90292L10438J68427R1675J37806K15630M17853N96955J68332p89288
34578E71239j051869l0288Q92415L05163q57463p58194K60067K67950r09219j353137
$$ plain form
34568 -2663336 -2902021 -1974855 -1138655 -983188 -998388 -773209 -420322 13506 564662 939630
34558 939630 893480 761777 871630 811355 130053 -603487 -378056 817443 1950481 2216415
34548 2216415 1710873 1059444 953604 1711018 2710920 2711801 1374741 -44623 -234963 538237
34538 538237 1181121 1488652 1996980 2616453 2688952 2196112 1705567 1201866 137992 -1312131
34528 -1312131 -2155239 -1898334 -1044252 -157652 665247 1283253 1391547 1153835 1166471 1548312
34518 1548312 1726076 1293638 474341 -367827 -1078978 -1534319 -1680328 -1717088 -1686571 -1119123
34508 -1119123 168724 1234645 979289 -215284 -944457 -815930 -765216 -1244863 -1507970
34499 -1507970 -1100650 -692764 -757576 -691714 -125697 34905 -985261 -2232189 -2092811
$$ packed form
34568b663336k38685R27166Q36200J55467j5200K25179L52887M33828N51156L74968
34558I39630m6150j31703J09853o0275o81302p33540K25431J195499J133038K65934
34548B216415n05542o51429j05840P57414R99902Q81j337060j419364j90340P73200
34538E38237O42884L07531N08328O19473P2499m92840m90545n03701j063874j450123
34528a312131q43108K56905Q54082Q86600Q22899O18006J08294k37712J2636L81841
34518A548312J77764m32438q19297q42168p11151m55341j46009l6760L0517N67448
34508a119123J287847J065921k55356j194573p29173J28527N0714m79647k63107
34499a507970M07320M07886o4812O5862N66017J60602j020166j246928J39378
$$ plain form
34490 -2092811 -514533 979817 1278638 724423 278302 473170 1212871 1988595 2256683
34481 2256683 1975027 1626073 1449880 1092893 439069 181476 820352 1598843 1404468
34472 1404468 421679 -202993 -231618 -632342 -1748876 -2392889 -1495815 189495 978448
34463 978448 400149 -490507 -815738 -942176 -1540779 -2290787 -2198935 -1025316 266061
34454 266061 694309 437464 384042 781070 975678 552151 34715 67877 429957 441142
34444 441142 10126 -385227 -566576 -782448 -1009481 -904281 -614670 -859507 -1779027 -2349235
34434 -2349235 -1582252 47325 1045372 672711 -295426 -670126 -270277 14982 -572654
34425 -572654 -1660400 -2123618 -1473008 -543412 -412640 -853560 -601704 705228 1743677
$$ packed form
34490b092811J578278J494350K98821n54215m46121J94868P39701P75724K68088
34481B256683k81656l48954j76193l56987o53824k57593O38876P78491j94375
34472A404468r82789o24672k8625m00724j116534o44013Q97074J685310P88953
34463I78448n78299q90656l25231j26438n98603p50008R1852J173619J291377
34454B66061M28248k56845n3422L97028J94608m23527n17436L3162L62080J1185
34444D41142m31016l95353j81349k15872k27033J05200K89611k44837r19520n70208
34434b349235P66983J629577R98047l72661r68137l74700L99849K85259n87636
34425e72654j087746m63218O50610R29596J30772m40920K51856J306932J038449
$$ plain form
34416 1743677 1256045 -156758 -951149 -893752 -1174719 -2274334 -3010174 -2267904 -686517
34407 -686517 265960 314770 480281 1326712 2075785 1759162 597162 -321806 -499459 -583546
34397 -583546 -1296202 -2238142 -2297989 -1215827 -109989 -88637 -828440 -1130679 -588624 23450
34387 23450 -80360 -878250 -1896537 -2624672 -2497965 -1317437 72856 393797 -399345
34378 -399345 -905286 -218052 825711 1035767 621893 588693 1055678 1305671 1099719 825656
34368 825656 558495 40498 -494264 -471017 68350 570687 992138 1755199 2666488 2890690
34358 2890690 2199952 1357056 1025686 1097998 1279638 1511885 1594932 1192919 450772 -96126
34348 -96126 -288582 -210974 584397 2491410 4399630 4351619 2188561 76537 -386682
$$ packed form
34416A743677m87632j412803p94391N7397k80967j099615p35840P42270J581387
34407f86517R52477M8810J65511Q46431P49073l16623j162000r18968j77653q4087
34397e83546p12656r41940n9847J082162J105838K1352p39803l02239N42055O12074
34387B3450j03810p97890j018287p28135J26707J180528J390293L20941p93142
34378c99345n05941O87234J043763K10056m13874l3200M66985K49993k05952k74063
34368H25656k67161n17997n34762K3247N39367N02337M21451P63061R11289K24202
34358B890690o90738q42896l31370P2312J81640K32247Q3047m02013p42147n46898
34348i6126j92456P7608P95371J907013J908220m8011k163058k112024m63219
$$ plain form
34339 -386682 -104098 -442733 -818300 -15446 1235184 1143469 -150761 -652307 310618
34330 310618 1013349 70554 -1477970 -1840215 -932849 65595 725048 1509691 2287802
34321 2287802 2128666 820943 -520439 -960098 -1100673 -2102802 -3722021 -4347101 -3147465
34312 -3147465 -1234284 -122876 155861 476765 758412 62549 -1502246 -2470558 -2099514
34303 -2099514 -1441112 -1560049 -1888716 -1446664 -662696 -578370 -947673 -683150 197435 650554
34293 650554 452615 334162 259748 -643854 -2084537 -2390333 -1140319 -305830 -1498163
34284 -1498163 -3484455 -4018164 -3057213 -2296021 -2159609 -1410945 206783 1019538 -104661
34275 -104661 -1892452 -2413655 -1687469 -1280788 -1802317 -2087745 -1023484 741152 1451520
$$ packed form
34339c86682K82584l38635l75567Q02854J250630r1715j294230n01546R62925
34330C10618P02731r42795j548524l62245R07366R98444O59453P84643P78111
34321B287802j59136j307723j341382m39659j40575j002129j619219o25080J199636
34312c147465J913181J111408K78737L20904K81647o95863j564795r68312L71044
34303b099514O58402j18937l28667M42052P83968Q4326l69303K64523Q80585M53119
34293F50554j97939j18453p4414r03602j440683l05796J250014Q34489j192333
34284a498163j986292n33709R60951P61192J36412P48664J617728Q12755j124199
34275a04661j787791n21203P26186M06681n21529k85428J064261J764636P10368
$$ plain form
34266 1451520 319847 -1526103 -2267748 -1318346 281836 1291547 1509723 1341593 855678
34257 855678 71859 -303276 405951 1465458 1313666 -218705 -1487929 -1315729 -446199
34248 -446199 21235 390112 1396182 2510571 2663811 2019121 1588266 1537201 1270667
34239 1270667 784605 477284 33336 -883080 -1240090 104038 1976555 2001607 281850
34230 281850 -528501 585095 1403232 258216 -1210472 -941914 157322 27289 -1065999
34221 -1065999 -1361984 -686546 -257837 -332518 -360326 -656058 -1613253 -2077155 -954513 313481
34211 313481 -444185 -2465604 -3098035 -2082962 -1596965 -2086041 -1575948 317318 1238778
34202 1238778 123194 -934258 -410978 127873 -787922 -1647150 -606483 1309574 2123137
$$ packed form
34266A451520j131673j845950p41645R49402J600182J009711K18176j68130m85915
34257H55678p83819l75135P09227J059507j51792j532371j269224J72200Q69530
34248d46199M67434L68877J006070J114389J53240o44690m30855n1065k66534
34239A270667m86062l07321m43948r16416l57010J344128J872517K5052j719757
34230B81850q10351J113596Q18137j145016j468688K68558J099236j30033j093288
34221a065999k95985O75438M28709p4681k7808k95732r57195m63902J122642J267994
34211C13481p57666k021419o32431J015073M85997m89076N10093J893266R21460
34202A238778j115584j057452N23280N38851r15795q59228J040667J916057Q13563
$$ plain form
34193 2123137 2048507 2255511 2261306 1154403 -50774 88100 793664 488041 -236286 267943
34183 267943 1501077 1491302 113668 -933485 -1093217 -1281353 -1519909 -919458 -15750
34174 -15750 -465780 -2145615 -3061831 -2537606 -1992143 -2002790 -1187912 975224 2603787
34165 2603787 2104592 548466 -118449 252843 547025 366954 83807 -223702 -676741
34156 -676741 -1055277 -1199949 -1327080 -1341257 -640233 795099 1978017 2192394 1833341
34147 1833341 1428775 816928 -39857 -463454 -152505 18532 -752456 -1830260 -1957260
34138 -1957260 -957709 148251 364746 -497916 -1829692 -2588377 -2187351 -1337187 -1316830
34129 -1316830 -2129576 -2345629 -1260678 -104200 -270201 -1328118 -1858082 -1513048 -1070403
$$ packed form
34193B123137p4630K07004N795j106903j205177J38874P05564l05623p24327N04229
34183B67943J233134r775j377634j047153j59732j88136k38556O00451R03708
34174a5750m50030j679835r16216N24225N45463j0647Q14878K163136J628563
34165B603787m99195j556126o66915L71292K94182j80071k83147l07509m53039
34156f76741l78536j44672j27131j4177P01024J435332J182918K14377l59053
34147A833341m04566o11847q56785m23597L10949J71037p70988j077804j27000
34138a957260R99551J105960K16495q62662j331776p58685M01026Q50164K0357
34129a316830q12746k16053J084951J156478j66001j057917n29964L45034M42645
$$ plain form
34120 -1070403 -912974 -654197 -124031 259058 130183 -470909 -1324298 -2078165 -2245064
34111 -2245064 -1660788 -790134 -208465 -69351 -378099 -1225789 -2232412 -2382568 -1216819
34102 -1216819 235706 581028 -124738 -521118 211082 1441359 2034032 1516646 252941
34093 252941 -944527 -1293946 -684399 42981 -88997 -1005214 -1659644 -1422515 -897100
34084 -897100 -1061454 -1957529 -2663475 -2464464 -1640690 -970985 -768764 -721086 -520373 -203029
34074 -203029 166000 617101 884157 495158 -314376 -411034 786602 2175625 2231313 1076245
34064 1076245 201845 268481 416102 -87090 -768816 -1009541 -1110446 -1616026 -2299038 -2434780
34054 -2434780 -1592652 161952 2243020 3524887 3172558 1792617 910868 1026086 1154955
$$ packed form
34120a070403J57429K58777N30166L83089j28875o01092q53389p53867j66899
34111b245064N84276Q70654N81669J39114l08748q47690j006623j50156J165749
34102a216819J452525L45322p05766l96380P32200J230277N92673n17386j263705
34093B52941j197468l49419O09547P27380j31978r16217o54430K37129N25415
34084h97100j64354q96075p05946J99011Q23774O69705K02221M7678K00713L17344
34074b03029L69029M51101K67056l88999q09534r6658J197636J389023N5688j155068
34064A076245q74400O6636J47621n03192o81726k40725j00905n05580o83012j35742
34054b434780Q42128J754604K081068J281867l52329j379941q81749J15218J28869
$$ plain form
34045 1154955 599824 -49015 -196289 -226137 -441213 -289637 427018 846082 604333 742830
34035 742830 1721993 1987164 367368 -1331420 -486202 2281917 3748029 2642463 1033092
34026 1033092 815714 1307162 1241373 981063 1362612 1956411 1957128 1655325 1647698 1483630
34016 1483630 419804 -1133176 -2099377 -2148029 -1608510 -585085 738491 1459281 880816
34007 880816 -203473 -340285 620129 1512940 1686767 1596664 1478736 768147 -637505
33998 -637505 -1642988 -1317310 -312963 -78809 -993982 -2011110 -2043625 -1147480 -286519
33989 -286519 -252054 -867415 -1180284 -573483 323738 245676 -1019890 -2116640 -1793620 -616765
33979 -616765 -203945 -931986 -1376817 -322210 1495113 2294107 1457190 81443 -587796
$$ packed form
34045A154955n55131o48839j47274k9848k15076J51576P16655M19064k41749J38497
34035G42830R79163K65171j619796j698788Q45218K768119J466112j105566j609371
34026A033092k17378M91448o5789k60310L81549N93799P17l01803p627j64068
34016A483630j063826j552980r66201m8652N39519J023425J323576P20790n78465
34007H80816j084289j36812R60414Q92811J73827r0103j17928p10589j405652
33998f37505j005483L25678J004347K34154r15173j017128l2515Q96145Q60961
33989b86519L4465o15361l12869O06801Q97221p8062j265566j096750L23020J176855
33979f16765M12820p28041m44831J054607J817323P98994q36917j375747o69239
$$ plain form
33970 -587796 -542393 -528150 -691701 -372138 729570 1794662 1809666 963594 402156 546021
33960 546021 543658 -104023 -287705 1211197 3433097 3945204 2048543 -111100 -342408
33951 -342408 818988 1205321 121560 -968676 -695710 457975 971508 158016 -1176429
33942 -1176429 -1678889 -834576 578121 1448743 1611320 1760722 2181720 2339764 1979563
33933 1979563 1735517 2083017 2509448 2460606 2305142 2458502 2354610 1435642 462656 468443
33923 468443 926307 510787 -609608 -928263 -67353 620015 277629 -195046 246888
33914 246888 1214890 1657701 1223837 229630 -871639 -1470587 -1060586 41336 942608
33905 942608 1342331 1612603 1704228 1151326 282320 19425 177721 -461385 -1856996 -2216511
$$ packed form
33970e87796M5403J4243j63551L19563J101708J065092J5004q46072n61438J43865
33960E46021k363o47681j83682J498902K221900N12107j896661k159643k31308
33951c42408J161396L86333j083761j090236K72966J153685N13533q13492j334445
33942a176429n02460Q44313J412697Q70622J62577J49402M20998J58044l60201
33933A979563k44046L47500M26431m8842j55464J53360j03892r18968r72986N787
33923D68443M57864m15520j120395l18655Q60910O87368l42386m72675M41934
33914B46888R68002M42811m33864r94207j101269n98948M10001J101922R01272
33905I42608L99723K70272R1625n52902q69006k62895J58296o39106j395611l59515
$$ plain form
33895 -2216511 -722159 877362 666673 -786896 -1572170 -1134256 -425234 -213315 -554370
33886 -554370 -1222463 -1537146 -590308 1254964 2088790 932557 -582441 -507591 525241
33877 525241 536491 -537736 -981673 -299970 162205 -249406 -345054 954912 2972090
33868 2972090 4161368 3658333 1688704 -632269 -1846570 -1452608 -630346 -772446 -1575747
33859 -1575747 -1691430 -878140 -102786 231159 572542 851849 521486 58907 690786
33850 690786 2313543 3365424 3163999 2680197 2507925 1893696 572541 -219419 325347
33841 325347 1183030 1234502 1017330 1440460 2032880 1942192 1578373 1674475 1633791 556791
33831 556791 -740674 -591805 919452 2004085 1813064 1333744 1382768 1350199 614707
$$ packed form
33895b216511J494352J599521k10689j453569p85274M37914P09022K11919l41055
33886e54370o68093l14683R46838J845272Q33826j156233j514998P4850J032832
33877E25241J1250j074227m43937O81703M62175m11611r5648J299966K017178
33868B972090J189278n03035j969629k320973j214301L93962Q22262j42100q03301
33859a575747j15683Q13290P75354L33945L41383K79307l30363m62579O31879
33850F90786J622757J051881k01425m83802j72272o14229j321155p91960N44766
33841C25347Q57683N1472k17172M23130N92420r0688l63819R6102m0684j077000
33831E56791j297465J48869J511257J084633j91021m79320M9024l2569p35492
$$ plain form
33822 614707 -128510 98418 1065047 1794482 1948431 1902146 1804771 1414246 796819 481071
33812 481071 740334 1152162 1087600 423252 -377051 -751799 -508812 80213 513682 413867
33802 413867 -234279 -1115074 -1820018 -2058604 -1717048 -862300 222916 1077438 1267765
33793 1267765 653878 -449909 -1316209 -1204823 -110397 866976 421660 -1378870 -2884946
33784 -2884946 -2703335 -1304388 -175812 154787 325221 686241 852071 738567 810800
33775 810800 991642 510373 -693710 -1564569 -1495331 -1131585 -930195 -212391 1340656
33766 1340656 2486648 2059734 861972 503550 1121471 1677532 1791697 1699057 1015616
33757 1015616 -655021 -2232868 -2129690 -648437 316782 12771 -485145 -471254 -641104
$$ packed form
33822F14707p43217K26928R66629P29435J53949m6285r7375l90525o17427l15748
33812D81071K59263M11828o4562o64348q00303l74748K42987N89025M33469r9815
33802D13867o48146q80795p04944k38586L41556Q54748J085216Q54522J90327
33793A267765o13887j103787q66300J11386J094426R77373m45316j800530j506076
33784b884946J81611J398947J128576L30599J70434L61020J65830j13504P2233
33775H10800J80842m81269j204083q70859O9238L63746K01390P17804J553047
33766A340656J145992m26914j197762l58422O17921N56061J14165r2640o83441
33757A015616j670637j577847J03178J481253R65219l04011m97916J3891j69850
$$ plain form
33748 -641104 -1419744 -1980205 -1739949 -1431815 -1779716 -2225343 -1881659 -918522 -192996 -85363
33738 -85363 -281353 -262780 279696 1080816 1345627 724941 1331 20818 389354 355794
33728 355794 435225 1520697 2730758 2191907 81150 -1243892 -645727 336318 180302
33719 180302 -490934 -511669 -59655 261340 615731 1040343 872978 165485 64994 700231
33709 700231 519816 -953864 -1736178 -494195 930866 324173 -1312904 -1560617 -618841
33700 -618841 -692444 -2165052 -3248403 -3065882 -2373009 -1362668 552463 2616811 2987961
33691 2987961 1584770 366865 270370 155868 -550066 -565783 759345 1774242 842766
33682 842766 -1209585 -2421221 -2296268 -1773526 -1555842 -1663137 -1892258 -1761531 -763475
$$ packed form
33748f41104p78640n60461K40256L08134l47901m45627L43684R63137P25526J07633
33738h5363j95990J8573N42476Q01120K64811o20686p23610J9487L68536l3560
33728C55794P9431J085472J210061n38851k110757j325042N98165R82045j56016
33719A80302o71236k0735M52014L20995L54391M24612j67365p07493j00491O35237
33709G00231j80415j473680p82314J241983J425061o06693j637077k47713R41776
33700f18841p3603j472608j083351J82521O92873J010341J915131K064348L71150
33691B987961j403191j217905r6495j14502p05934j5717J325128J014897r31476
33682H42766k052351j211636J24953N22742K17684j07295k29121J30727R98056
$$ plain form
33673 -763475 528844 576609 -955624 -2155132 -1193817 1111365 2399550 1791451 357992
33664 357992 -1005266 -2457693 -3828499 -4003734 -2522074 -738141 -382054 -1444616 -2375188
33655 -2375188 -2130115 -1124425 -139485 707985 1395053 1253634 -134297 -1623020 -1345630
33646 -1345630 837861 2790808 2593965 749040 -836912 -1300470 -1258022 -1292124 -1162697
33637 -1162697 -508053 528408 1460172 1710796 869496 -710018 -1798880 -1456885 -116101
33628 -116101 1098835 1771896 2178182 2323902 2035034 1732206 1996401 2457471 2201381
33619 2201381 1238201 458354 155538 -180898 -512401 -53605 1178429 1882355 1183650
33610 1183650 -138849 -740380 -218337 931651 2015753 2330671 1543311 428931 382850
$$ packed form
33673g63475J292319M7765j532233j199508R61315K305182J288185o08099j433459
33664C57992j363258j452427j370806j75235J481660J783933L56087j062562r30572
33655b375188K45073J005690R84940Q47470O87068j41419j387931j488723K77390
33646a345630K183491J952947j96843j844925j585952m63558M2448l4102J29427
33637a162697O54644J036461R31764K50624q41300j579514j088862L41995J340784
33628a16101J214936O73061M06286J45720k88868l02828K64195M61070k56090
33619B201381r63180p79847l02816l36436l31503M58796J232034P03926o98705
33610A183650j322499o01531N22043J149988J084102L14918p87360j114380m6081
$$ plain form
33601 382850 1621611 2705677 2455175 1454156 904187 859232 585409 -277 -391392
33592 -391392 -629364 -1233630 -2008639 -1925978 -541468 1090358 1404027 79802 -1519992
33583 -1519992 -1820427 -802530 65986 -246260 -1062867 -1102775 -219627 811645 1720656
33574 1720656 2726038 3321359 2544700 693638 -585271 -373260 565437 1344414 2098781
33565 2098781 2861019 2717573 1251396 -257149 -394916 354722 429699 -500348 -1309287
33556 -1309287 -1173499 -353880 640933 1571628 2119796 1992893 1581416 1763048 2744198
33547 2744198 3587104 3245347 1888450 878377 1251537 2369018 2621221 1682075 1208623
33538 1208623 2501468 4357772 4686128 3638788 3236250 4109485 4830309 4657914 4517049
$$ packed form
33601C82850J238761J084066k50502j001019n49969m4955k73823n85686l91115
33592c91392k37972o04266p75009Q2661J384510J631826L13669j324225j599794
33583a519992l00435J017897Q68516l12246q16607l9908Q83148J031272R09011
33574A720656J005382N95321p76659j851062j278909K12011R38697P78977P54367
33565B098781P62238j43446j466177j508545j37767P49638P4977r30047q08939
33556a309287J35788Q19619R94813R30695N48168j26903m11477J81632R81150
33547B744198Q42906l41757j356897j010073L73160J117481K52203r39146m73452
33538A208623J292845J856304L28356j047340m02538Q73235P20824j72395j40865
$$ plain form
33529 4517049 4655977 3944223 2547029 2588434 4651071 6369388 6393857 6831144 9397549
33520 9397549 12568525 16026580 24159459 39296254 53603996 54986976 41785004 25319549
33512 25319549 16026191 12933907 9707576 5169622 2612618 2479538 1794087 -332375
33504 -332375 -1628465 -1013267 -77967 98139 369657 1235126 1834411 1863299 2200155 2976922
33494 2976922 3034345 1985479 1053472 1121913 1482401 1272514 830700 820635 1066636 1037353
33484 1037353 733628 482621 376834 279089 -17426 -661637 -1308383 -1092652 203091
33475 203091 1323395 947691 -334700 -717874 262987 1283713 1429379 1284010 1399241
33466 1399241 1203628 227506 -852207 -1318779 -1527549 -1954410 -2059636 -1178076 178334
$$ packed form
33529D517049J38928p11754j397194M1405K062637J718317K4469M37287K566405
33520I397549L170976L458055Q132879J5136795J4307742J382980j3201972j6465455
33512B5319549r293358l092284l226331m537954k557004j33080o85451k126462
33504c32375j296090O15198R35300J76106K71518Q65469N99285K8888L36856P76767
33494B976922N7423j048866r32007O8441L60488k09887m41814j0065K46001k9283
33484A037353l03725k51007j05787r7745k96515o44211o46746K15731J295743
33475B03091J120304l75704j282391l83174R80861J020726J45666j45369J15231
33466A399241j95613r76122j079713m66572k08770m26861j05226Q81560J356410
$$ plain form
33457 178334 1022394 1350653 1764819 2037913 1317981 -302394 -1631780 -2076109 -2482488
33448 -2482488 -3734429 -5219305 -5476753 -4138125 -2497603 -1988119 -2577507 -3068528 -2721469
33439 -2721469 -1965388 -1405464 -809089 358766 1802593 2576891 2335467 1677759 1164228
33430 1164228 715181 244788 161161 694232 1230289 989422 154715 -312479 -13668 262394
33420 262394 -473387 -2068366 -3247162 -3031675 -1853939 -950737 -796270 -676103 39793
33411 39793 862645 980688 596969 625162 1198290 1367825 460938 -973346 -1869138 -1790365
33401 -1790365 -1136685 -630358 -767620 -1384043 -1681496 -1112535 -208029 68440 -239075
33392 -239075 -102657 858825 1680414 1405452 319279 -719590 -1411285 -1790316 -1585608
$$ packed form
33457A78334Q44060L28259M14166K73094p19932j620375j329386m44329m06379
33448b482488j251941j484876k57448J338628J640522N09484n89388m91021L47059
33439b721469P56081N59924N96375J167855J443827P74298k41424o57708n13531
33430A164228m49047m70393q3627N33071N36057k40867q34707m67194K98811K76062
33420B62394p35781j594979j178796K15487J177736R03202J54467J20167P15896
33411C9793Q22852J18043l83719K8193N73128J69535r06887j434284q95792P8773
33401a790365O53680N06327j37262o16423k97453N68961R04506K76469l07515
33392b39075J36418R61482Q21589k74962j086173j038869o91695l79031K04708
$$ plain form
33383 -1585608 -712797 69990 -27885 -597814 -530033 342172 990824 679046 -115231 -526300
33373 -526300 -382134 -68980 188493 411788 468536 86230 -671638 -1257211 -1198010 -739852
33363 -739852 -677990 -1397387 -2251374 -2178933 -916022 668952 1453831 1030644 -165840
33354 -165840 -1356950 -2009521 -2238140 -2628738 -3350407 -3577982 -2366754 -85853 1745586
33345 1745586 2245992 2044304 2003488 1869200 897172 -711949 -1862715 -1888825 -1151000
33336 -1151000 -354261 169664 436047 493538 323465 -60166 -444992 -423365 195159 970854
33326 970854 1195508 745727 174361 -119687 -276939 -373256 -84539 660585 1251620 1101597
33316 1101597 381184 -332136 -696984 -531964 366837 1795260 2917149 2996865 2127972
$$ packed form
33383a585608Q72811P82787r7875n69929O7781Q72205O48652l11778p94277m11069
33373e26300J44166L13154K57473K23295N6748l82306p57868n85573N9201M58158
33363g39852O1862p19397q53987P2441J262911J584974P84879m23187j196484
33354a65840j191110o52571k28619l90598p21669k27575J211228K280901J831439
33345A745586N00406k01688m0816j34288r72028j609121j150766k6110P37825
33336a151000P96739N23925K66383N7491j70073l83631l84826K1627O18524P75695
33326I70854K24654m49781n71366k94048j57252r6317K88717P45124N91035j50023
33316A101597p20413p13320l64848J65020Q98801J428423J121889P9716q68893
$$ plain form
33307 2127972 945731 -15755 -448657 -276036 170792 495263 931958 1979505 3171928
33298 3171928 3254200 2007675 751840 384102 162667 -657219 -1294520 -835545 21983
33289 21983 173016 58139 658951 1389176 1021370 162091 541328 1957152 2256012 717615
33279 717615 -731028 -450318 660130 881315 125983 -472708 -300065 446091 1322094
33270 1322094 1647206 759989 -954071 -2025914 -1598274 -495914 -17037 -354806 -808855
33261 -808855 -898862 -653466 -291910 -62461 29505 467674 1565376 2578705 2433774 1400812
33251 1400812 869199 1255607 1485405 944345 444647 564196 554817 -84806 -371500 527539
33241 527539 1604955 1431753 383986 -43186 489588 1019573 951157 507032 -150507
$$ packed form
33307B127972j182241r61486m32902J72621M46828L24471M36695J047547J192423
33298C171928Q2272j246525j255835l67738k21435q19886o37301M58975Q57528
33289B1983J51033j14877O00812P30225l67806q59279L79237J415824K98860j538397
33279G17615j448643K80710J110448K21185p55332n98691J72643P46156Q76003
33270A322094L25112q87217j714060j071843M27640J102360M78877l37769m54049
33261h08855r0007K45396L61556K29449R1966M38169J097702J013329j44931j032962
33251A400812n31613L86408K29798n41060m99698J19549r379o39623k86694Q99039
33241E27539J077416j73202j047767m27172N32774N29985o8416m44125o57539
$$ plain form
33232 -150507 -949547 -1288102 -602482 573362 1192970 1183796 1317904 1800580 2092460 2018305
33222 2018305 1919434 1699945 841112 -476970 -1292207 -1183420 -829975 -944902 -1370875
33213 -1370875 -1569653 -1426984 -1215207 -1128302 -1120928 -1032635 -814930 -723682 -1072829 -1625173
33203 -1625173 -1630041 -812378 122587 428254 280771 248433 323046 217399 177771 626860
33193 626860 1280878 1483292 1231022 1067804 1145360 1201689 1297996 1729468 2309798 2556233
33183 2556233 2483057 2418163 2194622 1433956 540763 421482 1128493 1692002 1458968 804155
33173 804155 381898 424843 877444 1480468 1675765 1201919 777208 1296665 2320307 2391258
33163 2391258 1062116 -423859 -812242 -223191 562449 1243653 1829456 2106355 1925368
$$ packed form
33232a50507p99040l38555O85620J175844O19608r174J34108M82676K91880p4155
33222B018305r8871k19489q58833j318082q15237J08787L53445j14927m25973
33213a370875j98778J42669K11777Q6905P374Q8293K17705R1248l49147n52344
33203a625173m868Q17663R34965L05667j47483l2338P4613j05647l9628M49089
33193F26860O54018K02414k52270j63218P7556N6329R6307M31472N80330K46435
33183B556233p3176o4894k23541p60666q93193j19281P07011N63509k33034o54813
33173H04155m22257M2945M52601O03024J95297m73846m24711N19457J023642P0951
33163B391258j329142j485975l88383N89051P85640O81204N85803K76899j80987
$$ plain form
33154 1925368 1501670 1004057 398831 -17218 318813 1259762 1848731 1654484 1329988
33145 1329988 1283206 829797 -411556 -1242345 -343944 1518702 2221744 1144991 -46617
33136 -46617 234218 1528187 2322104 2145573 1848497 2184446 2913906 3335683 3156708 2607201
33126 2607201 2003453 1531718 1381792 1701239 2247852 2429750 2046036 1718786 2078208
33117 2078208 2720981 2694115 1970363 1533414 1764292 1756863 835702 -196093 -259926 304545
33107 304545 431141 192479 563639 1486259 1679831 636824 -590100 -1084284 -1225287
33098 -1225287 -1454135 -1194608 -58504 1006533 1093430 943541 1642340 2432889 1695077
33089 1695077 -216104 -1185692 -584863 -210371 -1283859 -2506626 -2317833 -1369762 -1115360
$$ packed form
33154A925368m23698m97613o05226m16049L36031R40949N88969j94247l24496
33145A329988m6782m53409j241353q30789Q98401J862646P03042j076753j191608
33136d6617K80835J293969P93917j76531k97076L35949P29460M21777j78975n49507
33126B607201o03748m71735j49926L19447N46613J81898l83714l27250L59422
33117B078208O42773k6866p23752m36949K30878p429r21161j031795o3833N64471
33107C04545J26596k38662L71160R22620J93572j043007j226924m94184j41003
33098a225287k28848K59527J136104J065037Q6897j49889O98799P90549p37812
33089A695077j911181r69588O00829L74492j073488j222767J88793R48071K54402
$$ plain form
33080 -1115360 -1248176 -481674 932752 1477359 819721 110841 -101583 -447212 -1047059
33071 -1047059 -1030030 -232591 215786 -264082 -647602 31678 1131829 1496204 1164092
33062 1164092 951345 1012061 862517 442689 249274 555980 1077770 1277493 746746 -362812
33052 -362812 -1140208 -754462 308180 633736 -188882 -973750 -775928 -283798 -566163
33043 -566163 -1351629 -1594229 -1093462 -502624 -199206 -107896 -227605 -436960 -221093 495655
33033 495655 735240 -278233 -1668280 -1855377 -691487 493965 803330 558295 247831
33024 247831 -103669 -380495 -282157 -22301 -166688 -571332 -447853 274121 678304 353813
33014 353813 149304 828188 1835381 2173251 1842761 1540780 1364190 786389 -167864
$$ packed form
33080a115360j32816P66502J414426N44607o57638p08880k12424l45629n99847
33071a047059J7029P97439M48377m79868l83520O79280J100151L64375l32112
33062A164092k12747O0716j49544m19828j93415L06706N21790J99723n30747j109558
33052c62812p77396L85746J062642L25556q22618p84868J97822M92130k82365
33043e66163p85466k42600N00767N90838L03418R1310j19709k09355K15867P16748
33033D95655K39585j013473j390047j87097J163890J185452L09365k45035l10464
33024B47831l51500k76826R8338K59856j44387m04644J23479P21974M04183l24491
33014C53813k04509O78884J007193L37870l30490l01981j76590n77801r54253
$$ plain form
33005 -167864 -627894 -23511 1077376 1665945 1478978 1099567 1097181 1528942 2229411 3040359
32995 3040359 3552314 3131978 1666348 -5397 -852051 -631854 244144 1396124 2392857
32986 2392857 2444676 1197329 -302239 -522208 566651 1455419 1226423 616801 629492
32977 629492 1213832 1836901 2302192 2400977 1773341 765316 391787 746154 564618 -764666
32967 -764666 -1929635 -1558541 -294214 333373 213818 313680 679765 462097 -306804
32958 -306804 -540885 158976 864458 716962 52376 -161460 562095 1803450 2599387
32949 2599387 2366089 1634028 1386024 1523053 916901 -597611 -1499344 -711691 707337
32940 707337 1148683 671221 327419 269802 57945 1747 509424 773140 -94611 -1110209
$$ packed form
33005a67864m60030O04383J100887N88569j86967l79411k386M31761P00469Q10948
32995C040359N11955m20336j465630j671745q46654K20197Q75998J151980R96733
32986B392857N1819j247347j499568k19969J088859Q88768k28996o09622J2691
32977F29492N84340O23069M65291R8785o27636j008025l73529L54367j81536j329284
32967g64666j164969L71094J264327O27587j19555R9862L66085k17668p68901
32958c06804k34081O99861P05482j47496o64586k13836P23555J241355P95937
32949B599387k33298p32061k48004J37029o06152j514512r01733P87653J419028
32940G07337M41346m77462l43802n7617k11857n6198N07677K63716q67751j015598
$$ plain form
32930 -1110209 -507537 1461255 2700854 2240537 1234846 862320 974652 1208383 1847414
32921 1847414 2956700 3828871 3834919 3016813 1692183 355309 -86665 906113 2416225
32912 2416225 2827774 1787845 451422 -243622 -537959 -1022289 -1772512 -2407243 -2325355
32903 -2325355 -1054051 959690 2299031 2110878 1194050 744016 748151 646841 694376
32894 694376 1313936 1919811 1895588 1960723 2903427 3750972 3130755 1795297 1630911 2539742
32884 2539742 2574163 1125987 -189083 -52915 1020016 1899953 1990894 1121903 -216768
32875 -216768 -753151 -63083 286656 -903374 -1808802 136011 3786394 5143802 2833703
32866 2833703 -242516 -1322253 -956820 -726523 -454519 680365 2173858 3009915 3315629
$$ packed form
32930a110209O02672J968792J239599m60317j005691l72526J12332K33731O39031
32921A847414J109286Q72171O048q18106j324630j336874m41974R92778J510112
32912B416225M11549j039929j336423o95044k94337m84330p50223o34731Q1888
32903b325355J271304K013741J339341j88153r16828m50034M135j01310M7535
32894F94376O19560O05875k4223O5135R42704Q47545o20217j335458j64386R08831
32884B539742L4421j448176j315070J36168J072931Q79937R0941q68991j338671
32875b16768n36383O90068L49739j190030r05428J944813L650383J357408k310099
32866B833703l076219j079737L65433K30297K72004J134884J493493Q36057L05714
$$ plain form
32857 3315629 4025917 5613013 7661515 8989432 8258302 5504212 2753261 1838411 2117007
32848 2117007 1871003 1205134 1526460 2766070 3433911 3090173 2511759 1784580 548406
32839 548406 -291220 472071 2094237 2998468 3486721 4734485 5948361 5540390 4326430
32830 4326430 4279042 4862724 4102803 2501074 2090976 2386737 1398505 -76934 338921
32821 338921 1820990 1615358 428188 1172973 2861970 1777274 -1324964 -1697562 1206355
32812 1206355 2819309 1738310 1834374 4483952 5925003 4621117 4197841 6533258 8973061
32803 8973061 10859134 15117769 20434803 20255906 13565675 8246452 9020383 10571431
32795 10571431 8011907 5279245 6485381 7546810 4185428 431074 1041737 2847371
$$ packed form
32857C315629P10288J587096K048502J327917p31130k754090k750951r14850K78596
32848B117007k46004o65869L21326J239610O67841l43738n78414p27179j236174
32839E48406q39626P63291J622166R04231M88253J247764J213876m07971j213960
32830D326430m7388N83682p59921j601729m10098K95761r88232j475439M15855
32821C38921J482069k05632j187170P44785J688997j084696l102238l72598K903917
32812A206355J612954j080999R6064K649578J441051j303886m23276K335417K439803
32803H973061J886073M258635N317034j78897o690231n319223P73931J551048
32795A0571431k559524k732662J206136J061429l361382l754354O10663J805634
$$ plain form
32787 2847371 1809504 1111496 3664856 4627910 799663 -1060001 4126269 8843800
32779 8843800 6014944 3441526 10249764 18089407 14364810 6702542 11358980 20075538
32771 20075538 4919455 -36362598 -59944128 -12998884 116304322 285303798 419350357
32764 419350357 452035417 370603785 233750102 126638169 85712317 79167100 64202534
32757 64202534 39206040 26097646 26798475 24432475 14980436 10318542 13542297 14333644
32749 14333644 8967076 5530001 7320355 7620071 3776945 1959209 4500315 5344483
32741 5344483 1863572 -206740 2373609 4732995 3239664 1385650 2167273 2704112
32733 2704112 663175 -1063850 -123393 1085800 546922 282942 1628385 2145576 309799
$$ packed form
32787B847371j037867o98008K553360R63054l828247j859664N186270M717531
32779H843800k828856k573418O808238P839643l724597p662268M656438Q716558
32771B0075538j5156083m1282053k3581530M6945244J29303206J68999476J34046559
32764D19350357L2685060q1431632j36853683j07111933m0925852o545217j4964566
32757F4202534k4996494j3108394P00829k366000r452039m661894L223755P91347
32749A4333644n366568l437075J790354K99716l843126j817736K541106Q44168
32741E344483l480911k070312K580349K359386j493331j854014P81623N36839
32733B704112k040937j727025R40457J209193n38878k63980J345443N17191j835777
$$ plain form
32724 309799 -1563147 -1720295 -1690846 -2344360 -1883054 68344 966102 13637 -221079
32715 -221079 1201862 1656743 34364 -1001136 -89794 234471 -1444929 -2484947 -1117776
32706 -1117776 109986 -960800 -2065860 -730355 1077001 305225 -2019185 -2718216
32698 -2718216 -1397637 -109604 225700 141618 -248677 -986334 -1303930 -836340 -575305
32689 -575305 -1183596 -1820053 -1799633 -1664318 -1560632 -607503 1027624 1657370 839707 268724
32679 268724 711322 603610 -910224 -2187328 -1957141 -1362528 -1361982 -758538 1142059 2524891
32669 2524891 2056541 1440382 2408368 3418278 2241439 -40329 -716055 278161 862186
32660 862186 618219 1003960 2176435 2457147 1111010 -588815 -1335083 -1088965 -285389
$$ packed form
32724C09799j872946j57148K9449o53514M61306J951398Q97758r52465k34716
32715b21079J422941M54881j622379j035500R11342L24265j679400j040018J367171
32706a117776J227762j070786j105060J335505J807356p71776k324410o99031
32698b718216J320579J288033L35304q4082l90295p37657l17596M67590K61035
32689e75305o08291o36457K0420J35315J03686R53129J635127O29746q17663n70983
32679B68724M42598j07712j513834j277104K30187N94613N46O03444J900597J382832
32669B524891m68350o16159R67986J009910j176839k281768o75726R94216N84025
32660H62186k43967L85741J172475K80712j346137j699825p46268K46118Q03576
$$ plain form
32651 -285389 741430 1414586 1257854 659308 331697 201863 -206986 -621519 -352376
32642 -352376 403778 661726 51269 -730556 -948867 -684438 -549695 -912118 -1455636 -1430315
32632 -1430315 -456951 994133 2190362 2956001 3444811 3479552 2871123 2075408 1658367
32623 1658367 1401475 835238 231986 34034 -123174 -544141 -348869 1118635 2425030
32614 2425030 1656990 -524285 -1722446 -1464543 -1475274 -2269231 -2318213 -1171861 -535024
32605 -535024 -1149196 -1239638 471064 2463251 2736762 1574798 510349 160774 372541
32596 372541 925768 983738 -448101 -2488406 -2744499 -819897 710448 185056 -633682
32587 -633682 259659 1714777 1538783 142145 -511882 -273851 -590592 -1797650 -2879217
$$ packed form
32651b85389J026819O73156j56732n98546l27611j29834m08849m14533K69143
32642c52376P56154K57948o10457p81825k18311K64429J34743l62423n43518K5321
32632a430315R73364J451084J196229P65639M88810L4741o08429p95715m17041
32623A658367k56892n66237o03252j97952j57208m20967J95272J467504J306395
32614B425030p68040k181275j198161K57903j0731p93957m8982J146352O36837
32605e35024o14172r0442J710702J992187K73511j161964j064449l49575K11767
32596C72541N53227N7970j431839k040305k56093J924602J530345n25392q18738
32587f33682Q93341J455118j75994j396638o54027K38031l16741j207058j081567
$$ plain form
32578 -2879217 -3283565 -3094366 -2125654 -582356 226458 -450974 -1358698 -1141847 -600441
32569 -600441 -1115608 -1956147 -1418694 197055 1144364 1200716 1672885 2702625 2940667
32560 2940667 1994099 1074326 921639 890370 389468 -346968 -1148362 -2118987 -2801508 -2474344
32550 -2474344 -1387101 -479975 42788 583948 838698 138219 -992891 -1258954 -680874
32541 -680874 -656234 -1667510 -2490685 -2149599 -1236486 -674766 -402976 -17631 264900 80976
32531 80976 -291253 -278881 204268 697502 656568 -114749 -1175925 -1658074 -1162311 -319120
32521 -319120 -38507 -436750 -955218 -1180471 -976865 -228131 823987 1339405 771817
32512 771817 -249464 -650996 -251000 327865 711895 942895 911482 467781 -99126 -394488
$$ packed form
32578b879217m04348J89199R68712J543298Q08814o77432r07724K16851N41406
32569f00441n15167q40539N37453J615749R47309N6352M72169J029740K38042
32560B940667r46568r19773j52687l1269n00902p36436q01394r70625o82521L27164
32550b474344J087243R07126N22763N41160K54750p00479j131110k66063N78080
32541f80874K4640j011276q23175L41086R13113N61720K71790L85345K82531j83924
32531H0976l72229J2372M83149M93234m0934p71317j061176m82149M95763Q43191
32521c19120K80613l98243n18468k25253K03606P48734J052118N15418n67588
32512G71817j021281m01532L99996N78865L84030K31000l1413m43701n66907k95362
$$ plain form
32502 -394488 -474601 -477563 -160348 503664 836766 419539 -13828 415773 1362618 1879881
32492 1879881 1836021 1616260 1030521 -165687 -1163300 -985974 -192138 -219574 -1210958 -1973120
32482 -1973120 -1978064 -1819214 -1665290 -980237 -75534 -194773 -1389191 -1885124 -540602
32473 -540602 1329355 1712480 553376 -556164 -741052 -628140 -902797 -1236816 -1054403
32464 -1054403 -647609 -817334 -1544534 -1765995 -872565 166107 29847 -918277 -1059883
32455 -1059883 -61318 533395 -112632 -529163 804358 2870552 3434850 2116165 418376
32446 418376 -703151 -1483969 -1906970 -1505749 -605274 -62398 269675 1167730 2155070
32437 2155070 1883685 594165 125226 891759 966963 -756141 -2441988 -1945817 -114905
$$ packed form
32502c94488q0113k962L17215O64012L33102m17227m33367M29601R46845N17263
32492A879881m3860k19761n85739j196208r97613J77326P93836k7436r91384p62162
32482a973120m944J58850J53924O85053R04703j19239j194418m95933J344522
32473e40602J869957L83125j159104j109540j84888J12912k74657l34019J82413
32464a054403M06794j69725p27200k21461Q93430J038672j36260r48124j41606
32455a059883R98565N94713o46027m16531J333521K066194N64298j318685j697789
32446D18376j121527p80818m23001M01221R00475N42876L32073Q98055R87340
32437B155070k71385j289520m68939P66533P5204j723104j685847M96171J830912
$$ plain form
32428 -114905 427938 -999671 -2487419 -2377381 -1162304 -286695 -245445 -474859 -512658
32419 -512658 -557329 -842562 -933934 -202735 979070 1280785 194785 -937673 -645462
32410 -645462 465671 519332 -861351 -2076444 -1957626 -1156937 -714593 -644942 -579005 -544936
32400 -544936 -351550 638800 2233194 2915256 1599221 -903770 -2996215 -4040934 -4152942
32391 -4152942 -3199808 -1238719 598936 881322 -563365 -2551658 -3716435 -3292420 -1417029
32382 -1417029 592487 955110 -611558 -2186499 -1885875 -263648 657133 258702 -190825
32373 -190825 195352 703366 491875 55343 402567 1425936 1899818 993091 -683563
32364 -683563 -1664082 -1160733 151311 1061038 1319792 1612928 2056925 1735719 269571
$$ packed form
32428a14905N42843j427609j487748J10038J215077Q75609M1250k29414l7799
32419e12658m4671k85233r1372P31199J181805L01715j086000j132458K92211
32410f45462J111133N3661j380683j215093J18818Q00689M42344O9651O5937L4069
32400e44936J93386R90350J594394O82062j316035k502991k092445j044719j12008
32391d152942R53134J961089J837655K82386j444687j988293j164777M24015J875391
32382a417029K009516L62623j566668j574941L00624J622227R20781l98431m49527
32373a90825L86177N08014k11491m36532L47224J023369M73882r06727j676654
32364f83563r80519N03349J312044R09727K58754K93136M43997l21206j466148
$$ plain form
32355 269571 -1151785 -1311430 -810066 -1110308 -2190291 -2601559 -1791455 -887093 -856765
32346 -856765 -1225194 -1197985 -936199 -950575 -1105990 -1051651 -972888 -1104837 -1056515 -471907
32336 -471907 76070 -207355 -965880 -991574 54671 1070422 918187 -246256 -1402606
32327 -1402606 -1922578 -1940429 -1752601 -1361983 -668258 186911 838306 1029645 873590 737436
32317 737436 812175 820829 310884 -668873 -1353264 -1007221 115451 925334 809853 400499
32307 400499 563109 970490 555785 -595669 -932283 389573 2028909 2221159 1274131
32298 1274131 891162 1401768 1385930 170480 -1102726 -1494116 -1599916 -1892347 -1484899
32289 -1484899 -68512 537338 -1074676 -2968900 -2134014 809669 2097384 280893
$$ packed form
32355B69571j421356j59645N01364l00242j079983m11268Q10104R04362L0328
32346h56765l68429K7209K61786j4376j55415N4339P8763j31949M8322N84608
32336d71907N47977k83425p58525k5694J046245J015751j52235j164443j156350
32327a402606n19972j7851J87828L90618O93725Q55169O51395J91339j56055j36154
32317G37436P4739Q654n09945r79757o84391L46043J122672Q09883j15481m09354
32307D00499J62610M07381m14705j151454l36614J321856J639336J92250r47028
32298A274131l82969N10606j5838j215450j273206l91390j05800k92431M07448
32289a484899J416387O05850j612014j894224Q34886K943683J287715j816491
$$ plain form
32281 280893 -1764027 -1331418 406054 988017 604085 960266 1833129 1592692 399115
32272 399115 86811 946776 1202352 128226 -613388 347810 1948110 2407355 1706328
32263 1706328 1097442 1111625 1285235 1280918 1166791 848163 112325 -800680 -1254679 -875347
32253 -875347 116611 1147234 1737138 1866470 1913825 2040975 1826630 928449 -118788
32244 -118788 -401869 198740 1029819 1733063 2448568 2981623 2728125 1605731 204507
32235 204507 -1121383 -2385377 -3071746 -2267978 -143030 1741250 2186866 1582227 870783
32226 870783 233900 -536594 -1201307 -1409355 -1281037 -995937 -357397 617007 1194513 654730
32216 654730 -786358 -2153166 -2520548 -1605601 -110720 576566 -178903 -1205029 -905696
$$ packed form
32281B80893k044920M32609J737472N81963l83932L56181Q72863k40437j193577
32272C99115l12304Q59965K55576j074126p41614R61198J600300M59245p01027
32263A706328o08886J4183J73610m317j14127l18628p35838r13005m53999L79332
32253h75347R91958J030623N89904J29332M7355J27150k14345q98181j047237
32244a18788k83081O00609Q31079P03244P15505N33055k53498j122394j401224
32235B04507j325890j263994o86369Q03768K124948J884280M45616o04639p11444
32226H70783o36883p70494o64713k08048J28318K85100O38540R74404N77506n39783
32216F54730j441088j366808l67382R14947J494881O87286p55469j026126K99333
$$ plain form
32207 -905696 458854 1239862 1065433 1219044 2052018 2092151 572981 -1125818 -1702654
32198 -1702654 -1724579 -1907491 -1560578 -367944 216824 -626607 -1083432 508457 2442748
32189 2442748 1997596 -174072 -1070756 -86314 467526 -520386 -1454815 -1118588 -457825
32180 -457825 -457047 -622888 -530545 -797652 -1535922 -1684812 -882592 -344967 -888315 -1553188
32170 -1553188 -1162240 44902 1203493 2068139 2679461 2850615 2648679 2449334 2134957
32161 2134957 1283454 309566 81487 243371 -485725 -2046482 -2839381 -2279671 -1699914
32152 -1699914 -1988293 -2190679 -1417351 -378546 82484 363228 880500 1047068 621158
32143 621158 510043 1047096 1126355 371004 386954 2203621 4150361 4234267 3161661 2839330
$$ packed form
32207i05696J364550P81008j74429J53611Q32974M0133j519170j698799n76836
32198a702654k1925j82912L46913J192634N84768q43431m56825J591889J934291
32189B442748m45152k171668q96684R84442N53840r87912r34429L36227O60763
32180d57825P78j65841R2343k67107p38270j48890Q02220N37625n43348o64873
32170a553188L90948J207142J158591Q64646O11322J71154k01936j99345l14377
32161B134957q51503r73888k28079J61884p29096j560757p92899N59710N79757
32152a699914k88379k02386P73328J038805M61030K80744N17272J66568m25910
32143F21158j11115N37053P9259p55351J5950J816667J946740Q3906j072606l22331
$$ plain form
32133 2839330 3146960 2634555 1542039 1522391 2671306 3241076 2407378 1269209 834058
32124 834058 753856 412280 -146547 -671553 -989941 -794615 -103169 341562 146283 198001
32114 198001 1282040 2473174 2455623 1707901 1467488 1214754 -400204 -2449623 -2354256
32105 -2354256 31091 1719793 859653 -867069 -1328609 -959083 -994479 -902480 221889
32096 221889 1326772 869706 -437118 -670519 206278 564295 23997 -160636 364071
32087 364071 379184 -580247 -1193524 -435301 885482 1508071 1302928 646980 -475271
32078 -475271 -1741723 -2057989 -1089055 -288941 -1052079 -2547508 -2842959 -1696067 -654229
32069 -654229 -575057 -712911 -462508 -376931 -826735 -1042756 -438169 137887 -480776 -2053725
$$ packed form
32133B839330L07630n12405j092516j9648J148915N69770q33698j138169m35151
32124H34058q0202l41576n58827n25006l18388J95326O91446M44731j95279N1718
32114A98001J084039J191134j7551p47722k40413k52734j614958k049419R5367
32105b354256K385347J688702q60140j726722m61540L69526l5396R1999J124369
32096B21889J104883m57066j306824k33401Q76797L58017n40298j84633N24707
32087C64071J5113r59431o13277P58223J320783O22589k05143o55948j122251
32078d75271j266452l16266R68934Q00114p63138j495429k95451J146892J041838
32069f54229P9172j37854K50403Q5577m49804k16021O04587N76056o18663j572949
$$ plain form
32059 -2053725 -3275744 -3408148 -2793700 -2144630 -2011988 -2563314 -3241030 -3066872 -1886505
32050 -1886505 -779216 -599915 -810793 -577489 -219673 -414923 -657530 23771 1199580
32041 1199580 1447283 527866 -335109 -409331 -241482 -328269 -423473 -446999 -717461 -963642
32031 -963642 -475164 421073 497369 -299970 -441540 847755 2308632 2515743 1660138
32022 1660138 627438 -308094 -902243 -456627 896456 1633964 777208 -688816 -1419117
32013 -1419117 -1515508 -1553758 -1176487 -147479 478654 -35139 -481869 410243 1517514
32004 1517514 908246 -888464 -1581542 -712066 -132257 -841150 -1619180 -1235533 -59410
31995 -59410 1075930 1943569 2331651 1882545 1014464 660757 743639 264368 -839671 -1434638
$$ packed form
32059b053725j222019j32404O14448O49070J32642n51326o77716J74158J180367
32050a886505J107289J79301k10878K33304L57816j95250k42607O81301J175809
32041A199580K47703r19417q62975p4222J67849q6787r5204k3526k70462k46181
32031i63642M88478Q96237P6296p97339j41570J289295J460877K07111q55605
32022A660138j032700r35532n94149M45616J353083P37508q56756j466024p30301
32013a419117r6391l8250L77271J029008O26133n13793m46730Q92112J107271
32004A517514o09268j796710o93078Q69476N79809p08893p78030L83647J176123
31995e9410J135340Q67639L88082m49106q68081l53707Q2882m79271j104039n94967
$$ plain form
31985 -1434638 -1108144 -760784 -833650 -578996 270488 720787 258098 -79179 652894 1809957
31975 1809957 2252323 1835731 961998 -242599 -1414450 -1706524 -1000437 -393825 -618019
31966 -618019 -983326 -755448 -456685 -776112 -1271208 -1289295 -1156573 -1248575 -926214 186781
31956 186781 811649 -439514 -2742824 -3938845 -3341462 -2115966 -1193315 -469253 31331
31947 31331 -119787 -656608 -717376 -343694 -538157 -1446168 -1763972 -536048 1478740 2802751
31937 2802751 2791823 1788381 543481 -125732 123697 638085 540578 157893 614378
31928 614378 1766536 1939513 448844 -951655 -297258 1909067 3513136 3416003 2125460
31919 2125460 328395 -1439306 -2099330 -882600 1001344 1323367 -63443 -751976 806691
$$ packed form
31985a434638L26494L47360p2866K54654Q49484M50299m62689l37277P32073J157063
31975A809957M42366m16592q73733j204597j171851k92074P06087O06612k24194
31966f18019l65307K27878K98763l19427m95096j8087J32722r2002L22361J112995
31956A86781O24868j251163k303310j196021N97383J225496R22651P24062N00584
31947C1331j51118n36821o0768L73682j94463r08011l17804J227924K014788J324011
31937B802751j0928j003442j244900o69213K49429N14388r7507l82685M56485
31928F14378J152158J72977j490669j400499O54397K206325J604069r7133j290543
31919B125460j797065j767701o60024J216730J883944L22023j386810o88533J558667
$$ plain form
31910 806691 3013750 3462199 2256805 1411505 1771608 2291408 2077678 1492219 1098594
31901 1098594 893752 876543 1228526 1618238 1359634 548398 20867 -66564 -458166 -1252601
31891 -1252601 -1474156 -835466 -550023 -1372816 -2097394 -1373830 -2892 250075 -522184
31882 -522184 -597367 487861 1159351 325083 -895510 -756821 842152 2472021 2897728
31873 2897728 2049926 740679 -85143 -110443 68502 -311230 -1118847 -1474243 -955644
31864 -955644 -73096 527409 688881 454609 -155145 -845484 -1148682 -1085928 -1179258 -1594898
31854 -1594898 -1844879 -1553025 -945438 -384545 -18639 -65097 -718936 -1494031 -1416175 -327813
31844 -327813 646606 439883 -693329 -1705927 -1991794 -1574662 -616630 576866 1371817
$$ packed form
31910H06691K207059M48449j205394q45300L60103N19800k13730n85459l93625
31901A098594k04842j7209L51983L89712k58604q11236n27531q7431l91602p94435
31891a252601k21555O38690K85443q22793p24578P23564J370938K52967p72259
31882e22184p5183J085228O71490q34268j220593J38689J598973J629869M25707
31873B897728q47802j309247q25822k5300J78945l79732q07617l55396N18599
31864i55644Q82548O00505J61472k34272o09754o90339l03198O2754r3330m15640
31854a594898k49981K91854O07587N60893L65906m6458o53839p75095P7856J088362
31844c27813R74419k06723j133212j012598k85867M17132R58032J193496P94951
$$ plain form
31835 1371817 1270975 495543 -272884 -633378 -738461 -1024926 -1822173 -2968526 -3732100
31826 -3732100 -3464052 -2394456 -1375575 -857848 -682017 -815327 -1419190 -2012782 -1568933
31817 -1568933 40129 1519989 1704072 954175 390209 356260 366381 104713 -205872
31808 -205872 -154193 539622 1654474 2214702 1357093 -219369 -673307 492144 1453033
31799 1453033 521706 -1461798 -2469682 -2154394 -1805112 -1959619 -1796710 -862480 202835
31790 202835 923425 1599356 2271299 2291067 1442601 480206 12429 -272750 -727674 -906233
31780 -906233 -263107 891783 1742280 1863092 1340945 453992 -330716 -477393 -4427
31771 -4427 321527 -108337 -857981 -919192 16315 1142410 1447528 809390 56776 -24973
$$ packed form
31835A371817j00842p75432p68427l60494j05083k86465p97247j146353p63574
31826c732100K68048J069596J018881N17727J75831j33310o03863n93592M43849
31817a568933J609062J479860J84083p49897n63966l3949J0121k61668l10585
31808b05872N1679O93815J114852N60228q57609j576462m53938J165451R60889
31799A453033r31327j983504j007884L15288L49282j54507J62909R34230J065315
31790B02835P20590O75931O71943J9768q48466r62395m67777k85179m54924j78559
31780i06233O43126J154890Q50497J20812n22147q86953p84708j46677M72966
31771d427L25954m29864p49644o1211R35507J126095L05118o38138p52614q1749
$$ plain form
31761 -24973 375543 333442 -648133 -1997553 -2732142 -2443924 -1438645 -307195 291597
31752 291597 -131943 -1310710 -2148715 -1798006 -609146 426655 785668 406593 -829679
31743 -829679 -2644454 -3786980 -3130296 -1278488 67137 342394 462683 838482 610796
31734 610796 -518080 -1188559 -266458 1227251 1396573 67778 -1175230 -1222391 -477204
31725 -477204 255602 764403 1086633 1082740 757106 446690 392656 527041 818884 1341514
31715 1341514 1810799 1608199 662694 -95913 296933 1577491 2478121 2232069 1348787
31706 1348787 704342 398336 36895 -210949 315750 1566405 2494366 2399037 1817103
31697 1817103 1425051 752235 -960856 -3001929 -3611486 -2344694 -823500 -615650 -1342757
$$ packed form
31761b4973M00516m2101r81575j349420p34589K88218J005279J131450N98792
31752B91597m23540j178767q38005L50709J188860J035801L59013l79075j236272
31743h29679j814775j142526O56684J851808J345625K75257J20289L75799k27686
31734F10796j128876o70479R22101J493709J69322j328795j243008m7161P45187
31725d77204P32806N08801L22230l893l25634l10416n4034J34385K91843N22630
31715A341514M69285k02600r45505p58607L92846J280558R00630k46052q83282
31706A348787o44445l06006l61441k47844N26699J250655R27961r5329n81934
31697A817103l92052o72816j713091k041073o09557J266792J521194K07850p27107
$$ plain form
31688 -1342757 -1635914 -1182406 -810552 -917339 -884240 -181743 723626 940791 245980 -739288
31678 -739288 -1305856 -1312300 -1087559 -946416 -1030974 -1489893 -2354236 -3097626 -2860446 -1570453
31668 -1570453 -398057 -425107 -1175391 -1304548 -564466 -39617 -352146 -794345 -702426 -609505
31658 -609505 -1213105 -1989838 -1852674 -786536 128818 200571 -196246 -478842 -704314 -1250766
31648 -1250766 -2011507 -2310684 -1747093 -975430 -1197636 -2543735 -3414435 -2232440 312514
31639 312514 1763989 810600 -1267909 -2382564 -1883493 -582216 441256 402210 -844028
31630 -844028 -2246603 -2260675 -895409 -31899 -766728 -1695842 -1247331 -460032 -1352090
31621 -1352090 -3290665 -3519246 -1337186 737492 685591 -344706 -312584 589658 782442
$$ packed form
31688a342757k93157M53508L71854j06787L3099P02497R05369K17165o94811r85268
31678g39288n66568o444K24741J41143q4558m58919q64343p43390K37180J289993
31668a570453J172396k7050p50284j29157P40082N24849l12529m42199R1919R2921
31658f09505o03600p76733J37164J066138R15354P1753l96817k82596k25472n46452
31648a250766p60741k99177N63591P71663k22206j346099q70700J181995K544954
31639C12514J451475r53389k078509j114655M99071J301277J023472l9046j246238
31630h44028j402575j4072J365266Q63510p34829r29114M48511P87299q92058
31621a352090j938575k28581K182060K074678n1901j030297L2122R02242J92784
$$ plain form
31612 782442 119158 -1466 1027273 2137796 2185176 1348207 616526 539198 832709 952765
31602 952765 819047 943672 1789755 3080241 3982103 3945072 3085440 1849926 715873
31593 715873 120129 131338 196760 -233261 -848761 -857081 -175438 483691 730426 863415
31583 863415 1011021 822249 266710 -154732 -315523 -673133 -1217013 -1199395 -427171 166739
31573 166739 -107141 -694069 -894686 -1006221 -1443476 -1599754 -728758 639377 1299048
31564 1299048 980559 349483 -195773 -664866 -732941 14455 1159598 1719156 1357170
31555 1357170 647108 250473 434635 1090301 1569641 983458 -514019 -1297613 -210794
31546 -210794 1559098 1865176 552023 -477484 -112430 653972 623667 102676 -40753
$$ packed form
31612G82442o63284j20624J028739J110523M7380q36969p31681p7328K93511J20056
31602I52765j33718J24625Q46083J290486R01862l7031q59632j235514j134053
31593G15873n95744J1209O5422m30021o15500q320O81643O59129K46735J32989
31583H63415J47606j88772n55539m21442j60791l57610n43880J7618P72224N93910
31573A66739k73880n86928k00617j11535m37255j56278Q70996J368135O59671
31564A299048l18489o31076n45256m69093o8075P47396J145143N59558l61986
31555A357170p10062l96635J84162O55666M79340n86183j497477p83594J086819
31546b10794J769892L06078j313153j029507L65054P66402l0305n20991j43429
$$ plain form
31537 -40753 120652 -47967 -521776 -574477 323441 1952840 3413896 3664706 2463724
31528 2463724 803099 -110751 -178918 -66386 118751 714306 1256689 771515 -455667
31519 -455667 -829959 271847 1442991 1192986 -152083 -1264036 -1510537 -1025887 -54126
31510 -54126 850086 761880 -554938 -2139832 -3050364 -3324269 -3164107 -2267292 -827883
31501 -827883 -26493 -360543 -587699 311331 1213245 582500 -820902 -1014365 11134
31492 11134 464001 -6656 300062 1989372 3127897 2107316 148071 -513827 334742
31483 334742 1179325 1236449 1024918 851732 225934 -1020079 -2058952 -1958022 -755270
31474 -755270 648101 1430135 1503840 1337097 1298113 1359321 1459030 1758232 2177608 2056934
$$ packed form
31537d0753J61405j68619m73809n2701Q97918J629399J461056K50810j200982
31528B463724j660625r13850o8167J12532J85137N95555N42383m85174j227182
31519d55667l74292J101806J171144k50005j345069j111953k46501M84650R71761
31510e4126R04212q8206j316818j584894r10532k73905J60162Q96815J439409
31501h27883Q01390l34050k27156Q99030R01914o30745j403402j93463J025499
31492A1134M52867m70657L06718J689310J138525j020581j959245o61898Q48569
31483C34742Q44583N7124k11531j73186o25798j246013j038873J00930J202752
31474g55270J403371P82034P3705j66743l8984O1208R9709K99202M19376j20674
$$ plain form
31464 2056934 939139 -483266 -978591 -328604 512818 867243 1023541 1236100 1030529
31455 1030529 121125 -748938 -671970 156584 732583 540452 -27799 -382274 -380333 -315457
31445 -315457 -522247 -907644 -863317 -318 1029421 1076260 59657 -742685 -407046 367477
31435 367477 387301 -250377 -435943 186182 751597 596441 289581 762638 1841033 2241975
31425 2241975 1123335 -740610 -1733940 -1289936 -438552 -219688 -290062 149521 714846
31416 714846 387040 -590444 -853908 -30992 861078 1420205 2463456 3936596 4185363
31407 4185363 2604405 1175953 1567747 2296554 1055877 -1367200 -2203851 -1048034 -160388
31398 -160388 -517316 -589251 346007 603012 -893221 -2457615 -2239945 -1042895 -673516
$$ packed form
31464B056934j117795j422405m95325O49987Q41422L54425J56298K12559k05571
31455A030529r09404q70063P6968Q28554N75999j92131n68251l54475J941O4876
31445c15457k06790l85397M4327Q62999J029739M6839j016603q02342L35639P74523
31435C67477J9824o37678j85566O22125N65415j55156l06860M73057J078395M00942
31425B241975j118640j863945r93330M44004Q51384K18864p0374M39583N65325
31416G14846l27806r77484k63464Q22916Q92070N59127J043251J473140K48767
31407D185363j580958j428452L91794P28807j240677k423077q36651J155817Q87646
31398a60388l56928p1935R35258K57005j496233j564394K17670J197050L69379
$$ plain form
31389 -673516 -1001996 -690882 170892 188616 -1050889 -2462940 -3009732 -2557529 -1536098
31380 -1536098 -731016 -862692 -1432057 -809516 1388605 3007146 1979106 -593874 -1818583
31371 -1818583 -901951 322607 476358 115281 -4645 -79666 -151100 360772 1306343 1508888
31361 1508888 562360 -385597 -342796 241452 522118 397023 13304 -640430 -1073933 -524925
31351 -524925 562845 724215 -200002 -562377 368543 1029590 253383 -506489 480111
31342 480111 2214361 2576802 1769690 1624992 2208894 1827159 240274 -773379 -349560
31333 -349560 379324 626616 1041367 1701338 1308095 -439549 -1672865 -978520 482703
31324 482703 980525 796228 1070927 1383776 522382 -1098759 -1812579 -1185387 -349650
$$ packed form
31389f73516l28480L11114Q61774J7724j239505j412051n46792M52203J021431
31380a536098Q05082j31676n69365O22541K198121J618541j028040k572980j224709
31371a818583R16632J224558J53751l61077j19926p5021p1434N11872R45571K02545
31361A508888r46528r47957M2801N84248K80666j25095l83719o53734m33503N49008
31351e24925J087770J61370r24217l62375R30920O61047p76207p59872R86600
31342D80111J734250L62441q07112j44698N83902l81735j586885j013653M23819
31333c49560P28884K47292M14751O59971l93243j747644j233316O94345J461223
31324D82703M97822j84297K74699L12849q61394j621141p13820O27192Q35737
$$ plain form
31315 -349650 23617 392578 881746 769534 -103873 -712078 -247364 774840 1376190
31306 1376190 1342460 1043671 594385 -205586 -1289919 -2067687 -1842651 -616477 508841
31297 508841 255506 -1111266 -1659835 -230548 1579625 1167789 -1505835 -3589066 -2915387
31288 -2915387 -508759 1216115 1512808 1391804 1468648 1209553 293824 -456315 -6274
31279 -6274 1517566 2766105 2416696 480533 -1580344 -2225690 -1415847 -481384 -283651
31270 -283651 -149627 782909 1763949 1115464 -1261425 -3226167 -2876403 -910573 387075
31261 387075 114412 -423668 15869 694886 119691 -1470552 -2123574 -809465 1083058
31252 1083058 1532086 401820 -724340 -811793 -417718 -466791 -1000551 -1527299 -1838157
$$ packed form
31315c49650L73267L68961M89168j12212q73407o08205M64714J022204O01350
31306A376190l3730k98789m49286p99971j084333p77768K25036J226174J125318
31297E08841k53335j366772n48569J429287J810173m11836k673624k083231O73679
31288b915387K406628J724874K96693j21004P6844k59095r15729p50139M50041
31279f274J523840J248539l49409j936163k060877o45346Q09843R34463J97733
31270b83651J34024R32536R81040o48485k376889j964742L49764J965830J297648
31261C87075k72663n38080M39537O79017n75195j590243o53022J314109J892523
31252A083058M49028j130266j126160q7453L94075m9073n33760n26748l10858
$$ plain form
31243 -1838157 -1898341 -1447584 -372936 749991 1073313 430182 -470395 -770038 -164890
31234 -164890 970285 1886283 1988009 1297438 332802 -530521 -1290663 -1800273 -1551069
31225 -1551069 -430521 750224 1130309 888943 711604 438006 -704119 -2443723 -3231717
31216 -3231717 -2244509 -685888 -242629 -893647 -1227971 -540613 446418 840609 537163
31207 537163 -191415 -1136738 -1901831 -2003961 -1603209 -1464920 -1863935 -2226844 -2214510 -2288907
31197 -2288907 -2601358 -2254518 -691706 887338 818664 -627267 -1508844 -877004 198393
31188 198393 555336 509594 789218 1053874 521510 -625798 -1487468 -1694719 -1542292 -1214606
31178 -1214606 -767107 -638774 -1235415 -2028913 -1972721 -990067 -269558 -737702 -1822507
$$ packed form
31243a838157o0184M50757J074648J122927L23322o43131r00577k99643O05148
31234a64890J135175R15998J01726o90571r64636q63323p60142n09610K49204
31225a551069J120548J180745L80085k41366j77339k73598j142125j739604p87994
31216c231717R87208J558621M43259o51018l34324O87358R87031L94191l03446
31207E37163p28578r45323p65093j02130M00752J38289l99015l62909J2334p4397
31197b288907l12451L46840J562812J579044o8674j445931q81577O31840J075397
31188A98393L56943m5742K79624K64656n32364j147308q61670k07251J52427L27686
31178a214606M47499J28333n96641p93498N6192R82654P20509m68144j084805
$$ plain form
31169 -1822507 -2167352 -1225396 250811 1120508 904445 -38547 -1064672 -1735704 -1816621
31160 -1816621 -1185579 -136276 430571 -251068 -1770653 -2833700 -2785567 -2191257 -1659280
31151 -1659280 -986653 -48860 408490 -157210 -971385 -1072540 -928644 -1505171 -2180509
31142 -2180509 -1364612 805636 2262544 1951041 1170272 1164673 1151748 73641 -1193283
31133 -1193283 -1164598 -303824 -299077 -1266808 -1666804 -991944 -588810 -1296373 -1993910 -1454497
31123 -1454497 -337362 -127889 -921347 -1509648 -1259224 -728952 -488153 -333377 99228
31114 99228 668201 996627 972989 760492 630799 885987 1554899 2053112 1610103 269168
31104 269168 -996948 -1514333 -1798133 -2681190 -3892169 -4230328 -3126853 -1381878 -222351
$$ packed form
31169a822507l44845R41956J476207Q69697k16063r42992j026125o71032q0917
31160a816621O31042J049303N66847o81639j519585j063047M8133N94310N31977
31151a659280O72627R37793M57350n65700q14175j01155J43896n76527o75338
31142b180509Q15897K170248J456908l11503p80769n599j2925j078107j266924
31133a193283K8685Q60774M747r67731l99996O74860M03134p07563o97537N39413
31123a454497J117135K09473p93458n88301K50424N30272K40799J54776M32605
31114I9228N68973L28426k3638k12497j29693K55188O68912M98213m43009j340935
31104B69168j266116n17385k83800q83057j210979l38159J103475J744975J159527
$$ plain form
31095 -222351 -148739 -828889 -1586490 -1809601 -1403585 -1041800 -1411771 -2035737 -1618642 9897
31085 9897 1167722 331408 -1785939 -3151107 -2958604 -2186314 -1875472 -2051603 -2380137
31076 -2380137 -2731619 -2817900 -2279138 -1524908 -1590882 -2684305 -3661299 -3472657 -2424531
31067 -2424531 -1448656 -802677 -204547 246017 87672 -720616 -1614998 -1983228 -1598479
31058 -1598479 -649367 406308 1147667 1459412 1345331 647077 -569571 -1531447 -1451305
31049 -1451305 -681946 -233580 -86354 771979 2297066 2896350 1858935 792948 1228729
31040 1228729 2029869 1101946 -1081140 -1925845 -657071 456299 -478192 -2236908 -2439496
31031 -2439496 -960268 166297 -306412 -1419577 -1585971 -522015 799548 1514155 1607365
$$ packed form
31095b22351P3612o80150p57601k23111M06016L61785l69971o23966M17095J628539
31085I897J157825q36314k117347j365168J92503P72290L10842j76131l28534
31076b380137l51482q6281N38762P54230o5974j093423r76994J88642J048126
31067b424531R75875O45979N98130M50564j58345q08288q94382l68230L84749
31058a598479R49112J055675P41359L11745j14081o98254j216648r61876Q0142
31049a451305P69359M48366J47226Q58333J525087N99284j037415j065987M35781
31040A228729Q01140r27923k183086q44705J268774J113370r34491j758716k02588
31031b439496J479228J126565m72709j113165j66394J063956J321563P14607R3210
$$ plain form
31022 1607365 1403157 850933 -245608 -1421910 -1638132 -564559 687185 737498 -396844
31013 -396844 -1444320 -1507446 -832345 -43475 539057 686395 221738 -425481 -324891 775258
31003 775258 1841170 1623340 42454 -1845138 -2961709 -2968832 -2247243 -1514610 -1274778
30994 -1274778 -1362487 -1212685 -728771 -500892 -856579 -1113329 -342384 1271209 2395593
30985 2395593 1989132 419276 -1000878 -1362540 -866472 -294233 -34917 169292 555197
30976 555197 762791 261941 -757146 -1351771 -823840 546910 1925728 2786356 3091196
30967 3091196 2859790 2039222 924318 348800 1015403 2536221 3473159 2721369 787291
30958 787291 -731672 -988923 -677894 -749695 -1022570 -757354 -153521 -228748 -1152649 -1692774
$$ packed form
31022A607365k04208n52224j096541j176302k16222J073573J251744N0313j134342
31013c96844j047476o3126O75101P88870N82532J47338m64657o47219J00590J100149
31003G75258J065912k17830j580886j887592j116571p123P21589P32633K39832
30994a274778q7709J49802M83914K27879l55687k56750P70945J613593J124384
30985B395593m06461j569856j420154l61662M96068N72239K59316K04209L85905
30976E55197K07594n00850j019087n94625N27931J370750J378818Q60628L04840
30967C091196k31406q20568j114904n75518O66603J520818R36938p51790j934078
30958G87291j518963k57251L11029p1801k72875K65216O03833p5227r23901n40125
$$ plain form
30948 -1692774 -815742 817898 1611241 977391 -81852 -310033 368228 949949 704507
30939 704507 127507 314269 1416733 2168227 1334467 -661264 -2175546 -2304678 -1661760
30930 -1661760 -1075956 -396180 840423 2215841 2795215 2472698 2119277 2300892 2553324
30921 2553324 2229721 1519381 1125380 1193982 1102372 333661 -845370 -1736406 -1946650 -1547816
30911 -1547816 -725828 367692 1429688 1988716 1725703 729492 -553530 -1514486 -1669103
30902 -1669103 -1060147 -345223 -152870 -334959 -197401 519479 1298390 1530054 1118762
30893 1118762 386662 -122404 221786 1467978 2478919 1911877 71753 -1225878 -1049464
30884 -1049464 -413372 -300414 -82726 863025 1381672 241832 -1383247 -1371163 -87377
$$ packed form
30948a692774Q77032J633640P93343o33850j059243k28181O78261N81721k45442
30939G04507n77000J86762J102464P51494q33760j995731j514282j29132O42918
30930a661760N85804O79776J236603J375418N79374l22517l53421J81615K52432
30921B553324l23603p10340l94001O8602r1610p68711j179031q91036k10244L98834
30911a547816Q21988J093520J061996N59028k63013r96211j283022r60956j54617
30902a669103O08956P14924J92353j82089J37558P16880P78911K31664m11292
30893A118762p32100n09066L44190J246192J010941n67042j840124j297631J76414
30884a049464O36092J12958K17688R45751N18647j139840j625079J2084J283786
$$ plain form
30875 -87377 55537 -1541838 -2771947 -2288494 -1361504 -1241255 -1059595 34208 703406
30866 703406 -477533 -2182271 -1905867 400755 2422425 2782651 2242104 1777769 1431894
30857 1431894 1239694 1540014 1958350 1564603 487793 29649 686213 1335072 973256
30848 973256 60321 -558955 -926285 -1307125 -1281074 -549596 136873 21466 -247769 496935
30838 496935 1936218 2471612 1517173 312894 19101 132475 -391294 -1278367 -1319828
30829 -1319828 -253953 888552 1353649 1496904 1733481 1695039 1085508 495479 434089
30820 434089 215520 -1042060 -2713364 -3254342 -2374416 -1285427 -690204 35921 1247680
30811 1247680 2067475 1798627 1053885 542535 -115487 -1252298 -1906007 -1111581 343029
$$ packed form
30875h7377J42914j597375j230109M83453R26990J20249J81660J093803O69198
30866G03406j180939j704738K76404K306622K021670L60226n40547m64335l45875
30857A431894j92200L00320M18336l93747j076810m58144O56564O48859l61816
30848I73256r12935o19276l67330l80840K6051P31478O86469j15407k69235P44704
30838D96935J439283N35394r54439j204279k93793J13374n23769q87073m1461
30829a319828J065875J142505M65097J43255K36577l8442o09531n90029o1390
30820D34089k18569j257580j671304n40978Q79926J088989N95223P26125J211759
30811A247680Q19795k68848p44742n11350o58022j136811o53709P94426J454610
$$ plain form
30802 343029 923943 542158 232629 105929 -693205 -2130315 -3088518 -3199019 -3303037
30793 -3303037 -3758787 -3773431 -2934067 -2030415 -1664536 -1241184 -147238 1062561 1509530
30784 1509530 1233703 809489 412620 43176 76811 771778 1590612 1692114 896285 -242270
30774 -242270 -1053992 -1217969 -1001961 -1173331 -2140786 -3137549 -3021822 -1975384 -1388108
30765 -1388108 -1768194 -1952545 -1004697 254222 504059 -230531 -980473 -1304889 -1384646
30756 -1384646 -1324154 -1304852 -1763208 -2486713 -2308287 -775249 701784 689916 -13491 450143
30746 450143 2090925 3109347 2683557 1899150 1703374 1677813 1383781 1373955 2020661 2510963
30736 2510963 1929981 562732 -630119 -1217044 -1392986 -1446602 -1639096 -2112933 -2522054
$$ packed form
30802C43029N80914l81785l09529j26700p99134j437110r58203j10501j04018
30793c303037m55750j4644Q39364R03652L65879M23352J093946J209799M46969
30784A509530k75827m24214l96869l69444L3635O94967Q18834J01502p95829j138555
30774b42270q11722j63977K16008j71370r67455r96763J15727J046438N87276
30765a388108l80086j84351R47848J258919K49837p34590p49942l24416p9757
30756a384646O0492J9302m58356p23505J78426J533038J477033j1868p03407M63634
30746D50143J640782J018422m25790p84407j95776k5561k94032r826O46706M90302
30736B510963n80982j367249j192851n86925j75942n3616j92494m73837m09121
$$ plain form
30727 -2522054 -2233710 -1193839 -95939 497125 617389 365575 -316872 -1108242 -1311505
30718 -1311505 -745513 11089 487405 719605 634444 -68697 -1146959 -1848811 -2032442
30709 -2032442 -2275838 -2572727 -2120906 -928188 -312704 -968939 -1780641 -1615617 -1126256
30700 -1126256 -1444317 -2096944 -1806921 -679321 97300 364536 1098520 2417869 3106202
30691 3106202 2476183 1392539 914937 943073 812032 506209 636373 1511681 2642197
30682 2642197 3153483 2698670 1943547 1795798 2089684 1731501 455236 -522985 -300498
30673 -300498 260444 -39385 -726617 -471276 677400 1380142 996699 26125 -1170419
30664 -1170419 -2568325 -3564772 -3416474 -2541361 -1904290 -1274970 225712 2024783 2560810
$$ packed form
30727b522054K88344J039871J097900N93064J20264k51814o82447p91370k03263
30718a311505N65992P56602M76316K32200q5161p03141j078262p01852j83631
30709b032442k43396k96889M51821J192718O15484o56235q11702J65024M89361
30700a126256l18061o52627K90023J127600P76621K67236P33984J319349O88333
30691C106202o30019j083644m77602K8136j31041l05823J30164Q75308J130516
30682B642197N11286m54813p55123j47749K93886l58183j276265r78221K22487
30673c00498N60942k99829o87232K55341J148676P02742l83443r70574j196544
30664a170419j397906r96447J48298Q75113O37071O29320J500682J799071N36027
$$ plain form
30655 2560810 1912683 1746973 2306051 1884584 70274 -1029920 -105286 1183906 1042797
30646 1042797 373998 690413 1135595 141904 -1348902 -1128282 585036 1432297 629930
30637 629930 -160635 192511 766550 510152 -234744 -756290 -990665 -985555 -637924 -351543
30627 -351543 -753511 -1494763 -1538477 -818009 -322498 -375418 -250971 233624 273374 -312236
30617 -312236 -542169 -3654 355267 16378 59735 1379628 2871570 2780440 1184933
30608 1184933 -142926 -8769 1129139 2139731 2371479 1905240 1351415 1369588 1925233
30599 1925233 2155183 1381034 83616 -543559 75981 1308416 1987863 1557916 620671
30590 620671 299595 881572 1354119 731694 -488196 -948726 -289331 621941 1272721
$$ packed form
30655B560810o48127j65710N59078m21467j814310j100194R24634J289192j41109
30646A042797o68799L16415M45182r93691j490806K20620J713318Q47261q02367
30637F29930p90565L53146N74039k56398p44896n21546k34375N110L47631K86381
30627c51543m01968p41252m3714P20468M95511n2920J24447M84595L9750n85610
30617c12236k29933N38515L58921l38889M3357J319893J491942r1130j595507
30608A184933j327859J34157J137908J010592K31748m66239n53825J8173N55645
30599A925233K29950p74149j297418o27175O19540J232435O79447m29947r37245
30590F20671l21076N81977M72547o22425j219890m60530O59395R11272O50780
$$ plain form
30581 1272721 2097709 3148734 3381316 1993916 -364191 -2387884 -3399516 -3316535 -2237108
30572 -2237108 -787006 -44847 -262139 -362926 440409 1306807 1073071 185827 40238
30563 40238 826992 1412757 1215004 830161 671173 273457 -613312 -1288978 -1046136 -111587
30553 -111587 884232 1752657 2506177 2790149 2214845 1029650 -45639 -536351 -387773
30544 -387773 350246 1450258 2133664 1443479 -563536 -2361237 -2346022 -716310 651577
30535 651577 467948 -459736 -566076 177900 348335 -655775 -1622034 -1285213 -129647
30526 -129647 359822 -330365 -1352221 -1757127 -1366930 -560934 49051 -222669 -1527502
30517 -1527502 -2851639 -2663004 -599692 1871770 2900023 2156787 940886 513572 825171
$$ packed form
30581A272721Q24988J051025K32582j387400k358107k023693j011632Q2981J079427
30572b237108J450102P42159k17292j00787Q03335Q66398k33736q87244j45589
30563D0238P86754N85765j97753l84843j58988l97716q86769o75666K42842R34549
30553a11587R95819Q68425P53520K83972n75304j185195j075289m90712J48578
30544c87773P38019J100012O83406o90185k007015j797701J5215J629712J367887
30535F51577j83629r27684j06340P43976J70435j004110r66259L36821J155566
30526a29647M89469o90187j021856m04906L90197Q05996O09985k71720j304833
30517a527502j324137J88635K063312K471462J028253p43236j215901m27314L11599
$$ plain form
30508 825171 1046225 859640 642408 517446 2950 -1081007 -2002982 -1997546 -1295710 -591755
30498 -591755 133717 1356015 2741031 3179736 2284133 988765 354197 476766 865562
30489 865562 1213065 1460166 1666965 2047278 2585998 2611468 1547515 88179 -472961
30480 -472961 -239432 -675385 -2103381 -2789638 -1535509 218234 336164 -958307 -1609388
30471 -1609388 -720802 604283 1151757 813225 -34378 -980522 -1316165 -578368 434482
30462 434482 323930 -968778 -1929580 -1517800 -492965 -247486 -1079102 -2099144 -2303223
30453 -2303223 -1351547 274594 1593716 1922313 1507008 1112620 1051456 982895 540144
30444 540144 -261929 -1059251 -1188449 -120080 1560583 2143908 715692 -1296587 -1627324
$$ packed form
30508H25171K21054j86585k17232j24962n14496j083957r21975N436P01836P03955
30498e91755P25472J222298J385016M38705q95603j295368o34568J22569L88796
30489H65562L47503K47101K06799L80313N38720K5470j063953j459336n61140
30480d72961K33529m35953j427996o86257J254129J753743J17930j294471o51081
30471a609388Q88586J325085N47474l38532q47603r46144l35643P37797J012850
30462D34482j10552j292708r60802M11780J024835K45479q31616j020042k04079
30453b303223R51676J626141J319122L28597m15305l94388o1164o8561m42751
30444E40144q02073p97322j29198J068369J680663N83325j428216k012279l30737
$$ plain form
30435 -1627324 -6076 1755332 2408707 2513366 2749937 2540792 1214263 -547468 -1438557
30426 -1438557 -1112398 -285204 259030 195798 -300979 -541892 113255 1190971 1241524 -337744
30416 -337744 -2211540 -2601666 -1438591 -227348 -85366 -781012 -1605567 -2273526 -2699004
30407 -2699004 -2601825 -1903946 -1234469 -1447575 -2500841 -3207456 -2489856 -734913 576379
30398 576379 604027 -64227 -510533 -604636 -569763 -267671 260229 273886 -544507 -1072076
30388 -1072076 -227972 991179 683397 -887589 -1406262 -67903 1079032 323063 -1131819
30379 -1131819 -1286789 -457340 -363592 -1195559 -1648485 -1317578 -1032567 -970892 -353987 795270
30369 795270 1307699 696148 -120098 -361969 -297425 -113156 688004 1983288 2429676 1224901
$$ packed form
30435a627324J621248J761408O53375J04659K36571k09145j326529j761731q91089
30426a438557L26159Q27194N44234o3232m96777k40913O55147J077716N0553j579268
30416c37744j873796l90126J163075J211243J41982o95646q24555o67959m25478
30407b699004R7179O97879O69477k13106j053266p06615P17600J754943J311292
30398E76379K7648o68254m46306r4103L4873L02092N27900J3657q18393n27569
30388a072076Q44104J219151l07782j570986n18673J338359J146935p55969j454882
30379a131819j54970Q29449R3748q31967m52926L30907K85011O1675O16905J149257
30369G95270N12429o11551q16246k41871O4544J84269Q01160J295284M46388j204775
$$ plain form
30359 1224901 -522994 -1269503 -1025892 -734542 -475790 244509 932897 518483 -683083
30350 -683083 -1024384 79177 1246037 1243562 680656 676811 1019571 900335 599010 904420
30340 904420 1331682 590668 -1172231 -2222911 -1713332 -829737 -791829 -1044222 -451642
30331 -451642 752197 1418049 1189940 569144 -239180 -1339653 -2295307 -2434758 -1917098
30322 -1917098 -1464366 -1131592 -401004 529765 687343 -266959 -1571927 -2540932 -3247003
30313 -3247003 -3770445 -3738830 -3043286 -2184012 -1469257 -625550 375638 869983 421522
30304 421522 -392874 -620558 47727 1145731 1842452 1402169 -86434 -1355662 -1160659
30295 -1160659 47745 615323 -14259 -684321 -503292 -31739 94531 236758 549729
$$ packed form
30359A224901j747895p46509K43611K91350K58752P20299O88388m14414j201566
30350f83083l41301J103561J166860k475n62906l845L42760j19236l01325L05410
30340I04420M27262p41014j762899j050680N09579Q83595L7908k52393N92580
30331d51642J203839O65852k28109o20796q08324j100473r55654j39451N17660
30322a917098M52732L32774P30588R30769J57578r54302j304968r69005p06071
30313c247003n23442L1615O95544Q59274P14755Q43707J001188M94345m48461
30304D21522q14396k27684O68285J098004O96721m40283j488603j269228J95003
30295a160659J208404N67578o29582o70062J81029M71553J26270J42227L12971
$$ plain form
30286 549729 211242 -899306 -1177634 433606 2342730 2362265 934875 206736 544963
30277 544963 375822 -685856 -1084152 -135157 755629 567839 268800 736269 942212
30268 942212 -176730 -1478497 -1165569 263815 577500 -909528 -2370968 -2027554 -282546
30259 -282546 1196318 1479544 788770 -363837 -1565290 -2214803 -1672797 -92842 1275919
30250 1275919 1236322 147749 -347192 537924 1532758 1017508 -608924 -1461561 -903525
30241 -903525 -320448 -861459 -1857818 -2244756 -2244562 -2491263 -2506818 -1455794 201305 1204648
30231 1204648 1275038 1091693 823702 112936 -648015 -577809 54783 3932 -859422 -1233684
30221 -1233684 -684175 -552834 -1639137 -2592807 -1997393 -712586 -433039 -914082 -599295
$$ packed form
30286E49729l38487j110548k78328J611240J909124J9535j427390p28139L38227
30277E44963j69141j061678l98296R48995Q90786j87790k99039M67469K05943
30268I42212j118942j301767L12928J429384L13685j487028j461440L43414J745008
30259b82546J478864K83226o90774j152607j201453o49513N42006J579955J368761
30250A275919l9597j088573m94941Q85116R94834n15250j626432q52637N58036
30241i03525N83077n41011r96359l86938J94k46701j5555J051024J657099J003343
30231A204648P0390j83345k67991p10766p60951P0206O32592n0851q63354l74262
30221a233684N49509J31341j086303r53670N95414J284807K79547m81043L14787
$$ plain form
30212 -599295 576994 1167974 904749 1195326 2433097 2850512 1115267 -1535725 -3065367
30203 -3065367 -3309672 -3426655 -3609204 -3065698 -1912194 -1387284 -1955891 -2495958 -1847258
30194 -1847258 -287531 989077 1227127 574864 -265668 -507818 146557 1059271 1120941
30185 1120941 -50945 -1647519 -2591269 -2619973 -2265180 -2088204 -2216206 -2405077 -2283213
30176 -2283213 -1640535 -648825 266038 795638 877127 573567 153856 185847 992178 1924034
30166 1924034 1847506 703197 -105180 446562 1329388 678007 -1466769 -2874484 -2019749
30157 -2019749 -147539 517857 -132317 -183298 1263391 2683468 2341740 641349 -787317
30148 -787317 -1436296 -1970114 -2405730 -1891560 -470099 452103 20834 -875173 -1115471
$$ packed form
30212e99295J176289N90980k63225K90577J237771M17415j735245k650992j529642
30203c065367k44305j16983j82549N43506J153504N24910n68607n40067O48700
30194a847258J559727J276608K38050o52263q40532k42150O54375R12714O1670
30185A120941j171886j596574r43750k8704L54793J76976j28002j88871J21864
30176b283213O42678R91710R14863N29600Q1489l03560m19711L1991Q06331R31856
30166A924034p6528j144309q08377N51742Q82826o51381k144776j407715Q54735
30157b019749J872210O65396o50174n0981J446689J420077l41728j700391j428666
30148g87317o48979n33818m35616N14170J421461R22202m31269q96007k40298
$$ plain form
30139 -1115471 -1014511 -1486409 -2359090 -2685075 -2255141 -1688332 -1289051 -826921 -261367
30130 -261367 256878 916894 1831286 2295370 1527393 42231 -848124 -901425 -1095746 -1789044
30120 -1789044 -2083719 -1472938 -819184 -944060 -1331910 -1138411 -599531 -436555 -565521
30111 -565521 -495903 -525907 -1351768 -2637643 -3105822 -2263313 -1181871 -1150946 -2081725 -2712872
30101 -2712872 -2196504 -1056088 -430234 -588505 -628209 184846 1273922 1537671 929224
30092 929224 334065 -50782 -1040519 -2781915 -3925245 -3353972 -1892535 -1194610 -1457566
30083 -1457566 -1447028 -593471 205266 132609 -259563 49737 989394 1493536 1000385 203123
30073 203123 87161 610832 799379 87466 -969972 -1557428 -1614933 -1477583 -1038194 -157490
$$ packed form
30139a115471J00960m71898q72681l25985M29934N66809L99281M62130N65554
30130b61367N18245O60016R14392M64084p67977j485162q90355n3301j94321o93298
30120a789044k94675O10781O53754j24876l87850J93499N38880J62976j28966
30111e65521O9618l0004q25861j285875m68179Q42509J081442L0925r30779o31147
30101b712872N16368J140416O25854j58271l9704Q13055J089076K63749o08447
30092I29224n95159l84847r89737j741396j143330N71273J461437O97925k62956
30083a457566J0538Q53557P98737p2657l92172L09300R39657N04142m93151p97262
30073B03123j15962N23671J88547p11913j057438n87456n7505J37350M39389Q80704
$$ plain form
30063 -157490 436488 -132792 -1262882 -1311275 -21417 905392 399328 -252698 480483
30054 480483 1743339 1514300 -203274 -1331182 -801036 110495 -46477 -894978 -1154256
30045 -1154256 -485844 401594 797115 462072 -424250 -1265065 -1432829 -1045559 -893807
30036 -893807 -1311026 -1740999 -1787321 -1920966 -2514407 -2882485 -2178618 -782395 182118 439618
30026 439618 631043 885339 521311 -529200 -1146251 -562979 402368 562491 147145
30017 147145 248674 865405 861113 -11991 -413347 633679 2165408 2580939 1783497 966282
30007 966282 721352 521921 -21046 -498613 -509803 -254689 -20871 219131 389266 127076
29997 127076 -597340 -1182163 -1105690 -570017 -104120 163936 506660 1038683 1413193 1115429
$$ packed form
30063a57490N93978n69280j130090m8393J289858R26809n06064o52026P33181
30054D80483J262856k29039j717574j127908N30146R11531j56972q48501k59278
30045a154256O68412Q87438L95521l35043q86322q40815j67764L87270J51752
30036h93807m17219m29973m6322j33645n93441l68078P03867J396223R64513K57500
30026D39618J91425K54296l64028j050511o17051N83272R65347J60123m15346
30017A47145J01529O16731m292q73104m01356J047026J531729M15531p97442q17215
30007I66282k44930j99431n42967m77567j1190K55114K33818K40002J70135k62190
29997A27076p24416n84823P6473N35673M65897K68056L42724N32023L74510k97764
$$ [...]
##END NTUPLES=NMR SPECTRUM
##END=
