##TITLE=31Pdec_LY-16Dix.2.B
 CD3CN, 24 sc
 2.06.2021
##JCAMPDX= 6.0         $$ Bruker NMR JCAMP-DX V2.0
##DATA TYPE= NMR SPECTRUM
##DATA CLASS= NTUPLES
##ORIGIN= UXNMR, Bruker Analytische Messtechnik GmbH
##OWNER= root
$$ XWIN-NMR		Version 3.5
$$ Wed Jun  2 10:00:05 2021 Russian Standard Time (UT+4h)  she@DPX200
##.OBSERVE FREQUENCY= 81.013821
##.OBSERVE NUCLEUS= ^31P
##.ACQUISITION MODE= SIMULTANEOUS
##.ACQUISITION SCHEME= undefined
##.AVERAGES= 24
##.DIGITISER RES= 16
##SPECTROMETER/DATA SYSTEM= spect
##.PULSE SEQUENCE= zgpg30
##.SOLVENT NAME= CDCl3
##.SHIFT REFERENCE= (INTERNAL, CDCl3, 0, 248.564)
##AUDIT TRAIL= $$ (NUMBER, WHEN, WHO, WHERE, WHAT)
$$ ##TITLE= Audit trail, XWIN-NMR		Version 3.5
$$ ##JCAMPDX= 5.01
$$ ##ORIGIN= Bruker BioSpin GmbH
$$ ##OWNER= she
$$ F:/spectra/data/she/nmr/P31/1/pdata/1/auditp.txt
$$ ##AUDIT TRAIL=  $$ (NUMBER, WHEN, WHO, WHERE, WHAT)
(   1,<2021-06-02 09:58:30.73 +0400>,<she>,<DPX200>,
      <created by zg, POWCHK disabled, PULCHK disabled
       configuration hash MD5:
       00 E9 B6 7A A2 85 ED C7 34 08 36 98 17 FE 4E 26
       data hash MD5: 32K
       0E 19 0B F6 64 4B F2 87 9A 99 EA 8E 0A D4 73 D3>)
(   2,<2021-06-02 09:58:40.93 +0400>,<she>,<DPX200>,
      <Start of raw data processing
       efp BC_mod = 2 LB = 1 FT_mod = 6 PKNL = 1 PHC0 = -5892.631 PHC1 = 88.8726 SI = 64K 
       data hash MD5: 64K
       3E D4 60 61 BC 92 ED F9 7A 02 22 FD 45 FE 7F 14>)
(   3,<2021-06-02 09:59:12.42 +0400>,<she>,<DPX200>,
      <pk PHC0 = -19.25152 PHC1 = 39.4 
       data hash MD5: 64K
       6E 2D 3B 7E 38 A3 24 08 21 46 94 FB 0C 8C B8 0D>)
$$ ##END=
$$ 
$$ hash MD5
$$ 7C 5F 45 D5 1D 5A BB 5B 1B D6 80 C8 AB 8D DE 60
##$RELAX= 
##$RELAX= 
##$RELAX= 
##$RELAX= 
##$RELAX= 
##$RELAX= 
##$RELAX= 
##$RELAX= 
$$ Bruker specific parameters
$$ --------------------------
##$DU= <F:/spectra>
##$EXPNO= 1
##$NAME= <P31>
##$PROCNO= 1
##$TYPE= <nmr>
##$USER= <she>
##$AMP= (0..31)
100 100 100 100 100 100 100 100 100 100 100 100 100 100 100 100 100 100 
100 100 100 100 100 100 100 100 100 100 100 100 100 100 
##$AQSEQ= 0
##$AQ_mod= 1
##$AUNM= <au_zg>
##$AUTOPOS= <>
##$BF1= 81.014009
##$BF2= 200.13
##$BF3= 200.13
##$BF4= 200.13
##$BF5= 200.13
##$BF6= 200.13
##$BF7= 200.13
##$BF8= 200.13
##$BYTORDA= 1
##$CFDGTYP= 0
##$CFRGTYP= 5
##$CHEMSTR= <none>
##$CNST= (0..31)
1 1 145 1 1 1 1 1 1 1 1 1 1 1 1 1 1 1 1 1 1 1 1 1 1 1 1 1 1 1 1 1 
##$CPDPRG= <waltz16>
##$CPDPRG1= <>
##$CPDPRG2= <waltz16>
##$CPDPRG3= <>
##$CPDPRG4= <mlev>
##$CPDPRG5= <mlev>
##$CPDPRG6= <mlev>
##$CPDPRG7= <mlev>
##$CPDPRG8= <mlev>
##$CPDPRGB= <>
##$CPDPRGT= <>
##$D= (0..31)
0 1 0 0 0 0 0 0 0 0 0 0.03 2e-05 3e-06 0 0 0 0 0 0 0 0 0 0 0 0 0 0 0 0 
0 0 
##$DATE= 1622613510
##$DBL= (0..7)
120 120 120 11 120 120 24 19 
##$DBP= (0..7)
150 150 150 150 150 150 150 150 
##$DBP07= 0
##$DBPNAM0= <>
##$DBPNAM1= <>
##$DBPNAM2= <>
##$DBPNAM3= <>
##$DBPNAM4= <>
##$DBPNAM5= <>
##$DBPNAM6= <>
##$DBPNAM7= <>
##$DBPOAL= (0..7)
0.5 0.5 0.5 0.5 0.5 0.5 0.5 0.5 
##$DBPOFFS= (0..7)
$$ [...]
##$SUBNAM2= <"">
##$SUBNAM3= <"">
##$SUBNAM4= <"">
##$SUBNAM5= <"">
##$SUBNAM6= <"">
##$SUBNAM7= <"">
##$SUBNAM8= <"">
##$SUBNAM9= <"">
##$SW= 501.771253377433
##$SWIBOX= (0..15)
0 1 3 0 0 0 0 0 0 0 0 0 0 0 0 0 
##$SW_h= 40650.406504065
##$TD= 32768
##$TD0= 1
##$TE= 0
##$TE2= 300
##$TE3= 300
##$TEG= 300
##$TL= (0..7)
0 120 53 12 22 120 120 120 
##$TP= (0..7)
150 150 150 150 150 150 150 150 
##$TP07= 0
##$TPNAME0= <>
##$TPNAME1= <>
##$TPNAME2= <>
##$TPNAME3= <>
##$TPNAME4= <>
##$TPNAME5= <>
##$TPNAME6= <>
##$TPNAME7= <>
##$TPOAL= (0..7)
0.5 0.5 0.5 0.5 0.5 0.5 0.5 0.5 
##$TPOFFS= (0..7)
0 0 0 0 0 0 0 0 
##$TUNHIN= 0
##$TUNHOUT= 0
##$TUNXOUT= 0
##$USERA1= <user>
##$USERA2= <user>
##$USERA3= <user>
##$USERA4= <user>
##$USERA5= <user>
##$V9= 5
##$VALIST= <valist>
##$VCLIST= <CCCCCCCCCCCCCCC>
##$VD= 0
##$VDLIST= <DDDDDDDDDDDDDDD>
##$VPLIST= <PPPPPPPPPPPPPPP>
##$VTLIST= <TTTTTTTTTTTTTTT>
##$WBST= 1024
##$WBSW= 4
##$XGAIN= (0..3)
0 0 0 0 
##$XL= 0
##$YL= 0
##$YMAX_a= 5081
##$YMIN_a= -5637
##$ZGOPTNS= <>
##$ZL1= 120
##$ZL2= 120
##$ZL3= 120
##$ZL4= 120
##$ABSF1= 0
##$ABSF2= 0
##$ABSG= 0
##$ABSL= 0
##$ALPHA= 0
##$AQORDER= 0
##$ASSFAC= 0
##$ASSFACI= 0
##$ASSFACX= 0
##$ASSWID= 0
##$AUNMP= <proc_1d>
##$AZFE= 0.1
##$AZFW= 0.5
##$BCFW= 0
##$BC_mod= 2
##$BYTORDP= 0
##$COROFFS= 0
##$CY= -3
##$DATMOD= 1
##$DC= 0
##$DFILT= <>
##$DTYPP= 0
##$F1P= 0
##$F2P= 0
##$FCOR= 1
##$FTSIZE= 65536
##$FT_mod= 6
##$GAMMA= 0
##$GB= 0
##$INTBC= 1
##$INTSCL= 5.30512e-09
##$ISEN= 30
##$LB= 1
##$LEV0= 0
##$LPBIN= 0
##$MAXI= 10000
##$MC2= 0
##$MEAN= 0
##$ME_mod= 0
##$MI= 50
##$NCOEF= 0
##$NC_proc= -4
##$NLEV= 6
##$NOISF1= 182.463
##$NOISF2= 159.3651
##$NSP= 0
##$NTH_PI= 0
##$NZP= 0
##$OFFSET= 248.5645
##$PC= 4
##$PHC0= -5911.882
##$PHC1= 128.2726
##$PH_mod= 1
##$PKNL= yes
##$PPARMOD= 0
##$PSCAL= 0
##$PSIGN= 0
##$REVERSE= no
##$SF= 81.014009
##$SI= 65536
##$SIGF1= 159.3651
##$SIGF2= -187.1042
##$SINO= 113.3802
##$SIOLD= 16384
##$SREGLST= <1H.CDCl3>
##$SSB= 0
##$STSI= 65536
##$STSR= 0
##$SW_p= 40650.406504065
##$SYMM= 0
##$S_DEV= 0
##$TDeff= 32768
##$TDoff= 0
##$TI= <>
##$TILT= no
##$TM1= 0
##$TM2= 0
##$TOPLEV= 0
##$USERP1= <user>
##$USERP2= <user>
##$USERP3= <user>
##$USERP4= <user>
##$USERP5= <user>
##$WDW= 1
##$XDIM= 65536
##$YMAX_p= 273238254
##$YMIN_p= -7328487
$$ End of Bruker specific parameters
$$ ---------------------------------
##NTUPLES= NMR SPECTRUM
##VAR_NAME=  FREQUENCY,     SPECTRUM/REAL,   SPECTRUM/IMAG
##SYMBOL=    X,             R,               I
##VAR_TYPE=  INDEPENDENT,   DEPENDENT,       DEPENDENT
##VAR_FORM=  AFFN,          ASDF,            ASDF
##VAR_DIM=   65536,         65536,           65536
##UNITS=     HZ,            ARBITRARY UNITS, ARBITRARY UNITS
##FACTOR=    0.620285442955139, 1,           1
##FIRST=     20137.2065510759, 0,            0
##LAST=      -20513.1999529892, 0,           0
##MIN=       -20513.1999529892, -7328487,    0
##MAX=       20137.2065510759, 273238254,    0
$$ Real data points
##PAGE= N=1
##DATA TABLE= (X++(R..R)), XYDATA
$$ [...]
##PAGE= N=2
##DATA TABLE= (X++(I..I)), XYDATA
$$ plain form
35649 736577 434205 240831 85124 -166110 -409769 -438153 -283567 -188047 -221416 -168574
35639 -168574 113687 445896 593477 600930 631823 618998 376153 -4406 -201063 -125582
35629 -125582 -2040 63384 205771 372547 210199 -350197 -793045 -689705 -353409 -368164
35619 -368164 -702575 -819730 -552362 -314306 -403492 -575609 -443943 50482 681926 1162951
35609 1162951 1253075 925930 495714 335725 458329 618363 760223 1004302 1242977 1216048
35599 1216048 1041577 1173701 1655791 1880259 1380085 499175 -55184 -80674 12465 -187698
35589 -187698 -632614 -897212 -600389 173846 846305 892486 425782 30568 51488 321538
35579 321538 539196 551341 299188 -78631 -107556 529556 1337410 1479695 1006720 857579
$$ packed form
35649G36577l02372j93374j55707k51234k43659k8384J54586R5520l3369N2842
35639a68574K82261L32209J47581P453L0893j2825k42845l80559j96657P5481
35629a25582J23542O5424J42387J66776j62348n60396m42848J03340L36296j4755
35619c68164l34411j17155K67368K38056q9186j72117J31666M94425O31444M81025
35609A162951R0124l27145m30216j59989J22604J60034J41860K44079K38675k6929
35599A216048j74471J32124M82090K24468n00174q80910n54359k5490R3139k00163
35589a87698m44916k64598K96823P74235O72459M6181m66704l95214K0920K70050
35579C21538K17658J2145k52153l77819k8925O37112Q07854J42285m72975j49141
$$ plain form
35569 857579 1379318 1690479 1036343 -9739 -425104 -175617 60349 83732 147923 111535
35559 111535 -358584 -911308 -844866 -283320 -53820 -345153 -474049 -145398 75376 -109536
35549 -109536 -116964 444456 926945 588220 -219111 -546047 -141543 421853 642381 515452
35539 515452 258964 116586 287503 669400 874711 817570 941607 1464462 1818178 1423606
35529 1423606 668909 395753 615892 531318 -181916 -885963 -952689 -568630 -277043 -213190
35519 -213190 -135352 107704 450753 792186 1113736 1476125 1875679 2027577 1531066 520359
35509 520359 -171124 5980 451465 215050 -542283 -766944 -162904 410630 414821 396391
35499 396391 745890 766951 -130444 -1145941 -1080529 -71714 754089 979648 1097542 1229646
$$ packed form
35569H57579N21739L11161o54136j046082m15365K49487K35966K3383O4191l6388
35559A11535m70119n52724O6442N61546K29500k91333j28896L28651K20774j84912
35549a09536p428N61420M82489l38725q07331l26936M04504N63396K20528j26929
35539E15452k56488j42378J70917L81897K05311n7141J24037N22855L53716l94572
35529A423606p54697k73156K20139q4574p13234p04047o6726L84059K91587O3853
35519b13190P7838K43056L43049L41433L21550L62389L99554J51898m96511j010707
35509E20359o91483J77104M45485k36415p57333k24661O04040N73534M191j8430
35499C96391L49499K1061q97395j015497O5412J008815Q25803K25559J17894J32104
$$ plain form
35489 1229646 886987 93325 -394842 -273485 -106516 -213655 -93260 565449 1153815
35480 1153815 1039794 501679 137353 -53354 -318744 -411937 33592 722110 1025425 888071
35470 888071 745603 715855 548829 310584 448943 1086014 1761465 2009590 1820813 1465164
35460 1465164 1191736 1147021 1295134 1395620 1303787 1237103 1471462 1866867 2025298 1853680
35450 1853680 1623919 1506934 1382979 1114269 726206 340985 153501 348925 789060
35441 789060 986931 727992 457088 609139 867135 715836 461613 829497 1591824 1594359
35431 1594359 431531 -799522 -916745 -114726 562394 622504 357201 115363 25353
35422 25353 184166 536841 752428 689589 720650 1089329 1281497 725197 -99119 -70036
$$ packed form
35489A229646l42659p93662m88167J21357J66969j07139J20395O58709N88366
35480A153815j14021n38115l64326j90707k65390r3193M45529O88518L03315j37354
35470H88071j42468k9748j67026k38245J38359O37071O75451K48125j88777l55649
35460A465164k73428m4715J48113J00486r1833o6684K34359L95405J58431j71618
35450A853680k29761j16985j23955k68710l88063l85221j87484J95424M40135
35441G89060J97871k58939k70904J52051K57996j51299k54223L67884P62327K535
35431A594359j162828j231053j17223Q02019O77120O0110k65303k41838r0010
35422B5353J58813L52675K15587o2839L1061L68679J92168n56300q24316K9083
$$ plain form
35412 -70036 1020714 2097295 2199677 1598460 1180598 1258880 1429495 1277728 809240 346741
35402 346741 271336 706922 1279249 1418495 1080957 862534 1149187 1533432 1485734 1245829
35392 1245829 1423505 1910455 1961389 1419709 1069587 1453539 2066304 2244611 2197850 2366213
35382 2366213 2229441 822791 -1597427 -3439315 -3645065 -2876603 -2426996 -2657312 -3045889
35373 -3045889 -3179287 -3014741 -2562452 -1986090 -1753292 -2062199 -2342120 -1938206 -1090057
35364 -1090057 -590509 -646673 -768067 -659700 -477251 -236734 238246 711697 657698 133515
35354 133515 -229308 -279126 -559071 -1171712 -1308181 -451281 673977 999160 433644 -306127
35344 -306127 -709798 -714876 -366914 122014 287426 -46671 -421559 -415759 -281440 -374707
$$ packed form
35412g0036J090750J076581J02382o01217m17862P8282J70615j51767m68488m62499
35402C46741p5405M35586N72327J39246l37538k18423K86653L84245m7698k39905
35392A245829J77676M86950N0934n41680l50122L83952O12765J78307m6761J68363
35382B366213j36772j406650k420218j841888k05750P68462M49607k30316l88577
35373c045889j33398J64546M52289N76362K32798l08907k79921M03914Q48149
35364a090057M99548n6164j21394J08367J82449K40517M74980M73451n3999n24183
35354A33515l62823m9818k79945o12641j36469Q56900J125258L25183n65516p39771
35344c06127m03671n078L47962M88928J65412l34097l74888N800J34319r3267
$$ plain form
35334 -374707 -393466 117989 843377 1038511 598124 67187 -230148 -356918 -243310 196745
35324 196745 507764 77890 -859130 -1345689 -917008 -39336 690090 1068881 1004984 531925
35314 531925 216855 677672 1482081 1444968 352811 -573083 -442081 46440 -151462 -798651
35304 -798651 -980210 -672806 -574441 -748939 -618751 -189169 -129174 -521488 -610298 -102305
35294 -102305 274668 17643 -226906 284174 1070058 1060875 219823 -392721 -146056 406649
35284 406649 506871 216135 51786 107141 81945 -68803 -84358 36753 -76562 -573686
35274 -573686 -1049428 -1040394 -615262 -219145 -82861 -59200 9053 32058 -138273 -428662
35264 -428662 -578933 -420281 -48205 301167 518951 687582 819711 656320 -36390 -957116
$$ packed form
35334c74707j8759N11455P25388J95134m40387n30937k97335j26770J13608M40055
35324A96745L11019m29874r37020m86559M28681Q77672P29426L78791o3897m73059
35314E31925l15070M60817Q04409l7113j092157r25894J31002M88521j97902o47189
35304g98651j81559L07404R8365j74498J30188M29582N9995l92314q8810N07993
35294a02305L76973k57025k44549N11080P85884r183q41052o12544K46665N52705
35284D06649J00222k90736j64349N5355k5196j50748j5555J21111j13315m97124
35274e73686m75742R034M25132L96117J36284K3661O8253K3005j70331k90389
35264d28662j50271J58652L72076L49372K17784J68631J32129j63391o92710r20726
$$ plain form
35254 -957116 -1361602 -872665 -7499 366463 11701 -495989 -523950 -58658 424015 549594
35244 549594 379976 245178 335909 482790 370778 -38176 -432481 -574525 -619300 -810995
35234 -810995 -982583 -661935 255357 1159025 1243143 376827 -649561 -881771 -246110 352457
35224 352457 182298 -292479 -38208 959691 1480807 772058 -275295 -367005 303507 403077
35214 403077 -470293 -1172121 -738849 234378 549730 74540 -309865 -95706 280120 238475
35204 238475 -176327 -514479 -513399 -230246 200219 672284 1013382 1013427 673991 312256 229046
35193 229046 320270 270440 123636 256399 628350 580814 -179680 -873485 -631069 121198
35183 121198 167150 -658865 -1157078 -550362 408318 676942 412279 414301 723807 738449
$$ packed form
35254i57116m04486M88937Q65166L73962l54762n07690k7961M65292M82673J25579
35244E49594j69618j34798R0731J46881j12012m08954l94305j42044m4775j91695
35234h10995j71588L20648R17292R03668Q4118q66316j026388k32210O35661N98567
35224C52457j70159m74777K54271R97899N21116p08749j047353r1710O70512R9570
35214D03077q73370p01828M33272R73227L15352m75190l84405K14159L75826m1645
35204B38475m14802l38152J080K83153M30465M72065L41098M5l39436l61735q3210
35193B29046R1224m9830j46804J32763L71951m7536p60494o93805K42416P52267
35183A21198M5952q26015m98213O06716R58680K68624k64663K022L09506J4642
$$ plain form
35173 738449 375887 138930 131566 -62819 -460942 -514050 -96237 129498 -268325 -744075
35163 -744075 -558603 160043 694648 762117 678615 664218 579379 398275 426806 821617
35153 821617 1227330 1185986 753321 437718 549394 823421 768439 278034 -225150 -260580
35143 -260580 170999 584312 529056 29904 -514786 -748139 -551761 31291 771822 1145916
35133 1145916 660916 -432583 -1071002 -483980 762440 1345504 800071 -21335 -223878
35124 -223878 60831 255249 349908 672374 1042066 941292 403819 14945 26059 127240
35114 127240 151479 332061 707488 926361 894659 1002518 1382503 1530983 1091122 483210
35104 483210 242172 182874 -159724 -590419 -466338 244159 770039 519441 -211235 -681250
$$ packed form
35173G38449l62562k36957p364j94385l98123n3108M17813K25735l97823m75750
35163g44075J85472P18646N34605O7469q3502j4397q4839j81104K8531L94811
35153H21617M05713m1344m32665l15603J11676K74027n4982m90405n03184l5430
35143b60580M31579M13313n5256m99152n44690k33353J96378N83052P40531L74094
35133A145916m85000j093499o38419N87022J246420N83064n45433q21406k02543
35124b23878K84709J94418R4659L22466L69692j00774n37473l88874J1114J01181
35114A27240K4239J80582L75427K18873l1702J07859L79985J48480m39861o07912
35104D83210k41038n9298l42598m30695J24081P10497N25880k50598p30676m70015
$$ plain form
35094 -681250 -556977 -148367 56201 -36148 -42716 339676 784905 656881 -57177 -560899
35084 -560899 -259174 448422 776589 598986 378080 337831 330039 379581 682565 1041352
35074 1041352 962186 467053 187974 386693 466032 -113412 -897544 -995013 -322898 310221
35064 310221 340593 110612 221688 669295 964222 872537 631941 473565 308727 21534
35054 21534 -209128 -104198 351155 928063 1400995 1597444 1403302 996787 880976 1296369
35044 1296369 1743875 1564391 908252 559529 788742 1045257 942265 814223 934975
35035 934975 893208 327014 -280238 -224363 397017 972364 1351415 1788638 2163079 2088337
35025 2088337 1740210 1774839 2330098 2796463 2720241 2319899 1950726 1640189 1347528 1153196
$$ packed form
35094f81250J24273M08610K04568r2349o568L82392M45229j28024p14058n03722
35084e60899L01725P07596L28167j77603k20906m0249p792M9542L02984L58787
35074A041352p9166m95133k79079J98719P9339n79444p84132r7469O72115O33119
35064C10221L0372k29981J11076M47607K94927r1685k40596j58376j64838k87193
35054B1534k30662J04930M55353N76908M72932J96449j94142m06515j15811M15393
35044A296369M47506j79484o56139l48723K29213K56515j02992j28042J20752
35035I34975m1767n66194o07252N5875O21380N75347L79051M37223L74441p4742
35025B088337l48127L4629N55259M66365p6222m00342l69173l10537k92661j94332
$$ plain form
35015 1153196 985410 642632 265047 277543 662279 821790 453303 62102 233637 789006
35005 789006 1055642 702248 -18886 -626933 -750563 -348385 179665 319724 35016 -239188
34995 -239188 -283646 -361860 -609423 -637091 -102893 694315 1187579 1223278 1022903 764237
34985 764237 574148 647544 956326 1083070 759487 332308 250073 325977 45335 -546874
34975 -546874 -851801 -595292 -162460 16511 -57741 -200071 -323743 -312299 3739 516970
34965 516970 784990 540054 51294 -224876 -175350 3847 225034 604026 1118680 1411770
34955 1411770 1132049 442670 -12523 209572 825537 1198985 1153526 1069345 1153673 1087659
34945 1087659 648852 243302 357647 761124 797461 362361 58019 357335 1078472 1747145
$$ packed form
35015A153196j67786l42778l77585J2496L84736J59511l68487l91201J71535N55369
35005G89006K66636l53394p21134o08047j23630M02178N28050J40059k84708k74204
34995b39188m4458p8214k47563k7668N34198P97208M93264L5699k00375k58666
34985G64237j90089P3396L08782J26744l23583m27179q2235P5904k80642n92209
34975e46874l04927K56509M32832J78971p4252j42330j23672J1444L16038N13231
34965E16970K68020k44936m88760k76170M9526J79197K21187L78992N14654K93090
34955A411770k79721o89379m55193K22095O15965L73448m5459q4181Q4328o6014
34945A087659m38807m05550J14345M03477L6337m35100l04342K99316P21137O68673
$$ plain form
34935 1747145 2045388 1822272 1118052 351247 84273 394346 802340 973307 1084904
34926 1084904 1293717 1309528 892746 400683 345310 640104 785781 648467 517283 448243
34916 448243 143550 -380399 -534458 110486 1149917 1742572 1531010 910458 479456
34907 479456 455313 615194 646995 506282 445698 668852 1000002 1038539 650275 129735
34897 129735 -176971 -224674 -171246 -140161 -204675 -394352 -546756 -359604 193988 695787
34887 695787 784509 644860 680684 863255 816845 491643 293113 457893 704901 684624
34877 684624 470385 401264 637338 1016976 1206490 949974 370657 1806 211278 617725
34867 617725 516061 -60628 -261320 361767 1112349 1066110 301848 -289017 -127058 608203
$$ packed form
34935A747145K98243k23116p04220p66805k66974L10073M07994J70967J11597
34926A084904K08813J5811m16782m92063n5373K94794J45677j37314j31184o9040
34916D48243l04693n23949j54059O44944J039431N92655k11562o20552m31002
34907D79456k4143J59881L1801j40713o0584K23154L31150L8537l88264n20540
34897A29735l06706m7703N3428L1085o4514j89677j52404J87152N53592N01799
34887F95787Q8722j39649L5824J82571m6410l25202j98530J64780K47008k0277
34877F84624k14239o9121K36074L79638J89514k56516n79317l68851K09472M06447
34867F17725j01664n76689k00692O23087P50582m6239p64262n90865J61959P35261
$$ plain form
34857 608203 1405846 1802987 1541963 851454 425795 671235 1140943 1161996 777278 517923
34847 517923 493643 397582 257285 408721 745345 758898 385910 68739 -94622 -449613
34837 -449613 -907172 -880137 -388398 -287946 -915292 -1391944 -926335 -14394 435883 494865
34827 494865 825156 1419795 1695470 1541790 1362147 1254985 1014723 823367 1087445 1610449
34817 1610449 1726647 1301926 880901 800963 862098 901780 953631 778022 44006 -863252
34807 -863252 -1044598 -375586 198371 25509 -357644 -178487 426940 823946 857463 763074
34797 763074 556598 192391 -13433 210341 520171 443223 211094 428803 1056700 1431770
34787 1431770 1272405 969429 819169 659688 458087 606543 1276739 1957716 2032197 1504883
$$ packed form
34857F08203P97643L97141k61024o90509m25659K45440M69708K1053l84718k59355
34847E17923k4280r6061j40297J51436L36624J3553l72988l17171j63361l54991
34837d49613m57559K7035M91739J00452o27346m76652M65609R11941M50277N8982
34827D94865L30291N94639K75675j53680j79643j07162k40262j91356K64078N23004
34817A610449J16198m24721m21025p9938O1135L9682N1851j75609p34016r07258
34807h63252j81346O69012N73957j72862l83153J79157O05427L97006L3517r4389
34797G63074k06476l64207k05824K23774L09830p6948k32129K17709O27897L75070
34787A431770j59365l02976j50260j59481k01601J48456O70196O80977P4481n27314
$$ plain form
34777 1504883 844717 379593 140510 51870 -28019 -257809 -543248 -524067 -79520 407376
34767 407376 599283 737812 1191452 1688246 1568593 770933 4429 -162159 123699 486253
34757 486253 847235 1163181 1134556 653264 217427 385397 998430 1429555 1468775 1439622
34747 1439622 1488834 1328821 802308 222011 -45927 30387 328767 761392 1112338 1094180
34737 1094180 821437 852728 1438823 2043091 1968837 1215242 360536 -159345 -259612 72501
34727 72501 750601 1339069 1307862 635038 -134428 -464417 -234040 362864 1012397 1392092
34717 1392092 1391669 1245878 1220351 1223024 993111 577820 270406 135272 -9022 -149151
34707 -149151 -49643 282660 529964 553278 537488 536712 330543 -69246 -222770 115392 540277
$$ packed form
34777A504883o60166m65124k39083q8640p9889k29790k85439J9181M44547M86896
34767D07376J91907J38529M53640M96794j19653p97660p66504j66588K85858L62554
34757D86253L60982L15946k8625m81292m35837J67970O13033M31125L9220k9153
34747A439622M9212j60013n26513n80297k67938P6314K98380M32625L50946j8158
34737A094180k72743L1291N86095O04268p4254p53595q54706n19881j00267L32113
34727G2501O78100N88468l1207o72824p69466l29989K30377N96904O49533L79695
34717A392092m23j45791k5527K673k29913m15291l07414j35134j44294j40129
34707a49151R9508L32303K47304K3314j5790p76k06169l99789j53524L38162M24885
$$ plain form
34696 540277 517612 93192 -257313 -262818 -1491 394960 801387 956399 623711 -62073
34686 -62073 -621177 -632088 -28504 911223 1750630 2174916 2208310 2077945 1841787 1352936
34676 1352936 639732 22105 -294402 -439701 -519468 -387427 -40948 130208 -116756 -400190
34666 -400190 -237598 205484 409174 340925 403787 648036 703474 544251 641472 1136683
34656 1136683 1473781 1210198 717238 655304 1090842 1537183 1613000 1279498 653255 -2635
34646 -2635 -251052 138376 827185 1256244 1297767 1243768 1232576 1101387 839999 769936 1090024
34635 1090024 1539094 1721460 1576578 1353763 1281726 1412208 1628037 1647604 1191049 350813
34625 350813 -327903 -364940 123326 604717 762924 731110 774432 1008920 1401218 1754392
$$ packed form
34696E40277k2665m24420l50505n505K61327L96451M06427J55012l32688o85784
34686f2073n59104j0911O03584R39727Q39407M24286L3394j30365k36158m88851
34676A352936p13204o17627l16507j45299p9767J32041L46479J71156k46964k83434
34666d00190J62592M43082K03690o8249O2862K44249N5438j59223R7221M95211
34656A136683L37098k63583m92960o1934M35538M46341P5817l33502o26243o55890
34646b635k48417L89428O88809M29059M1523n3999j1192j31189k61388p0063L20088
34635A090024M49070J82366j44882k22815p2037J30482K15829J9567m56555q40236
34625C50813o78716l7037M88266M81391J58207l1814M3322K34488L92298L53174
$$ plain form
34615 1754392 1699547 1044629 192163 -162297 117074 437475 345604 110743 111694 128875
34605 128875 -188121 -520855 -302311 229813 244096 -354598 -655643 -90818 728630 984628
34595 984628 774594 646400 575712 175169 -413433 -619711 -303273 151143 485714 685069
34585 685069 575921 38229 -434650 -184076 525694 686834 18726 -586285 -447837 -66212
34575 -66212 -115007 -252538 199196 928101 998308 334143 -143287 89100 502894 498176
34565 498176 291292 420516 900957 1322951 1449950 1319330 999662 623481 487075 755831
34555 755831 1149030 1214591 881105 499027 371681 478453 648318 762282 727116 464855
34545 464855 71544 -125244 171478 896061 1625142 1944646 1787857 1401920 1041314 789301
$$ packed form
34615A754392n4845o54918q52466l54460K79371L20401r1871k34861R51J7181
34605A28875l16996l32734K18544N32124J4283n98694l01045N64825Q19448K55998
34595I84628k10034j28194p0688m00543n88602k06278L16438M54416L34571J99355
34585F85069j09148n37692m72879K50574P09770J61140o68108o05011J38448L81625
34575f6212m8795j37531M51734P28905P0207o64165m77430K32387M13794m718
34565D98176k06884J29224M80441M21994J26999j30620l19668l76181j36406K68756
34555G55831L93199O5561l33486l82078j27346J06772J69865J13964l5166k62261
34545D64855l93311j96788K96722P24583P29081L19504j56789l85937l60606k52013
$$ plain form
34535 789301 675385 787029 1090292 1243129 892807 248170 64310 784859 1844924
34526 1844924 2166250 1365588 182589 -379665 -67806 612348 1106056 1227069 1043068
34517 1043068 725290 504255 475750 452113 289341 289298 827204 1562551 1628735 850721 133027
34506 133027 173973 439973 164667 -194731 394013 1665661 2136768 1269767 301827 364982
34496 364982 928938 951316 567269 505539 585304 139814 -502289 -392469 321090 507893
34486 507893 25663 114212 1340410 2491973 2314919 1276622 662583 767539 1000090
34477 1000090 1131292 1350673 1488267 1217654 793398 664896 591838 93005 -429539 -94880
34467 -94880 941968 1488242 1035265 443323 527806 926085 951044 768688 976753 1531498
$$ packed form
34535G89301j13916J11644L03263J52837l50322o44637j83860P20549J060065
34526A844924L21326q00662j182999n62254L11859O80154M93708J21013j84001
34517A043068l17778k21035k8505k3637j62772m3N37906P35347O6184p78014p17694
34506A33027M0946K66000k75306l59398N88744J271648M71107q67001r67940O3155
34496C64982N63956K2378l84047o1730P9765m45490o42103J09820P13559J86803
34486E07893m82230Q8549J226198J151563j77054j038297o14039J04956K32551
34477A000090J31202K19381J37594k70613m24256j28502p3058m98833n22544L34659
34467i4880J036848N46274m52977n91942Q4483L98279K4959j82356K08065N54745
$$ plain form
34457 1531498 1837995 1633323 1175237 737983 434698 417215 805250 1440954 1977755 2143476
34447 2143476 1810135 1073788 414060 372369 802201 884439 269381 -276995 81930 993679
34437 993679 1429200 1166389 902237 958747 802345 75850 -696094 -855863 -471028 15198
34427 15198 502326 1068729 1443027 1247088 648292 248857 307863 482882 426386 298127
34417 298127 496855 1055303 1496809 1310903 525903 -245005 -406129 -16819 308568 165760
34407 165760 -167590 -139755 380041 999991 1267364 1028519 428801 -219444 -611973 -694312
34397 -694312 -699602 -792257 -785260 -455848 -29028 33011 -257420 -326393 172503 850729 1136773
34386 1136773 1033018 959727 1050243 1038909 795603 540965 451315 417559 358528 467812
$$ packed form
34457A531498L06497k04672m58086m37254l03285j7483L88035O35704N36801J65721
34447B143476l33341p36347o59728m1691M29832Q2238o15058n46376L58925R11749
34437I93679M35521k62811k64152N6510j56402p26495p71944j59769L84835M86226
34427A5198M87128N66403L74298j95939n98796l99435N9006J75019n6496j28259
34417B98127J98728N58448M41506j85906p85000p70908j61124L89310L25387j42808
34407A65760l33350K7835N19796O19950K67373k38845n99718o48245l92529q2339
34397f94312n290r2655O997L29412M26820O2039k90431o8973M98896O78226K86044
34386A136773j03755p3291R0516j1334k43306k54638q9650l3756n9031J09284
$$ plain form
34376 467812 902536 1420322 1602055 1369648 1044364 862504 611374 -117969 -1323264
34367 -1323264 -2353457 -2449409 -1581543 -567787 -178276 -285440 -185398 380972 962976
34358 962976 1131436 950719 590958 36446 -509880 -481333 291000 1101448 1252982 1078070
34348 1078070 1378015 2081710 2302575 1722182 1071699 1033383 1412889 1718280 1880409 1974842
34338 1974842 1821411 1380439 1086398 1241250 1430209 1086114 360404 -108436 -90403 96652
34328 96652 190553 203686 114124 -167165 -509401 -631943 -465935 -146862 257746 677057
34318 677057 844813 617318 378983 630372 1200033 1399226 1025197 662510 787757 1071920
34308 1071920 925065 412710 217897 757397 1606816 1888328 1209714 188343 -107105
$$ packed form
34376D67812M34724N17786J81733k32407l25284j81860k51130p29343j205295
34367a323264j030193r5952Q67866J013756L89511j07164J00042N66370N82004
34358I62976J68460j80717l59761n54512n46326K8547P72333Q10448J51534j74912
34348A078070K99945P03695K20865n80393o50483l8316L79506L05391J62129R4433
34338A974842j53431m40972k94041J54852J88959l44095p25710m68840J8033J87055
34328I6652R3901J3133q9562k81289l42236j22542J66008L19073M04608M19311
34318F77057J67756k27495k38335K51389N69661J99193l74029l62687J25247K84163
34308A071920j46855n12355j94813N39500Q49419K81512o78614j021371k95448
$$ plain form
34299 -107105 649160 1603102 1720403 1017380 413949 509533 1019831 1430627 1638408 1724644
34289 1724644 1567616 1053838 430931 105612 161912 296004 223887 47593 164322 752335
34279 752335 1385954 1417368 839425 390252 521827 718758 360984 -180798 -118257 358247
34269 358247 277571 -496388 -924847 -382580 423492 656770 574155 828200 1271446 1305292
34259 1305292 946605 734777 880248 1183323 1493653 1624147 1186681 225960 -356286
34250 -356286 163702 1166090 1456892 978793 728905 1047618 1159618 658378 305807
34241 305807 774899 1509323 1610195 1222919 1175594 1580379 1672978 1039508 283799 213200
34231 213200 777081 1155851 797275 106713 -13530 750270 1695764 1890658 1225804 433650
$$ packed form
34299a07105P56265R53942J17301p03023o03431R5584N10298M10796K07781Q6236
34289A724644j57028n13778o22907l25319N6300J34092p2117j76294J16729N88013
34279G52335O33619L1414n77943m49173J31575J96931l57774n41782O2541M76504
34269C58247q0676p73959m28459N42267Q06072K33278q2615K54045M43246L3846
34259A305292l58687k11828J45471L03075L10330J30494m37466r60721n82246
34250c56286N19988J002388K90802m78099k49888L18713J12000n01240l52571
34241C05807M69092P34424J00872l87276m7325M04785R2599o33470p55709p0599
34231B13200N63881L78770l58576o90562j20243P63800R45494J94894o64854p92154
$$ plain form
34221 433650 147156 279641 380113 266739 127522 192397 485190 822870 983516 928283
34211 928283 833009 813814 736435 492392 341028 658984 1356097 1840841 1628646 777528
34201 777528 -265456 -1004007 -1113147 -639504 -36810 245067 228742 249507 400010 458674
34191 458674 339277 248890 372494 713258 1206671 1632407 1521637 689320 -159238 -17211
34181 -17211 1051931 1782874 1287850 195286 -249267 233579 814954 721687 18151 -665190
34171 -665190 -783557 -294234 335363 608095 605487 904904 1749587 2605544 2786178 2244190
34161 2244190 1472526 870248 506396 321019 271313 365995 666701 1081249 1169915 566994
34151 566994 -324363 -595679 -21562 573169 464088 -44746 -302217 -325288 -491541 -692459
$$ packed form
34221D33650k86494J32485J00472j13374j39217O4875K92793L37680J60646n5233
34211I28283r5274j9195p7379k44043j51364L17956O97113M84744k12195q51118
34201G77528j042984p38551j09140M73643O02694K81877j6325K0765J50503N8664
34191D58674j19397r0387J23604L40764M93413M25736j10770q32317q48558J42027
34181a7211J069142P30943m95024j092564m44553M82846N81375r3267p03536o83341
34171f65190j18367M89323O29597K72732k608K99417Q44683Q55957J80634n41988
34161B244190p71664o02278l63852j85377m9706R4682L00706M14548Q8666o02921
34151E66994q91357k71316N74117N94731j09081n08834k57471k3071j66253k00918
$$ plain form
34141 -692459 -543220 -146731 59502 15927 -33677 -102173 -293091 -309880 151265 700089
34131 700089 697131 274148 133310 405584 534803 318985 227719 534752 901693 1042114
34121 1042114 1131139 1335188 1516266 1561503 1466456 1059207 268414 -376896 -306068 56518
34111 56518 -223654 -997058 -1067913 -110125 717846 648845 522216 1216160 2017633 1782378
34101 1782378 852071 417641 541633 302093 -351905 -406992 442413 1201879 1149220 856523
34091 856523 1086953 1592838 1686303 1335464 984191 725141 354814 30954 216524 929440
34081 929440 1521305 1401672 755298 327512 550704 1081376 1291257 1036888 696244 551750
34071 551750 519858 505144 566598 607891 400913 119675 269916 767702 774848 -6161 -593546
$$ packed form
34141f92459J49239L96489K06233m3575m9604o8496j90918j6789M61145N48824
34131G00089k958m22983j40838K72274J29219k15818r1266L07033L66941J40421
34121A042114Q9025K04049J81078M5237r5047m07249p90793o45310P0828L62586
34111E6518k80172p73404p0855R57788Q27971o9001j26629O93944Q01473k35255
34101A782378r30307m34430J23992k39540o53998n5087Q49405P59466n2659k92697
34091H56523K30430N05885R3465l50839l51273k59050l70327l23860J85570P12916
34081I29440N91865j19633o46374m27786K23192N30672K09881k54369l40644j44494
34071E51750l1892j4714O1454M1293k06978k81238J50241M97786P146p81009n87385
$$ plain form
34060 -593546 -117271 663946 360442 -875843 -1467338 -712065 313244 480830 79163
34051 79163 -35426 204022 331252 284571 306663 349259 274492 321184 724299 1109017 882618
34040 882618 116095 -485329 -439733 97423 710014 1107083 1132772 755504 172929 -245171
34030 -245171 -225317 194970 685204 884984 747514 555594 475579 298806 -89823 -262813
34020 -262813 185268 798768 729174 67126 -125237 643513 1545163 1654167 1152468 736839
34010 736839 519209 260298 166777 618047 1394383 1917421 2053547 2051911 1941138 1636043
34000 1636043 1378017 1372094 1241730 614926 25291 327550 1300142 1799903 1411966 975614
33990 975614 1159026 1422874 969429 57433 -319433 257208 1206459 1699584 1441799 765459
$$ packed form
34060e93546M76275P81217l03504j236285n91495P55273J025309J67586m01667
34051G9163j14589K39448J27230m6681K2092M2596p4767M6692M03115L84718k26399
34040H82618p66523o01424M5596N37156O12591L97069K5689l77268n82575m18100
34030b45171J9854M20287M90234J99780j37470j91920q0015j76773l88629j72990
34020b62813M48081O13500o9594o62048j92363P68750R01650J09004n01699m15629
34010G36839k17630k58911r3521M51270P76336N23038J36126j636j10773l05095
34000A636043k58026n923j30364o26804n89635L02259R72592M99761l87937m36352
33990I75614J83412K63848m53445r11996l76866N76641R49251M93125k57785o76340
$$ plain form
33980 765459 213479 51547 121668 173664 200611 280549 299135 169920 144992 454244 784744
33969 784744 676294 344113 435755 930995 1016053 267444 -714558 -1164648 -1035249 -668155
33959 -668155 -179996 361710 646243 526386 369998 554103 917871 1118809 1203372 1408303
33949 1408303 1706269 1959369 2216059 2454635 2378248 1914315 1556783 1684367 1870304 1469250
33939 1469250 613336 -33661 -298017 -540985 -788057 -599688 95802 732344 867691
33930 867691 663626 439403 288189 331687 796316 1518351 1835657 1363323 577532 286972
33920 286972 728583 1441605 1844183 1714873 1273734 970106 1060524 1321027 1360715 1207748
33910 1207748 1242870 1511222 1561139 1154426 678286 557265 677869 759827 896762 1269649
$$ packed form
33980G65459n51980j61932P0121N1996K6947P9938J8586j29215k4928L09252L30500
33969G84744j08450l32181R1642M95240Q5058p48609r82002m50090J29399L67094
33959f68155M88159N41706K84533j19857j56388J84105L63768K00938Q4563K04931
33949A408303K97966K53100K56690K38576p6387m63933l57532J27584J85937m01054
33939A469250q55914o46997k64356k42968k47072J88369O95490O36542J35347
33930H67691k04065k24223j51214M3498M64629P22035L17306m72334p85791k90560
33920B86972M41611P13022M02578j29310m41139l03628R0418K60503L9688j52967
33910A207748L5122K68352M9917m06713m76140j21021J20604Q1958J36935L72887
$$ plain form
33900 1269649 1652097 1712194 1557991 1475885 1376201 1073545 888905 1279093 1985968 2297371
33890 2297371 2112159 1930257 1761226 1045962 -58576 -409400 469590 1435366 1324889
33881 1324889 688840 791715 1510062 1637538 1005741 730618 1177828 1232197 206941
33872 206941 -858574 -738719 173954 680004 609706 668872 982041 1047938 908238 1133491
33862 1133491 1640785 1664659 1091785 785082 1238236 1823029 1829645 1466335 1276925 1211940
33852 1211940 899419 380676 -21486 -256647 -448757 -485172 -178038 320248 651677 688835
33842 688835 555114 362199 180529 119197 227707 463592 847301 1374310 1702959 1378725
33832 1378725 580466 153435 553487 1212498 1375064 1128920 1078108 1357225 1577225 1514305
$$ packed form
33900A269649L82448O0097j54203q2106r9684l02656j84640L90188P06875L11403
33890B297371j85212j81902j69031p15264j104538l50824Q78990R65776j10477
33881A324889o36049J02875P18347J27476o31797k75123M47210N4369j025256
33872B06941j065515J19855R12673N06050p0298N9166L13169O5897j39700K25253
33862A133491N07294K3874n72874l06703M53154N84793O616l63310j89410o4985
33852A211940l12521n18743m02162k35161j92110l6415L07134M98286L31429L7158
33842F88835j33721j92915j81670o1332J08510K35885L83709N27009L28649l24234
33832A378725p98259m27031M00052O59011J62566k46144n0812K79117K20000o2920
$$ plain form
33822 1514305 1259915 844668 275221 -162272 -150725 199055 584152 1014369 1562875 1842219
33812 1842219 1403017 545679 29954 2450 -71153 -395323 -572371 -490844 -644233 -1203969
33802 -1203969 -1520314 -1051981 -205705 296703 420005 623290 1035017 1389365 1535307
33793 1535307 1501155 1265537 934966 920344 1419159 1914590 1759099 1122064 721968 668345
33783 668345 332623 -437766 -762671 66148 1366986 1815222 1208990 687873 1064725
33774 1064725 1702411 1546985 741513 421450 1024975 1642729 1338492 455684 57784
33765 57784 470401 1040040 1191457 1055662 971361 954805 926216 1039442 1445420 1943923
33755 1943923 2137987 1840279 1217636 669273 589497 1010956 1427576 1264652 626728 261223
$$ packed form
33822A514305k54390m15247n69447m37493J1547L49780L85097M30217N48506K79344
33812A842219m39202q57338n15725k7504p3603l24170j77048Q1527j53389n59736
33802a203969l16345M68333Q46276N02408J23302K03285M11727L54348J45942
33793A535307l4152k35618l30571j4622M98815M95431j55491o37035m00096n3623
33783F68345l35722p70389l24905Q28819J300838M48236o06232n21117L76852
33774A064725O37686j55426q05472l20063O03525O17754l04237q82808l97900
33765E7784M12617N69639J51417j35795q4301j6556k8589J13226M05978M98503
33755A943923J94064k97708o22643n48363p9776M21459M16620j62924o37924l65505
$$ plain form
33745 261223 635437 1392468 1920560 2080373 2050522 1807714 1227370 513737 67754 -5798
33735 -5798 121818 433374 1048624 1783846 2169696 2024762 1658283 1366801 1064100 609214
33725 609214 205636 180371 524511 932344 1223173 1466983 1697004 1743525 1456684 948150
33715 948150 482369 194540 33374 -53846 -28714 105819 219032 216803 210505 369386 631615
33704 631615 726919 512477 137233 -175541 -359747 -445758 -423330 -299724 -194767 -237933
33694 -237933 -423814 -666738 -912905 -1076123 -966740 -489778 108953 410601 302125 124015
33684 124015 245598 632598 977893 1155896 1328569 1592171 1750391 1586341 1213027 940236
33674 940236 853770 769683 619488 607413 866459 1208233 1417583 1599240 1979887 2507481
$$ packed form
33745B61223L74214P57031N28092J59813k9851k42808n80344p13633m45983p3552
33735e798J27616L11556O15250P35222L85850j44934l66479k91482l02701m54886
33725F09214m03578k5265L44140M07833K90829K43810K30021M6521k86841n08534
33715I48150m65781k87829j61166q7220K5132J34533J13213k229o298J58881K62229
33704F31615R5304k14442l75244l12774j84206q6011K2428J23606J04957m3166
33694b37933j85881k42924k46167j63218J09383M76962N98731L01648j08476j78110
33684A24015J21583L87000L45295J78003J72673K63602J58220j64050l73314k72791
33674I40236q6466q4087j50195j2075K59046L41774K09350J81657L80647N27594
$$ plain form
33664 2507481 2919224 3101710 3097808 2854228 2309893 1703121 1422806 1514162 1667482 1732599
33654 1732599 1865662 2084670 2103529 1796936 1455064 1351731 1406845 1507441 1777842 2220253
33644 2220253 2467037 2291609 2035098 2070684 2155167 1865923 1427710 1423531 1788344 1844855
33634 1844855 1436407 1278322 1867129 2663821 2827568 2320846 1779726 1589166 1614845 1680195
33624 1680195 1767899 1754157 1419066 847685 472649 550317 845115 1007594 1063371 1304367
33614 1304367 1799934 2252819 2359460 2144804 1866916 1703243 1642545 1627071 1654158 1717125
33604 1717125 1780436 1881316 2126765 2466717 2584012 2210749 1526865 1041824 1046750 1357241
33594 1357241 1639449 1787250 1864110 1855134 1678379 1382560 1170968 1214161 1494763 1810311
$$ packed form
33664B507481M11743J82486l902k43580n44335o06772k80315R1356J53320O5117
33654A732599J33063K19008J8859l06593l41872j03333N5114J00596K70401M42411
33644B220253K46784j75428k56511L5586Q4483k89244m38213m179L64813N6511
33634A844855m08448j58085N88807P96692J63747n06722n41120j90560K5679O5350
33624A680195Q7704j3742l35091n71381l75036P7668K94798J62479N5777K40996
33614A304367M95567M52885J06641k14656k77888j63673o0698j5474K7087O2967
33604A717125O3311J00880K45449L39952J17295l73263o83884m85041M926L10491
33594A357241K82208J47801P6860q976j76755k95819k11592M3193K80602L15548
$$ plain form
33584 1810311 1920667 1796388 1744286 2106767 2734636 2970048 2381233 1380373 832311
33575 832311 1095521 1724818 2119322 2159256 2111368 2187306 2387223 2611788 2754955 2797755
33565 2797755 2923841 3379875 4072917 4498290 4309057 3813025 3597219 3739456 3773697 3476427
33555 3476427 3252701 3492243 3892013 3844384 3338816 2980513 3068528 3155848 2789128 2271303
33545 2271303 2231362 2674817 3025579 3061423 3192602 3666572 4113968 4217154 4247192 4439098
33535 4439098 4401044 3883379 3667648 4667912 6331683 7091256 6522902 5881472 6147750
33526 6147750 6783675 7063652 7390631 8300584 9302790 9957645 10929171 12152957 10919409
33517 10919409 4433555 -5564663 -13298480 -15081649 -12969571 -11150926 -10736435 -10014182
$$ packed form
33584A810311J10356j24279n2102L62481O27869K35412n88815j000860n48062
33575H32311K63210O29297L94504L9934m7888P5938J99917K24565J43167M2800
33565B797755J26086M56034O93042M25373j89233m96032k15806J42237L4241k97270
33555C476427k23726K39542L99770m7629n05568l58303Q8015Q7320l66720n17825
33545B271303l9941M43455L50762L5844J31179M73970M47396J03186L0038J91906
33535D439098l8054n17665k15731J000264J663771P59573n68354o41430K66278
33526F147750O35925K79977L26979R09953J002206O54855R71526J223786j233548
33517A0919409o485854r998218p733817j783169K112078J818645M14491P22253
$$ plain form
33509 -10014182 -8283687 -6797289 -6279530 -5886245 -4994180 -4212790 -4001565 -3704109 -2729506
33500 -2729506 -1654849 -1368931 -1840742 -2412072 -2755834 -2942709 -2980594 -2823048 -2562123
33491 -2562123 -2251222 -1807597 -1335376 -1188216 -1435787 -1615324 -1311629 -697227 -241043
33482 -241043 -156649 -367283 -730628 -1050687 -1113103 -937874 -788318 -758475 -596180 -128550
33472 -128550 364012 419262 -92441 -856276 -1392786 -1393283 -940392 -453327 -291610 -425095
33462 -425095 -598976 -683668 -680032 -590106 -541365 -762497 -1091632 -881429 77709 920009
33452 920009 716641 -167864 -593506 -307461 -79386 -259114 -353212 -167336 -158968 -312671
33442 -312671 120130 1212104 1852161 1365629 569659 374285 371281 -143903 -667358 -257955
$$ packed form
33509a0014182J730495J486398N17759L93285Q92065P81390K11225K97456R74603
33500b729506J074657K85918m71811n71330l43762j86875l7885J57546K60925
33491b562123L10901M43625M72221J47160k47571j79537L03695O14402M56184
33482b41043Q4394k10634l63345l20059o2416J75229J49556K9843J62295M67630
33472a28550M92562N5250n11703p63835n36510m97M52891M87065J61717j33485
33462d25095j73881q4692L636Q9926M8741k21132l29135K10203R59138Q42300
33452I20009k03368q84505m25642K86045K28075j79728r4098J85876Q368j53703
33442c12671M32801J091974O40057m86532p95970j95374l004n15184n23455M09403
$$ plain form
33432 -257955 826729 1529368 1591682 1550193 1481194 979403 202111 -238214 -340033 -582893
33422 -582893 -821072 -442494 369939 709430 421536 371213 966653 1502667 1371643 934784
33412 934784 695572 495930 109205 -122654 135587 580937 767274 746004 762915 818124
33402 818124 952045 1426349 2139411 2394068 1803436 959576 604664 565499 206448 -373249
33392 -373249 -400841 353117 1132530 1148496 488581 -151521 -330484 -214817 -208450 -433002
33382 -433002 -632391 -553697 -282637 -42794 232749 800244 1530277 1815191 1286208 361102
33372 361102 -199293 -113231 294047 633388 819354 932710 994025 969746 876641 788232
33362 788232 756326 762114 763207 772004 819066 829595 665604 367001 207754 384189 773499
$$ packed form
33432b57955J084684P02639O2314m1489o8999n01791p77292m40325j01819k42860
33422e82893k38179L78578Q12433L39491k87894n0323N95440N36014j31024m36859
33412I34784k39212j99642l86725k31859K58241M45350J86337k1270J6911N5209
33402H18124J33921M74304P13062K54657n90632q43860l54912l9165l59051n79697
33392c73249k7592P53958P79413J5966o59915o40102j78963J15667O367k24552
33382d33002j99389P8694K71060K39843K75543N67495P30033K84914n28983r25106
33372C61102n60395Q6062M07278L39341J85966J13356O1315k4279r3105q8409
33362G88232l1906N788J093Q797M7062J0529j63991k98603j59247J76435L89310
$$ plain form
33351 773499 1122789 1310887 1286646 988833 545189 283066 250662 26337 -602826 -1092498
33341 -1092498 -824379 -91562 280086 163377 192016 552005 576704 -125733 -876907 -776019
33331 -776019 139603 1072123 1455179 1327798 990609 720463 684415 814857 851579 672485
33321 672485 430511 269670 160225 131586 368176 911593 1537738 2058797 2464537 2687851
33311 2687851 2598884 2332616 2205465 2188841 1941807 1509083 1409096 1769396 1983274 1614155
33301 1614155 1066200 879062 897822 717491 483969 608666 1040030 1433435 1715333 1876903
33291 1876903 1596724 799764 249701 719385 1762447 2202867 1756932 1234985 1120691
33282 1120691 981896 537786 294813 607728 943486 733780 321797 351406 690187 708260
$$ packed form
33351G73499L49290J88098k4241k97813m43644k62123l2404k24325o29163m89672
33341a092498K68119P32817L71648j16709K8639L59989K4699p02437p51174J00888
33331g76019R15622R32520L83056j27381l37189k70146l6048J30442L6722j79094
33321F72485k41974j60841j09445k8639K36590N43417O26145N21059M05740K23314
33311B687851q8967k66268j27151j6624k47034m32724r9987L60300K13878l69119
33301A614155n47955j87138J8760j80331k33522J24697M31364L93405K81898J61570
33291A876903k80179p96960n50063M69684J043062M40420m45935n21947j14294
33282A120691j38795m44110k42973L12915L35758k09706m11983K9609L38781J8073
$$ plain form
33272 708260 329596 75494 208616 499296 776297 1066034 1172572 786402 181248 172496
33262 172496 1020944 1860138 1690822 643509 -251419 -369964 -11931 357088 746406
33253 746406 1255907 1561740 1284958 637996 201461 142352 152011 164516 551819 1368616
33243 1368616 1939399 1666553 914707 546068 753890 954521 816312 737574 1068263 1434189
33233 1434189 1302377 859196 764946 1171475 1547955 1541862 1494455 1849967 2436607 2704137
33223 2704137 2468620 2037922 1684444 1387584 1142594 1149320 1495010 1893980 1986120 1769777
33213 1769777 1531508 1443257 1455963 1547110 1810224 2212219 2452374 2240044 1673726 1198944
33203 1198944 1130987 1301213 1298223 1048630 967129 1389932 2016477 2190595 1713699 1083817
$$ packed form
33272G08260l78664k54102J33122K90680K77001K89737J06538l86170o05154q752
33262A72496Q48448Q39194j69316j047313q94928j18545L58033L69019L89318
33253G46406N09501L05833k76782o46962m36535n9109R659J2505L87303Q16797
33243A368616N70783k72846p51846l68639K07822K00631j38209p8738L30689L65926
33233A434189j31812m43181r4250M06529L76480o093m7407L55512N86640K67530
33223B704137k35517m30698l53478k96860k44990O726L45690L98970R2140k16343
33213A769777k38269q8251J2706R1147K63114M01995K40155k12330n66318m74782
33203A198944o7957J70226k990k49593q1501M22803O26545J74118m76896o29882
$$ plain form
33193 1083817 852859 1031197 1283523 1450050 1612632 1794268 1872159 1771445 1566955 1385474
33183 1385474 1295600 1273508 1249482 1252155 1472945 2020396 2624629 2818765 2449128 1785459
33173 1785459 1147264 726947 729189 1208540 1719444 1698056 1354813 1552330 2514807 3361990
33163 3361990 3375373 2996637 2913489 2855598 2204734 1272696 897218 1037020 864062 200866
33153 200866 -174571 222839 942147 1386881 1461936 1268822 906200 734280 1118422 1775141
33143 1775141 2079239 2063713 2279711 2625516 2363346 1529662 1181722 1747843 2232887 1783249
33133 1783249 1057538 1121545 1761493 1941708 1423156 884857 726502 718986 727058 910208
33123 910208 1176708 1161707 861727 719515 938542 1176972 1112360 978679 1284997 2088853
$$ packed form
33193A083817k30958J78338K52326J66527J62582J81636P7891j00714k04490j81481
33183A385474q9874k2092k4026K673K20790N47451O04233J94136l69637o63669
33173A785459o38195m20317K242M79351N10904k1388l43243J97517R62477Q47183
33163C361990J3383l78736q3148n7891o50864r32038l75478J39802j72958o63196
33153B00866l75437L97410P19308M44734P5055j93114l62622j71920L84142O56719
33143A775141L04098j5526K15998L45805k62170q33684l47940N66121M85044m49638
33133A783249p25711O4007O39948J80215n18552n38299j58355p516Q072J83150
33123I10208K66500j5001k99980j42212K19027K38430o4612j33681L06318Q03856
$$ plain form
33113 2088853 2742025 2509521 1459286 492916 293652 551905 622282 575466 911157 1496580
33103 1496580 1717621 1622112 1869639 2422679 2420310 1690123 1228975 1633070 2167374 2099734
33093 2099734 1858236 1962684 1857125 964414 66550 326966 1479520 2255270 2246684 2144344
33083 2144344 2366983 2616796 2690895 2703603 2560417 2106027 1675723 1652188 1686001 1266388
33073 1266388 818663 1187634 2162804 2598316 2007114 1045853 400869 165772 354753
33064 354753 1040824 1865006 2296326 2444695 2761801 3009487 2558800 1691725 1432936 1962507
33054 1962507 2399946 2381592 2561928 3156327 3331185 2712985 2269930 2803389 3593761 3547165
33044 3547165 2851126 2427450 2404025 2265385 2081978 2416997 3135615 3348180 2679152 1837637
$$ packed form
33113B088853O53172k32504j050235r66370j99264K58253P0377m6816L35691N85423
33103A496580K21041r5509K47527N53040k369p30187m61148M04095N34304o7640
33093B099734k41498J04448j05559q92711q97864K60416J152554P75750q586j02340
33083B144344K22639K49813P4099J2708j43186m54390m30304k3535L3813m19613
33073A266388m47725L68971R75170M35512n91202r61261o44984k35097J88981
33064C54753O86071Q24182M31320J48369L17106K47686m50687q67075k58789N29571
33054A962507M37439j8354J80336N94399J74858o18200m43055N33459P90372m6596
33044C547165o96039m23676k3425j38640j83407L35019P18618K12565o69028q41515
$$ plain form
33034 1837637 1713453 2401800 3278151 3688874 3464506 2976592 2723901 2774227 2764904 2552716
33024 2552716 2530670 3006615 3563411 3481326 2698293 1954940 1947100 2593811 3221295 3329281
33014 3329281 3072014 2955936 3117728 3130257 2687198 2195936 2267396 2779745 3027465 2818494
33004 2818494 2779509 3339497 4010771 4114054 3781489 3696773 4055916 4328136 4061294 3505387
32994 3505387 3248863 3432561 3572315 3224844 2655123 2545215 2999733 3246364 2650443
32985 2650443 1706660 1494232 2260721 3108027 3148243 2479494 1845489 1714226 1926843 2041369
32975 2041369 1846983 1599448 1727855 2252497 2706344 2796267 2798005 2969373 2987593 2519258
32965 2519258 1993145 2084760 2656241 3002556 3013397 3199872 3581407 3537665 2977015 2691624
$$ packed form
33034A837637j24184O88347Q76351M10723k24368m87914k52691N0326r323k12188
33024B552716k2046M75945N56796q2085p83033p43353p840O46711O27484J07986
33014C329281k57267j16078J61792J2529m43059m91262P1460N12349K47720k08971
33004B818494l8985N59988O71274J03283l32565q4716L59143K72220k66842n55907
32994C505387k56524J83698J39754l47471n69721j09908M54518K46631n95921
32985B650443r43783k12428P66489Q47306M0216o68749o34005j31263K12617J14526
32975B041369j94386k47535J28407N24642M53847Q9923J738J71368J8220m68335
32965B519258n26113R1615N71481L46315J0841J86475L81535m3742n60650k85391
$$ plain form
32955 2691624 3146839 3760845 3892868 3794765 3963672 4166521 3822848 2981557 2280514 2149839
32945 2149839 2515958 3066297 3421384 3305751 2906696 2777178 3054337 3164968 2749045
32936 2749045 2449148 3099024 4343700 4862334 4082978 3003723 2942845 3907700 4697153
32927 4697153 4459512 3633862 3230230 3594189 4221894 4564581 4562955 4411173 4237752 4138446
32917 4138446 4162046 4136369 3854256 3521078 3593098 4063353 4412805 4407288 4335165 4272143 3872683
32906 3872683 3215059 2986682 3337012 3483455 3125810 3226873 4437311 5739527 5883174
32897 5883174 5307076 5220249 5525066 5288225 4699300 4715131 5058991 4534471 3328365 3017592
32887 3017592 3999120 4841036 4702507 4521312 5041223 5460527 5096451 4816604 5533003
$$ packed form
32955B691624M55215O14006J32023r8103J68907K02849l43673q41291p01043j30675
32945B149839L66119N50339L55087j15633l99055j29518K77159J10631m15923
32936B749045k99897O49876J244676N18634p79356j079255o0878R64855P89453
32927D697153k37641q25650m03632L63959O27705L42687j626j51782j73421r9306
32917D138446K3600k5677k82113l33178P2020M70255L49452n517p2123o3022l99460
32906C872683o57624k28377L50330J46443l57645J01063J210438J302216J43647
32897E883174n76098q6827L04817k36841n88925J5831L43860n24520j206106l10773
32887C017592R81528Q41916j38529j81195N19911M19304l64076k79847P16399
$$ plain form
32878 5533003 6508086 6497280 5667662 5124492 5216215 5462511 5655163 5981506 6363970 6505206
32868 6505206 6388687 6205590 6071843 6152902 6618932 7198111 7337996 7062934 7015306 7402318
32858 7402318 7649734 7375069 6903812 6516086 6020563 5425915 5201302 5488192 5816674
32849 5816674 5910269 6024404 6298453 6570236 6890329 7307235 7236620 6224234 5231181 5686817
32839 5686817 7225243 8034118 7656216 7586940 8628302 9607955 9522480 9092578 9169474 9288914
32829 9288914 8940371 8761118 9319397 10036607 10324097 10491863 10682819 10350019 9639958
32820 9639958 9744637 10977122 12071816 12265342 12391021 13035103 13434693 13173233 13104503
32811 13104503 13635214 14031082 14274282 15394323 17105063 17661547 16990068 16998144 17667716
$$ packed form
32878E533003R75083j0806q29618n43170R1723K46296J92652L26343L82464J41236
32868F505206j16519j83097j33747Q1059M66030N79179J39885k75062m7628L87012
32858G402318K47416k74665m71257l87726m95523n94648k24613K86890L28482
32849E816674R3595J14135K74049K71783L20093M16906p0615j012386r93053M55636
32839E686817J538426Q08875l77902o9276J041362R79653q5475m29902P6896J19440
32829I288914l48543j79253N58279P17210K87490J67766J90956l32800p10061
32820I639958J04679J232485J094694J93526J25679O44082L99590k61460o8730
32811A3104503N30711L95868K43200J120041J710740N56484o71479Q076O69572
$$ plain form
32802 17667716 16377360 12803269 10651045 12096672 14306606 14395347 14009661 15502727
32794 15502727 17335069 17409496 17495286 19786009 22286794 22479915 22430900 24970931 27906311
32785 27906311 27899118 27140440 29599085 33382080 34230657 34235670 38624034 45507360 48348457
32776 48348457 48131937 52512550 61749142 67328107 69032700 81974231 117435874 162127592
32768 162127592 183915406 156613097 78710747 -23955816 -109940680 -146897283 -135591131
32761 -135591131 -106961486 -89793085 -85684718 -80121845 -68456690 -59116335 -56457652
32754 -56457652 -54728438 -49709486 -44867394 -43120073 -41486925 -37462429 -33649500 -32498701
32746 -32498701 -32085954 -30330969 -28617878 -28315459 -27894770 -26143927 -24522236 -24008375 -23098674
$$ packed form
32802A7667716j290356l574091k152224J445627K209934Q8741l85686J493066
32794A5502727J832342P4427Q5790K290723K500785J93121m9015K540031K935380
32785B7906311p193p58678K458645L782995Q48577N013M388364O883326K841097
32776D8348457k16520M380613R236592N578965J704593J2941531L5461643M4691718
32768A62127592K1787814k7302309p7902350j02666563q5984864l6956603J1306152
32761a35591131K8629645J7168401M108367N562873J1665155R340355K658683
32754e6457652J729214N018952M842092J747321J633148M024496L812929J150799
32746c2498701M12747J754985J713091L02419M20689J750843J621691N13861R09701
$$ plain form
32737 -23098674 -21022056 -19570643 -19751986 -19880859 -18891611 -18301687 -18942145 -18954426 -17165160
32728 -17165160 -15437230 -15436414 -15851980 -15098099 -14146879 -14294042 -14490939 -13372759 -11914786
32719 -11914786 -11669986 -12093503 -11861139 -11302262 -11408182 -11789437 -11561920 -11028891 -10774448
32710 -10774448 -10347063 -9422520 -8945878 -9555087 -10196367 -9841940 -9248054 -9465602 -9941973
32701 -9941973 -9698771 -9134581 -9059650 -9122391 -8755692 -8543351 -9111654 -9766405 -9709769 -9483320
32691 -9483320 -9741547 -9800918 -8980718 -8191789 -8489177 -9128115 -8818471 -7930546 -7648397 -7808795
32681 -7808795 -7452502 -6815904 -6896829 -7540812 -7725850 -7374089 -7254161 -7422027 -7293665 -6956100
32671 -6956100 -6955157 -7081448 -6739807 -6203907 -6184945 -6515318 -6557142 -6489467 -6829923 -7114661
$$ packed form
32737b3098674K076618J451413j81343j28873R89248N89924o40458j2281J789266
32728a7165160J727930Q16m15566P53881R51220j47163j96897J118180J457973
32719a1914786K44800m23517K32364N58877j05920l81255K27517N33029K54443
32710a0774448M27385R24543M76642o09209o41280L54427N93886k17548m76371
32701i941973K43202N64190P4931o2741L66699K12341n68303o54751N6636K26449
32691i483320k58227n9371Q20200P88929k97388o38938L09644Q87925K82149j60398
32681g808795L56293O36598q0925o43983j85038L51761J19928j67866J28362L37565
32671f956100R43j26291L41641N35900J8962l30373m1824O7675l40456k84738
$$ plain form
32661 -7114661 -6517385 -5448585 -5062809 -5411513 -5531327 -5189762 -5098272 -5453917 -5629778
32652 -5629778 -5335988 -4910000 -4530079 -4257519 -4632150 -5981315 -7334571 -7328161 -6072950
32643 -6072950 -4892718 -4412117 -4224336 -4218754 -4717841 -5337615 -5229616 -4554373 -4309003 -4639430
32633 -4639430 -4766094 -4598836 -4812881 -5197418 -4699999 -3479168 -3104323 -4083369 -4933033
32624 -4933033 -4554932 -3881607 -4082685 -4637904 -4504038 -3968439 -3910900 -4137233 -3871396 -3273288
32614 -3273288 -3151737 -3591913 -4000192 -4154629 -4212160 -4042989 -3520891 -3125298 -3318884 -3659017
32604 -3659017 -3447560 -2920718 -2820734 -3095906 -3090980 -2837722 -3032769 -3738600 -4189005 -4034039
32594 -4034039 -3787824 -3802999 -3736530 -3386118 -3202765 -3493033 -3811672 -3677178 -3336476 -3283828
$$ packed form
32661g114661N97276J068800L85776l48704j19814L41565R1490l55645j75861
32652e629778K93790M25988L79921K72560l74631j349165j353256O410J255211
32643f072950J180232M80601J87781N582m99087o19774J07999O75243K45370l30427
32633d639430j26664J67258k14045l84537M97419J220831L74845r79046q49664
32624d933033L78101O73325k01078n55219J33866N35599N7539k26333K65837N98108
32614c273288J21551m40176m08279j54437n7531J69171N22098L95593j93586l40133
32604c659017K11457N26842R9984k75172M926K53258j95047p05831m50405J54966
32594d034039K46215j5175O6469L50412J83353k90268l18639J34494L40702N2648
$$ plain form
32584 -3283828 -3467225 -3523276 -3478000 -3668956 -4136066 -4528839 -4530943 -4083082 -3338992 -2679084
32574 -2679084 -2565449 -3037335 -3497021 -3348777 -2751302 -2399481 -2647449 -3213442 -3709152
32565 -3709152 -4044126 -4215034 -4068851 -3516360 -2807771 -2389899 -2505017 -2966452 -3288385
32556 -3288385 -3094182 -2514329 -2105975 -2210995 -2488176 -2332737 -1701568 -1203640 -1340911
32547 -1340911 -1970158 -2600723 -2932615 -2975801 -2897162 -2902966 -3090619 -3328521 -3440326 -3462814
32537 -3462814 -3443224 -3090865 -2128564 -1002403 -625650 -1232889 -2098050 -2634538 -3076650
32528 -3076650 -3684046 -4056784 -3891337 -3708334 -3981177 -4132996 -3422112 -2405678 -2359804
32519 -2359804 -3393086 -4263237 -4089544 -3203048 -2233155 -1432376 -1090665 -1530228 -2348260
$$ packed form
32584c283828j83397n6051M5276j90956m67110l92773k104M47861P44090O59908
32574b679084J13635m71886m59686J48244N97475L51821k47968n65993m95710
32565c709152l34974j70908J46183N52491P08589M17872j15118m61435l21933
32556c288385J94203N79853M08354j05020k77181J55439O31169M97928j37271
32547a340911o29247o30565l31892m3186P8639n804j87653k37902j11805k2488
32537c462814J9590L52359R62301J126161L76753o07239q65161n36488m42112
32528c076650o07396l72738J65447J83003k72843j51819P10884J016434M5874
32519b359804j033282q70151J73693Q86496R69893Q00779L41711m39563q18032
$$ plain form
32510 -2348260 -2646731 -2355815 -2333985 -2809124 -2878970 -2127561 -1532959 -1896867 -2453497 -2157847
32500 -2157847 -1488441 -1669323 -2670307 -3326753 -3158815 -2778840 -2570635 -2207974 -1646705
32491 -1646705 -1495977 -2036554 -2698372 -2894077 -2737605 -2616163 -2597222 -2565312 -2496957 -2334566
32481 -2334566 -1959399 -1490655 -1270329 -1395891 -1593296 -1666903 -1728200 -1855864 -1888467 -1743962
32471 -1743962 -1659644 -1892456 -2328781 -2545460 -2222582 -1500097 -956413 -1083620 -1683518 -2025385
32461 -2025385 -1777767 -1443785 -1555368 -1832671 -1692367 -1306921 -1441849 -2279017 -3092471
32452 -3092471 -3241586 -2923979 -2717466 -2812521 -2960166 -2900539 -2633196 -2387200 -2344864 -2295321
32442 -2295321 -1780069 -859946 -409235 -1098697 -2316094 -2813893 -2355496 -1910925 -2128295
$$ packed form
32510b348260k98471K90916K1830m75139o9846P51409N94602l63908n56630K95650
32500b157847O69406j80882j000984o56446J67938L79975K08205L62661N61269
32491a646705J50728n40577o61818j95705J56472J21442J8941L1910O8355J62391
32481b334566L75167M68744K20326j25562j97405p3607o1297j27664l2603J44505
32471a743962Q4318k32812m36325k16679L22878P22485N43684j27207n99898l41867
32461b025385K47618L33982j11583k77303J40304L85446j34928q37168q13454
32452c092471j49115L17607K06513r5055j47645N9627K67343K45996M2336M9543
32442b295321N15252R20123M50711o89462j217397m97799M58397M44571k17370
$$ plain form
32433 -2128295 -2493454 -2343833 -1881772 -1605902 -1410200 -990288 -693751 -1130129 -2094477
32424 -2094477 -2647088 -2327155 -1673978 -1382596 -1461954 -1510535 -1427784 -1430792 -1526446 -1412531
32414 -1412531 -1000162 -698395 -903380 -1379063 -1522746 -1235703 -1087130 -1433311 -1833008
32405 -1833008 -1745125 -1437060 -1589502 -2167546 -2387838 -1875268 -1188181 -962819 -1131301 -1342296
32395 -1342296 -1623806 -2117587 -2529618 -2440819 -2005003 -1798056 -2015374 -2300539 -2392192 -2460357
32385 -2460357 -2655701 -2755285 -2534744 -2186574 -2020495 -1930355 -1554453 -923396 -537629 -686817
32375 -686817 -1056020 -1233564 -1280644 -1436698 -1523781 -1173695 -571840 -385912 -828138 -1330503
32365 -1330503 -1402548 -1313098 -1552042 -2037653 -2319945 -2274579 -2133977 -2043038 -1994548 -1997236 -1935976
$$ packed form
32433b128295l65159J49621M62061K75870J95702M19912K96537m36378r64348
32424b094477n52611L19933O53177K91382p9358m8581Q2751l008r5654J13915
32414a412531M12369L01767k04985m75683j43683K87043J48573l46181l99697
32405a833008Q7883L08065j52442n78044k20292N12570O87087K25362j68482k10995
32395a342296k81510m93781m12031Q8799M35816K06947k17318k85165r1653o8165
32385b460357j95344r9584K20541L48170J66079R0140L75902O31057L85767j49188
32375f86817l69203j77544m7080j56054q7083L50086O01855J85928m42226n02365
32365a330503p2045Q9450k38944m85611k82292M5366J40602R0939M8490k688O1260
$$ plain form
32354 -1935976 -1538581 -885031 -598309 -1016337 -1559621 -1576006 -1421275 -1839888 -2573468 -2660263
32344 -2660263 -2039321 -1674678 -1921133 -1993574 -1480635 -1160766 -1594175 -2020196 -1658758 -1200879
32334 -1200879 -1759633 -2919387 -3187115 -2189141 -1141570 -1049350 -1563138 -1887535 -1828644
32325 -1828644 -1513683 -901718 -134081 223962 -144062 -796493 -1167479 -1339380 -1695185
32316 -1695185 -2123283 -2152441 -1743518 -1385585 -1371971 -1454393 -1361019 -1265578 -1465512 -1830874
32306 -1830874 -1925568 -1643071 -1389540 -1481883 -1607388 -1201957 -310184 314779 133274 -475546
32296 -475546 -745446 -554037 -491726 -935134 -1520226 -1716022 -1550225 -1449697 -1574656 -1668698
32286 -1668698 -1516581 -1239220 -1077419 -1105388 -1254933 -1470681 -1726510 -1969517 -2140519 -2208106
$$ packed form
32354a935976L97395O53550K86722m18028n43284j6385J54731m18613p33580q6795
32344b660263O20942L64643k46455p2441N12939L19869m33409m26021L61438M57879
32334a200879n58754j159754k67728R97974J047571R2220n13788l24397N8891
32325a828644L14961O11965P67637L58043l68024o52431l70986j71901l55805
32316a695185m28098k9158M08923L57933J3614q2422R3374R5441j99934l65362
32306a830874r4694K82497K53531r2343j25505M05431Q91773O24963j81505o08820
32296d75546k69900J91409O2311m43408n85092j95796J65797J00528j24959r4042
32286a668698J52117K77361J61801k7969j49545k15748k55829k43007j71002o7587
$$ plain form
32276 -2208106 -2128487 -1831597 -1328290 -806732 -537702 -646479 -989732 -1275469 -1333130 -1287646
32266 -1287646 -1423085 -1809033 -2118575 -1963314 -1401387 -909809 -786695 -820226 -705303 -511999
32256 -511999 -428252 -274707 222042 730424 489667 -608611 -1640448 -1747982 -1240454
32247 -1240454 -1091311 -1547660 -1830277 -1270337 -239418 330553 92340 -383907 -415434
32238 -415434 -86038 -91830 -743470 -1468073 -1574878 -1226226 -1111155 -1283617 -1092638 -436171
32228 -436171 -215104 -988497 -1923937 -1908693 -1163578 -772353 -960173 -973669 -586891 -518798
32218 -518798 -1097586 -1597491 -1394017 -898037 -776404 -981800 -1151326 -1316637 -1574562 -1604258
32208 -1604258 -1175832 -683502 -542930 -502327 -201168 41027 -259750 -836663 -1088568 -1103402
$$ packed form
32276b208106P9619K96890N03307N21558K69030j08777l43253k85737n7661M5484
32266a287646j35439l85948l09542J55261N61927M91578J23114l3531J14923J93304
32256e11999Q3747J53545M96749N08382k40757j098278j031837j07534N07528
32247a240454J49143m56349k82617N59940J030919N69971k38213m76247l1527
32238d15434L29396n792o51640p24603j06805L48652J15071j72462J90979O56467
32228d36171K21067p73393r35440J5244P45115L91225j87820j3496L86778O8093
32218e18798n78788m99905K03474M95980J21633k05396j69526j65311k57925k9696
32208a604258M28426M92330J40572M0603L01159K42195l00777n76913k51905j4834
$$ plain form
32198 -1103402 -1378198 -1726431 -1446511 -570280 19733 -124839 -504393 -685429 -948195
32189 -948195 -1509107 -1898318 -1713613 -1393593 -1560575 -1985632 -1887935 -1069200 -151661 241412
32179 241412 41623 -497473 -1099816 -1435884 -1205913 -500255 127139 182922 -220102 -517421
32169 -517421 -413105 -266921 -587760 -1239027 -1490634 -993511 -351441 -371594 -979486 -1351131
32159 -1351131 -1025628 -352395 198322 584363 840367 734554 194468 -295658 -206778 291883
32149 291883 505923 68300 -678935 -1113978 -937373 -413416 -160424 -575546 -1344046 -1722435
32139 -1722435 -1446408 -1058376 -1113398 -1436036 -1545591 -1449451 -1448566 -1414409 -976306 -373135
32129 -373135 -356015 -1076098 -1769184 -1866967 -1789017 -2153786 -2724941 -2774005 -2180905 -1513508
$$ packed form
32198a103402k74796l48233K79920Q76231N90013j44572l79554j81036k62766
32189i48195n60912l89211J84705L20020j66982m25057R7697Q18735R17539L93073
32179B41412j99789n39096o02343l36068K29971P05658O27394N5783m03024k97319
32169e17421J04316J46184l20839o51267k51607M97123O42070k0153o07892l71645
32159a351131L25503O73233N50717L86041K56004j05813n40086m90126Q8880M98661
32149B91883K14040m37623p47235m35043J76605N23957K52992m15122p68500l78389
32139a722435K76027L88032n5022l22638j09555R6140Q85L4157M38103O03171
32129c73135J7120p20083o93086r7783P7950l64769n71155m9064N93100O67397
$$ plain form
32119 -1513508 -1150888 -982671 -988925 -1451046 -2335765 -2982529 -2796548 -1976100 -1211039 -854973
32109 -854973 -732675 -632379 -594673 -671867 -710811 -530819 -176601 113415 121237 -188735
32099 -188735 -608706 -775994 -490605 -15458 114432 -286189 -777325 -824840 -477997 -264434
32089 -264434 -474050 -850345 -1025657 -954525 -794758 -648089 -613691 -835920 -1230130 -1384794
32079 -1384794 -1079944 -736755 -926205 -1493564 -1649603 -1014447 -118908 321506 225307 -33691
32069 -33691 -262267 -521504 -788040 -938276 -982502 -1021126 -1065059 -1144797 -1422203 -1879011
32059 -1879011 -2089024 -1720071 -1120198 -910563 -1080638 -1077686 -814680 -884651 -1514209 -1977430
32049 -1977430 -1549739 -559910 84430 74277 -216268 -570734 -1122629 -1727754 -1865212 -1398521
$$ packed form
32119a513508L62620J68217o254m62121q84719o46764J85981Q20448P65061L56066
32109h54973J22298J00296L7706p7194l8944J79992L54218K90016P822l09972
32099a88735m19971j67288K85389M75147J29890m00621m91136m7515L46843K13563
32089b64434k09616l76295j75312P1132J59767J46669L4398k22229l94210j54664
32079a384794L04850L43189j89450n67359j56039O35156Q95539M40414r6199k58998
32069c3691k28576k59237k66536j50236m4226l8624m3933p9738k77406m56808
32059a879011k10013L68953N99873K09635j70075K952K63006o9971o29558m63221
32049a977430M27691R89829O44340j0153k90545l54466n51895o05125j37458M66691
$$ plain form
32039 -1398521 -907521 -955459 -1395076 -1691127 -1624418 -1368164 -1112004 -954195 -1019301 -1337267
32029 -1337267 -1636204 -1529281 -943792 -208369 271668 304630 -23458 -368815 -290917 317607
32019 317607 929619 794909 -216106 -1392689 -1951562 -1817573 -1455278 -1166413 -909009
32010 -909009 -693891 -696614 -875940 -892280 -641367 -534883 -919872 -1474222 -1594111 -1228014
32000 -1228014 -851655 -666462 -372930 127922 352028 -98241 -858279 -1226518 -1057349
31991 -1057349 -809936 -812392 -901607 -828576 -664460 -647103 -814987 -943089 -794233 -395171
31981 -395171 -80404 -200577 -718977 -1174897 -1143141 -670492 -191458 -99929 -452375 -957641
31971 -957641 -1200167 -1035308 -805764 -947406 -1372014 -1605712 -1597450 -1836076 -2405500 -2580597
$$ packed form
32039a398521M91000m7938m39617k96051O6709K56254K56160J57809o5106l17966
32029a337267k98937J06923N85489P35423M80037L2962l28088l45357P7898O08524
32019C17607O12012j34710j011015j176583n58873J33989L62295K88865K57404
32010i09009K15118k723j79326j6340K50913J06484l84989n54350j19889L66097
32000a228014L76359J85193K93532N00852K24106m50269p60038l68239J69169
31991a057349K47413k456q9215P3031J64116J7357j67884j28102J48856L99062
31981c95171L14767j20173n18400m55920L1756M72649M79034R1529l52446n05266
31971i57641k42526J64859K29544j41642m24608k33698Q262k38626n69424j75097
$$ plain form
31961 -2580597 -1916926 -1141885 -1144215 -1529550 -1228331 -324441 -49216 -806764 -1439713 -971596
31951 -971596 -9225 338102 58634 -159353 -256156 -670966 -1255854 -1383594 -1033801 -812860
31941 -812860 -849221 -557018 304642 1110388 1210335 674543 -101706 -943283 -1656279 -1775171
31931 -1775171 -1100288 -203696 115467 -238827 -689864 -875090 -1066223 -1598084 -2216333
31922 -2216333 -2284461 -1584468 -671410 -297880 -594930 -1030897 -1153890 -1062176 -1011066 -922011
31912 -922011 -647319 -469521 -817666 -1527532 -1892705 -1559474 -944604 -612288 -634610 -771841
31902 -771841 -899390 -956509 -775122 -314508 113684 174123 -50180 -210695 -192443 -202752
31892 -202752 -406426 -690632 -807468 -649594 -411189 -477559 -988643 -1489133 -1307535 -440988
$$ packed form
31961b580597O63671P75041k330l85335L01219R03890K75225p57548o32949M68117
31951i71596R62371L47327k79468k17987r6803m14810n84888j27740L49793K20941
31941h12860l6361K92203Q61660Q05746R9947n35792p76249q41577p12996j18892
31931a775171O74883Q96592L19163l54294m51037j85226j91133n31861o18249
31922b216333o8128O99993R13058L73530k97050m35967j22993R1714N1110Q9055
31912i22011K74692J77798l48145p09866l65173L33231O14870L32316k2322j37231
31902g71841j27549n7119J81387M60614M28192O0439k24303j60515J8252j0309
31892b02752k03674k84206j16836J57874K38405o6370n11084n00490J81598Q66547
$$ plain form
31882 -440988 237436 -70305 -1139023 -1999466 -1986845 -1241266 -361277 101736 -65576 -602092
31872 -602092 -957809 -835137 -449160 -120089 90674 104291 -353379 -1168406 -1523125 -870759
31862 -870759 112761 407518 221853 608756 1573627 1861039 943793 -95278 -340550
31853 -340550 -460366 -1322530 -2242946 -1977884 -803980 -143125 -427451 -778787 -728286 -790274
31843 -790274 -1123721 -1032141 -297876 194267 -177521 -797113 -908705 -767395 -875663 -892878
31833 -892878 -292951 483727 590163 149672 75794 657334 1210552 1122446 483030 -320714
31823 -320714 -930521 -920447 -116161 838566 913749 -26908 -912753 -762197 117069 593293
31813 593293 119581 -712870 -999389 -600259 -183670 -225135 -308447 188214 903395 728176
$$ packed form
31882d40988O78424l07741j068718q60443J2621P45579Q79989M63013j67312n36516
31872f02092l55717J22672L85977L29071K10763J3617m57670q15027l54719O52366
31862h70759R83520K94757j85665L86903R64871K87412r17246j039071k45272
31853c40550j19816q62164r20416K65062J173904O60855k84326l51336N0501o1988
31843g90274l33447R1580P34265M92143l71788o19592j11592J41310j08268j7215
31833h92878N99927P76678J06436m40491p3878N81540N53218q8106o39416q03744
31823c20714o09807J0074Q04286R54727P5183r40657q85845J50556Q79266M76224
31813E93293m73712q32451k86519L99130M16589m1465q3312M96661P15181j75219
$$ plain form
31803 728176 -559440 -1689462 -1512633 -562200 -186504 -617183 -926702 -666580 -403283
31794 -403283 -530115 -612433 -272741 116403 54322 -409084 -955526 -1374652 -1415116 -928941
31784 -928941 -424467 -708019 -1613674 -1926633 -1088371 -107570 -43543 -431561 -241022 274731
31774 274731 6330 -1014288 -1462777 -768322 -46448 -402723 -1263550 -1242389 -135105
31765 -135105 844446 709346 -159452 -697902 -485194 -29441 55417 -250573 -566733 -684532
31755 -684532 -673194 -569278 -328360 -95286 -141349 -385599 -321927 327698 1146313 1481241
31745 1481241 1166326 522183 -144832 -698363 -971148 -805992 -325736 96433 186327 -26770
31735 -26770 -290633 -312728 -12696 273324 50845 -683313 -1301120 -1307346 -956025 -746745
$$ packed form
31803G28176j287616j130022J76829R50433L75696m30679l09519K60122K63297
31794d03283j26832q2318L39692L89144o2081m63406n46442m19126m0464M86175
31784i28941N04474k83552r05655l12959Q38262R80801O4027l88018J90539N15753
31774B74731k68401j020618m48489O94455P21874l56275q60827K1161J107284
31765a35105R79551j35100q68798n38450K12708M55753Q4858l05990l16160j17799
31755f84532J1338J03916K40918K33074m6063k44250O3672O49625Q18615L34928
31745A481241l14915o44143o67015n53531k72785J65156M80256M22169Q9894k13097
31735b6770k63863k2095L00032K86020k22479p34158o17807o226L51321K09280
$$ plain form
31725 -746745 -613423 -166249 425181 464644 -264447 -1106889 -1370787 -1089095 -688314 -329992
31715 -329992 36254 262917 105887 -339941 -655295 -569489 -207904 121058 200318 -10986
31705 -10986 -359927 -537681 -313598 203675 659708 828611 739741 440202 -63411 -485690
31695 -485690 -276853 611333 1235380 597803 -910574 -1728183 -1045503 202080 734924
31686 734924 588747 573098 678432 203465 -712719 -969392 -179354 637152 517147 -215235
31676 -215235 -769274 -1096157 -1535042 -1928092 -1929240 -1736165 -1719353 -1678888 -1232783 -645036
31666 -645036 -504166 -804066 -1075673 -1226074 -1497966 -1763453 -1645539 -1263491 -1091066 -1102730
31656 -1102730 -822777 -247124 47948 -179754 -528627 -690459 -810977 -953241 -876748 -568293
$$ packed form
31725g46745J33322M47174N91430L9463p29091q42442k63898K81692M00781L58322
31715c29992L66246K26663j57030m45828l15354Q5806L61585L28962P9260k11304
31705a0986l48941j77754K24083N17273M56033J68903q8870k99539n03613m22279
31695d85690K08837Q88186O24047o37577j508377q17609O82680J247583N32844
31686G34924j46177j5649J05334m74967r16184k56673P90038Q16506j20005p32382
31676b15235n54039l26883m38885l93050j148J93075J6812M0465M46105N87747
31666f45036J40870k99900k71607j50401k71892k65487J17914L82048J72425j1664
31656a102730K79953N75653K95072k27702l48873j61832j20518j42264P6493L08455
$$ plain form
31646 -568293 -375141 -398237 -358955 -269775 -571094 -1299486 -1757360 -1409680 -594253 26524
31636 26524 238073 158863 -134029 -459507 -465948 -132945 36063 -316767 -922917 -1382902
31626 -1382902 -1673948 -1816241 -1586424 -1048511 -824317 -1213316 -1526699 -1044902 -254964
31617 -254964 -251030 -1084509 -1645276 -1248797 -477377 -179719 -366536 -521023 -469084 -434773
31607 -434773 -516941 -553603 -409163 -123576 156822 246944 44890 -280269 -369187 -92578
31597 -92578 230665 177414 -318185 -950315 -1346058 -1255592 -619442 309786 996405 1044017
31587 1044017 624634 294215 343304 516179 429865 62982 -307374 -492155 -533406 -554647
31577 -554647 -633249 -759544 -796086 -576681 -184232 21552 -143856 -393799 -426443 -480571
$$ packed form
31646e68293J93152k3096L9282Q9180l01319p28392m57874L47680Q15427O20777
31636B6524K11549p9210k92892l25478o441L33003J69008l52830o06150m59985
31626a382902k91046j42293K29817N37913K24194l88999l13383M81797P89938
31617b54964L934q33479n60767L96479P71420K97658j86817j54487N1939L4311
31607d34773q2168l6662J44440K85587K80398R0122k02054l25159q8918K76609
31597i2578L23243n3251m95599o32130l95743R0466O36150R29228O86619M7612
31587A044017m19383l30419M9089J72875q6314l66883l70356j84781m1251k1241
31577e54647p8602j26295l6542K19405L92449K05784j65408k49943l2644n4128
$$ plain form
31567 -480571 -975170 -1701839 -1974103 -1647145 -1343452 -1422251 -1371795 -669340 302350 779949
31557 779949 665134 421294 216778 -145671 -582168 -691920 -409832 -154455 -235670 -521972
31547 -521972 -733497 -705385 -375607 130117 443862 341111 98975 91195 143332 -253780
31537 -253780 -1146044 -1977788 -2237013 -1878062 -1189080 -590945 -404584 -456945 -192874 412367
31527 412367 517184 -356754 -1270985 -1012777 69615 541165 23048 -448792 -280528
31518 -280528 -145114 -582123 -1102544 -1284974 -1545488 -2060544 -2045685 -1044332 -159
31509 -159 -17884 -790443 -1275637 -1308292 -1481632 -1898518 -2093040 -1918040 -1630506 -1356384
31499 -1356384 -1213736 -1563594 -2316681 -2446659 -1192948 566736 1189570 341851 -792169
$$ packed form
31567d80571m94599p26669k72264L26958L03693p8799N0456P02455R71690M77599
31557G79949j14815k43840k04516l62449m36497j09752K82088K55377q1215k86302
31547e21972k11525K8112L29778N05724L13745j02751k42136p780N2137l97112
31537b53780q92264q31744k59225L58951O88982N98135J86361n2361K64071O05241
31527D12367J04817q73938r14231K58208J082392M71550n18117m71840J68264
31518b80528J35414m37009n20421j82430k60514n15056J4859J001353J044173
31509a59j7725p72559m85194l2655j73340m16886j94522J75000K87534K74122
31499a356384J42648l49858p53087j29978J253711J759684O22834q47719j134020
$$ plain form
31490 -792169 -1231469 -1075704 -697422 -185898 168874 -170424 -1125286 -1803714 -1556320 -701336
31480 -701336 64795 458211 554632 430333 164144 -104616 -311536 -460476 -490854 -414431
31470 -414431 -471598 -801129 -1108923 -1085045 -960812 -1140900 -1472409 -1492182 -1264016 -1283915
31460 -1283915 -1598776 -1724248 -1477916 -1209425 -1108808 -948875 -656354 -506656 -564090 -503724
31450 -503724 -188568 93547 142209 105868 93130 7639 -112444 -77611 34191 -69236
31440 -69236 -368003 -579668 -739416 -1099615 -1413210 -1062538 -86481 642974 543248 -24315
31430 -24315 -471675 -681636 -700767 -443539 -98098 -180664 -745029 -1114140 -820316 -243486
31420 -243486 94057 239747 340180 127180 -495861 -945316 -768496 -482512 -803091 -1401744
$$ packed form
31490g92169m39300J55765L78282N11524L54772l39298r54862o78428K47394Q54984
31480g01336P66131L93416R6421j24299k66189k68760k06920j48940l0378P6423
31470d14431n7167l29531l07794K3878J24233j80088l31509j9773K28166j9899
31460a283915l14861j25472K46332K68491J00617J59933K92521J49698n7434O0366
31450e03724L15156K82115M8662l6341j2738q5491j20083L4833J11802j03427
31440f9236k98767k11665j59748l60199l13595L50672R76057P29455r9726n67563
31430b4315m47360k09961j9131K57228L45441q2566n64365l69111K93824N76830
31420b43486L37543J45690J00433k13000o23041m49455J76820K85984l20579n98653
$$ plain form
31410 -1401744 -1308658 -387533 441756 465460 -87030 -684237 -1187206 -1618315 -1744183 -1304622
31400 -1304622 -473395 196993 278419 -174571 -733384 -1008323 -950523 -772470 -664954 -664520
31390 -664520 -681649 -529159 -84350 395000 376899 -204276 -637752 -376528 42174 -247059
31380 -247059 -1016224 -1249164 -788170 -515232 -725236 -624963 42961 221447 -710631 -1596246
31370 -1596246 -1136616 40661 363482 -270084 -607738 -248550 -103686 -588474 -897787
31361 -897787 -498863 -31232 -101221 -262770 53418 447702 221471 -445967 -803648 -653356
31351 -653356 -441222 -432245 -437669 -297364 -109614 30256 112762 9510 -445516 -1064138
31341 -1064138 -1292575 -810457 -13448 339170 -4137 -464531 -355846 203855 434395
$$ packed form
31410a401744R3086R21125Q29289K3704n52490n97207n02969m31109j25868M39561
31400a304622Q31227O70388Q1426m52990n58813k74939N7800J78053J07516M34
31390f64520j7129J52490M44809M79350j8101n81175m33476K61224M18702k89233
31380b47059p69165k32940M60994K72938k10004J00273O67924J78486r32078q85615
31370a596246M59630J177277L22821o33566l37654L59188J44864m84788l09313
31361h97787L98924M67631o9989j61549L16188L94284k26231o67438l57681J50292
31351f53356K12134Q977n424J40305J87750J39870Q2506j03252m55026o18622
31341a064138k28437M82118P97009L52618l43307m60394J08685N59701K30540
$$ plain form
31332 434395 -26414 -597981 -565543 -67328 148616 -228779 -745330 -896289 -756424 -769490
31322 -769490 -1167989 -1738170 -2049745 -1879506 -1458128 -1220698 -1257726 -1203129 -798489 -325135
31312 -325135 -238779 -576016 -981119 -1141493 -956786 -502211 -105064 -209480 -823851 -1328357
31302 -1328357 -1194906 -680985 -430599 -612924 -869899 -902487 -679197 -277609 46929 -114235
31292 -114235 -752807 -1173262 -832992 -180760 -70742 -618668 -1262550 -1614832 -1510270 -617500
31282 -617500 983776 2114281 1598124 41237 -722813 -116400 519250 73808 -844646
31273 -844646 -1212910 -1178206 -1413930 -1782274 -1641912 -936942 -156446 353136 416949 -83350
31263 -83350 -753820 -742201 91760 718282 381737 -203895 5422 725350 911451 468161
$$ packed form
31332D34395m60809n71567L2438M98215K15944l77395n16551j50959J39865j3066
31322g69490l98499n70181l11575J70239M21378K37430l7028N4597M04640M73354
31312c25135Q6356l37237m05103j60374J84707M54575L97147j04416o14371n04506
31302a328357J33451N13921K50386j82325k56975l2588K23290M01588L24538j61164
31292a14235o38572m20455L40270O52232J10018n47926o43882l52282J04562Q92770
31282f17500J601276J130505n16157j556887p64050O06413O35650m45442r18454
31273h44646l68264L4704k35724l68344J40362P04970P80496N09582O3813n00299
31263h3350o70470J1619Q33961O26522l36545n85632K09317P19928J86101m43290
$$ plain form
31253 468161 179879 238585 90172 -322280 -363025 110590 419491 171938 -188240 -219845
31243 -219845 -95737 -91228 -141230 -189469 -389715 -704269 -812692 -618249 -388176 -280891
31233 -280891 -195182 -118235 -106700 64792 642825 1298676 1449797 1165394 1013830 1010376
31223 1010376 606701 -145756 -420522 42663 373391 -126189 -956383 -1317386 -1268311 -1258208
31213 -1258208 -1140550 -500630 433099 988149 935870 583821 227676 32118 157185 474289
31203 474289 474142 -3090 -307201 125404 755487 578183 -403271 -1103825 -746704 312749
31193 312749 1190578 1363880 923713 403297 371507 824787 1073691 609457 -131274 -371086
31183 -371086 -133395 -131160 -642712 -1214788 -1483486 -1574547 -1586119 -1363429 -986385 -866228
$$ packed form
31253D68161k88282N8706j48413m12452m0745M73615L08901k47553l60178l1605
31243b19845J24108M509n0002m8239k00246l14554j08423J94443K30073J07285
31233b80891Q5709P6947J1535J71492N78033O55851J51121k84403j51564l454
31223A010376m03675p52457k74766M63185L30728m99580q30194l61003M9075J0103
31213a258208J17658O39920R33729N55050n2279l52049l56145j95558J25067L17104
31203D74289j47m77232l04111M32605O30083j77304r81454p00554L57121J059453
31193C12749Q77829J73302m40167n20416l1790M53280K48904m64234p40731k39812
31183c71086K37691K235n11552n72076k68698r1061j1572K22690L77044J20157
$$ plain form
31173 -866228 -1110113 -1315364 -1222825 -1080865 -1145123 -1297663 -1371342 -1377146 -1221561 -710939
31163 -710939 -41117 267395 156311 150476 401676 296937 -508674 -1319744 -1313500 -737028
31153 -737028 -483272 -814799 -1216010 -1274179 -1011022 -497477 173897 608968 461572 53015
31143 53015 36279 439737 659932 442079 203952 235421 239425 -30352 -248533 -46092
31133 -46092 364996 536045 460499 475130 647490 659510 278917 -318510 -726458 -697169
31123 -697169 -376042 -168822 -283958 -457077 -332797 -43222 -47105 -396848 -653471 -674967
31113 -674967 -921332 -1600768 -2036038 -1503682 -410702 71629 -491127 -1293627 -1404444
31104 -1404444 -855058 -393422 -535475 -1117648 -1564801 -1426798 -806265 -313551 -414743
$$ packed form
31173h66228k43885k05251R2539J41960o4258j52540p3679n804J55585N10622
31163g10939O69822L08512j11084n835K51200j04739q05611q11070O244N76472
31153g37028K53756l31527m01211n8169K63157N13545O71374M35071j47396m08557
31143E3015j6736M03458K20195k17853k38127L1469M004k69777k18181K02441
31133d6092M11088J71049p5546J4631J72360J2020l80593n97427m07948K9289
31123f97169L21127K07220j15136j73119J24280K89575l883l49743k56623k1496
31113f74967k46365o79436m35270N32356J092980M82331n62756q02500j10817
31104a404444N49386M61636j42053n82173m47153J38003O20533M92714j01192
$$ plain form
31095 -414743 -859285 -1038093 -832193 -650683 -624968 -385958 131889 309252 -265404 -1042321
31085 -1042321 -1265835 -1103165 -1284851 -1810552 -1821619 -853837 460672 1179577 1044188
31076 1044188 461363 -83574 -337724 -319789 -285648 -469754 -784858 -988306 -1075493 -1143171
31066 -1143171 -970840 -302427 469120 601791 128783 -83136 323727 641328 359390
31057 359390 92817 461839 822621 184382 -1102622 -1757686 -1445867 -1048824 -1055753 -893257
31047 -893257 -175324 443737 240853 -495533 -946215 -823049 -460011 -217553 -199870 -310087
31037 -310087 -347325 -273521 -399500 -917805 -1330785 -969505 -82890 368362 130806 -10113
31027 -10113 405091 775730 574257 280167 473285 815886 773459 626093 809568 875832
$$ packed form
31095d14743m44542j78808K05900J81510K5715K39010N17847J77363n74656p76917
31085a042321k23514J62670j81686n25701j1067R67782J314509P18905j35389
31076A044188n82825n44937k54150J7935L4141j84106l15104k03448q7187o7678
31066a143171J72331O68413P71547J32671m73008k11919M06863L17601k81938
31057C59390k66573L69022L60782o38239j287004o55064L11819L97043o929J62496
31047h93257P17933O19061k02884p36386m50682J23166L63038K42458J7683j10217
31037c10087l7238P3804j25979n18305m12980L61280Q86615M51252k37556j40919
31027a0113M15204L70639k01473k94090J93118L42601m2427j47366J83475O6264
$$ plain form
31017 875832 216616 -616758 -527650 369536 795363 168262 -660714 -780087 -389784 -199217
31007 -199217 -355296 -439587 -148867 336694 481456 -129529 -1221520 -1924547 -1787427 -1391695
30997 -1391695 -1447597 -1675394 -1353864 -655832 -435491 -787778 -894866 -421914 -18511 -156469
30987 -156469 -446944 -491351 -502889 -637129 -559832 -186735 -59281 -448898 -844625 -873714
30977 -873714 -932392 -1265852 -1257475 -480982 248193 -132685 -1362199 -2234065 -2191279 -1631092
30967 -1631092 -955497 -316190 -109452 -680422 -1504699 -1584783 -792793 -34739 35588 -308869
30957 -308869 -628884 -941186 -1255342 -1195110 -563385 164189 347147 -68816 -569445 -617906
30947 -617906 -53978 774636 1197885 862594 235697 82328 409141 446607 -168156 -774866
$$ packed form
31017H75832o59216q33374Q9108Q97186M25827o27101q28976j19373L90303J90567
31007a99217j56079q4291K90720M85561J44762o10985j091991p03027J37120L95732
30997a391695n5902k27797L21530O98032K20341l52287j07088M72952M03403j37958
30987a56469k90475m4407j1538j34240P7297L73097J27454l89617l95727k9089
30977h73714n8678l33460Q377P76493P29175l80878j229514q71866M2786N60187
30967a631092O75595O39307K06738n70970q24277q0084P91990P58054P0327l44457
30957c08869l20015l12302l14156O0232O31725P27574J82958m15963n00629m8461
30947f17906N63928Q28614M23249l35291o26897j53369L26813L7466o14763o06710
$$ plain form
30937 -774866 -602149 180792 767974 733692 298685 -162600 -418541 -349821 -72799 -9241
30927 -9241 -418253 -900781 -785225 -31274 659507 745936 480220 430593 688586 868556
30917 868556 720897 406489 209675 282608 684896 1355095 1922011 1847055 1017823 29109
30907 29109 -415818 -300275 -203699 -459122 -745803 -618638 -148809 171545 22621 -406388
30897 -406388 -610248 -239824 523518 1058790 920725 353955 -13415 41134 172017 117709
30887 117709 78012 244487 392461 303793 249378 579230 1049191 1077017 593335 123275
30877 123275 -27877 -181637 -682175 -1267268 -1365163 -851091 -212000 37638 -95967 -206374
30867 -206374 -46848 202435 267275 183219 153197 129301 -113417 -472972 -494973 -30442
$$ packed form
30937g74866J72717P82941N87182l4282m35007m61285k55941O8720K77022O3558
30927i241m09012m82528J15556P53951O90781Q6429k65716m9627K57993J79970
30917H68556j47659l14408j96814P2933M02288O70199N66916p4956q29232r88714
30907B9109m44927J15543R6576k55423k86681J27165M69829L20354j48924m29009
30897d06388k03860L70424P63342N35272j38065n66770l67370N4549J30883n4308
30887A17709l9697J66475J47974q8668n4415L29852M69961K7826m83682m70060
30877A23275j51152j53760n00538n85093r7895N14072O39091K49638j33605j10407
30867b06374J59526K49283O4840q4056l0022k3896k42718l59555k2001M64531
$$ plain form
30857 -30442 417691 256175 -543311 -1564553 -2427591 -2879456 -2712549 -1974033 -1076120 -381564
30847 -381564 137193 565635 684331 330325 -163349 -363989 -350798 -439130 -530408 -331310
30837 -331310 -45306 -150305 -522967 -499203 87433 592953 489150 17778 -323643 -424118
30827 -424118 -407225 -288848 -82472 94700 220988 350566 322518 -53968 -456621 -295533
30817 -295533 328723 598026 203089 -151907 55593 232517 -350522 -1289738 -1662526 -1455917
30807 -1455917 -1366482 -1440026 -1038619 -185326 180919 -381709 -1108737 -1224546 -1035200 -1197433
30797 -1197433 -1556313 -1490701 -1005337 -670426 -653669 -557467 -194749 140887 259398 330742
30787 330742 396674 167428 -436913 -975271 -1001654 -565022 15604 495352 595768 30020
$$ packed form
30857c0442M48133j61516p99486j021242q63038m51865J66907P38516Q97913O94556
30847c81564N18757M28442J18696l54006m93674k00640J3191q8332r1278J99098
30837c31310K86004j04999l72662K3764N86636N05520j03803m71372l41421j00475
30827d24118J6893J18377K06376J77172J26288J29578k8048l76486m02653J61088
30817b95533O24256K69303l94937l54996K07500J76924n83039r39216l72788K06609
30807a455917Q9435p3544M01407Q53293L66245n62628p27028j15809J89346j62233
30797a197433l58880O5612M85364L34911J6757R6202L62718L35636J18511P1344
30787C30742O5932k29246o04341n38358k6383M36632N80626M79748J00416n65748
$$ plain form
30777 30020 -970489 -1588195 -1388273 -990205 -1184894 -1726912 -1751837 -1150695 -622763 -425812
30767 -425812 -97287 404952 357219 -468416 -1178604 -1079546 -774073 -1094132 -1663281 -1547926
30757 -1547926 -821593 -352093 -323981 -131096 342991 480430 85764 -251923 -188447 -71306
30747 -71306 -79705 138535 576608 530819 -290109 -1102161 -1133844 -729416 -694662 -1086513 -1362118
30736 -1362118 -1312198 -1142159 -932275 -674020 -593778 -812398 -895060 -376200 405855 621592
30726 621592 48225 -706030 -1070587 -1081863 -1026084 -982495 -877737 -691766 -477524 -324176
30716 -324176 -296016 -298892 -142961 121513 164985 -112996 -325427 -145096 200082 356455
30706 356455 437177 682888 828244 457617 -164040 -332370 13251 148780 -330964 -900304
$$ packed form
30777C0020j000509o17706J99922L98068j94689n42018k4925O01142N27932J96951
30767d25812L28525N02239m7733q25635p10188R9058L05473l20059n69149J15355
30757a547926P26333M69500K8112J92885M74087J37439l94666l37687O3476J17141
30747g1306q399K18240M38073m5789q20928q12052l1683M04428L4754l91851k75605
30736a362118M9920J70039K09884K58255Q0242k18620q2662N18860P82055K15737
30726F21592n73367p54255l64557j1276N5779M3589J04758J85971K14242J53348
30716c24176K8160k876J55931K64474M3472k77981k12431J80331L45178J56373
30706C56455Q0722K45711J45356l70627o21657j68330L45621J35529m79744n69340
$$ plain form
30696 -900304 -878248 -303642 303626 650953 768662 692368 455078 272823 401274 783719
30686 783719 1009278 672065 -226953 -1193614 -1608686 -1297491 -686980 -296445 -206637 -202273
30676 -202273 -230075 -382330 -565278 -589622 -532748 -601374 -682825 -505973 -239970 -368494
30666 -368494 -856561 -1036185 -564495 72982 348517 408525 531198 417636 -278884 -1070192
30656 -1070192 -1090424 -335339 326674 427671 414746 676020 820959 424677 -103026 -79580
30646 -79580 338775 342136 -300858 -889475 -819638 -380537 -223172 -485509 -838361 -1078509
30636 -1078509 -1221816 -1188171 -863324 -436556 -271024 -410608 -559339 -576581 -637713 -841401
30626 -841401 -1019350 -1047585 -1002324 -880930 -541852 -106470 -26473 -456196 -882595 -727093
$$ packed form
30696i00304K2056N74606O07268L47327J17709p6294k37290j82255J28451L82445
30686G83719K25559l37213q99018r66661m15072L11195O10511L90535Q9808M364
30676b02273k7802j52255j82948k4344N6874o8626q1451J76852K66003j28524
30666c68494m88067j79624M71690O37477K75535O0008J22673j13562o96520p91308
30656a070192k0232P55085O62013J00997j2925K61274J44939l96282n27703K3446
30646g9580M18355L361o42994n88617O9837M39101J57365k62337l52852k40148
30636a078509j43307L3645L24847M26768J65532j39584j48731j7242o1132k03688
30626h41401j77949k8235M5261J21394L39078M35382P9997m29723m26399J55502
$$ plain form
30616 -727093 -84423 449339 470776 18111 -593480 -854420 -296021 896752 1747070 1472971
30606 1472971 451281 -311443 -493615 -617570 -975274 -1136783 -708083 34979 551137
30597 551137 621854 317883 -177489 -494217 -286686 212603 299059 -233361 -677776 -367544
30587 -367544 369686 714294 508411 342459 633589 1157368 1488170 1453070 1087726 512406
30577 512406 -30423 -265570 -120823 249028 653252 932750 916322 534816 -34431 -513909
30567 -513909 -785440 -856843 -674481 -202190 361835 678113 572134 94254 -630332 -1393556
30557 -1393556 -1863016 -1864481 -1666892 -1658060 -1745503 -1465469 -770153 -281814 -505845 -1112039
30547 -1112039 -1354421 -1021975 -575310 -383188 -254560 84986 375517 85201 -738092
$$ packed form
30616g27093O42670N33762K1437m52665o11591k60940N58399J192773Q50318k74099
30606A472971j021690p62724j82172j23955l57704j61509M28700P43062N16158
30597E51137P0717l03971m95372l16728K07531M99289Q6456n32420m44415L10232
30587c67544P37230L44608k05883j65952K91130N23779L30802l5100l65344n75320
30577E12406n42829k35147J44747L69851M04224K79498j6428l81506n69247m79478
30567e13909k71531p1403J82362M72291N64025L16278j05979m77880p24586p63224
30557a393556m69460j465J97589Q832q7443K80034O95316M88339k24031o06194
30547a112039k42382L32446M46665J92122J28628L39546K90531k90316q23293
$$ plain form
30538 -738092 -1293706 -971437 -215173 -9434 -542277 -896820 -295255 818117 1377966
30529 1377966 1065668 510952 272278 247957 155651 -9061 -204359 -513885 -805541 -679236
30519 -679236 -88146 414863 437298 335499 567364 861616 674752 200270 154432 619152
30509 619152 879179 548863 140405 209243 543197 616471 381651 143697 -24158 -268997
30499 -268997 -563558 -737055 -787003 -837496 -884849 -837760 -687744 -431747 -15416 412577
30489 412577 425364 -185373 -1016553 -1473929 -1434770 -1213250 -1068093 -1066743 -1228055 -1433782
30479 -1433782 -1390679 -1041753 -769762 -778017 -593492 220722 1132234 1181139 352170 -398073
30469 -398073 -515327 -423986 -565705 -690476 -452756 -17550 321467 540242 565916 186661
$$ packed form
30538g38092n55614L22269P56264K05739n32843l54543O01565J113372N59849
30529A377966l12298n54716k38674k4321r2306j64712j95298l09526k91656J26305
30519f79236N91090N03009K2435j01799K31865K94252j86864m74482m5838M64720
30509F19152K60027l30316m08458O8838L33954P3274k34820k37954j67855k44839
30499b68997k94561j73497m9948n0493m7353M7089J50016K55997M16331M27993
30489D12577J2787o10737q31180m57376L9159K21520J45157J350j61312k05727
30479a433782M3103L48926K71991q255J84525Q14214R11512M8905q28969p50243
30469c98073j17254R1341j41719j24771K37720M35206L39017K18775K5674l79255
$$ plain form
30459 186661 -354891 -350190 330971 844458 558276 -24013 -167782 -83969 -390749 -928749
30449 -928749 -1037883 -673335 -335871 -136055 161128 335364 -82150 -826858 -1055658 -592390
30439 -592390 -188086 -369961 -774098 -820737 -405263 242099 787034 801695 170806 -484707
30429 -484707 -467011 -42183 -8459 -305355 -136949 443152 394912 -456649 -840824 -102759
30419 -102759 490250 -324276 -1680614 -1861113 -920314 -384216 -740705 -977720 -626059
30410 -626059 -532404 -1146241 -1556823 -1031242 -314523 -414090 -961529 -866526 -59661 505182
30400 505182 363378 66243 166597 501835 693474 723677 703472 516598 58099 -423459
30390 -423459 -553454 -299561 31215 215616 315667 431988 451561 190698 -275272 -601160
$$ packed form
30459A86661n41552M701O81161N13487k86182n82289j43769Q3813l06780n38000
30449i28749j09134L64548L37464J99816K97183J74236m17514p44708k28800M63268
30439e92390M04304j81875m04137m6639M15474O47362N44935J4661o30889o55513
30429d84707J7696M24828L3724k96896J68406N80101m8240q51561l84175P38065
30419a02759N93009q14526j356338j80499R40799N36098l56489k37015L51661
30410f26059R3655o13837m10582N25581P16719r9567n47439R5003Q06865N64843
30400E05182j41804k97135J00354L35238J91639L0203k0205j86874m58499m81558
30390d23459j29995K53893L30776J84401J00051J16321J9573k60863m65970l25888
$$ plain form
30380 -601160 -562703 -355723 -381857 -761333 -1178504 -1241804 -910381 -500707 -300956 -245658
30370 -245658 -27826 455847 869595 794452 291302 -124758 -161341 -135286 -448433 -898857
30360 -898857 -896835 -303159 351671 547585 305030 -90282 -510630 -882084 -985752 -741232
30350 -741232 -495660 -609306 -824565 -497354 454439 1241516 1095093 219880 -443048 -306748
30340 -306748 276086 522953 110195 -530614 -714057 -235982 385200 431783 -222913 -933751
30330 -933751 -976967 -326019 400449 652247 377875 -176089 -729074 -954151 -612005 17412
30320 17412 152410 -617719 -1641592 -1859944 -1115255 -310608 -176940 -412496 -314393 223240
30310 223240 787911 1152855 1319031 1068764 182912 -860873 -1112189 -356903 464753
$$ packed form
30380f01160L8457K06980k6134l79476m17171o3300L31423M09674J99751N5298
30370b45658K17832M83673M13748p5143n03150m16060l6583K6055l13147m50424
30360h98857K022N93676O54830J95914k42555l95312m20348l71454j03668K44520
30350g41232K45572j13646k15259L27211R51793P87077j46423q75213o62928J36300
30340c06748N82834K46867m12758o40809j83443M78075O21182M6583o54696p10838
30330i33751m3216O50948P26468K51798k74372n53964n52985k25077L42146O29417
30320A7412J34998p70129j023873k18352P44689Q04647J33668k35556R8103N37633
30310B23240N64671L64944J66176k50267q85852j043785k51316P55286Q21656
$$ plain form
30301 464753 444543 -178527 -592608 -644995 -760646 -887402 -456186 486353 988699 463032
30291 463032 -440467 -773159 -544212 -387645 -437739 -349916 -174765 -306442 -603914 -476738
30281 -476738 6097 -3563 -796654 -1495539 -1324953 -764206 -707190 -1031816 -878548 -60784
30271 -60784 686699 825072 604071 426944 265024 -69696 -517469 -854289 -905513 -592432
30261 -592432 -24826 439376 481556 133849 -403822 -1045945 -1590499 -1534152 -703342 167858
30251 167858 233256 -202692 -71856 779373 1288074 846641 271532 483555 1055988 932373
30241 932373 49608 -666270 -654827 -235411 130553 336155 351407 95634 -264495 -369239
30231 -369239 -171786 -35040 -213672 -531819 -653738 -436926 6480 377285 349922 -82013
$$ packed form
30301D64753k0210o23070m14081n2387j15651j26756M31216R42539N02346n25667
30291D63032r03499l32692K28947J56567n0094Q7823J75151j31677k97472J27176
30281d76738M82835r660p93091o98885J70586N60747N7016l24626J53268Q17764
30271f0784P47483J38373k21001j77127j61920l34720m47773l36820n1224L13081
30261e92432N67606M64202M2180l47707n37671o42123n44554N6347Q30810Q71200
30251A67858O5398m35948J30836Q51229N08701m41433n75109K12023N72433j23615
30241I32373q82765p15878J1443M19416L65964K05602J5252k55773l60129j04744
30231c69239J97453J36746j78632l18147j21919K16812M43406L70805k7363m31935
$$ plain form
30221 -82013 -463721 -360927 50468 180087 -191207 -633059 -629588 -148144 436434 748385
30211 748385 642699 232171 -184154 -329641 -182173 49977 199785 320492 576726 990264
30201 990264 1294528 1088407 257130 -770226 -1367195 -1349127 -1072962 -899178 -867671 -966804
30191 -966804 -1285242 -1661337 -1616298 -1017162 -439494 -409019 -608960 -411472 55005 70452
30181 70452 -519152 -1046677 -1050770 -875027 -956567 -1102825 -905601 -461020 -194866 -206601
30171 -206601 -236291 -166313 -142871 -211096 -194667 -32349 46121 -147257 -424824 -443049 -202602
30160 -202602 -96572 -390199 -852732 -1073315 -985861 -822611 -641692 -259099 302957 659289
30150 659289 518051 18446 -541991 -1024121 -1306749 -1168396 -619966 -103784 -20130 -219191
$$ packed form
30221h2013l81708J02794M11395J29619l71294m41852L471M81444N84578L11951
30211G48385j05686m10528m16325j45487J47468K32150J49808J20707K56234M13538
30201I90264L04264k06121q31277j027356n96969J8068K76165J73784L1507r9133
30191i66804l18438l76095M5039N99136N77668L0475j99941J97488M66477J5447
30181G0452n89604n27525m093J75743q1540j46258J97224M44581K66154j1735
30171b06601k9690O9978K3442o8225J6429J62318P8470j93378k77567j8225K40447
30160b02602J06030k93627m62533k20583Q7454J63250J80919L82593N62056L56332
30150F59289j41238m99605n60437m82130k82628J38353N48430N16182Q3654j99061
$$ plain form
30140 -219191 -255000 13299 341670 460097 271018 -127675 -419061 -329151 -104234 -328969
30130 -328969 -983368 -1196244 -425427 620219 899524 450695 96402 94434 30301 -137795
30120 -137795 24500 466764 616461 452395 592168 1040863 916410 -97659 -1028703
30111 -1028703 -1011633 -532039 -477366 -716822 -596659 -278683 -474213 -1099966 -1282822 -735890
30101 -735890 -201614 -313315 -759580 -891518 -600702 -244784 -91754 -180786 -494902 -965656
30091 -965656 -1392358 -1545163 -1343146 -900911 -458760 -239875 -250287 -221577 108262 617522
30081 617522 824425 391517 -413580 -865246 -489199 391724 969857 855503 459266 342452
30071 342452 464721 387575 4718 -365827 -518433 -538517 -477784 -293279 -104462 -80869
$$ packed form
30140b19191l5809K68299L28371J18427j89079l98693k91386Q9910K24917k24735
30130c28969o54399k12876P70817J045646K79305m48829l54293j968o4133j68096
30120a37795J62295M42264J49697j64066J39773M48695j24453j014069r31044
30111a028703J7070M79594N4673k39456J20163L17976j95530o25753j82856N46932
30101g35890N34276j11701m46265j31938K90816L55918J53030q9032l14116m70754
30091i65656m26702j52805K02017M42235M42151K18885j0412K8710L29839N09260
30081F17522K06903m32908q05097m51666L76047Q80923N78133j14354l96237j16814
30071C42452J22269p7146l82857l70545j52606k0084O0733J84505J88817K3593
$$ plain form
30061 -80869 -107556 -22102 -79133 -568795 -1059976 -821927 -57036 195978 -380744 -894029
30051 -894029 -720429 -461791 -748620 -1043492 -586362 199912 340327 -124199 -286831 170236
30041 170236 682227 820122 672997 295040 -351573 -922419 -953360 -571098 -220069 174827
30031 174827 929764 1628112 1445689 511293 -73786 200971 606066 386152 -245962 -694278
30021 -694278 -768580 -508171 36573 458656 173989 -623571 -920157 -276186 470249 463865
30011 463865 76123 161769 662547 802952 334089 -226155 -453629 -466698 -561330 -850209
30001 -850209 -1183232 -1144322 -395471 676125 1075175 411441 -436584 -446078 162640 375778
29991 375778 -73467 -460451 -305177 -22507 -145880 -536602 -667289 -312498 263211 574308
$$ packed form
30061h0869k6687Q5454n7031m89662m91181K38049P64891K53014n76722n13285
30051h94029J73600K58638k86829k94872M57130P86274J40415m64526j62632M57067
30041A70236N11991J37895j47125l77957o46613n70846l0941L82262L51029L94896
30031A74827P54937O98348j82423r34396n85079K74757M05095k19914o32114m48316
30021f94278p4302K60409N44744M22083k84667p97560k96586O43971P46435o384
30011D63865l87742Q5646N00778J40405m68863n60244k27474j3069r4632k88879
30001h50209l33023L8910P48851J071596L99050o63734q48025r494O08718K13138
29991C75778m49245l86984J55274K82670j23373l90722j30687L54791N75709L11097
$$ plain form
29981 574308 306742 -336955 -726599 -493604 -14476 112437 -106552 -208586 -97681 -123479
29971 -123479 -329912 -256608 306564 884225 930864 519560 143761 100987 289706 385893
29961 385893 60965 -723354 -1485702 -1571005 -927551 -296549 -408554 -1184362 -1926417 -2098340
29951 -2098340 -1688581 -990225 -327945 43713 33727 -215568 -446229 -502135 -406816 -267032
29941 -267032 -144658 -8046 192144 388170 413144 237030 98642 263702 708989 1173797
29931 1173797 1425406 1316590 750953 -112772 -743848 -721647 -324630 -236593 -617232 -896364
29921 -896364 -626411 -94951 162972 73462 -88656 -213251 -370193 -506514 -499154 -405120
29911 -405120 -362243 -345420 -287903 -313852 -553034 -832552 -863866 -664292 -499734 -479095 -498894
$$ packed form
29981E74308k67566o43697l89644K32995M79128J26913k18989j02034J10905k5798
29971a23479k06433P3304N63172N77661M6639m11304l75799m2774J88719R6187
29961C85893l24928p84319p62348q5303O43454O31002j12005p75808p42055j71923
29951b098340M09759O98356O62280L71658r986k49295k30661n5906R5319J39784
29941b67032J22374J36612K00190J96026K4974j76114j38388J65060M45287M64808
29931A173797K51609j08816n65637q63725o31076K2201L97017Q8037l80639k79132
29921h96364K69953N31460K57923q9510j62118j24595j56942j36321P360R4034
29911d05120M2877J6823N7517k5949k39182k79518l1314J99574J64558K0639j9799
$$ plain form
29900 -498894 -511506 -526370 -412694 -53240 352630 514079 528173 689668 841235 482541
29890 482541 -338503 -854389 -621451 -183045 -225041 -550610 -521551 -178627 -161708 -631948
$$ packed form
29900d98894j2612j4864J13676L59454M05870J61449J4094J61495J51567l58694
29890D82541q21044n15886K32938M38406m1996l25569K9059L42924J6919m70240
$$ [...]
##END NTUPLES=NMR SPECTRUM
##END=
