##TITLE=31Pdec_LY-15.Dix.1B
 CD3CN, 24 sc
 1.06.2021
##JCAMPDX= 6.0         $$ Bruker NMR JCAMP-DX V2.0
##DATA TYPE= NMR SPECTRUM
##DATA CLASS= NTUPLES
##ORIGIN= UXNMR, Bruker Analytische Messtechnik GmbH
##OWNER= root
$$ XWIN-NMR		Version 3.5
$$ Tue Jun  1 09:55:19 2021 Russian Standard Time (UT+4h)  she@DPX200
##.OBSERVE FREQUENCY= 81.013821
##.OBSERVE NUCLEUS= ^31P
##.ACQUISITION MODE= SIMULTANEOUS
##.ACQUISITION SCHEME= undefined
##.AVERAGES= 24
##.DIGITISER RES= 16
##SPECTROMETER/DATA SYSTEM= spect
##.PULSE SEQUENCE= zgpg30
##.SOLVENT NAME= CD3CN
##.SHIFT REFERENCE= (INTERNAL, CD3CN, 0, 248.564)
##AUDIT TRAIL= $$ (NUMBER, WHEN, WHO, WHERE, WHAT)
$$ ##TITLE= Audit trail, XWIN-NMR		Version 3.5
$$ ##JCAMPDX= 5.01
$$ ##ORIGIN= Bruker BioSpin GmbH
$$ ##OWNER= she
$$ F:/spectra/data/she/nmr/P31/1/pdata/1/auditp.txt
$$ ##AUDIT TRAIL=  $$ (NUMBER, WHEN, WHO, WHERE, WHAT)
(   1,<2021-06-01 09:53:46.96 +0400>,<she>,<DPX200>,
      <created by zg, POWCHK disabled, PULCHK disabled
       configuration hash MD5:
       00 E9 B6 7A A2 85 ED C7 34 08 36 98 17 FE 4E 26
       data hash MD5: 32K
       A4 0E 50 31 34 1D 5D 39 FA 06 4B BB F4 EB C2 2C>)
(   2,<2021-06-01 09:53:53.73 +0400>,<she>,<DPX200>,
      <Start of raw data processing
       efp BC_mod = 2 LB = 1 FT_mod = 6 PKNL = 1 PHC0 = -6005.985 PHC1 = 368.0723 SI = 64K 
       data hash MD5: 64K
       C9 C8 B5 AB ED 69 18 43 1D E4 A1 5A B0 34 A3 8B>)
(   3,<2021-06-01 09:54:25.67 +0400>,<she>,<DPX200>,
      <pk PHC0 = 152.4239 PHC1 = -324.4001 
       data hash MD5: 64K
       3F 59 40 3F 5F 03 BA 6B 63 88 C7 A5 32 4F A7 C0>)
(   4,<2021-06-01 09:54:33.37 +0400>,<she>,<DPX200>,
      <abs ABSG = 5 
       data hash MD5: 64K
       35 DA 73 F3 50 82 27 70 03 F9 41 C8 74 02 4B 9B>)
$$ ##END=
$$ 
$$ hash MD5
$$ 78 52 63 1E 5E FC 8C DF A7 E0 73 E9 BB 4D 23 A3
##$RELAX= 
##$RELAX= 
##$RELAX= 
##$RELAX= 
##$RELAX= 
##$RELAX= 
##$RELAX= 
##$RELAX= 
$$ Bruker specific parameters
$$ --------------------------
##$DU= <F:/spectra>
##$EXPNO= 1
##$NAME= <P31>
##$PROCNO= 1
##$TYPE= <nmr>
##$USER= <she>
##$AMP= (0..31)
100 100 100 100 100 100 100 100 100 100 100 100 100 100 100 100 100 100 
100 100 100 100 100 100 100 100 100 100 100 100 100 100 
##$AQSEQ= 0
##$AQ_mod= 1
##$AUNM= <au_zg>
##$AUTOPOS= <>
##$BF1= 81.014009
##$BF2= 200.13
##$BF3= 200.13
##$BF4= 200.13
##$BF5= 200.13
##$BF6= 200.13
##$BF7= 200.13
##$BF8= 200.13
##$BYTORDA= 1
##$CFDGTYP= 0
##$CFRGTYP= 5
##$CHEMSTR= <none>
##$CNST= (0..31)
1 1 145 1 1 1 1 1 1 1 1 1 1 1 1 1 1 1 1 1 1 1 1 1 1 1 1 1 1 1 1 1 
##$CPDPRG= <waltz16>
##$CPDPRG1= <>
##$CPDPRG2= <waltz16>
##$CPDPRG3= <>
##$CPDPRG4= <mlev>
##$CPDPRG5= <mlev>
##$CPDPRG6= <mlev>
##$CPDPRG7= <mlev>
##$CPDPRG8= <mlev>
##$CPDPRGB= <>
##$CPDPRGT= <>
##$D= (0..31)
0 1 0 0 0 0 0 0 0 0 0 0.03 2e-05 3e-06 0 0 0 0 0 0 0 0 0 0 0 0 0 0 0 0 
0 0 
##$DATE= 1622526826
##$DBL= (0..7)
120 120 120 11 120 120 24 19 
##$DBP= (0..7)
150 150 150 150 150 150 150 150 
##$DBP07= 0
##$DBPNAM0= <>
##$DBPNAM1= <>
$$ [...]
##$SUBNAM3= <"">
##$SUBNAM4= <"">
##$SUBNAM5= <"">
##$SUBNAM6= <"">
##$SUBNAM7= <"">
##$SUBNAM8= <"">
##$SUBNAM9= <"">
##$SW= 501.771253377433
##$SWIBOX= (0..15)
0 1 3 0 0 0 0 0 0 0 0 0 0 0 0 0 
##$SW_h= 40650.406504065
##$TD= 32768
##$TD0= 1
##$TE= 0
##$TE2= 300
##$TE3= 300
##$TEG= 300
##$TL= (0..7)
0 120 53 12 22 120 120 120 
##$TP= (0..7)
150 150 150 150 150 150 150 150 
##$TP07= 0
##$TPNAME0= <>
##$TPNAME1= <>
##$TPNAME2= <>
##$TPNAME3= <>
##$TPNAME4= <>
##$TPNAME5= <>
##$TPNAME6= <>
##$TPNAME7= <>
##$TPOAL= (0..7)
0.5 0.5 0.5 0.5 0.5 0.5 0.5 0.5 
##$TPOFFS= (0..7)
0 0 0 0 0 0 0 0 
##$TUNHIN= 0
##$TUNHOUT= 0
##$TUNXOUT= 0
##$USERA1= <user>
##$USERA2= <user>
##$USERA3= <user>
##$USERA4= <user>
##$USERA5= <user>
##$V9= 5
##$VALIST= <valist>
##$VCLIST= <CCCCCCCCCCCCCCC>
##$VD= 0
##$VDLIST= <DDDDDDDDDDDDDDD>
##$VPLIST= <PPPPPPPPPPPPPPP>
##$VTLIST= <TTTTTTTTTTTTTTT>
##$WBST= 1024
##$WBSW= 4
##$XGAIN= (0..3)
0 0 0 0 
##$XL= 0
##$YL= 0
##$YMAX_a= 3740
##$YMIN_a= -4793
##$ZGOPTNS= <>
##$ZL1= 120
##$ZL2= 120
##$ZL3= 120
##$ZL4= 120
##$ABSF1= 248.5645
##$ABSF2= -253.2056
##$ABSG= 5
##$ABSL= 3
##$ALPHA= 0
##$AQORDER= 0
##$ASSFAC= 0
##$ASSFACI= 0
##$ASSFACX= 0
##$ASSWID= 0
##$AUNMP= <proc_1d>
##$AZFE= 0.1
##$AZFW= 0.5
##$BCFW= 0
##$BC_mod= 2
##$BYTORDP= 0
##$COROFFS= 0
##$CY= -3
##$DATMOD= 1
##$DC= 0
##$DFILT= <>
##$DTYPP= 0
##$F1P= 0
##$F2P= 0
##$FCOR= 1
##$FTSIZE= 65536
##$FT_mod= 6
##$GAMMA= 0
##$GB= 0
##$INTBC= 1
##$INTSCL= 5.30512e-09
##$ISEN= 30
##$LB= 1
##$LEV0= 0
##$LPBIN= 0
##$MAXI= 10000
##$MC2= 0
##$MEAN= 0
##$ME_mod= 0
##$MI= 50
##$NCOEF= 0
##$NC_proc= -5
##$NLEV= 6
##$NOISF1= 182.463
##$NOISF2= 159.3651
##$NSP= 0
##$NTH_PI= 0
##$NZP= 0
##$OFFSET= 248.5645
##$PC= 4
##$PHC0= -5853.561
##$PHC1= 43.67221
##$PH_mod= 1
##$PKNL= yes
##$PPARMOD= 0
##$PSCAL= 0
##$PSIGN= 0
##$REVERSE= no
##$SF= 81.014009
##$SI= 65536
##$SIGF1= 159.3651
##$SIGF2= -187.1042
##$SINO= 113.3802
##$SIOLD= 16384
##$SREGLST= <1H.CDCl3>
##$SSB= 0
##$STSI= 65536
##$STSR= 0
##$SW_p= 40650.406504065
##$SYMM= 0
##$S_DEV= 0
##$TDeff= 32768
##$TDoff= 0
##$TI= <>
##$TILT= no
##$TM1= 0
##$TM2= 0
##$TOPLEV= 0
##$USERP1= <user>
##$USERP2= <user>
##$USERP3= <user>
##$USERP4= <user>
##$USERP5= <user>
##$WDW= 1
##$XDIM= 65536
##$YMAX_p= 443741374
##$YMIN_p= -6761839
$$ End of Bruker specific parameters
$$ ---------------------------------
##NTUPLES= NMR SPECTRUM
##VAR_NAME=  FREQUENCY,     SPECTRUM/REAL,   SPECTRUM/IMAG
##SYMBOL=    X,             R,               I
##VAR_TYPE=  INDEPENDENT,   DEPENDENT,       DEPENDENT
##VAR_FORM=  AFFN,          ASDF,            ASDF
##VAR_DIM=   65536,         65536,           65536
##UNITS=     HZ,            ARBITRARY UNITS, ARBITRARY UNITS
##FACTOR=    0.620285442955139, 1,           1
##FIRST=     20137.2065510759, 0,            0
##LAST=      -20513.1999529892, 0,           0
##MIN=       -20513.1999529892, -6761839,    0
##MAX=       20137.2065510759, 443741374,    0
$$ Real data points
##PAGE= N=1
##DATA TABLE= (X++(R..R)), XYDATA
$$ [...]
37733 1114291 1338675 1203260 1024479 423066 -781330 -1787900 -1670911 -726034 -158007
37724 -158007 -455533 -894976 -845183 -711345 -1067106 -1540368 -1331647 -479289 165116 101422
37714 101422 -352298 -735628 -937123 -875908 -282760 844014 1897097 2183397 1732175
37705 1732175 1271145 1271160 1227223 261707 -1485867 -2573396 -1872406 -162002 669387 -20398
37695 -20398 -980038 -1011705 -553573 -664823 -1302018 -1612503 -1431949 -1384487 -1663999 -1741073
37685 -1741073 -1331459 -777001 -339701 68746 271507 -224273 -1283355 -1860312 -1204159
37676 -1204159 131219 1007069 1056223 744239 345464 -389887 -1446185 -2120253 -1895527
37667 -1895527 -1359926 -1539966 -2336138 -2418078 -1055887 686188 1317230 877903 477203
37658 477203 290399 -521361 -1854736 -2295385 -1332768 -404624 -701335 -1296344 -821535
37649 -821535 190317 357583 -52745 278004 1072312 659562 -1003158 -1695908 -102542
37640 -102542 2156977 2743782 1529685 175190 -201114 254503 1034535 1719688 1841555
37631 1841555 1225102 369063 -86428 -110675 -129316 -406664 -891683 -1350380 -1451347 -1152245
37621 -1152245 -1069054 -1750487 -2471647 -1798498 195783 1454100 567957 -1144159 -1434556
37612 -1434556 -245886 492534 -132695 -869004 -411791 752984 1312693 947950 345260
37603 345260 -16552 -218979 -251414 219840 1262972 2298747 2591571 2030456 1278581
37594 1278581 1123977 1695102 2326813 2229377 1306815 271813 -107290 173813 440743
37585 440743 249395 -116373 -304072 -633960 -1495014 -2199408 -1508035 396555 1599595
37576 1599595 905064 -418562 -539053 112253 -434098 -2454568 -3878805 -3165073 -1182575
37567 -1182575 405806 1184806 1521113 1298213 308119 -816742 -1143325 -577252 188821
37558 188821 482609 33604 -834071 -1091412 42820 1704622 2088304 1048902 559885
37549 559885 1693215 2766778 1973743 367925 176081 1174652 1162135 -386134 -1612822
37540 -1612822 -1365867 -669677 -533668 -380020 378978 910267 303525 -877927 -1503357
37531 -1503357 -1414687 -1128803 -827550 -519758 -503476 -873652 -1159833 -1057333 -874242 -787619
37521 -787619 -505513 -179755 -595868 -1704743 -2087178 -934914 454391 467414 -380997
37512 -380997 -342691 751611 1274387 325043 -1104865 -1755617 -1565767 -1101365 -640858
37503 -640858 -355858 -507447 -901796 -828874 -36852 777149 846713 220342 -541262 -1046573
37493 -1046573 -1150625 -852831 -457135 -437575 -890521 -1472795 -1958713 -2341352 -2338481 -1532611
37483 -1532611 -203333 773486 1163823 1648078 2429869 2579249 1526094 285482 129535
37474 129535 697536 605069 -492482 -1648619 -2188880 -2329034 -2333825 -2232826 -2380956 -3139411
37464 -3139411 -3908022 -3646047 -2514871 -1785824 -1889284 -1909261 -1422826 -1335177 -2105963 -2606451
37454 -2606451 -1906524 -973985 -1167008 -1949165 -1686343 -172491 1196171 1507406 1156315
37445 1156315 688363 185444 -125579 108843 546788 383873 -429697 -1123494 -1304877
37436 -1304877 -1272842 -1143908 -718378 -263116 -320775 -630264 -362719 444150 893233 824866
37426 824866 1047454 1656724 1604904 550514 -290682 17300 713717 701488 162394 -199184
37416 -199184 -426078 -714551 -604883 -19997 -138947 -1758222 -3511002 -3323003 -1272902
37407 -1272902 475208 404595 -1012728 -2533969 -3339358 -2983735 -1455173 408397 1463630
37398 1463630 1423513 838844 96329 -729110 -1265096 -1123797 -685613 -575403 -495534 255118
37388 255118 1190542 978640 -387912 -1194249 -390973 845838 814020 -359412 -1052828
37379 -1052828 -326731 1137007 2074784 1933877 1140423 519033 538234 990936 1369041
37370 1369041 1420967 1189097 725762 117314 -390295 -678080 -977921 -1416814 -1621702 -1273908
37360 -1273908 -730972 -496386 -420623 -135819 96749 -153485 -504189 -232395 499217 916439
37350 916439 903322 865093 572632 -473745 -1609041 -1495545 -247840 498470 24131
37341 24131 -527709 -164172 605451 1143165 1752067 2380163 1881071 -81931 -1787848
37332 -1787848 -1678198 -705080 -809598 -1984593 -2641945 -2245367 -1714379 -1554311 -1396322
37323 -1396322 -1292897 -1735651 -2282575 -1808511 -413684 419378 -24258 -797105 -1055007
37314 -1055007 -1317219 -2156690 -2822168 -2259629 -800814 200343 82147 -573817 -933056
37305 -933056 -814370 -598742 -612559 -729513 -618094 -417641 -800777 -1908621 -2623069 -1785417
37295 -1785417 11371 965928 541367 116916 655004 1096411 206180 -1075372 -783519
37286 -783519 985837 1887917 487345 -1853738 -2898247 -2212117 -1021498 -215683 368167
37277 368167 1008288 1580053 2068641 2685432 3160191 2670179 1004921 -711481 -1124219
37268 -1124219 -268534 523258 312590 -413657 -558935 215320 1277571 1893249 1871467
37259 1871467 1394745 629385 -257677 -907813 -972099 -582260 -327162 -545985 -887711 -896814
37249 -896814 -786039 -1066498 -1523243 -1344005 -443502 207133 57640 -68810 680005 1597259
37239 1597259 1306925 -136716 -1263866 -1198334 -437362 414345 1356517 2104914 1848126
37230 1848126 636516 -82465 734660 2185834 2649686 1933401 1169791 978837 816405
37221 816405 114507 -809084 -1208711 -842870 -304281 -491873 -1552670 -2366192 -1664047
37212 -1664047 181265 1293603 639743 -639419 -912170 -173371 489729 768641 1200801
37203 1200801 1797930 1918819 1416026 815871 409231 132301 210043 871344 1530525 1365884
37193 1365884 692619 629606 1358262 1866357 1528605 778147 82998 -508726 -651937 72507
37183 72507 924922 515299 -965733 -1651014 -868229 -345094 -1370747 -2495541 -1816927
37174 -1816927 -183122 67426 -1210789 -1838960 -689228 927212 1494948 1088616 463138
37165 463138 -82828 -341334 -6625 561832 534723 51823 276576 1508312 2506346 2332054
37155 2332054 1563498 892915 -98328 -1664882 -2711737 -2321930 -1419118 -1293314 -1318763
37146 -1318763 14838 2326162 3590155 3035874 1854204 896506 -309894 -1736450
37138 -1736450 -2049727 -699499 753841 647116 -604770 -1486126 -1489248 -1061029 -416935
37129 -416935 267941 263737 -754739 -1766608 -1752605 -1398354 -2015573 -3259881 -3535815 -2438857
37119 -2438857 -1176973 -621782 -556850 -918382 -2038858 -3293324 -3217783 -1666269 -359785
37110 -359785 -472639 -1025292 -617137 479630 1078472 947524 747289 798120 962185 1203531
37100 1203531 1363562 907292 -296410 -1469341 -1892144 -1747116 -1371179 -553927 598510
37091 598510 1100733 503433 -49566 514207 1319604 867444 -445416 -880754 -42549
37082 -42549 821451 1069713 1340861 1808404 1608579 518023 -427224 -643978 -873067 -1610781
37072 -1610781 -2061252 -1559522 -820391 -751852 -1060577 -1115109 -1290925 -2228537 -3363551 -3449901
37062 -3449901 -2322967 -1149806 -992553 -1822598 -2841394 -3220630 -2692326 -1848764 -1602070
37053 -1602070 -1994185 -1996271 -954292 302979 463665 -561566 -1633814 -1807702 -1111180
37044 -1111180 -144139 462784 341717 -306296 -803460 -767581 -544222 -551444 -658154 -655403
37034 -655403 -746035 -913049 -440910 1000946 2289245 1971132 211457 -1454728 -2112896
37025 -2112896 -2052364 -1512589 -264181 1342695 2298120 2394414 2527245 2965622 2651384
37016 2651384 1114326 -208246 97508 1134203 952963 -440392 -1119059 -247054 712641
37007 712641 337086 -703551 -897104 -151456 365594 99565 -334717 -344563 -120106 -33996
36997 -33996 -15338 161595 444133 666871 804063 770677 312246 -480323 -771592 279849
36987 279849 2248562 3465061 2751311 813821 -626280 -877089 -739593 -979620 -1310497
36978 -1310497 -1290374 -1250339 -1501298 -1438776 -625631 -175758 -1500788 -3835589 -4759449 -3504710
36968 -3504710 -1972018 -1709967 -1700027 -473409 1180920 1520349 753432 477306 835360
36959 835360 550778 -354769 -293150 1020123 1724043 773116 -266712 304764 1672437
36950 1672437 1872075 608493 -868439 -1840544 -2517082 -2912021 -2768117 -2294672 -1799870
36941 -1799870 -922961 662589 2170855 2507642 1846437 1219211 807502 -72117 -1381605
36932 -1381605 -2082461 -1614531 -564105 326506 844005 878567 345467 -215584 84996
36923 84996 1250926 2196490 2082921 1221465 477230 431719 1218183 2424376 3036282 2286344
36913 2286344 752590 -147081 96392 668519 896378 1085545 1482198 1435293 355249
36904 355249 -1190333 -2139669 -2277918 -2223436 -2351232 -2377631 -1962263 -1252461 -709157 -541270
36894 -541270 -403859 207005 1170546 1640568 1041902 -127981 -945428 -1203400 -1309754
36885 -1309754 -1314817 -801087 335782 1668449 2727182 3141629 2576133 1249346 174135
36876 174135 -5328 -38313 -877186 -1914673 -1827941 -902388 -782494 -1813180 -2441784 -1692283
36866 -1692283 -452124 369585 1171019 2159860 2233928 733676 -1026768 -1473574 -1009068
36857 -1009068 -1087800 -1888325 -2364414 -2021626 -1278253 -479904 248780 561404 394828 526889
36847 526889 1589675 2898816 3241454 2451200 1298587 283834 -523065 -936551 -939796
36838 -939796 -1057758 -1506900 -1507499 -436479 919770 1363192 975819 659737 544641 114369
36828 114369 -551365 -935963 -1046769 -994628 -226047 1391274 2389401 1399584 -433747
36819 -433747 -749317 537989 1231711 427660 -292205 146716 468578 -578176 -1929866
36810 -1929866 -1873475 -632818 332802 659154 1089709 1695739 1612387 513314 -779903
36801 -779903 -1357696 -1214484 -987199 -1048574 -1033803 -321134 963498 1773248 1438489 769177
36791 769177 1040102 2081327 2398059 1212139 -640678 -1966567 -2349957 -1908606 -997087
36782 -997087 -351479 -465988 -704635 -197949 416686 -251264 -1733056 -1901476 -426881
36773 -426881 229438 -1398018 -3128964 -2244778 436850 1972584 1646213 1319516 1962397
36764 1962397 2461478 2028523 1436834 1215493 525428 -1242970 -3153960 -3968936 -3766732
36755 -3766732 -3523584 -3717751 -3965185 -3653118 -2622037 -1483869 -1170710 -1752079 -2066183
36746 -2066183 -1214844 58005 444673 -11478 -391917 -805325 -2050694 -3518872 -3490289
36737 -3490289 -1918485 -868970 -1395205 -1978679 -1248782 -290744 -519783 -904486 453265
36728 453265 2962826 4132154 3151058 1712835 1249949 1376935 1414939 1590006 2034550
36719 2034550 2148176 1778777 1755322 2354389 2351933 651448 -1925464 -3477413 -3124675
36710 -3124675 -1463606 514695 2036732 2457551 1548885 -81770 -1422637 -1893997 -1493602
36701 -1493602 -488080 592338 1066461 801359 496106 735356 1149535 1143722 1005037
36692 1005037 1407097 2119426 2254861 1744869 1478058 1767294 1748129 818890 -205632
36683 -205632 -152176 828918 1453754 984649 18443 -440624 -130914 481864 989560 1367002
36673 1367002 1556065 1231581 357026 -355031 -202645 346741 86085 -1148926 -2105674
36664 -2105674 -2023470 -1785943 -2182626 -2154923 -434831 1766284 1838617 -414505 -2170484
36655 -2170484 -1429227 450619 1108948 419104 -61282 365136 1128510 1727901 1966971
36646 1966971 1424256 132969 -639622 243661 1887781 2289325 1127187 182213 740034
36637 740034 1940813 2284867 1692315 1221126 1328911 1283270 301347 -1219065 -1971148
36628 -1971148 -1350011 -454997 -848545 -2363986 -3108448 -1981635 -105390 914906 963572
36619 963572 611167 -399728 -2225064 -3420220 -2451526 -345165 271986 -1198828 -2680101
36610 -2680101 -2616673 -1720041 -965186 24165 1547326 2615782 2463401 1806135 1369392
36601 1369392 599513 -799657 -1490007 -365043 1362036 1797135 1192918 1156642 1727766
36592 1727766 1502724 458147 294705 1562636 2554073 1908031 591207 197811 646386
36583 646386 797780 338541 -254009 -933352 -1964237 -2934107 -3072078 -2455822 -1902417
36574 -1902417 -1683584 -1302948 -630837 -279058 -519224 -708998 -354023 -44792 -583755
36565 -583755 -1600730 -1892000 -1079960 -207011 -497193 -2002526 -3648609 -4255920 -3399026
36556 -3399026 -1655581 -224466 -8948 -850583 -1790382 -2078557 -1676783 -877814 56443
36547 56443 817862 1172727 1346622 1774498 2279378 2083973 916496 -485785 -1306722
36538 -1306722 -1495170 -1353872 -972200 -497506 -273338 -243291 37488 369253 -105935 -1263209
36528 -1263209 -1571742 -321529 978114 794950 -49075 19815 431629 -512029 -2341220
36519 -2341220 -2758172 -1307448 -142977 -612891 -1454961 -1241429 -439645 63346 524302
36510 524302 1167091 1210684 438376 108806 844065 1204545 86277 -924929 284962
36501 284962 2812957 3631287 1718246 -709333 -1219661 170859 1704177 2096957 1591387
36492 1591387 1347217 1998874 2771209 2458350 1297996 837029 1569341 2069078 1289483
36483 1289483 265212 248036 507877 -300026 -1601775 -1670272 -350964 793279 754749
36474 754749 -51151 -831652 -883838 466350 2825565 4181636 3083833 832187 -291690
36465 -291690 -284437 -736358 -1526697 -949617 946311 2085159 1901311 2234424 3757892
36456 3757892 4399995 2843094 985674 917316 1624258 1035464 -366813 -568460 442167
36447 442167 752271 -326804 -1459484 -1521575 -761765 195304 838008 401447 -1289315
36438 -1289315 -2694996 -2068580 -154806 516478 -644717 -1331370 55150 1844047 1632543
36429 1632543 -171876 -1311510 -1265150 -1637301 -3050943 -3802548 -2380959 219752 1819076
36420 1819076 1734907 1046518 788159 993284 1245356 1178370 537299 -428010 -789769 -20335
36410 -20335 985078 1020776 516727 998294 2518234 3258042 2269990 1009815 1093192 1898628
36400 1898628 1763849 534568 -543415 -725338 -144079 1071347 2614325 3469340 3001314
36391 3001314 2119930 1975799 2086307 1343234 256610 242070 1061819 1160956 477301 583433
36381 583433 1733976 2165238 1096170 198194 934182 2310412 2565067 1570000 347017
36372 347017 -452322 -511623 347480 1325796 1052995 -180021 -257113 1517200 2880129
36363 2880129 1938104 175579 -3585 837451 361406 -1471092 -2357517 -1392018 -219261
36354 -219261 -247610 -966314 -1458930 -1617679 -1295195 11907 1938670 3112767 2865353
36345 2865353 1925570 1026381 97463 -710515 -569900 690103 1862657 1806912 890185
36336 890185 343041 752875 1673251 2221678 1748651 388638 -919234 -1453241 -1631999
36327 -1631999 -2202061 -2770812 -2267018 -802174 227674 78333 -619904 -1340217 -2361930
36318 -2361930 -3450455 -3441913 -2157462 -1326686 -2266270 -3729735 -3569621 -1747295 -97913
36309 -97913 368945 237497 -22535 -723553 -1616278 -1516862 -58343 1373219 1376800 373495
36299 373495 -233427 -78763 84528 -27859 175166 809487 892651 -272948 -1835091
36290 -1835091 -2373923 -1772559 -1165418 -1115015 -918391 -84980 532077 -29831 -1116388
36281 -1116388 -1134519 149643 1126246 480810 -1104952 -1999791 -1720165 -1180490 -1145539
36272 -1145539 -1309151 -1078772 -607019 -521460 -845594 -746966 415113 2082424 2943473
36263 2943473 2402688 1247259 674843 969546 1464685 1598710 1526916 1632035 1832796
36254 1832796 1670473 997758 352750 481245 1452472 2431809 2567897 1982660 1490464
36245 1490464 1381382 1069543 138708 -896502 -1315889 -1168120 -969655 -840299 -559752
36236 -559752 -187603 2455 5362 -30558 -127657 -169132 290928 1196355 1467565 304918
36226 304918 -1358150 -1887403 -1210372 -684996 -753246 -356658 905511 1703030 970039
36217 970039 -420256 -1154978 -1513971 -2500785 -3789103 -4134026 -3422353 -2751918 -2544813
36208 -2544813 -2047550 -920402 -6428 -36646 -597427 -938766 -997121 -1066044 -1144250 -1183255
36198 -1183255 -1394915 -1730949 -1598295 -754779 -6984 -183036 -705348 -196524 1411719
36189 1411719 2388267 1364433 -731865 -1726437 -849981 596307 1265495 1440262 2091628
36180 2091628 3036994 3127427 2120406 1227026 1376177 1816162 1222663 -299739 -1256016
36171 -1256016 -735722 489423 1091774 768474 247194 112097 193152 50725 -431066
36162 -431066 -1103163 -1858702 -2546976 -2718502 -1906794 -360829 821510 693887 -469815
36153 -469815 -1471560 -1561000 -1115812 -865927 -920361 -884123 -580539 -228628 -93332 -317526
36143 -317526 -893644 -1414661 -1108877 314427 1976889 2615893 2064526 1306056 989598
36134 989598 695006 11718 -488502 -102732 712947 822724 15677 -723358 -607376 50723
36124 50723 549467 736335 838629 850941 579533 59162 -449359 -749131 -794335 -696207
36114 -696207 -778273 -1260052 -1656209 -984540 930642 2756667 2950997 1616745 367144
36105 367144 337195 1035329 1348115 1004809 620537 723138 1205694 1560622 1360903 657592
36095 657592 57196 157368 747562 894759 61884 -1181107 -1856577 -1678088 -1088314
36086 -1088314 -485528 97395 644067 941853 790748 203069 -568607 -1054814 -836008
36077 -836008 -78892 395713 -43908 -1075839 -1883932 -2195824 -2356641 -2510859 -2398408
36068 -2398408 -2048680 -1959748 -2261348 -2323283 -1698951 -967399 -991562 -1655353 -2069743 -1876989
36058 -1876989 -1507656 -1090010 -109726 1349319 1965958 788194 -1056305 -1519893 -430545
36049 -430545 233161 -740559 -1965395 -1526411 160400 973731 68349 -1289639 -1821056
36040 -1821056 -1671077 -1388330 -841977 68211 645348 300343 -400848 -477769 94121 545072
36030 545072 521223 348502 257389 88036 -205528 -341441 -157076 75357 -38612 -475622
36020 -475622 -684683 -216239 459543 256183 -888471 -1265568 594798 3470951 4531289
36011 4531289 3009950 1092010 579914 581399 -308650 -1351588 -1029636 262836 994474
36002 994474 1077954 1505166 2015928 1464565 285838 203353 1285647 1586725 239460
35993 239460 -1243974 -1530201 -1304100 -1510414 -1571169 -687496 479108 780741 215077
35984 215077 -542978 -1289941 -1943505 -1971393 -1205805 -439016 -324371 -490913 -496204 -662046
35974 -662046 -1141212 -1264889 -791640 -675453 -1495381 -2270789 -2074969 -1642421 -1908509 -2106191
35964 -2106191 -1078999 473349 1028229 776733 1008231 1506591 940595 -311261 -309684
35955 -309684 1056837 1379809 -530333 -2477451 -2067624 -324016 -70091 -1670695 -2544355
35946 -2544355 -843515 2154023 3833755 3224906 1449656 -82171 -963886 -1344917 -1083905
35937 -1083905 7225 1360715 1898686 1309199 452345 118145 4791 -476828 -985858
35928 -985858 -746887 70951 489390 186985 -143848 -43607 33215 -374592 -929914 -1101707
35918 -1101707 -1005709 -1061888 -1147427 -719979 201573 681555 -126801 -1721339 -2504841 -1640872
35908 -1640872 -227596 85164 -641077 -860458 -69052 360102 -470135 -1251102 -384624
35899 -384624 1432163 2129074 1149593 -197622 -916439 -1201281 -1219911 -657790 261126
35890 261126 682556 423717 253920 620069 1137428 1490433 1736422 1621667 823808 8193
35880 8193 280292 1312940 1459717 208087 -910885 -552341 602854 1075785 567502
35871 567502 -153147 -471556 -302864 18730 -235443 -1411541 -2455550 -1881391 -93006
35862 -93006 807976 155823 -140221 1285133 2810565 2251891 315234 -489002 474289
35853 474289 1568161 1801829 1966532 2639555 2932183 1951743 314968 -528646 106070
35844 106070 1546894 2363799 1602009 -134092 -1104420 -508165 326691 -340332 -2227397
35835 -2227397 -3456280 -3193936 -2568451 -2766467 -3415980 -3436795 -2678400 -1960830 -1813499
35826 -1813499 -1842853 -1495072 -1065202 -1396538 -2405275 -2619425 -1075859 780237 540735
35817 540735 -1733466 -3203393 -2021201 259293 1150921 554504 62890 224926 376464
35808 376464 356126 495172 446458 -200131 -638047 28885 890198 411194 -907613 -1190665
35798 -1190665 -249851 337995 177104 515966 1397209 1033551 -995285 -2371259 -1287832
35789 -1287832 891322 1709200 710485 -942623 -2382019 -3083133 -2447220 -896907 -151942
35780 -151942 -960863 -1830768 -1439405 -768426 -1029240 -1089222 569372 2543724 2116718
35771 2116718 -337227 -1613956 -526484 473184 -666302 -2636400 -3242022 -2579979 -1935809
35762 -1935809 -1240840 237335 1738247 1751722 522625 -154260 374050 923480 736863
35753 736863 693004 1510025 2249983 1802153 767774 418597 473758 -376176 -1909386 -2221171
35743 -2221171 -659363 801570 262970 -1320504 -1593422 -215481 901674 463713 -820386
35734 -820386 -1801177 -2188838 -1897009 -656963 976457 1582743 783357 73536 713533
35725 713533 1800910 1693927 553096 -36944 382017 513394 -585229 -1983684 -2008999
35716 -2008999 -235225 2112703 3450825 3290985 2503048 2157342 2215735 1785125 674153
35707 674153 -110948 146263 742981 724935 461816 927017 1837984 1848060 605679 -615560
35697 -615560 -666901 131414 883771 1459938 2200428 2849929 2668991 1550914 366450
35688 366450 -48845 89673 -117070 -905790 -1323371 -446477 1118702 1670747 511415
35679 511415 -1096378 -1526163 -743839 6578 28152 -203000 -132899 24432 -203487 -768675
35669 -768675 -1193164 -1165713 -787926 -347724 -39320 47972 -262659 -1190584 -2516879 -3381348
35659 -3381348 -3092530 -2087468 -1438890 -1364177 -1043457 -140659 488148 168663 -460639
35650 -460639 -534342 -356612 -644412 -1015620 -521783 613365 1113833 541561 -133973 -120946
35640 -120946 86215 -317872 -1115942 -1335057 -542734 561360 852801 12948 -1005116
35631 -1005116 -1008621 -86304 480990 81614 -286046 370094 1279332 933689 -538334 -1355151
35621 -1355151 -518325 878402 1170397 188591 -638582 93240 2203102 3829170 3150946
35612 3150946 529397 -1544242 -1210444 552529 1258163 -15735 -1837880 -2400113 -1287176
35603 -1287176 575725 1840647 1706415 699741 227653 733740 975348 42494 -867242
35594 -867242 -200720 1231112 1290076 -101117 -831054 37695 1024136 881581 372402
35585 372402 499552 848092 815430 893956 1498613 1855046 1282611 439659 129331 -55301
35575 -55301 -712840 -1266800 -879727 65238 594621 594347 556217 537144 443347 749383 1838767
35564 1838767 3062391 3414592 2793442 1835857 958946 261090 -156457 -441174 -990515
35555 -990515 -1623469 -1501905 -511240 196867 -142935 -674866 -348418 353630 343160 -198230
35545 -198230 -270128 129341 50284 -762704 -1512377 -1569111 -1038002 -201459 696823 1201855
35535 1201855 974240 269218 -508910 -1410696 -2461350 -3048963 -2623895 -1638116 -945195
35526 -945195 -590918 -51757 606192 706842 23711 -843593 -1148269 -664695 129235 324921
35516 324921 -498828 -1461049 -1238975 3592 578649 -356977 -1576824 -1677081 -977427
35507 -977427 -517312 -300595 203789 741133 775581 617750 868809 1383694 1783037 2200134
35497 2200134 2576552 2234884 1186957 665602 1183920 1479596 818808 728511 2510127
35488 2510127 4565967 4574799 3092974 2387202 2673881 2350803 1301451 976812 1430281
35479 1430281 1185164 103238 -357945 110658 323991 135203 592826 1388598 1045010
35470 1045010 15613 528869 2646126 3601651 2140485 452486 366853 566189 -574654
35461 -574654 -1975958 -1779161 -222641 1335080 2426500 2801416 1685453 -468647 -1368848
35452 -1368848 56840 1742009 1538867 408117 449767 1452888 1792312 1400415 1406116
35443 1406116 1827988 1902893 1840877 2128734 1972914 579022 -861389 -677896 492808
35434 492808 649636 -426634 -1192919 -1050129 -801151 -723681 -409327 -348425 -1430669 -2824292
35424 -2824292 -2549521 -453876 1416595 1837389 1854239 2569152 3271782 2796493 1473223
35415 1473223 639993 863031 1399830 1160557 -66360 -1169377 -714024 1237593 2801314
35406 2801314 2414502 764094 -231671 212475 1364679 2384506 2961768 2909426 2236151
35397 2236151 1456789 1018726 734340 387058 212027 82328 -786544 -2365857 -3167730
35388 -3167730 -2264733 -807477 -201567 -86206 258938 -41866 -1875257 -3851365 -4042230
35379 -4042230 -3010784 -2536853 -2280781 -678436 1523055 1949438 643476 48767 762013
35370 762013 746561 -632735 -1283357 -165993 915279 708367 547316 1309821 1376554
35361 1376554 -313626 -1915229 -1656901 -702680 -673980 -701897 416449 1365102 629468
35352 629468 -221570 1128076 3581903 4290559 3444110 3715131 5354925 5637643 3531944
35343 3531944 1401751 1103698 1483675 1117364 865519 1922637 3349704 3464971 2357317
35334 2357317 1360221 1031901 1091580 1478262 2071969 2062834 978767 -136905 112559 1427363
35324 1427363 2171776 1658082 810354 406311 -78165 -1246827 -2359167 -2146716 -724480
35315 -724480 301175 -201937 -1568413 -2393189 -2336391 -2185527 -2406511 -2506130 -1978702 -1122469
35305 -1122469 -505424 -188245 14509 -48247 -555692 -1077996 -903981 25885 1038192
35296 1038192 1593721 1746651 1653657 1138422 77024 -1074356 -1582841 -1303290 -900082
35287 -900082 -962005 -1102158 -397512 1210357 2485615 2248789 768783 -678218 -1285582
35278 -1285582 -1126351 -431456 619683 1431400 1284679 343809 -404284 -436057 -142098
35269 -142098 181695 811648 1668476 1956697 1424082 1053414 1594252 2174099 1476662 -191990
35259 -191990 -1217397 -917607 -354327 -711227 -1718444 -2111003 -1223481 244618 1003981
35250 1003981 609067 -55077 19998 527901 381518 -334686 -155993 1432258 2699579
35241 2699579 1929880 102710 -281197 1304686 2802073 2608223 1578511 1300250 1704361
35232 1704361 1533103 459536 -457716 -313810 525152 1013857 643845 -126429 -427693
35223 -427693 139408 1070250 1393716 654989 -530584 -1028457 -379163 628285 772676
35214 772676 -148638 -981841 -658956 272736 221193 -1276329 -2700870 -2328846 -298047
35205 -298047 1707093 2408809 1850372 668900 -587838 -1315279 -902477 572342 2140334
35196 2140334 2868181 2732040 2252973 1556944 303597 -1459801 -2851506 -2892408 -1588816
35187 -1588816 -27416 642795 159236 -908823 -1827889 -2094119 -1477306 -166548 1140039
35178 1140039 1719562 1533730 1193471 1162612 1283207 1155169 689795 170930 -32134 217507
35168 217507 606047 553507 -120993 -862944 -1048722 -782692 -588581 -574840 -517763 -500926
35158 -500926 -667063 -558465 278938 1144534 880857 -153380 -217030 1249671 2635640
35149 2635640 2527405 1686095 1520926 1813224 1474048 729528 838491 1956952 2875809
35140 2875809 2911474 2685370 2786763 2816353 2184192 1057239 115740 -151058 249790 801515
35130 801515 784689 16270 -823896 -985203 -496358 201274 1013341 1939146 2511112 2322490
35120 2322490 1823969 1783858 2198594 2476900 2354429 1843523 771421 -650616 -1336634
35111 -1336634 -628913 379013 251460 -473607 -135624 1079624 1166829 -337923 -1256156
35102 -1256156 -43377 1798974 2056510 962318 267257 348093 260247 4737 616956
35093 616956 2007848 2576369 1399015 -614881 -2222547 -3222504 -3732386 -3329653 -1915729
35084 -1915729 -616648 -662236 -1694566 -2187941 -1442102 -268515 310697 143310 -445872
35075 -445872 -1171485 -1454179 -515121 1353316 2348489 1142094 -1107212 -2031362 -1193337
35066 -1193337 -451088 -984258 -1664333 -1198585 -304344 -357939 -1062738 -1179840 -863335 -1404657
35056 -1404657 -2876658 -3814016 -3368836 -2194690 -936310 565254 2071864 2520287 1644965
35047 1644965 763986 990407 1713016 1835202 1502255 1378267 1031310 -463468 -2648881
35038 -2648881 -3858598 -3340803 -2041421 -1075162 -504407 -45839 2542 -697511 -1625746
35029 -1625746 -1829936 -1023430 337414 1822172 3139247 3601833 2483002 293261 -1172987
35020 -1172987 -829954 266593 391434 -447909 -802164 -223722 128091 -411826 -900115
35011 -900115 -523183 -8627 -190837 -402765 296061 1229943 1007518 -329535 -1603473
35002 -1603473 -2411498 -3098159 -3244943 -2069620 -287535 301986 -598978 -1273962 -513287
34993 -513287 838536 1366724 781285 -361235 -1384739 -1535199 -570116 334891 -357589
34984 -357589 -2230834 -3210373 -2630614 -2192784 -3031784 -3704890 -2476367 -107404 1226872
34975 1226872 772192 -505562 -1603088 -2079552 -1652705 -479964 621184 1179409 1710000
34966 1710000 2595077 3197746 2969046 2480351 2379447 2298125 1800363 1344899 1223828 725997
34956 725997 -422292 -1060840 -446518 239730 -154046 -730892 -405985 -255656 -1512396
34947 -1512396 -2546349 -956896 2064832 2887438 908267 -576338 438709 1940007
34939 1940007 1597245 213372 -289906 56596 172921 65321 160174 -7232 -646368
34930 -646368 -557768 1089709 2907279 2941574 1304878 -420446 -1488854 -2025015 -1600803
34921 -1600803 261633 2523548 3380942 2576773 1525839 1175686 1089858 670490 589
34912 589 -691856 -1328480 -1593305 -1182653 -510382 -295296 -465342 -369820 -14867 -75888
34902 -75888 -648424 -1025078 -868324 -622087 -554550 -354984 53905 233491 48670 -164932
34892 -164932 -546258 -1733541 -3430216 -4084534 -2870260 -1066726 -430336 -929795 -1269844
34883 -1269844 -1052431 -954566 -1007264 -352970 976240 1582288 767920 -205214 -22171 542470
34873 542470 -156235 -1854991 -2526648 -1329521 230693 616527 284397 450039 1000279
34864 1000279 956923 320378 -11713 68113 -326253 -1466321 -2452289 -2646106 -2583480 -2895324
34854 -2895324 -3227907 -2952537 -2244319 -1640794 -1030056 26742 1209904 1581286 884666
34845 884666 -5439 -188737 185543 259355 -393750 -1285689 -1606853 -1088178 -217267 308765
34835 308765 238646 -128644 -369024 -357922 -324414 -546814 -921812 -869561 32849 1236313
34825 1236313 1524327 512869 -628168 -593778 275682 493180 -447812 -1444597 -1417054
34816 -1417054 -595737 168118 515738 559784 526284 864253 1899860 2887979 2370024 228070
34806 228070 -1588839 -1441241 -254893 -90747 -1137664 -1748724 -1147295 -267490 253811
34797 253811 1057850 2356532 2920313 1923033 528386 261470 705385 341839 -878499
34788 -878499 -1483202 -915314 -395276 -950053 -1950886 -2306086 -2010738 -1623628 -1056837
34779 -1056837 32181 1153751 1435493 1005235 889130 1465489 1950224 1648358 898167
34770 898167 426947 463305 861122 1446130 1821014 1497665 744489 622438 1501560 2194189
34760 2194189 1450121 -198463 -1111748 -709368 148567 712104 1001019 926148 156300
34751 156300 -783896 -606659 920404 2385589 2679328 2428497 2606175 2811902 2187870
34742 2187870 1233878 1220432 2139761 2631748 1897793 504657 -726934 -1509193 -1682145
34733 -1682145 -1154980 -513512 -667049 -1531801 -1979034 -1488518 -951978 -1287385 -2055858
34724 -2055858 -2174108 -1457200 -716766 -600595 -932938 -1106099 -745046 -37042 443681
34715 443681 368290 85501 116384 319275 82041 -698364 -1488276 -1972490 -2235446 -2034924
34705 -2034924 -941585 506609 982376 304063 -28088 862673 1622556 706525 -1021582
34696 -1021582 -1490755 -591858 -147304 -870264 -1448886 -1041793 -685716 -1327140 -2139481
34687 -2139481 -2017474 -1442598 -1502156 -2020829 -2066806 -1612381 -1293534 -1023816 -268106 599115
34677 599115 628226 -91752 -508850 -366275 -530955 -1280231 -1574104 -622846 879774 1779780
34667 1779780 1885616 1686102 1363354 819567 164409 -478580 -1224078 -1950837 -2068179
34658 -2068179 -1329021 -402860 -51781 -207968 -455538 -834257 -1359134 -1293453 15129
34649 15129 1812771 2548212 1818259 745547 343749 481198 687244 1002327 1524690
34640 1524690 1850231 1555493 800771 36179 -500578 -692871 -426706 77272 256116
34631 256116 -88421 -475798 -507301 -508540 -952379 -1607807 -1798579 -1297498 -497303 153246
34621 153246 480123 491449 307908 48781 -474548 -1651692 -3255040 -4068438 -3024495
34612 -3024495 -688572 1056040 1045762 102616 -62381 1093335 2418090 2548758 1464009
34603 1464009 260312 -339730 -640006 -1028208 -1147979 -669428 -305018 -941275 -1899272
34594 -1899272 -1392307 894542 2945529 2927059 1477472 402585 14916 -734196 -1971326
34585 -1971326 -2478871 -1684106 -554613 -31266 161315 463368 343422 -815215 -2373703
34576 -2373703 -2977667 -2155739 -639688 687060 1487039 1755160 1566220 1111651 578650
34567 578650 -46733 -777808 -1313340 -1287361 -837434 -588039 -939908 -1546581 -1618649 -734735
34557 -734735 650551 1527855 1251180 140993 -906015 -1319523 -1184972 -811899 -378129
34548 -378129 -62691 -126687 -629905 -1294979 -1820433 -2144359 -2305598 -2269815 -1996765 -1493675
34538 -1493675 -780386 -14026 440595 417415 318622 578751 837669 327947 -842544 -1573149
34528 -1573149 -1199736 -302030 242495 210063 -394778 -1773268 -3558723 -4398143 -3326608
34519 -3326608 -1107732 674954 1395523 1380325 767285 -362661 -1103619 -453154 1049263
34510 1049263 1754621 1151348 399449 366114 498471 173938 -158831 -5462 139493 -216638
34500 -216638 -436327 260917 1284755 1285070 17452 -1303734 -1381737 43551 2140595
34491 2140595 3444714 2795389 560209 -1396999 -1665301 -852535 -514927 -1020957 -1442582
34482 -1442582 -1221069 -806553 -678531 -741140 -780559 -679093 -152877 887708 1759405 1722008
34472 1722008 1239932 1452223 2315941 2507235 1470312 294747 2266 166380 -18185
34463 -18185 -428397 -717782 -1292277 -2411085 -3139639 -2525525 -1233470 -605154 -495079
34454 -495079 373822 1948101 2417726 763777 -1636476 -2775771 -2411749 -1790590 -1691744
34445 -1691744 -1798856 -1723474 -1638827 -1726900 -1666900 -1036926 60136 1072993 1625051 1814437
34435 1814437 1803451 1329588 9801 -1785359 -2804100 -2092520 -132943 1607087 2173804
34426 2173804 1798581 1223744 917651 995913 1357451 1671656 1614738 1300832 1145135 1202949
34416 1202949 1088680 725311 665766 1307214 2180321 2471887 2015967 1324988 781110 268199
34406 268199 -352196 -802159 -692732 -155373 123645 -297737 -901707 -697645 428231
34397 428231 1335049 1055358 175149 32763 761380 1096202 235019 -1091363 -1768802
34388 -1768802 -1609500 -982419 -6677 1128276 1753200 1536152 1209400 1593172 2338149
34379 2338149 2590399 2489561 2846613 3530542 3451484 2278525 1007929 520212 623707
34370 623707 889214 1341410 1770716 1451235 395101 -37234 1109561 2652423 2558470
34361 2558470 701083 -978720 -1179415 -843505 -1475219 -2830609 -3264035 -1984395 10291
34352 10291 1321092 1678841 1714570 1790119 1717652 1407518 1038841 501272 -575671 -1885417
34342 -1885417 -2302763 -1400620 -508147 -1186832 -2890478 -3385602 -1706279 498086 1124484
34333 1124484 115907 -997464 -1246242 -905182 -535781 -408042 -674023 -1172736 -1142273
34324 -1142273 -11540 1511574 2004160 1103941 -73037 -462745 -198382 53535 82138
34315 82138 -37175 -411568 -974956 -1137707 -501239 333840 355529 -526732 -1318774 -1180844
34305 -1180844 -377552 157029 -106014 -813557 -1157097 -669031 326293 1051624 1135450 1015643
34295 1015643 1287326 1763405 1578099 368949 -983509 -1177504 2407 1341600 1478032
34286 1478032 304630 -1047727 -1403611 -518130 871154 1585152 811449 -1037743 -2304774
34277 -2304774 -1629668 313548 1410956 813377 95681 889676 2283234 2038144 -10151
34268 -10151 -1564135 -1172443 -187661 -467308 -1518134 -1397905 306792 1985377 2299235
34259 2299235 1585849 814947 314745 -62284 -404415 -876620 -1756005 -2864924 -3455933
34250 -3455933 -3081963 -2183619 -1441628 -925514 -279090 575523 1348497 1782524 1777364 1305407
34240 1305407 552716 -16535 -80263 162542 300080 227380 59422 -263058 -849747 -1438844
34230 -1438844 -1545497 -1048434 -277998 436120 899232 809916 -26199 -1137325 -1671346
34221 -1671346 -1514385 -1497318 -2060907 -2379294 -1539458 -78191 638730 341495 71560
34212 71560 432061 787997 593904 393320 756120 1138387 764404 -27589 -375507 -312664
34202 -312664 -428015 -478626 294907 1542246 1943236 1233715 671938 938947 977473 -134595
34192 -134595 -1367770 -1134632 254600 974554 209900 -1049083 -1709238 -1822578 -1888175
34183 -1888175 -2004227 -2218519 -2884522 -3996207 -4684695 -4101465 -2635296 -1621542 -1737011
34174 -1737011 -2184316 -1850365 -969170 -909089 -2131678 -3200018 -2592806 -897083 -823
34165 -823 -395972 -821792 -699256 -1051742 -2220128 -2543463 -827391 1350532 1696416 505189
34155 505189 -146969 273068 542093 366878 769113 1683475 1634209 337252 -630527 -464447
34145 -464447 -249020 -590229 -378923 908114 1869713 1624079 1479447 2372731 2686998
34136 2686998 888136 -1409207 -1668650 -435957 -259152 -1472776 -2103988 -1624041 -1627871
34127 -1627871 -2489688 -2391408 -611718 873547 440046 -672640 -445423 982848 2057107
34118 2057107 2244956 2180116 2209621 2168185 2052158 1845860 1169861 -9948 -826574 -476761
34108 -476761 705635 1805933 2446523 2713355 2522893 1782829 787550 -141495 -1057104
34099 -1057104 -1986383 -2555347 -2422453 -1707477 -770373 -47364 -118803 -1117371 -1996187 -1477109
34089 -1477109 9803 559801 -602614 -2086461 -2500591 -2172039 -1799639 -942893 812500
34080 812500 2493186 3055296 2960091 2914411 2219428 220742 -1653706 -1537264 -157590
34071 -157590 121277 -1016907 -1542739 -533592 520060 366912 -309855 -668307 -1132715
34062 -1132715 -1967041 -2191691 -1180345 69726 476187 466488 869908 1341702 1133416
34053 1133416 525952 302215 515880 805150 1196536 1642474 1548103 740291 105771 255554
34043 255554 417045 -209016 -883027 -505060 372204 287390 -793965 -1464520 -1044138 -308581
34033 -308581 -41795 -178112 -483211 -891399 -1023684 -455907 399034 676745 388690 348405
34023 348405 757151 980414 820112 842145 1261614 1675914 2111903 3055085 4097235 3956003
34013 3956003 2478607 1289634 1534890 2147097 1491068 -177453 -1192751 -868938 -114013
34004 -114013 178944 236003 731904 1723492 2466910 2027555 183265 -2045883 -3083326
33995 -3083326 -2360664 -910013 -108974 -218628 -464959 -87449 1072950 2527017 3275118
33986 3275118 2563559 979000 172968 931013 2158114 2424282 1774265 1127201 610762
33977 610762 -296588 -1386873 -1782762 -1289561 -577944 -54237 402114 623255 236427
33968 236427 -319653 -40393 1053008 1649255 961750 -131294 -352493 349969 1101890
33959 1101890 1421323 1525149 1655103 1712753 1488392 937064 273038 -160752 -261442 -269542
33949 -269542 -235282 276337 1386652 2207962 1872799 1041108 1219901 2523478 3365297
33940 3365297 2713325 1406619 647563 363968 -95731 -628251 -735052 -520826 -397371
33931 -397371 -315877 -102852 -62029 -486625 -1038958 -1275813 -1271661 -1144382 -678442 -100228
33921 -100228 -358524 -1702921 -2827763 -2560881 -1644915 -1561921 -2274517 -2593867 -2232450
33912 -2232450 -1849566 -1420974 -363679 802244 787673 -242969 -601197 295388 979159
33903 979159 362313 -533363 -316420 674855 1199471 953472 374700 -492977 -1671246
33894 -1671246 -2433021 -2066521 -1075492 -557268 -685833 -752753 -419141 10048 358002 748610
33884 748610 1124008 1344991 1651573 2309970 2889123 2557751 1106454 -784093 -2171771
33875 -2171771 -2391660 -1332102 286288 1235226 957547 145658 -284138 -250957 27793
33866 27793 847751 2271489 3202728 2524797 850390 -206642 -316365 -526048 -1104323
33857 -1104323 -980823 260956 1442259 1554132 1032423 435721 -685093 -2411388 -3289758
33848 -3289758 -2159888 -273001 145286 -1042236 -1968112 -1653321 -1015950 -867565 -700051
33839 -700051 -64574 387441 168525 84617 1038198 2516444 3309699 3166926 2763008 2443698
33829 2443698 1971048 1285625 641095 74460 -510278 -808143 -384636 515533 1083069
33820 1083069 937106 464293 112575 -157749 -627193 -1385476 -2175231 -2459001 -1877867
33811 -1877867 -918382 -649587 -1307457 -1779666 -1309569 -968993 -2078008 -3662940 -3349937
33802 -3349937 -897750 1129599 897769 -336334 -527431 154596 229911 -417327 -654525
33793 -654525 -214501 115817 94819 168244 187524 -447722 -1437196 -1898178 -2017565 -2777704
33783 -2777704 -3913355 -3880589 -2307516 -809690 -672816 -1257168 -1527756 -1633039 -1849589
33774 -1849589 -1385137 291559 1987748 2246734 1531066 1335460 1662699 1168203 -309914
33765 -309914 -1179792 -461533 767476 997441 251597 -360450 -237557 387006 1143357
33756 1143357 1713161 1644826 778252 -240666 -559707 -266501 -279822 -909630 -1214766 -341720
33746 -341720 993361 1242420 172504 -711598 -244599 868499 1378896 1488325 2209456
33737 2209456 3177981 2792873 799408 -887132 -748848 272870 406721 -331089 -579928
33728 -579928 -1168 411464 159962 -186452 -364159 -876591 -1649012 -1565381 -111651 1546507
33718 1546507 2010576 1412182 850439 732831 690565 640127 719802 369735 -1182411 -3266216
33708 -3266216 -3869452 -2124330 223362 789665 -561201 -1833455 -1591479 -377506 615247
33699 615247 1100928 1402421 1500041 1192065 738204 606027 814851 1093539 1416770 1788056
33689 1788056 1736236 739390 -865897 -1973369 -1782951 -462044 1140286 2084613 1887997
33680 1887997 938566 159633 -95513 -389272 -1019697 -1252251 -589654 -28374 -715192
33671 -715192 -1872281 -1686213 -77673 1168067 1121532 700323 583220 131627 -824089
33662 -824089 -1093003 -223264 290923 -593826 -1466636 -666097 838365 836158 -782376 -2190283
33652 -2190283 -2492857 -2303243 -1879449 -910336 -47574 -428450 -1472501 -1282830 338173
33643 338173 1346159 572668 -618818 -696343 -82684 247293 538288 1164409 1267697
33634 1267697 194837 -849049 -401682 820473 967021 17985 -251600 847926 1984731
33625 1984731 2030276 1489109 1116691 642885 -234658 -826682 -533502 -60900 -351240 -876876
33615 -876876 -293502 1376112 2441156 1670152 -179269 -1330612 -871591 649124 1976851
33606 1976851 2159732 1205039 25845 -535503 -667920 -1103014 -1733508 -1621184 -634529
33597 -634529 25817 -369276 -817352 -213626 682283 374147 -897108 -1530840 -1155626
33588 -1155626 -966241 -1378539 -1354148 -626017 -595200 -1912500 -2906844 -1914881 150938
33579 150938 1186914 827426 275767 -24030 -665841 -1551132 -1694849 -884660 -69078
33570 -69078 158700 259090 670611 1086468 1109689 803474 372839 -21440 -90014 248131
33560 248131 415356 -179706 -1136814 -1512990 -1168958 -782087 -605179 -219765 401630 598380
33550 598380 74427 -533798 -434956 523876 1958242 3386798 4688457 6562221 10009443
33541 10009443 14483353 17133306 15340991 9992901 4900661 2811577 3214485 4158609
33533 4158609 4622781 4457751 3489761 1890214 624256 428377 739019 463272 -464389
33524 -464389 -1010060 -440207 735664 1348409 917661 235733 365122 1097009 1068200 -207294
33514 -207294 -1262467 -560334 1187041 1864018 843095 -327412 -168841 1062609 2190435
33505 2190435 2487976 1922442 960179 407358 699757 1286353 1425545 1319766 1465133
33496 1465133 1297141 -71325 -1971058 -2691770 -1911270 -921268 -341335 467935 1408336
33487 1408336 1244773 -16444 -486828 682358 1694827 912928 -478961 -394833 973580
33478 973580 1845724 1712157 1539580 1746263 1825755 1681779 1730410 1839680 1550380 1188731
33468 1188731 1455469 2006411 1681154 182878 -1528333 -2584661 -3031275 -3207616 -3113572
33459 -3113572 -2593066 -1657065 -537025 341020 616869 434584 282533 267378 96034
33450 96034 -141190 -39127 68102 -723384 -2170303 -2623391 -1331090 221239 360069
33441 360069 -511274 -953300 -733672 -512429 -144814 956017 2234097 2483716 1759626
33432 1759626 1267591 1439301 1602469 1580146 2081766 3184595 3792429 3173040 2003353
33423 2003353 1283922 996591 471044 -415315 -1024062 -837641 -196053 10597 -587279
33414 -587279 -1305306 -1322162 -922231 -1066951 -1751263 -1854963 -955697 -122350 -242317 -667516
33404 -667516 -422026 239898 540775 593834 969407 1520313 1717183 1544903 1100375 38750
33394 38750 -1552205 -2568450 -2352225 -1856232 -2009152 -1860135 -70972 2420752 3203944
33385 3203944 1716464 14851 78088 1710281 3248934 3266769 1610346 -345658 -802048
33376 -802048 268959 791101 -486652 -1899575 -1373529 199406 448362 -493588 -392166
33367 -392166 962065 1200644 -515940 -1865141 -1046436 476696 501278 -721213 -1531440
33358 -1531440 -1467260 -1103042 -545888 289202 862760 862591 1005543 1776426 2312555 1803783
33348 1803783 1058342 1273579 2052847 2144864 1540108 1249460 1352164 891950 -252166
33339 -252166 -875973 -231713 826019 1047812 380007 -274940 -450383 -610679 -1261670
33330 -1261670 -2047008 -2102884 -1237000 -293963 -86175 -376905 -425959 -193153 -247720 -635822
33320 -635822 -724769 -291002 52889 -207632 -780876 -1054804 -739467 117964 1145063 1557448
33310 1557448 770311 -708072 -1661526 -1580336 -967311 -206525 822979 1739013 1505408
33301 1505408 28186 -1138488 -702254 489443 628747 -435736 -1012846 -9916 1547028
33292 1547028 1852604 470568 -1405587 -2475742 -2528065 -2119872 -1592038 -812647 238619
33283 238619 1132789 1462014 1338398 1124307 869894 352478 -415949 -1015921 -994644 -351493
33273 -351493 297118 169712 -754384 -1427129 -926281 145143 311669 -619690 -1120538
33264 -1120538 -97291 1552845 2215619 1475841 46757 -1290060 -1885713 -1327163 -226421
33255 -226421 71595 -524150 -337743 1472354 3161841 2832266 1355583 897033 1502261
33246 1502261 1383429 -12832 -1487293 -2270001 -2523449 -1973300 -324737 1150990 853644
33237 853644 -385594 -326178 852088 639368 -1388849 -2371842 -628193 1559870 1486663
33228 1486663 -9040 -315181 974859 2184929 2531807 2735374 3141018 3095323 2203308
33219 2203308 1025221 442027 846331 1711588 1788714 394091 -1403139 -1859176 -913539
33210 -913539 -201147 -542435 -978350 -685962 -122187 370480 1285606 2417045 2454161 1243782
33200 1243782 653109 1796660 3109708 2805739 1689825 1622006 2424812 2402700 1182826
33191 1182826 90821 73076 822411 1660350 1999913 1348340 31891 -574005 341578
33182 341578 1739889 2125131 1525546 939527 593988 124072 -167790 265052 922152
33173 922152 787841 -84948 -746500 -851603 -824553 -779605 -446385 -2036 146235 334906
33163 334906 1354437 3130084 4551127 4736882 3867576 2723959 1887429 1447141 1245989
33154 1245989 1361423 2113743 3230240 3477830 2103964 301554 -161641 375249 -46251
33145 -46251 -1673409 -2384948 -1119387 268352 -125225 -1562835 -2453389 -2904452 -3495495
33136 -3495495 -3206216 -1014521 1569718 2078121 571505 -733657 -880943 -939479 -1509996
33127 -1509996 -1705124 -950228 -5643 300321 39609 -467449 -1182547 -1930627 -2262743
33118 -2262743 -1918865 -980310 207507 914687 506865 -452707 -536953 444379 910221
33109 910221 15097 -767621 41522 1475704 1789716 1325134 1586458 2421080 2443286 1664871
33099 1664871 1359107 1618850 1329750 457022 141221 471954 317898 -447716 -660039
33090 -660039 -121866 -95305 -1037807 -1802033 -1756130 -1857183 -2750216 -3447033 -2943498 -1825743
33080 -1825743 -1200051 -1078911 -874112 -679308 -1011184 -1717953 -2012892 -1480745 -548335
33071 -548335 50990 98272 107758 568718 1038118 583893 -670172 -1287365 -357605 1243540
33061 1243540 2158411 2232728 2007847 1477006 544624 -59082 334989 1094818 1179239 698010
33051 698010 348901 -25135 -884679 -1577248 -1038309 411013 1383785 1284103 618803 -123727
33041 -123727 -669153 -558323 168157 490692 -112880 -551548 58069 522667 -553700
33032 -553700 -2005319 -1571651 478372 1696002 1147894 222079 -221273 -866876 -1753312
33023 -1753312 -1613001 -180075 1003659 959477 588737 805424 1082916 730360 115054
33014 115054 -204813 -307773 -299562 -100565 -178737 -1122942 -2216512 -1972409 -420940 753236
33004 753236 738383 527909 812979 796066 -38544 -678552 -231631 546424 534223 -3007
32994 -3007 -46744 542062 940087 442366 -869987 -2063048 -1848036 76002 2138971
32985 2138971 2315132 468088 -1714428 -2981232 -3367074 -2859246 -1000477 1641185 3186136
32976 3186136 2528586 663750 -730053 -1067224 -680628 58961 707748 634895 -326873
32967 -326873 -1563301 -2364851 -2463828 -1804371 -495642 810921 1194039 420241 -775154
32958 -775154 -1426701 -1021941 338888 1960293 2921464 2883352 2320508 1726149 1096248
32949 1096248 399465 -220386 -912346 -1753552 -1804779 -94633 2139052 2271676 133700
32940 133700 -1346136 -584677 233060 -913433 -2281105 -1445947 385967 439119 -1075430
32931 -1075430 -1904361 -1782905 -1973531 -2001186 -576160 1101440 727365 -1009397 -1425021
32922 -1425021 -458640 -494050 -1862797 -2444022 -1760362 -1557248 -2014626 -1252353 802896
32913 802896 1752027 732147 -277341 63247 819678 1259218 1830999 2127497 1016971
32904 1016971 -675121 -753883 673814 1314305 710566 672729 1417049 1075025 -366272
32895 -366272 -505541 1225096 2483479 2131574 1784649 2312515 2444436 1844695 1949500
32886 1949500 2756123 2384121 728725 -132145 47226 -814999 -2782621 -3199344 -1341419
32877 -1341419 383929 889502 1733719 2982177 2403912 164116 -367186 1888009 3927645
32868 3927645 3881579 3380010 3312761 2223131 513586 970739 3253948 3334470 486790
32859 486790 -903742 1126678 2830666 1846451 1337981 3480077 4909973 2895536 431595
32850 431595 741469 1916867 1480893 1200959 2806679 3845703 2389371 1055432 1871849
32841 1871849 2127606 -75571 -1362620 893529 3333952 2619213 1425182 2894211
32833 2894211 4353057 2599690 451565 1632224 3775111 3072466 1525024 2853778
32825 2853778 5204864 4641740 2260855 1387423 1261489 -256813 -1332679 430464 2939502
32816 2939502 3666908 4548267 7226681 8307258 5349928 2356232 3036742 4262101 2693596
32807 2693596 1601601 3989320 5752659 3453869 1668257 4202143 5844476 2142793
32799 2142793 -1052487 1827960 4976497 2346146 243726 5400538 10458898 6810143
32791 6810143 1895301 6139543 12684244 10240077 6174352 13483287 24277542 23655715
32783 23655715 21620590 38445682 64486473 75989985 93012613 171503714 315145040
32776 315145040 436717840 443741374 340782822 217165954 151085593 152627218 182235702
32769 182235702 191045774 151031649 76404862 15496064 1728640 17479047 23579141
32762 23579141 12209755 5389857 11224108 13749622 5541166 -47032 4862043 9533710
32754 9533710 6000246 2279709 5168209 8036560 5110914 2246865 4356150 5829373
32746 5829373 2219574 -790094 1566835 4174251 2030529 -849742 -41203 1106191
32738 1106191 -852424 -2196571 475569 3317399 2446942 854373 1884963 2761415
32730 2761415 661354 -1294830 -41865 1514052 182395 -1606868 -858975 459658
32722 459658 -112374 -819445 -48950 -111359 -2245230 -3188792 -1063647 753769 -67981
32713 -67981 -337642 2226105 3871560 1348691 -1822455 -1241384 1035414 847618 -637388
32704 -637388 204784 2632863 3345809 2376904 1998408 2116387 1384770 646364 1091211
32695 1091211 1279992 -181478 -1456628 -615377 647979 66919 -1070669 -520282 756734
32686 756734 700754 21272 395691 1077773 686816 155654 712486 1213491 525048 115847
32676 115847 1216688 1934054 367029 -1837418 -2172963 -1151847 -544539 -237558 251441
32667 251441 -207813 -1849850 -2319314 -548001 637765 -943927 -2798371 -1910307 153306
32658 153306 370619 -372467 484678 2014744 1552718 -271396 -828323 -294907 -717314
32649 -717314 -1546713 -528874 1805528 2687629 1596445 529865 400370 553843 1128759
32640 1128759 2555593 3461256 2292227 233870 -523280 -353665 -881867 -1384806 -77292
32631 -77292 2027284 2253489 602234 -563504 -561668 -668536 -969202 -475786 67690 -934545
32621 -934545 -2520384 -2157750 -36368 1051972 141260 -943896 -1182628 -1616534 -2650124
32612 -2650124 -3167816 -2843254 -2599017 -2430754 -1416397 -101020 -168075 -1472627 -2052545
32603 -2052545 -1346360 -755644 -772737 -314716 676327 747547 -300978 -778263 -29968 413574
32593 413574 -454110 -1423841 -1112632 79275 969507 1134926 831456 565454 959043
32584 959043 1902445 2117237 956693 437 959645 2664366 2518462 517801 -886080
32575 -886080 -817306 -925809 -1928382 -2166406 -610946 1249881 1811578 1574193 1676744
32566 1676744 1936338 1634297 945081 475031 311261 218434 -27145 -736309 -1817080
32557 -1817080 -2314162 -1637142 -901170 -1456139 -2447268 -1849683 185830 1274172 342417
32548 342417 -970452 -956749 204773 1726470 3369299 4548669 4249818 2783503 1913787
32539 1913787 2346015 2701930 1818696 432004 -301416 -355923 -20394 853338 1789744
32530 1789744 1458505 -335865 -1822528 -1585253 -434656 187891 384561 1025819 1876748
32521 1876748 1998374 1377840 849285 781193 874895 929909 938351 695907 43412 -687510
32511 -687510 -952410 -534727 383065 1301407 1465646 441796 -1192613 -2312950 -2513294
32502 -2513294 -2296412 -2033618 -1596235 -1104980 -1047326 -1317344 -1028488 241546 1666424
32493 1666424 2051671 1079025 -504682 -1550300 -1394502 -534076 -221748 -903061 -1493228
32484 -1493228 -902729 323062 902243 756553 742039 901859 540919 -145470 -128899 701216
32474 701216 1332671 1305048 1172754 1183756 945115 558887 634354 1006674 935074 704451
32464 704451 1361259 2610290 2804705 1541671 438809 574589 926932 379942 -310481
32455 -310481 165672 1579991 2639965 2718645 2103667 1245832 605530 613859 1117104 1414885
32445 1414885 1230442 972604 869566 751462 801009 1393121 2052616 1864679 1087784 875525
32435 875525 1171883 657236 -710509 -1056727 546627 2356367 2332293 753726 -778377
32426 -778377 -1571125 -1747058 -1183349 6493 889308 915856 880294 1575635 2392045 2318939
32416 2318939 1421453 320174 -783686 -1578230 -1308036 -88198 651602 226168 -96583
32407 -96583 723514 1528770 843265 -590166 -1084725 -705020 -593583 -560849 329751 1422621
32397 1422621 1158625 -186752 -835287 -500746 -663152 -1684574 -2077694 -1190539 -319967
32388 -319967 -306933 -166407 752393 1209975 192539 -994897 -536812 1011815 1479330
32379 1479330 273089 -811225 -49443 2120904 3776062 3586366 1944404 341649
32371 341649 -179984 123762 508924 1009394 2102759 3229200 2915372 942395 -778864
32362 -778864 -552694 717031 781124 -835041 -2440759 -2754390 -2259853 -1663140 -596907
32353 -596907 1189164 2553575 2188263 480489 -1070225 -1849995 -2280102 -2303259 -1291500
32344 -1291500 350329 1013934 -14574 -1439503 -1673262 -691461 545512 1491311 1928889
32335 1928889 1491603 422602 -9839 883052 1899352 1609948 685091 939636 2443228
32326 2443228 3337043 2500077 759026 -677491 -1432541 -1428290 -700481 -48247 -404238
32317 -404238 -1290316 -1388246 -790208 -876086 -1682379 -1586954 -354283 -147858 -2134657 -4207531
32307 -4207531 -3940266 -2081103 -1000599 -1030597 -678158 408919 1095419 1036061 1134467
32298 1134467 1716550 2079280 1998725 2098351 2512475 2554607 1912371 976453 -121538 -1614142
32288 -1614142 -3105955 -3609600 -2825081 -1503591 -408259 320524 782861 1047944 1169367
32279 1169367 872151 -345793 -2067792 -2652200 -1236801 628820 817386 -435430 -1093240
32270 -1093240 -460237 134933 -240726 -952294 -1289522 -1279688 -630323 1255747 3596386
32261 3596386 4391618 3110421 1564899 1246202 1491430 1318394 1274669 2022741 2693055
32252 2693055 2364789 1837506 2042249 1894907 -6507 -2349335 -2356418 21565 1672361
32243 1672361 611340 -1524699 -2267608 -1672008 -1370963 -1664185 -1450136 -524690 -116283
32234 -116283 -901784 -1857514 -1708669 -653202 108210 72723 -145311 13832 218249 -165684
32224 -165684 -1130512 -2032497 -2268282 -1655226 -407614 917769 1683158 1760880 1668051 1768324
32214 1768324 1695038 1103011 558381 793745 1348346 1116758 277187 310865 1651638 2716634
32204 2716634 2233808 1346920 2003381 3971075 5047338 4040761 2059355 667523 93725
32195 93725 -247158 -523784 -516266 -257489 -10982 79543 -38283 -389381 -775780 -870509
32185 -870509 -680638 -537347 -523877 -404549 -243613 -485525 -1167697 -1664785 -1564570 -1222504
32175 -1222504 -1058804 -900045 -493703 -86038 87485 327497 820623 998631 349022
32166 349022 -568129 -809595 -445535 -339114 -774557 -1309930 -1830720 -2605831 -3265172 -2923060
32156 -2923060 -1585788 -322948 299140 800170 1359557 1129962 -164969 -1138483 -483021
32147 -483021 1004158 1474965 625679 -93301 348396 1444209 2250512 2498069 2380127
32138 2380127 2080137 1758177 1430467 839951 -781 -355883 356938 1446820 1690570
32129 1690570 1090035 754829 981623 765659 -378131 -1407428 -1326845 -704760 -634745
32120 -634745 -942377 -519001 928420 2417165 2865573 2060981 586527 -652859 -968912
32111 -968912 -469640 -24103 -293672 -972537 -1304376 -1062437 -610959 -269424 -88415 -81396
32101 -81396 -248179 -465670 -640524 -793845 -787053 -322847 446679 722010 -14917 -1127133
32091 -1127133 -1403243 -405715 1134639 2130010 2057350 1323274 1003179 1869945 3339297
32082 3339297 3831572 2653222 1005331 453677 898471 1002968 321371 -177081 207771
32073 207771 836338 796105 158825 -441269 -832286 -1190112 -1310693 -782755 188594 790155
32063 790155 596957 137238 227681 982971 1722142 1748301 1008236 24686 -584231 -464771
32053 -464771 329314 1347875 2064364 2407820 2808437 3445559 3702254 2879034 1332418
32044 1332418 237702 120686 322692 194096 56979 395287 726366 192206 -952249
32035 -952249 -1381322 -409312 1046967 1600280 1027629 261901 -56083 -367180 -1238579
32026 -1238579 -2118245 -1861151 -561340 112792 -898135 -2313707 -2136695 -568057 224718
32017 224718 -696714 -1772391 -1486645 -541248 -328923 -609922 -306214 330135 181292
32008 181292 -563107 -579301 275686 650234 42542 -279574 529972 1282783 516817 -1130019
31998 -1130019 -1651829 -356022 1372713 1956015 1337009 588982 461550 746486 851671
31989 851671 579515 175331 -191124 -602576 -977144 -936151 -425570 -42392 -213481 -428299
31979 -428299 -10730 627870 430821 -677374 -1618040 -1756671 -1625831 -1690839 -1466733 -535039
31969 -535039 490778 915807 1159501 1955208 2855927 2723815 1526378 455945 148793
31960 148793 -100567 -978018 -1992985 -2311494 -2009018 -1741564 -1666601 -1488630 -1268101 -1337760
31950 -1337760 -1509676 -1207801 -497517 -186518 -608324 -1026133 -714281 -36799 152899
31941 152899 -244522 -594210 -516625 -193048 170652 554090 847522 923714 966133 1262596
31931 1262596 1754320 2208103 2607495 2886780 2672671 1988580 1728317 2420068 2965826
31922 2965826 1954684 -47921 -1164641 -1105444 -1411280 -2424180 -2302014 -176689 1857306
31913 1857306 1644200 72935 -802599 -1211233 -2624347 -4264831 -3693353 -827690 1469771
31904 1469771 1420776 487313 540991 1061888 577557 -739993 -1531309 -1317923 -716919 -231745
31894 -231745 28301 -59817 -315303 33998 1371822 2746934 2828329 1691849 852919
31885 852919 1424000 2806670 3435478 2542487 939083 23423 195184 610353 549923
31876 549923 408276 864582 1678873 2095719 2015251 1864030 1644444 1106602 571135 481645
31866 481645 408286 -262489 -908348 -442546 601515 493308 -999241 -2148900 -1926642
31857 -1926642 -1245435 -920351 -417561 358972 144245 -1296302 -1813808 40613 2193427
31848 2193427 1806891 -204349 -228511 2737572 5572275 5318138 2715504 495136 -121377
31839 -121377 40818 17804 -124903 199558 1099230 1796283 1309572 -210747 -1228008
31830 -1228008 -551829 1036788 1770476 1203880 448312 250189 115573 -469349 -1177467
31821 -1177467 -1627859 -1955334 -2043591 -1179096 756177 2457814 2430449 736276 -1114366
31812 -1114366 -1824496 -1402350 -759570 -639601 -978908 -1178022 -919278 -505321 -258209
31803 -258209 -16650 296617 86143 -1051678 -2121552 -1544904 639009 2493028 2559141
31794 2559141 1544563 1023036 1357464 1771657 1794963 1584155 1140185 233316 -894032
31785 -894032 -1568207 -1570429 -1386562 -1435994 -1543431 -1322870 -674051 251635 1223114 1906607
31775 1906607 1982994 1502680 933559 666241 559041 96477 -1002689 -2317354 -2856278
31766 -2856278 -1856790 335802 2334034 2958867 2356443 1576816 1210853 983069 651473
31757 651473 513837 651690 409126 -646055 -1709281 -1586016 -393882 475991 166304
31748 166304 -691551 -1003294 -430486 622589 1433303 1112594 -701124 -2788624 -2980780
31739 -2980780 -656595 2196356 3295387 2624677 1650555 883417 -222932 -1445851 -1684689
31730 -1684689 -805121 -84443 -475314 -1591026 -2581925 -2828866 -1725261 767780 3133450
31721 3133450 3464747 2066316 1283545 2165864 3067129 2435529 1113468 485342 36116
31712 36116 -1408140 -3221248 -3712843 -2580173 -885033 766646 2303099 3025514 2215641
31703 2215641 649192 -149324 31459 271439 396479 960711 1602735 1299697 294012
31694 294012 -57075 474270 695723 229449 181056 1044324 1702661 1254195 257863 -580418
31684 -580418 -1384984 -1923732 -1087141 1237829 3170922 3137029 2112667 2137251 3373533
31675 3373533 4118665 3285448 1526418 55928 -558929 -454432 -120290 -18666 -109878
31666 -109878 59274 534633 720774 315155 -169103 -261799 -180395 -79418 467318 1452437
31656 1452437 1791292 792076 -406242 -171696 1184691 1659839 292642 -1536002 -1894055
31647 -1894055 -540065 1105645 1731947 1373955 941363 812071 274159 -1320565 -3194976
31638 -3194976 -3801223 -2892347 -1889879 -1781015 -1803367 -1027142 -109450 -176684 -761018 -436357
31628 -436357 820988 1525526 1023885 443148 843864 1670388 1764024 1041730 355471 195712
31618 195712 301477 369992 523215 942326 1357537 1191169 297388 -638448 -802106 -324892
31608 -324892 -138848 -642621 -1187987 -1220213 -1135404 -1381224 -1477764 -841314 38250 328641
31598 328641 311094 895484 1939379 2327155 1667678 656081 -289504 -1402266 -2351163
31589 -2351163 -2071042 -392613 1347118 2002622 1879913 1616464 930736 -504952 -1849012
31580 -1849012 -1969382 -1041827 -177809 184392 440001 605407 131860 -913385 -1483959
31571 -1483959 -844993 363020 831323 84670 -1075949 -1544473 -1085593 -459372 -437311
31562 -437311 -901109 -1123764 -781403 -270467 -36462 -83277 -250933 -454336 -475613 -110498
31552 -110498 211437 -370340 -1852098 -2905445 -2372012 -759752 430953 491929 -84012
31543 -84012 -626421 -904063 -887889 -660109 -513385 -561695 -439812 7673 84514 -867258
31533 -867258 -2214658 -2689544 -2160135 -1628749 -1485270 -1050486 -92424 551893 398743
31524 398743 106418 156606 -11854 -663386 -806989 198072 1154000 648243 -642013
31515 -642013 -953602 -200236 116101 -479070 -885804 -654975 -754570 -1534322 -1826995 -1035977
31505 -1035977 -403281 -925734 -1503093 -736815 606257 718308 -466602 -1474737 -1768275
31496 -1768275 -2071851 -2423136 -1962898 -948213 -973200 -2407404 -3331449 -2160781 -16102
31487 -16102 822145 -104578 -1325336 -1688284 -1361764 -848887 -247074 417642 1009317 1542782
31477 1542782 1954133 1663329 163496 -1870017 -2885600 -2208483 -863167 -232168 -398022
31468 -398022 -368233 349827 1090707 1069201 547666 507934 1302841 2147123 2136630 1357030
31458 1357030 571270 94019 -415406 -1088570 -1452697 -1141865 -498774 -138608 -241113
31449 -241113 -510354 -512281 118646 1377569 2539744 2575840 1320184 -84807 -288776
31440 -288776 888797 2342142 2681328 1336214 -851696 -2097543 -1402079 83197 277201
31431 277201 -1061401 -1958619 -1125007 172078 204336 -564143 -529560 291568 510784 -73032
31421 -73032 -222110 416043 727591 252661 20518 604400 1047334 606000 18946 -13269
31411 -13269 -192894 -1221829 -2274027 -2291784 -1780415 -1757823 -1766030 -706564 861265 1197149
31401 1197149 131016 -511717 359872 1572531 1619909 786002 355203 682350 1188039
31392 1188039 1690035 2532803 3506671 3713232 2833504 1831194 1869060 2808352 3281842
31383 3281842 2302785 482211 -569929 29515 1504514 2271317 1632584 504676 360445
31374 360445 1451291 2344588 1575424 -412530 -1690016 -1406212 -1004136 -2076667 -3790479
31365 -3790479 -3832629 -1711096 439267 687321 -467774 -1366221 -1398824 -951542 -172556
31356 -172556 955921 1916763 2185153 2086386 2189572 2293531 1968520 1594912 1756868 2041740
31346 2041740 1648338 821750 372459 90575 -814675 -1794047 -1230854 1001000 2864395
31337 2864395 2715436 1195313 -137941 -787499 -1071010 -1075017 -915638 -1145891 -1865180
31328 -1865180 -2166243 -1444748 -524262 -435711 -783718 -534090 128199 96955 -744575 -1264503
31318 -1264503 -801542 30410 501298 749148 1247134 2026392 2781516 3221400 3094201
31309 3094201 2330817 1296511 470415 -132702 -725596 -1029070 -524858 475679 803105
31300 803105 -180875 -1761931 -2802468 -2967514 -2639723 -2131237 -1526768 -984876 -612732
31291 -612732 -152388 705078 1657978 1859360 850927 -753196 -1749443 -1549351 -773055
31282 -773055 -501931 -1007657 -1502572 -1231169 -438250 60298 -45151 -411782 -798548 -1314257
31272 -1314257 -1827008 -1770370 -905097 147922 578324 365361 171875 373220 615276
31263 615276 387512 -328786 -1168585 -1854059 -2218550 -1903203 -564813 1383144 2695547
31254 2695547 2495021 1339075 482709 182117 -464167 -1840896 -2929726 -2663834 -1393776
31245 -1393776 -202593 651505 1648700 2755234 3333821 3187199 2693253 1957549 900533
31236 900533 234328 1089461 3213319 4650455 3934677 1792044 -2255 -670919 -579787
31227 -579787 -133498 408729 474577 -353550 -1529703 -2097585 -1980025 -1897533 -2074950 -1924698
31217 -1924698 -1106343 -51921 751664 1198417 1076860 107007 -1055924 -863289 1111662
31208 1111662 2885653 2109462 -721629 -2451273 -1091253 1665229 2618516 954441
31200 954441 -1219722 -1894561 -1345468 -1014142 -1406574 -1907936 -1956243 -1472149 -502809 649896
31190 649896 1110927 185006 -1419383 -1908381 -345702 2172672 3646790 3241024 1987491
31181 1987491 1546412 2407371 3386981 3065881 1618550 616533 815641 1049290 94983
31172 94983 -1216272 -1093376 448565 1496938 941549 -306717 -1122874 -1609018 -2042736
31163 -2042736 -1849454 -677576 569486 830396 214074 -594787 -1333756 -1713664 -1051539
31154 -1051539 538503 1600902 1260075 732030 1453418 2582929 2132991 26919 -1832832
31145 -1832832 -2278893 -1835444 -1064949 146884 1439234 1889436 1537997 1468257 1901812
31136 1901812 1692138 262265 -1356114 -2045991 -1884115 -1293791 -216063 1159688 2030479
31127 2030479 2084209 1902407 1684349 820229 -593635 -1213866 -372351 749764 911175
31118 911175 499311 272374 -227835 -1461592 -2238398 -1147492 1030895 2176503 1726987
31109 1726987 995604 778176 386951 -747234 -2008009 -2536600 -2163858 -1143872 100621
31100 100621 838569 584167 -88176 -174490 268999 220814 -657178 -1489676 -1507824 -955231
31090 -955231 -425765 -156992 -217283 -552188 -597659 303124 1780949 2534860 1918262 739130
31080 739130 118277 185133 285547 -41575 -640866 -927930 -389136 691392 1101377 -27601
31070 -27601 -1843948 -2474408 -1203756 817064 2122311 2311718 1734580 809222 67948
31061 67948 12963 424981 460644 -237358 -1188509 -1972958 -2581210 -2704866 -1857252 -606729
31051 -606729 -373487 -1274354 -1488390 181585 2321709 2823991 1793780 951118 844896
31042 844896 488896 -480864 -1132807 -948939 -611022 -603160 -394292 356428 964645 866776
31032 866776 609316 803071 915807 183587 -824299 -798229 241503 653343 -666866
31023 -666866 -2712159 -3587852 -2774900 -1424170 -657641 -475322 -494755 -861116 -1757821
31014 -1757821 -2580150 -2488187 -1600039 -788900 -346052 215849 897738 835746 -285336 -1384626
31004 -1384626 -1354224 -584137 -228315 -469717 -496306 108840 942314 1619556 2133425 2404175
30994 2404175 2302005 2125660 2280071 2503565 2255385 1848060 2176929 3143242 3435854
30985 3435854 2367372 972891 593728 1123221 1459059 1146518 694366 536114 491442
30976 491442 216956 -419800 -1417939 -2592273 -3399041 -3219835 -1959016 -219145 1080029
30967 1080029 1217838 139518 -1311737 -1923185 -1268022 -155709 394454 345364 346295 532487
30957 532487 334632 -495674 -1342881 -1463668 -824730 18468 517164 427069 -98158 -485701
30947 -485701 -186137 614437 1102204 924892 699605 986927 1247531 556969 -905450
30938 -905450 -1940159 -1867822 -1120856 -214043 850633 1770196 1635945 279876 -959822
30929 -959822 -924871 -410180 -902412 -2022135 -1954630 -473418 356769 -808996 -2575653
30920 -2575653 -2965333 -2206287 -1846680 -2108857 -1936921 -1160622 -735630 -866796 -642071
30911 -642071 156847 437345 -466486 -1741377 -2370890 -2290490 -1691627 -427945 1083141
30902 1083141 1563335 530621 -707952 -799743 -171377 84689 211104 1089027 2182929
30893 2182929 2065476 882026 392582 1167124 1492586 -35293 -2181548 -2542297 -621147
30884 -621147 1647348 2143439 572508 -1566484 -2474067 -1648143 -274447 186922 -228210
30875 -228210 -272648 451076 855076 291370 -188704 369300 862385 -346603 -2517324
30866 -2517324 -3127321 -1472412 276509 273992 -524978 -300009 638269 479841 -1188263
30857 -1188263 -2872009 -3420138 -3229217 -2973776 -2485961 -1465236 -333013 254625 125371
30848 125371 -577348 -1611523 -2335681 -2020840 -1014615 -762220 -1898475 -3076670 -2688037
30839 -2688037 -1136292 -195546 -481073 -937896 -801587 -615567 -924974 -1262983 -1118728
30830 -1118728 -888979 -1100807 -1538729 -1931208 -2674795 -3904884 -4541462 -3436744 -1116844
30821 -1116844 711032 1175140 779872 220958 -165434 84467 1246412 2419051 2149166
30812 2149166 449214 -1022588 -1298453 -1302094 -1902650 -2122208 -692772 1480393 2097796
30803 2097796 467584 -1759726 -2898563 -2892344 -2395329 -1538617 -338268 610095 740071
30794 740071 350280 127152 136171 -113808 -788778 -1434666 -1529109 -1017812 -358188 -185009
30784 -185009 -736822 -1456659 -1455609 -608385 132575 -155095 -1223225 -2022783 -2017816 -1686575
30774 -1686575 -1761317 -2327639 -2717629 -2130308 -446654 1447856 2382951 2122590 1531938
30765 1531938 1289725 975714 11448 -1006864 -881821 422333 1615052 1822486 1513465
30756 1513465 1355052 1160024 635893 312680 759229 1395767 1113090 -142043 -1325729
30747 -1325729 -1743840 -1647074 -1383855 -892427 -225599 287631 714034 1533592 2587847
30738 2587847 2843047 1796008 366904 -359170 -608912 -1200612 -1917231 -1845864 -1137878
30729 -1137878 -1055969 -2015188 -2827662 -2457502 -1435721 -731253 -178364 835548 1752198
30720 1752198 1298069 -536067 -2227205 -2670953 -2345593 -2142858 -2046281 -1660250 -1264272
30711 -1264272 -1403698 -1814329 -1654153 -710517 360885 990053 1198960 1080785 484284
30702 484284 -466111 -1076269 -777725 121131 735182 536590 -230364 -914015 -995659 -369136
30692 -369136 665975 1654858 2333537 2745648 3021074 3121015 2846401 2083821 1083475
30683 1083475 459053 632241 1130738 870234 -399602 -1349887 -598453 1239076 2163131
30674 2163131 1583216 1113155 1905770 2640447 1580558 -420951 -951214 279265 947973
30665 947973 -293295 -1787119 -1480181 96728 976677 745478 628120 1162690 1555969
30656 1555969 1324340 1061928 1314572 1888199 2551005 3333264 3850335 3442253 2374993
30647 2374993 1778944 1876610 1452696 -142853 -1621897 -1491280 -225197 599958 622788
30638 622788 652589 786743 303589 -612095 -814865 -243729 -326084 -1618416 -2658958 -2289882
30628 -2289882 -1664395 -2355785 -3556490 -3141544 -1034915 572556 459371 -165445 40
30619 40 403241 86454 -437878 -195307 418208 366272 -147696 -131757 261432 -54747 -1006456
30608 -1006456 -1202504 -238143 449752 -245993 -1453384 -1801825 -1405120 -1223575 -1347526
30599 -1347526 -1196160 -809924 -643329 -478520 151327 715006 218018 -1064952 -1737275
30590 -1737275 -1297951 -723706 -789170 -1110816 -1258875 -1481160 -1716103 -1220080 -17773
30581 -17773 563895 -94956 -562509 582593 2338300 2616307 1344161 376260 560496
30572 560496 814139 321322 -156443 232783 1116035 1812130 2353403 2845347 2884010 2377548
30562 2377548 1971685 1903944 1396857 -24195 -1596734 -2553392 -3206830 -3753405 -3164005
30553 -3164005 -774108 1918494 2818630 2054970 1402490 1265634 387714 -1323115 -1989513
30544 -1989513 -629841 1120148 1375624 527250 771 -149279 -678640 -1139832 -403013
30535 -403013 1157178 1869495 1250169 603288 781278 926475 170147 -796196 -973609
30526 -973609 -910564 -1903897 -3713046 -4455349 -3027790 -631245 657137 241053 -659187
30517 -659187 -719882 97974 941144 1294027 1390524 1579995 1779370 1731252 1483290 1291023
30507 1291023 1189037 990680 659438 333438 -24749 -597916 -1210071 -1281536 -585841 274936
30497 274936 500483 -95047 -1290220 -3065399 -5251064 -6761839 -6254813 -3933672 -1804554
30488 -1804554 -1441969 -2146915 -2142054 -1037266 -1573 233704 199821 338585 162315 -579405
30478 -579405 -985264 -231275 997593 1347231 643875 -83669 -144505 243860 755870 1279036
30468 1279036 1403259 623635 -680640 -1331936 -760908 365801 1173572 1485986 1415536
30459 1415536 892027 104251 -323519 -215736 -305094 -1158831 -2176155 -2381198 -1800402
30450 -1800402 -1271338 -1154369 -1049617 -724071 -561079 -930922 -1628382 -2125464 -2093982 -1600020
30440 -1600020 -990896 -612052 -524111 -562942 -669314 -884273 -1015651 -788926 -448075 -591543
30430 -591543 -1148904 -1243848 -527331 138857 13238 -290877 151023 970455 1147712 805487
30420 805487 980475 1752470 2033248 1379754 655498 493029 357864 -256742 -812264 -677614
30410 -677614 -233696 -209136 -554168 -732971 -647242 -622162 -881397 -1498590 -2346422 -2694000
30400 -2694000 -1605537 660978 2430225 2549814 1806750 1520392 1537839 869482 -311379
30391 -311379 -857009 -608484 -563207 -952547 -743060 458604 1473755 1319866 647716
30382 647716 413355 238781 -597613 -1388289 -844019 604411 1023608 -286340 -1749050
30373 -1749050 -1795660 -953353 -727905 -1286506 -1429691 -522925 643125 1006684 477807
30364 477807 -193262 -320884 101656 402545 -149157 -1446670 -2409523 -2117786 -892781
30355 -892781 211093 716295 860142 707070 120015 -391414 51025 1219444 1669899
30346 1669899 681516 -680737 -1136730 -840403 -565688 -210549 669443 1555474 1580848
30337 1580848 1030052 871432 1109525 1009847 719827 1055989 1675347 1222333 -310487
30328 -310487 -1112245 -229326 866081 528147 -526704 -403932 1015015 1844989 782415
30319 782415 -1279808 -2433808 -1851081 -451092 235592 -259087 -896035 -543827 475673
30310 475673 905379 377488 -281547 -536395 -697535 -771530 -149133 1016120 1506965 906886
30300 906886 437407 1005050 1767046 1765817 1579037 1893628 1796294 320147 -1414255 -1697815
30290 -1697815 -1050304 -1261457 -2164820 -1902287 -345785 362102 -783499 -2075122 -1853393
30281 -1853393 -800893 -319688 -341246 -77319 403150 677553 983114 1480890 1407000 186716
30271 186716 -1299888 -1717454 -1029192 -253872 83932 321825 770424 1227270 1224657 373575
30261 373575 -1161145 -2311068 -1961506 -517332 286746 -332439 -1118211 -708967 389866
30252 389866 829436 522019 414605 718930 703829 23004 -886574 -1605649 -1990972 -1840444
30242 -1840444 -1225519 -904430 -1409933 -1963685 -1416872 -154606 178758 -969231 -2138042
30233 -2138042 -1721719 130037 1966766 2694700 2261074 1197719 61132 -802049 -1232496
30224 -1232496 -1078081 -243598 862718 1295461 537867 -721624 -1413431 -1489421 -1714110
30215 -1714110 -2176879 -2057948 -1138614 -526734 -1216697 -2609615 -3242466 -2609977 -1501838
30206 -1501838 -693464 -85220 673496 1305365 1137597 58164 -1167389 -1641127 -1189601
30197 -1189601 -385957 42788 -361779 -1655440 -3302224 -4215795 -3571738 -1745079 -15687
30188 -15687 781893 866981 720761 377466 -204175 -772551 -1272961 -2068212 -3090759 -3420773
30178 -3420773 -2496473 -1230893 -980812 -1678862 -1930398 -896404 744979 1736073 1452603
30169 1452603 177985 -1211528 -1834950 -1604953 -1350833 -1679287 -2020505 -1481547 -334046
30160 -334046 232369 -272841 -1105353 -1311705 -544002 984242 2510506 2872063 1605572
30151 1605572 -202596 -1096784 -1059408 -1062684 -1190031 -733965 -11758 -209532 -1159085 -1276017
30141 -1276017 -362482 -362362 -2150040 -3597960 -2608628 -435347 153036 -1140827 -2291068
30132 -2291068 -2331573 -2122279 -1953623 -886651 1071742 2285506 1827854 848385 717674
30123 717674 1196281 1372965 1196043 1011639 532539 -611608 -1878293 -2292722 -1550667
30114 -1550667 -54207 1617313 2723518 2533346 1209772 -16263 -232271 132159 282715
30105 282715 339345 780399 1274481 1135168 481667 -134057 -845490 -2013964 -2971316 -2614088
30095 -2614088 -1209272 -201533 -94323 11989 482151 418949 -384617 -427784 1242325
30086 1242325 3033752 2730571 638536 -917867 -837247 -179495 142231 760426 2296689
30077 2296689 3841682 4018538 2796085 1387118 783062 986604 1325108 1068542 70230
30068 70230 -914134 -964792 -245569 112763 -340224 -651456 30222 990875 897046 -248217
30058 -248217 -1079935 -688390 387723 1072365 992096 592128 421978 523433 440774 -115756
30048 -115756 -656435 -403141 436181 562401 -667298 -1982542 -1613537 297077 1703501
30039 1703501 1176931 -450250 -1289950 -604277 661346 1215020 825322 353633 561107
30030 561107 1126255 1131126 423216 -121728 59131 309172 -203626 -1074779 -1124448 -29397
30020 -29397 1269595 1701705 1016499 -234919 -1115937 -955359 -152600 24021 -935161
30011 -935161 -1888020 -1622624 -715733 -611992 -1335872 -1622438 -1119042 -784709 -970546 -805608
30001 -805608 64521 753172 815179 1115442 2114705 2667402 1632000 -403910 -2035947
29992 -2035947 -2670223 -2290732 -795223 1179197 1861453 346389 -1734331 -2097371 -831843
29983 -831843 19818 -511914 -1423557 -1758974 -1782037 -1798881 -1336556 -173810 900964 1091254
29973 1091254 656351 425376 768487 1429532 1912210 1756106 883850 -103586 -411051
29964 -411051 6672 430081 430665 406227 797275 1248746 1001501 -57904 -1120278 -1316782
29954 -1316782 -717095 -259808 -584064 -1203242 -1258037 -865130 -931843 -1581338 -1777388 -967164
29944 -967164 -84772 -125249 -601966 -470351 109662 174508 -308776 -404494 246141 1017159
29934 1017159 1391276 1383488 916572 -116417 -1113088 -1165556 -343284 397582 649245 865335
29924 865335 1186738 1134418 708021 624020 1079127 1344981 1001697 538359 303365 -70802
29914 -70802 -690613 -943833 -664422 -716353 -1632469 -2580544 -2539938 -1755347 -1189180 -1181462
29904 -1181462 -1425466 -1649666 -1591233 -925965 62373 429376 -69759 -328195 532746 1702867
29894 1702867 1847790 1056655 460145 471938 684255 1066822 1850179 2426333 1827948 359512
29884 359512 -599140 -573397 -437396 -608600 -253572 1045733 2133333 1807683 630859
29875 630859 135777 766643 1613688 1868438 1571905 1021568 346570 -152811 58455 1095083
29865 1095083 2254548 2583416 1800890 616712 165289 987113 2405551 3052735 2243616
29856 2243616 721077 -191276 -22070 570218 773955 391810 -323456 -1000326 -1147371
29847 -1147371 -421609 739930 1292615 875106 406314 737682 1253077 817718 -237301
29838 -237301 -432280 517122 1195556 827536 549724 1326907 2054036 1303323 -121109
29829 -121109 -302921 741939 1255575 785018 806754 1985170 2966039 2663503 1821023
29820 1821023 1339521 891205 336971 644847 1910557 2316135 984389 115387 1758750
29811 1758750 3871266 2777266 -1077584 -3364778 -2180564 -591875 -1569251 -3547120
29803 -3547120 -3331418 -1146696 34795 -981925 -2460701 -2723897 -1964708 -952812 143154
29794 143154 1188501 1771612 1936944 2151107 2237878 1409960 -313498 -1762957 -2114102
29785 -2114102 -1786311 -1410204 -865367 47639 861372 1140529 1230165 1507960 1518294 765104
29775 765104 -160066 -330009 -48161 -444043 -1520326 -1897244 -905184 231628 80280
29766 80280 -968993 -1321464 -353386 1012093 1714943 1614809 1097829 471174 7776
29757 7776 -56083 95377 -49612 -564488 -849272 -456824 266768 692230 656022 373895
29747 373895 77990 162025 1115325 2605602 3132724 1655124 -612725 -1269915 148455
29738 148455 1379883 499569 -1327243 -1409557 767405 2913240 3012118 1614083 567813
29729 567813 655945 1339640 2004669 2384884 2160915 1176758 -42448 -811892 -1221563 -1742710
29719 -1742710 -2075674 -1477409 -322787 -91405 -1279958 -2458269 -2243860 -1283068 -1163603
29710 -1163603 -2008182 -2455640 -1809162 -937832 -892161 -1621869 -2329811 -2320967 -1298629 433091
29700 433091 1844333 1993931 1223974 818855 1211918 1377309 496567 -598830 -490349
29691 -490349 778400 1626537 894650 -787014 -1805915 -1393754 -333359 175137 61811
29682 61811 294483 1152791 1424063 101563 -1753907 -2128420 -825942 345323 315284
29673 315284 41709 425203 611792 -357307 -1510132 -1213827 273066 1182808 803402
29664 803402 91631 -150438 -195908 -332034 -214128 338862 889680 1027132 695409 -150904
29654 -150904 -1318758 -1859079 -918249 780563 1504516 789802 -91797 -249939 -309997
29645 -309997 -792886 -863368 175038 1324459 1203110 99862 -653687 -751532 -925511
29636 -925511 -1301187 -1239539 -681390 -192039 373923 1768714 3643542 4444999 3613245
29627 3613245 2512586 2346955 2454107 1822406 1116447 1546764 2429013 1801202 -562294
29618 -562294 -2585526 -2786021 -2106136 -2053379 -2456801 -2261886 -1456559 -772120 -174171 841827
29608 841827 1855098 1967986 1511348 1718545 2562736 2536589 1059467 -445116 -663001
29599 -663001 -183538 -140697 -290449 224374 1086628 1246087 637943 110212 -39461 -209627
29589 -209627 -447662 -504661 -752143 -1758571 -2989974 -3203748 -2240907 -1232867 -882573
29580 -882573 -755318 -511066 -563778 -1045981 -1280495 -918419 -646698 -1098526 -1836507 -2030272
29570 -2030272 -1507544 -675324 -34118 -80583 -926420 -1750794 -1556775 -738539 -737839 -1744806
29560 -1744806 -2170012 -1166879 -151133 -571058 -1538472 -1313501 -80160 652328 686495
29551 686495 1073092 1718498 1288723 -218306 -888513 310169 1803866 1555743 -272258
29542 -272258 -1905664 -2329921 -1954255 -1432945 -899761 -303416 190090 254614 -308222 -1225771
29532 -1225771 -1745221 -1356857 -483979 54310 142663 213904 165064 -484234 -1288377 -1057737
29522 -1057737 225119 1021405 489243 -215884 111939 817261 794978 618707 1468667
29513 1468667 2773044 2958145 2108122 1715137 1888714 1155343 -597675 -1407978 -429141
29504 -429141 439864 -377920 -1438500 -674726 1048362 1243863 -198532 -966323 -128067
29495 -128067 585817 -163844 -1252756 -1147667 -269174 66986 -181936 -159501 128621 -76750
29485 -76750 -709599 -736316 283031 1459247 1705638 990968 152093 -163763 -57597 -26875
29475 -26875 -320493 -747603 -1030151 -1084807 -852556 -192864 728417 1269713 1001118 263338
29465 263338 -493327 -1478899 -2818703 -3474436 -2212707 381926 2248891 2459480 2111255
29456 2111255 2239881 2388030 1996720 1667465 1885041 1798967 640533 -704406 -938112
29447 -938112 -247488 417038 986549 1664848 1681009 498379 -585141 -154374 677269
29438 677269 -245669 -2350836 -2795065 -895346 724809 259640 -671696 25542 1615591
29429 1615591 2026384 1007344 -113958 -671377 -866904 -604283 201656 758597 330438
29420 330438 -459862 -569425 -209138 -228382 -397186 159246 1151926 1370691 711858 415695
29410 415695 994948 1317786 374776 -1075235 -1441419 -360325 894844 958309 -102368
29401 -102368 -932760 -477288 777952 1387725 668160 -604676 -1232913 -789194 322865
29392 322865 1349685 1539469 746168 -22299 553412 2311550 3472143 2786294 1010244
29383 1010244 -285842 -467019 236362 1502831 2687949 2715586 1291726 -410657 -1189255
29374 -1189255 -1200278 -1049589 -541591 417720 694513 -624283 -2325824 -2405440 -949854
29365 -949854 89991 -134720 -434093 225569 1273184 1750791 1644188 1463566 1470859 1684539
29355 1684539 1901245 1675947 1045613 980517 2077720 3214847 2863266 1386079 402806
29346 402806 128931 -662029 -1942745 -1947703 -89640 1683636 1580961 372959 -159122
29337 -159122 158748 197237 -493786 -1287146 -1504267 -916246 300570 1486643 1906656
29328 1906656 1615816 1284070 1062076 599566 191099 487034 896579 22021 -1858472
29319 -1858472 -2683382 -1746747 -857761 -1247211 -1539217 -446841 682320 231558 -625805
29310 -625805 115639 1672049 1731450 439084 53102 996806 1359996 507324 181854
29301 181854 1287861 2244137 1648019 345995 -389345 -822255 -1550575 -1983180 -1473515
29292 -1473515 -701472 -535781 -544196 54362 809479 689301 -309706 -1311468 -1789156 -1671993
29282 -1671993 -776337 831113 2277127 2669453 2260226 2057058 2449198 2890075 2801210
29273 2801210 2198635 1482716 1032758 966257 1068937 1068784 1013935 1109416 1272485 1334104 1525217
29262 1525217 2017961 2126027 1037137 -586338 -1041061 -11739 805098 218997 -676989
29253 -676989 -319594 926235 1552599 1236979 940995 1237112 1884108 2631634 3161369
29244 3161369 2666456 869284 -893022 -1081247 -248954 -372405 -1928058 -3299969 -3345624
29235 -3345624 -2856540 -2812393 -2683791 -1496984 429745 1847671 2087348 1469722 714257
29226 714257 477707 933024 1345095 684761 -875547 -1792086 -1070284 323916 722733
29217 722733 -85447 -783105 -358647 724728 1202596 413124 -1022147 -1793416 -1254566
29208 -1254566 -59884 859965 1612349 2823439 4019441 3805302 1983704 244923 67700
29199 67700 990387 1730761 1966147 2022907 1754395 936662 129596 2068 306855 494330
29189 494330 689687 1032271 864609 -110293 -665777 330870 1752638 1535376 -157426
29180 -157426 -1115670 -452189 288173 -185705 -1091816 -1237439 -803734 -467054 -114833 497100
29170 497100 863844 472050 -388670 -1222732 -1879985 -2046027 -1274354 -44958 421196
29161 421196 -31922 -227493 195701 18919 -1220430 -1916495 -856051 643293 833907
29152 833907 331888 708756 1477585 948895 -583559 -1094115 -114315 692550 475506
29143 475506 376014 1150734 1724716 1096152 712 -412478 -253263 -195585 -198494 41711
29133 41711 218395 -7401 -185910 252179 931401 931063 37085 -977612 -1236783 -621504
29123 -621504 172878 363656 -37520 -255612 113420 429861 -31182 -936003 -1422777 -1308260
29113 -1308260 -941425 -406827 93115 -318941 -1996664 -3491017 -3066401 -1204176 108274
29104 108274 339089 682175 1433714 1408968 372436 -302456 -160624 -527366 -1796284
29095 -1796284 -2217060 -874404 352659 -294270 -1525978 -1176110 339116 1129820 1075358
29086 1075358 1349272 1628187 539373 -1469036 -2330758 -1501417 -583676 -581812 -669616 -112749
29076 -112749 531654 738502 901546 1311795 1647859 1908051 2447647 2722057 1534239
29067 1534239 -888613 -2539065 -2129660 -715317 -20825 -243231 -387896 82860 825141
29058 825141 1296717 1216208 677983 76632 -437170 -1255695 -2360340 -2470802 -475648
29049 -475648 2386227 3435549 2031346 503868 882938 2247062 2426612 1062876 -388738
29040 -388738 -881658 -696373 -584625 -1036212 -2106505 -3219793 -3459412 -2602035 -1452890
29031 -1452890 -780818 -560674 -616684 -1084206 -1660311 -1417700 -187063 812706 654643
29022 654643 113135 335816 957263 795497 -188860 -909864 -735975 49944 945518 1347800
29012 1347800 530947 -1320187 -2585543 -1995221 -451289 269966 72275 185504 737001
29003 737001 660314 -36547 -20195 946307 1310006 195352 -1200249 -1607790 -1489616 -1751865
28993 -1751865 -2095049 -1921826 -1677783 -1919078 -2052160 -1427818 -838652 -1389840 -2490809
28984 -2490809 -2554722 -1355836 -171078 262637 450518 795450 1022022 1209807 2049849
28975 2049849 3529809 4417281 3698607 1844973 193403 -343073 328218 1662021 2679527
28966 2679527 2615969 1749693 1089613 1029788 951093 379497 -254266 -424565 -306475 -193764
28956 -193764 185648 1068583 1914776 2037886 1611291 1298710 1145240 601407 -434522
28947 -434522 -1300403 -1414909 -985182 -724965 -1065774 -1675288 -1751710 -996707 -210884 -402078
28937 -402078 -1301478 -1591339 -857648 -277399 -741416 -1401408 -1145706 -522261 -699166 -1218847
28927 -1218847 -645253 776661 1137834 -104612 -1053142 -213301 1227338 1249270 -64093
28918 -64093 -938958 -575605 104253 203904 57548 427575 1293726 1813289 1235822 -194502
28908 -194502 -1183691 -548000 1358819 2786731 2480708 1041665 79419 444154 1646764
28899 1646764 2554042 2260524 771218 -745927 -905618 251709 1149035 685343 -377298
28890 -377298 -718694 -345042 -149022 -215505 151479 959242 1364612 1066125 751164 866959
28880 866959 846202 1070 -1391432 -2330869 -2195742 -1431587 -1187592 -2096461 -3340780
28871 -3340780 -3401758 -1960333 -358139 267637 401351 902896 1314426 711200 -412821
28862 -412821 -638402 270015 1192146 1432913 1230204 595111 -744455 -2116491 -2260211
28853 -2260211 -1270437 -646051 -963416 -1095436 -360136 204274 -348403 -1263541 -1432187
28844 -1432187 -1092961 -963462 -773159 -6407 781745 804850 548535 1018157 1879585 1718772
28834 1718772 97168 -1723130 -2204114 -1031608 740827 1620176 1019972 -29474 -15521
28825 -15521 1069780 1820614 1735409 1971063 3027998 3407784 2052519 566943 935695
28816 935695 2151012 1582515 -848002 -2472174 -1865220 -487343 136974 457012 1163863
28807 1163863 1558755 1007570 392126 673880 1244709 1066128 426848 245758 482685
28798 482685 533748 485326 700153 758251 73909 -924302 -1462227 -1791260 -2538646 -3060170
28788 -3060170 -2047557 144827 1344908 285033 -1714212 -2510459 -1730282 -805126 -979911
28779 -979911 -2083635 -3067135 -3140801 -2369447 -1473461 -1058845 -955208 -493361 482293 1231603
28769 1231603 1022514 113701 -580435 -637020 -449803 -424174 -401229 -136822 105824 -59649
28759 -59649 -369098 -81608 1026046 2303106 2969953 2763421 1730951 53939 -1491507
28750 -1491507 -1566309 389763 3116157 4663924 4491160 3673756 3153710 2777472 2208251
28741 2208251 1674186 1262027 394429 -1216465 -2766390 -3326839 -3103165 -2893560 -2735609
28732 -2735609 -2060183 -952216 -218562 -147561 -116920 341545 858428 933647 708811 634978
28722 634978 782650 849919 638239 303942 244927 691284 1201292 820012 -758908 -2411783
28712 -2411783 -2708586 -1754137 -1006257 -1131284 -1119221 -53511 1268773 1428360 424377
28703 424377 -462319 -534049 -347610 -555426 -1035187 -1388826 -1555974 -1574003 -1214689 -234332
28693 -234332 1187453 2411045 2726742 2008962 1154509 1403913 2745769 3520099 2438257
28684 2438257 576912 182160 1596982 2767543 2129208 593255 -70287 413305 1149227
28675 1149227 1749626 2339169 2498866 1641574 246476 -545540 -535119 -532700 -857616 -983333
28665 -983333 -804836 -984046 -1637056 -1849685 -1084299 -65470 349986 212261 -271352
28656 -271352 -1418777 -3004623 -3527301 -1955638 389842 1205794 195890 -795930 -575062
28647 -575062 105210 341028 496099 981793 1071104 233073 -367300 708232 2710328
28638 2710328 3284403 1586260 -596819 -1242458 -420481 414264 475869 110134 -166459
28629 -166459 -146564 253850 854518 1073896 678506 476413 1364209 2688716 2599170 439774
28619 439774 -2075951 -2756038 -1413318 293940 1097686 1273919 1608776 2152310 2446049
28610 2446049 2421583 2421556 2435302 1890472 482671 -1077177 -1617847 -909557 -111990 -469547
28600 -469547 -1799559 -2754064 -2464818 -1337024 -187287 689013 1309606 1565271 1530818
28591 1530818 1720033 2422741 3124963 3163373 2670670 2305535 2311723 2422351 2437126 2302052
28581 2302052 1903910 1429487 1583941 2652594 3650746 3344959 1895563 459922 -574253
28572 -574253 -1602275 -2126994 -855573 1907392 3633619 2551833 68949 -1166175
28564 -1166175 -744957 -483299 -1408919 -2466087 -2365570 -1315406 -384909 -91533 -194334
28555 -194334 -291597 -129782 314191 711909 603869 -45662 -734966 -970860 -695827 -151565
28545 -151565 358042 510043 135456 -489726 -818741 -689245 -578384 -1003052 -1844421 -2514842
28535 -2514842 -2713595 -2737890 -2971849 -3317178 -3385928 -3134388 -2908368 -2793206 -2399532 -1594166
28525 -1594166 -953813 -930260 -956093 -179949 1093088 1636774 1063084 418506 727090 1751172
28515 1751172 2555434 2528893 1476568 -450041 -2379927 -3080010 -2312174 -1139909 -355832
28506 -355832 503143 1868633 2895537 2603811 1482919 734480 498176 62961 -671819
28497 -671819 -1260230 -1801624 -2569261 -2893816 -1949597 -474146 -88100 -901152 -1441313
28488 -1441313 -1073119 -692755 -685059 -136510 1169856 1856562 1158963 334799 501351 627257
28478 627257 -587754 -2107774 -1936580 -378052 262302 -915124 -2308936 -2399243 -1682558
28469 -1682558 -1454689 -2040642 -2912095 -3510981 -3345282 -2173091 -658506 -17859 -479831
28460 -479831 -912313 -513648 37989 -142164 -610139 -360414 483499 884032 467472 -217158
28450 -217158 -836258 -1512493 -1904302 -1260389 243574 1291583 1126771 573200 675500
28441 675500 1134234 1002331 318331 -54384 83290 69576 -321974 -435404 166502 1013561
28431 1013561 1501936 1667132 1809343 1945065 2026162 2187627 2386669 2261434 1729783 1285437
28421 1285437 1313019 1533691 1522927 1350924 1269077 1149507 725987 122120 -278173 -280027
28411 -280027 67895 578530 896752 768825 498867 602313 874192 566522 -268256 -602926
28401 -602926 -106123 88016 -919145 -2321317 -2813761 -2324152 -1448165 -172310 1452438
28392 1452438 2323104 1711542 964692 1821669 3501852 3648037 2033967 974853 1712285
28383 1712285 2736345 2512301 1727626 1640772 2005022 2008924 1817187 1789070 1409024 376664
28373 376664 -324667 171260 1075048 1125071 454456 5788 -43892 53196 629625 1773677
28363 1773677 2264503 1005947 -1006626 -1816681 -1216765 -662610 -791748 -859820 -626792
28354 -626792 -906432 -1821444 -2169494 -1214312 175270 856972 838977 759546 853955 1005705
28344 1005705 1058662 670944 -337796 -1183592 -656724 1067563 2196659 1589300 309408
28335 309408 43081 774587 1127330 515649 -236662 -365228 -233794 -633784 -1616748 -2392041
28325 -2392041 -2193026 -1085711 45866 353335 -129594 -648533 -709143 -573320 -720206
28316 -720206 -1217769 -1775455 -1983755 -1328793 431634 2489420 3181025 1690249 -758553
28307 -758553 -2171962 -2090267 -1797160 -2240690 -2737854 -2198614 -841746 83282 -107669
28298 -107669 -971686 -1772368 -2097877 -1675289 -422316 1032123 1619656 1121057 620468
28289 620468 1100734 2075737 2334567 1678781 1072469 1240537 1988765 2848367 3454438 3233051
28279 3233051 1777145 -170038 -1165667 -980921 -996316 -2006792 -2779062 -1918244 -228705
28270 -228705 306934 -577302 -1210278 -646710 70007 -234559 -1135891 -1554075 -1416954 -1416588
28260 -1416588 -1737347 -1973595 -1972995 -1912501 -1692979 -1023333 -105563 430963 406893 361845
28250 361845 746191 1289535 1438581 1067460 443056 -207172 -683156 -598958 258319 1364417
28240 1364417 1817121 1419596 877541 675120 371726 -499116 -1424145 -1566888 -1035346
28231 -1035346 -614528 -489819 -236387 45977 -234195 -866352 -835666 -23447 340714 -398785
28221 -398785 -1143612 -728853 266850 576705 247125 207696 440385 87560 -855135 -1406077
28211 -1406077 -1189696 -882471 -925448 -957595 -747879 -595674 -508065 -90 924030 1533080
28201 1533080 1508231 1422333 1622400 1496436 464669 -958119 -1706861 -1347003 -322354
28192 -322354 523069 429800 -639003 -1551955 -956229 897939 2096867 1462924 194016
28183 194016 160411 1205618 1430610 30671 -1475459 -1299955 288484 1459205 1161698
28174 1161698 148365 -299891 63327 518377 560649 401561 311035 46416 -698655 -1550802
28164 -1550802 -1612397 -438059 1317979 2324142 1715573 -45379 -1485267 -1491599 -326789
28155 -326789 912350 1564033 1626793 1059637 -141629 -1156395 -840870 565999 1429993
28146 1429993 1056306 777099 1757050 3007995 2977832 2009944 1507483 1516857 1135071 748956
28136 748956 1606981 3270842 3810991 2856668 2192623 2652695 2642127 906992 -1159342
28127 -1159342 -1524328 -436591 240127 -347149 -1521371 -2500353 -3064923 -3237185 -3248967
28118 -3248967 -3435739 -3552265 -2860255 -1450792 -537265 -690987 -805848 228307 1766836
28109 1766836 2395962 1861972 939749 128113 -433767 -444708 61267 293131 -235779 -858412
28099 -858412 -846383 -537406 -455971 -337327 -141634 -854728 -2803388 -4289892 -3678324 -1916728
28089 -1916728 -1072549 -1215057 -927056 -214631 -381621 -1284504 -1365487 -589716 -736721 -2216013
28079 -2216013 -3078799 -2061187 -322081 855670 1838417 2861094 2720708 984350 -406574
28070 -406574 211977 1445320 900824 -1044588 -1844943 -583927 1057190 1519259 1047764
28061 1047764 433342 -181227 -703446 -642825 86771 800866 961383 788788 669508 609372
28051 609372 539135 565360 653534 541419 155769 -286638 -651369 -928719 -944838 -594323
28041 -594323 -359625 -913636 -2034985 -2592299 -1943276 -774583 -108023 48467 473583
28032 473583 1437358 2289795 2350566 1677306 816029 240753 246217 901627 1663768 1447985
28022 1447985 -192809 -2121361 -2712282 -1960285 -1456331 -1879028 -1767310 167541 2578579
28013 2578579 2990366 1287435 -170286 34252 775683 766240 622053 1358353 2367876
28004 2367876 2509399 2170794 2489656 3130148 2664610 1013073 -240706 -196302 253118
27995 253118 166755 53156 788330 1992848 2441374 1625569 202957 -817209 -869993
27986 -869993 -175780 283613 -468454 -2153558 -3119758 -2106448 72818 1308918 683924
27977 683924 -508880 -535404 563008 1167366 301431 -1132817 -1657501 -1146910 -754510
27968 -754510 -1154361 -1715831 -1607650 -929219 -251609 343435 1060351 1625949 1563085 1104540
27958 1104540 991412 1230808 859271 -611234 -2101820 -2038280 -383701 1096610 915181
27949 915181 -246353 -381411 1158269 2711745 2610221 1627301 1894920 3669501 4800596
27940 4800596 3828851 1990843 1135797 1107687 752018 382813 1165991 2567322 2707434
27931 2707434 1407994 672715 1461694 2052563 827937 -1019398 -1212033 323718 1642015
27922 1642015 1594791 763801 -139292 -1135532 -2052203 -2130710 -1120335 121532 665739
27913 665739 594946 622250 1000567 1211025 659187 -486747 -1255219 -874144 189718 632572
27903 632572 -85957 -1121303 -1548161 -1564840 -1770295 -1949463 -1530934 -763136 -328760 -62696
27893 -62696 759411 1926147 2335230 1725750 1155757 1312128 1455861 746622 -283975
27884 -283975 -492894 164544 590727 69660 -835869 -986586 54552 1487499 1956526
27875 1956526 897594 -813516 -1802042 -1683335 -1213240 -1088136 -1236525 -1338966 -1312962
27866 -1312962 -1022548 -163753 1175439 2318881 2681801 2264904 1356649 292583 -383813
27857 -383813 -239428 325169 384374 -230263 -752964 -856780 -1203111 -2118787 -2787248 -2547305
27847 -2547305 -2047628 -2142146 -2449854 -2097686 -1229906 -634883 -411805 -176180 -121579 -640843
27837 -640843 -1250668 -1165678 -678591 -666968 -934474 -468436 679890 1257374 759728 106863
27827 106863 -7558 -101614 -683360 -1230083 -1082215 -437003 156855 492892 420756 -276502
27817 -276502 -1230986 -1563415 -1087246 -588780 -481327 -188246 574943 1003905 503465 -205980
27807 -205980 -236990 68071 -55955 -335031 -103 708029 823794 251413 -47081 493507
27797 493507 1276912 1414009 801404 192519 423230 1458869 2142338 1329183 -609389
27788 -609389 -2087202 -2294320 -1963597 -1800538 -1381025 -417054 119514 -610219 -1752320
27779 -1752320 -1987953 -1534681 -1412641 -1418371 -624831 480021 298431 -1342338 -2693550
$$ [...]
##END NTUPLES=NMR SPECTRUM
##END=
