##TITLE=31Pdec_LY-15Dix.5.B
 CD3CN, 24 sc
 4.06.2021
##JCAMPDX= 6.0         $$ Bruker NMR JCAMP-DX V2.0
##DATA TYPE= NMR SPECTRUM
##DATA CLASS= NTUPLES
##ORIGIN= UXNMR, Bruker Analytische Messtechnik GmbH
##OWNER= root
$$ XWIN-NMR		Version 3.5
$$ Fri Jun  4 11:40:36 2021 Russian Standard Time (UT+4h)  she@DPX200
##.OBSERVE FREQUENCY= 81.013821
##.OBSERVE NUCLEUS= ^31P
##.ACQUISITION MODE= SIMULTANEOUS
##.ACQUISITION SCHEME= undefined
##.AVERAGES= 24
##.DIGITISER RES= 16
##SPECTROMETER/DATA SYSTEM= spect
##.PULSE SEQUENCE= zgpg30
##.SOLVENT NAME= CDCl3
##.SHIFT REFERENCE= (INTERNAL, CDCl3, 0, 248.564)
##AUDIT TRAIL= $$ (NUMBER, WHEN, WHO, WHERE, WHAT)
$$ ##TITLE= Audit trail, XWIN-NMR		Version 3.5
$$ ##JCAMPDX= 5.01
$$ ##ORIGIN= Bruker BioSpin GmbH
$$ ##OWNER= she
$$ F:/spectra/data/she/nmr/P31/1/pdata/1/auditp.txt
$$ ##AUDIT TRAIL=  $$ (NUMBER, WHEN, WHO, WHERE, WHAT)
(   1,<2021-06-04 11:39:27.17 +0400>,<she>,<DPX200>,
      <created by zg, POWCHK disabled, PULCHK disabled
       configuration hash MD5:
       00 E9 B6 7A A2 85 ED C7 34 08 36 98 17 FE 4E 26
       data hash MD5: 32K
       04 B7 04 E9 54 54 5B 4E 7C 9F E3 0A 38 6F E3 FF>)
(   2,<2021-06-04 11:39:30.17 +0400>,<she>,<DPX200>,
      <Start of raw data processing
       efp BC_mod = 2 LB = 1 FT_mod = 6 PKNL = 1 PHC0 = -5946.13 PHC1 = 195.2715 SI = 64K 
       data hash MD5: 64K
       32 95 8D A4 AA 82 B5 8C 19 92 0F 2E AA 79 3B 2F>)
(   3,<2021-06-04 11:39:59.98 +0400>,<she>,<DPX200>,
      <pk PHC0 = -444.1791 PHC1 = 916.2031 
       data hash MD5: 64K
       A6 31 19 15 EC 01 CC 07 1F 4F E5 1B 2F 96 40 24>)
(   4,<2021-06-04 11:40:02.84 +0400>,<she>,<DPX200>,
      <abs ABSG = 5 
       data hash MD5: 64K
       A8 52 21 65 5E B3 9C F2 FB D8 C5 B1 E0 29 33 0F>)
$$ ##END=
$$ 
$$ hash MD5
$$ E1 65 E8 49 26 D8 C7 12 97 FC ED B4 DF 9D B4 B5
##$RELAX= 
##$RELAX= 
##$RELAX= 
##$RELAX= 
##$RELAX= 
##$RELAX= 
##$RELAX= 
##$RELAX= 
$$ Bruker specific parameters
$$ --------------------------
##$DU= <F:/spectra>
##$EXPNO= 1
##$NAME= <P31>
##$PROCNO= 1
##$TYPE= <nmr>
##$USER= <she>
##$AMP= (0..31)
100 100 100 100 100 100 100 100 100 100 100 100 100 100 100 100 100 100 
100 100 100 100 100 100 100 100 100 100 100 100 100 100 
##$AQSEQ= 0
##$AQ_mod= 1
##$AUNM= <au_zg>
##$AUTOPOS= <>
##$BF1= 81.014009
##$BF2= 200.13
##$BF3= 200.13
##$BF4= 200.13
##$BF5= 200.13
##$BF6= 200.13
##$BF7= 200.13
##$BF8= 200.13
##$BYTORDA= 1
##$CFDGTYP= 0
##$CFRGTYP= 5
##$CHEMSTR= <none>
##$CNST= (0..31)
1 1 145 1 1 1 1 1 1 1 1 1 1 1 1 1 1 1 1 1 1 1 1 1 1 1 1 1 1 1 1 1 
##$CPDPRG= <waltz16>
##$CPDPRG1= <>
##$CPDPRG2= <waltz16>
##$CPDPRG3= <>
##$CPDPRG4= <mlev>
##$CPDPRG5= <mlev>
##$CPDPRG6= <mlev>
##$CPDPRG7= <mlev>
##$CPDPRG8= <mlev>
##$CPDPRGB= <>
##$CPDPRGT= <>
##$D= (0..31)
0 1 0 0 0 0 0 0 0 0 0 0.03 2e-05 3e-06 0 0 0 0 0 0 0 0 0 0 0 0 0 0 0 0 
0 0 
##$DATE= 1622792366
##$DBL= (0..7)
120 120 120 11 120 120 24 19 
##$DBP= (0..7)
150 150 150 150 150 150 150 150 
##$DBP07= 0
##$DBPNAM0= <>
##$DBPNAM1= <>
$$ [...]
##$SUBNAM3= <"">
##$SUBNAM4= <"">
##$SUBNAM5= <"">
##$SUBNAM6= <"">
##$SUBNAM7= <"">
##$SUBNAM8= <"">
##$SUBNAM9= <"">
##$SW= 501.771253377433
##$SWIBOX= (0..15)
0 1 3 0 0 0 0 0 0 0 0 0 0 0 0 0 
##$SW_h= 40650.406504065
##$TD= 32768
##$TD0= 1
##$TE= 0
##$TE2= 300
##$TE3= 300
##$TEG= 300
##$TL= (0..7)
0 120 53 12 22 120 120 120 
##$TP= (0..7)
150 150 150 150 150 150 150 150 
##$TP07= 0
##$TPNAME0= <>
##$TPNAME1= <>
##$TPNAME2= <>
##$TPNAME3= <>
##$TPNAME4= <>
##$TPNAME5= <>
##$TPNAME6= <>
##$TPNAME7= <>
##$TPOAL= (0..7)
0.5 0.5 0.5 0.5 0.5 0.5 0.5 0.5 
##$TPOFFS= (0..7)
0 0 0 0 0 0 0 0 
##$TUNHIN= 0
##$TUNHOUT= 0
##$TUNXOUT= 0
##$USERA1= <user>
##$USERA2= <user>
##$USERA3= <user>
##$USERA4= <user>
##$USERA5= <user>
##$V9= 5
##$VALIST= <valist>
##$VCLIST= <CCCCCCCCCCCCCCC>
##$VD= 0
##$VDLIST= <DDDDDDDDDDDDDDD>
##$VPLIST= <PPPPPPPPPPPPPPP>
##$VTLIST= <TTTTTTTTTTTTTTT>
##$WBST= 1024
##$WBSW= 4
##$XGAIN= (0..3)
0 0 0 0 
##$XL= 0
##$YL= 0
##$YMAX_a= 2636
##$YMIN_a= -4153
##$ZGOPTNS= <>
##$ZL1= 120
##$ZL2= 120
##$ZL3= 120
##$ZL4= 120
##$ABSF1= 248.5645
##$ABSF2= -253.2056
##$ABSG= 5
##$ABSL= 3
##$ALPHA= 0
##$AQORDER= 0
##$ASSFAC= 0
##$ASSFACI= 0
##$ASSFACX= 0
##$ASSWID= 0
##$AUNMP= <proc_1d>
##$AZFE= 0.1
##$AZFW= 0.5
##$BCFW= 0
##$BC_mod= 2
##$BYTORDP= 0
##$COROFFS= 0
##$CY= -3
##$DATMOD= 1
##$DC= 0
##$DFILT= <>
##$DTYPP= 0
##$F1P= 0
##$F2P= 0
##$FCOR= 1
##$FTSIZE= 65536
##$FT_mod= 6
##$GAMMA= 0
##$GB= 0
##$INTBC= 1
##$INTSCL= 5.30512e-09
##$ISEN= 30
##$LB= 1
##$LEV0= 0
##$LPBIN= 0
##$MAXI= 10000
##$MC2= 0
##$MEAN= 0
##$ME_mod= 0
##$MI= 50
##$NCOEF= 0
##$NC_proc= -6
##$NLEV= 6
##$NOISF1= 182.463
##$NOISF2= 159.3651
##$NSP= 0
##$NTH_PI= 0
##$NZP= 0
##$OFFSET= 248.5645
##$PC= 4
##$PHC0= -6390.309
##$PHC1= 1111.475
##$PH_mod= 1
##$PKNL= yes
##$PPARMOD= 0
##$PSCAL= 0
##$PSIGN= 0
##$REVERSE= no
##$SF= 81.014009
##$SI= 65536
##$SIGF1= 159.3651
##$SIGF2= -187.1042
##$SINO= 113.3802
##$SIOLD= 16384
##$SREGLST= <1H.CDCl3>
##$SSB= 0
##$STSI= 65536
##$STSR= 0
##$SW_p= 40650.406504065
##$SYMM= 0
##$S_DEV= 0
##$TDeff= 32768
##$TDoff= 0
##$TI= <>
##$TILT= no
##$TM1= 0
##$TM2= 0
##$TOPLEV= 0
##$USERP1= <user>
##$USERP2= <user>
##$USERP3= <user>
##$USERP4= <user>
##$USERP5= <user>
##$WDW= 1
##$XDIM= 65536
##$YMAX_p= 415885292
##$YMIN_p= -7356316
$$ End of Bruker specific parameters
$$ ---------------------------------
##NTUPLES= NMR SPECTRUM
##VAR_NAME=  FREQUENCY,     SPECTRUM/REAL,   SPECTRUM/IMAG
##SYMBOL=    X,             R,               I
##VAR_TYPE=  INDEPENDENT,   DEPENDENT,       DEPENDENT
##VAR_FORM=  AFFN,          ASDF,            ASDF
##VAR_DIM=   65536,         65536,           65536
##UNITS=     HZ,            ARBITRARY UNITS, ARBITRARY UNITS
##FACTOR=    0.620285442955139, 1,           1
##FIRST=     20137.2065510759, 0,            0
##LAST=      -20513.1999529892, 0,           0
##MIN=       -20513.1999529892, -7356316,    0
##MAX=       20137.2065510759, 415885292,    0
$$ Real data points
##PAGE= N=1
##DATA TABLE= (X++(R..R)), XYDATA
$$ [...]
37858 1818006 -117231 -795918 218913 1281993 913952 -156027 -253806 648251 1048058
37849 1048058 399841 -94209 453950 1162021 840675 -68264 -137420 931619 1955368
37840 1955368 1995437 1485385 1336296 1605338 1579432 885860 11995 -298635 143747 878681
37830 878681 1310911 1152743 479417 -368552 -881118 -676812 30531 423981 -113007 -1193806
37820 -1193806 -1749385 -1223965 -158507 539894 611239 490636 559251 668935 400322 -403549
37810 -403549 -1403010 -2009936 -1916285 -1398132 -984684 -814157 -518781 179540 1020224 1543409
37800 1543409 1665013 1644019 1596930 1334811 690590 -181475 -878338 -1070319 -793332 -413431
37790 -413431 -171847 157739 839319 1452072 1189897 120662 -523410 92778 1064867
37781 1064867 796216 -841087 -2264013 -2113632 -653963 868096 1497411 989727 -278190
37772 -278190 -1379837 -1376432 -276583 839294 955205 109381 -881183 -1269830 -807868
37763 -807868 183166 940940 895899 323983 -88875 -309997 -840534 -1490232 -1324470 -205508
37753 -205508 710029 634791 239823 296121 368732 -48168 -217813 547437 1212172 443998
37743 443998 -893871 -731207 927365 1904848 1289609 707360 1337302 1803866 523114
37734 523114 -1490532 -2033507 -967016 -169179 -624191 -1310047 -1103389 -352549 -50833
37725 -50833 -380302 -684172 -458609 53779 151800 -543610 -1527165 -1747306 -675101 1088706
37715 1088706 2397971 2569497 1749417 615196 -120097 -222261 -122464 -339649 -753545
37706 -753545 -892708 -809491 -894283 -826843 212369 1946644 2773360 1842395 363195 -55628
37696 -55628 525028 1009090 1127672 1344121 1465269 816552 -386863 -1188473 -1382885 -1616684
37686 -1616684 -1970495 -1741587 -891123 -462557 -1050555 -1860487 -1881082 -1197363 -552424 -256469
37676 -256469 -138062 -124130 -311979 -688248 -1101439 -1352921 -1234262 -730635 -151304 260009
37666 260009 654006 1057104 876122 -287196 -1596035 -1812567 -1123088 -941383 -1732045
37657 -1732045 -2339672 -1931853 -1242033 -1044477 -657500 759316 2288770 2164706 316384
37648 316384 -1366356 -1414190 -330780 506130 576238 343783 258120 276349 232215 161519
37638 161519 86195 -231970 -940335 -1556443 -1341704 -460835 -75445 -624259 -727821 986483
37628 986483 3416348 4021847 2413253 988283 1287586 1685739 173191 -2207262 -2804333
37619 -2804333 -1290484 140043 197874 -124527 179861 593201 524362 556298 1225274 1881807
37609 1881807 1858028 1741975 2384689 3432405 3931800 3769050 3433278 2869916 1743946
37600 1743946 566106 364015 1190689 1949539 1844748 1139693 311561 -617334 -1504582
37591 -1504582 -1704790 -966567 -166305 -353576 -1328478 -1942684 -1726296 -1389872 -1547558
37582 -1547558 -1782176 -1491114 -980041 -909763 -1062785 -662204 149109 240293 -768655 -1697892
37572 -1697892 -1383523 -265071 418778 367077 155006 -70242 -627860 -1243373 -1237106 -845124
37562 -845124 -1043939 -1731946 -1439012 447800 2385521 2617086 1447514 407341 -28830
37553 -28830 -418227 -591449 270759 1723890 2005730 567448 -807792 -437937 858151
37544 858151 1104488 129635 -387908 390486 1320901 1179401 389215 111611 542723 999705
37534 999705 1107334 1004353 744734 380164 409275 1217985 2121949 1908579 489657 -853123
37524 -853123 -1132805 -724296 -422393 -350826 -394334 -823337 -1601029 -1766409 -610634 927671
37514 927671 1192783 18304 -1058294 -814098 404087 1522392 1850748 1172127 -279347
37505 -279347 -1588461 -1798741 -1156064 -881872 -1400960 -1795743 -1462942 -1130618 -1408166
37496 -1408166 -1440654 -229787 1467375 1941971 873232 -426920 -962575 -1012695 -1082546
37487 -1082546 -1065127 -796780 -576137 -696624 -991896 -1099398 -788546 -5680 967039 1495866
37477 1495866 1257424 752725 592136 577366 270322 95356 741255 1648696 1482994 287083
37467 287083 -282674 603258 1630655 1298678 38359 -674415 -435116 13486 215576
37458 215576 357304 507853 510663 485280 671698 951396 1128633 1343291 1568946 1197107
37448 1197107 -27815 -1106278 -856123 362538 1071603 726087 237440 370303 733027
37439 733027 720745 518151 604428 890909 911002 531942 90245 -2929 364848 852753
37429 852753 894525 292661 -549172 -1211167 -1721273 -2057506 -1750090 -716949 46800 -304682
37419 -304682 -919711 -288607 1252606 1658318 219111 -1114321 -394539 1571715 2381235
37410 2381235 1184533 -589827 -1301247 -728215 344497 1222568 1681729 1718086 1247005
37401 1247005 134480 -1361423 -2397708 -2333714 -1653739 -1381268 -1543724 -1176464 -71627
37392 -71627 661180 368453 -9181 480410 1138801 785396 -206444 -462236 273327 975573
37382 975573 1045474 817752 491584 -66475 -396604 302250 1698569 2343898 1617984 608236
37372 608236 546589 1300560 1967430 2133599 1908793 1367093 608362 -49497 -430725 -706620
37362 -706620 -934927 -840897 -364582 37524 -37957 -488604 -1078533 -1783452 -2473770 -2746438
37352 -2746438 -2437891 -1910222 -1514330 -1149765 -639217 -140358 129190 242779 367591
37343 367591 500449 581985 586920 417921 54068 -193767 -17367 349071 477082 525223
37333 525223 916674 1305413 869205 -215508 -711369 -139331 449807 144895 -437401
37324 -437401 -268817 480796 904599 735117 336515 -62342 -234998 305940 1467311
37315 1467311 2064336 1202070 -336794 -1128466 -988040 -653668 -170466 935533 2173800
37306 2173800 2387190 1591605 1042262 1259481 1410605 992962 697380 1004784 1219993
37297 1219993 706338 41770 77865 629022 882586 490660 -361795 -1322176 -1768820 -1129959
37287 -1129959 72987 352459 -788227 -1862987 -1350960 108565 670391 -92416 -884749
37278 -884749 -830170 -528604 -734219 -1123610 -909175 24779 1042612 1378120 650792 -745325
37268 -745325 -1647848 -1108501 409191 1350530 836101 -404267 -1140387 -1137071 -1072039 -1329012
37258 -1329012 -1448560 -779982 620448 1822335 1780233 428958 -1022869 -1229286 -183070
37249 -183070 836723 881293 370380 225499 509523 525501 5128 -477199 -353373 156833
37239 156833 358520 -10164 -392727 -32583 977543 1470546 463243 -1354468 -2052609
37230 -2052609 -763075 1083478 1501795 428607 -492293 -326283 139081 -55788 -676058
37221 -676058 -1059038 -1288354 -1750598 -2134130 -1779928 -731441 335692 1033658 1434498
37212 1434498 1517985 1166745 640096 394367 440089 445771 418524 664610 1090522 1171891
37202 1171891 671738 -153116 -1032667 -1777665 -1983973 -1401817 -612123 -504392 -973623
37193 -973623 -1028525 -398451 -33258 -580838 -1351085 -1434006 -984300 -632214 -379937 36619
37183 36619 321358 121768 -117609 196593 647669 321650 -712508 -1446784 -1415953 -1178556
37173 -1178556 -1230383 -1314994 -1035565 -449979 167741 607373 655707 301202 47916 411713
37163 411713 1056384 1125064 553752 282789 841113 1434032 980465 -398326 -1498532
37154 -1498532 -1449616 -563030 198704 292538 32843 55677 513260 990514 1154814 1090424
37144 1090424 888062 444394 -16295 168746 1133514 1968106 1891234 1408760 1406108 1580952
37134 1580952 957025 -303200 -932708 -462653 181670 221994 -45391 -212410 -456991
37125 -456991 -771729 -608771 78846 450578 114618 -99103 545428 1491063 1841983 1719830
37115 1719830 1754511 1886292 1605025 859537 -107316 -1291161 -2454406 -2703541 -1528504
37106 -1528504 153375 972224 820453 688000 1092515 1628218 1871119 1788756 1344967
37097 1344967 559631 -80819 -37795 496328 884221 968936 1061659 1245566 1427266 1810238
37087 1810238 2475019 2745832 1953886 685633 214532 682847 913597 192431 -780282
37078 -780282 -1017280 -440101 392766 982244 999494 436965 -35898 415267 1592683 2295597
37068 2295597 1914315 1261645 1320608 1845697 1885136 1232112 613329 598294 957160 1177892
37058 1177892 1184975 1288368 1567867 1661530 1404763 1409607 2368082 3726382 3916914 2389940
37048 2389940 573664 32434 467472 622724 439683 820054 1642463 1737472 906083
37039 906083 329999 648037 1146384 1298055 1559476 1992350 1633273 173949 -1067385
37030 -1067385 -923102 -2323 492967 469499 345914 -129011 -1110075 -1623774 -764372 745957
37020 745957 1577842 1747643 2112990 2506649 2014772 812685 81090 144721 214845 30258
37010 30258 244777 953145 1264947 784733 309272 558956 1208272 1603213 1570027 1196413
37000 1196413 669569 570549 1418020 2681892 3180701 2665851 2007161 1627375 979057
36991 979057 -32329 -424336 342911 1349739 1559441 1221735 1080395 1082340 844167 643091
36981 643091 904627 1271805 1179806 910135 1129449 1725249 1963452 1532557 714761 -143557
36971 -143557 -682051 -517657 110339 248221 -414382 -759197 149303 1327370 1112847
36962 1112847 -285892 -1068855 -590749 -154973 -732039 -1474728 -1255335 -398798 97579
36953 97579 159023 409785 924763 1179540 992957 761796 844150 1196305 1522599 1495139
36943 1495139 1019573 451298 216546 127611 -370173 -1118610 -1210422 -437049 125834 -275815
36933 -275815 -722135 23613 1399724 1690173 637760 -65532 743205 2024493 2075367
36924 2075367 780016 -585957 -1141147 -991387 -439061 295531 597046 -219328 -1733796
36915 -1733796 -2407286 -1341966 489788 1439882 1212953 882031 1039071 944667 -132537
36906 -132537 -1587239 -2218648 -1801919 -1081255 -460349 302256 1004471 678591 -1021849
36897 -1021849 -2835390 -3135134 -1829543 -245879 673865 1163057 1572698 1528505 694197
36888 694197 -322492 -636698 -370759 -463721 -1195913 -1676392 -1113094 3547 513435
36879 513435 51680 -678463 -969293 -843734 -644567 -451448 -213792 -85309 -239252 -522746
36869 -522746 -579012 -186606 679334 1837461 2709505 2549640 1371669 347011 592849
36860 592849 1668459 2043604 1163529 235970 569859 1816708 2500379 1891288 665620
36851 665620 -150294 -250445 11466 256774 400979 547140 767032 976405 988928 712634
36841 712634 306715 155650 637473 1723635 2720388 2709009 1557229 249335 -207354
36832 -207354 37579 133458 -105736 -86140 447690 1141691 1891725 2844031 3363454 2393929
36822 2393929 417165 -444093 662776 1690133 475469 -1971272 -2863783 -1609091
36814 -1609091 -230267 -29051 -77502 571943 1245004 1089747 519375 207536 -4966
36805 -4966 -182377 454092 2118066 3325324 2560515 468019 -885705 -560966 548750
36796 548750 1276298 1377614 1214627 1094184 1048423 850244 322470 -188671 -95104 443438
36786 443438 526462 -83464 -464941 -110339 6966 -1027736 -2336621 -2373432 -1178145
36777 -1178145 -98603 334673 762386 1410341 1686546 1466124 1374462 1546338 1380755
36768 1380755 806987 536302 711269 577797 -39122 -216414 480416 1122564 941240
36759 941240 599764 952160 1487827 1167572 129620 -604041 -674397 -546796 -452943 -248725
36749 -248725 -162657 -654110 -1510532 -1973165 -1831585 -1583495 -1407983 -831700 271624 1083033
36739 1083033 770019 -382512 -1259031 -1160397 -398428 303477 701045 1164607 1969611
36730 1969611 2650934 2360602 968091 -495835 -825468 23665 891771 704025 -462287
36721 -462287 -1639928 -2032284 -1629473 -896619 -128926 707985 1583107 2148826 2068265 1408634
36711 1408634 477953 -537674 -1449252 -1810381 -1356519 -647695 -600925 -1229836 -1531481
36702 -1531481 -935928 -157805 -63096 -333262 -65593 708315 1068328 676944 253402 384333
36692 384333 695765 626279 360245 402157 651845 576989 137741 -106986 144980 546568
36682 546568 739802 845160 946336 581708 -567827 -1698125 -1470318 191630 1687447
36673 1687447 1671784 769086 574204 1387715 1994285 1590525 744145 101231 -707685 -2055466
36663 -2055466 -3063866 -2535549 -845331 251962 -149183 -1001978 -826277 392025 1420153
36654 1420153 1474016 1010620 903767 1401887 2057719 2319004 1978987 1282301 773781 825061
36644 825061 1119843 893266 -1706 -597218 43208 1374288 1868917 1050896 127847
36635 127847 213203 835097 944111 608252 645980 1066225 1088989 572588 244992 425943
36625 425943 596068 458707 431297 761051 1072199 1163341 1376140 1751218 1682615 923676
36615 923676 145402 -48419 78504 107535 195677 484071 557815 219470 88282 634676
36605 634676 1258402 1169777 618219 377396 537948 721928 994396 1546115 1867995 1348668
36595 1348668 485556 401727 1174801 1655125 1092712 114558 -151621 638464 1761719
36586 1761719 2038034 836044 -1106027 -2111813 -1328679 236210 974243 543972 -203061
36577 -203061 -677142 -976699 -1140181 -984421 -656812 -549281 -731519 -1119454 -1899889 -2997304
36567 -2997304 -3513916 -2699996 -1194322 -288934 -281744 -630525 -1270843 -2364388 -3085103
36558 -3085103 -2373553 -881879 -387931 -1054837 -1116138 235418 1544680 1517353 969964
36549 969964 1197738 1905545 2090164 1740061 1310131 620559 -310675 -389312 988505 2331819
36539 2331819 1796566 -7474 -823142 -146698 151937 -1082263 -2442568 -2126649 -604192
36530 -604192 144523 -616743 -1650459 -1688218 -1021820 -700937 -841201 -587732 356368 1137265
36520 1137265 1134222 1076167 1840606 2722007 2209644 352933 -1070320 -993687 -298512 -130002
36510 -130002 -346113 -406097 -507819 -790125 -502364 789988 2003491 1801456 423848
36501 423848 -910398 -1743522 -2223052 -1883175 -237091 1648961 1843921 48420 -1911989
36492 -1911989 -2407915 -1700839 -950944 -558599 -97653 724819 1619196 2046960 1813352
36483 1813352 1365054 1286078 1384437 815182 -564733 -1708683 -1844408 -1593241 -1752801
36474 -1752801 -1834259 -1051040 -50760 -140813 -1195112 -1900622 -1860685 -1832134 -1958460 -1520335
36464 -1520335 -638405 -472342 -1238917 -1631923 -856021 212936 592502 526438 484287 205364
36454 205364 -328989 -272052 628026 1095199 110890 -1308528 -1455188 -320676 726970
36445 726970 1114422 1454814 1978670 1978799 1037090 -204545 -818565 -520925 312647 1050906
36435 1050906 1171411 660275 76357 -89300 8848 -45123 -203940 -79945 341509 588057
36425 588057 324016 -225750 -534107 -333637 60797 27718 -596510 -1166432 -1010525 -426239
36415 -426239 -334489 -1004133 -1794727 -2156709 -2077593 -1479823 -185207 1240809 1681242 1016860
36405 1016860 485972 894490 1489511 1363069 905722 838983 765437 -33745 -1059249 -1237123
36395 -1237123 -666451 -363210 -518204 -369813 249525 569382 260309 -753 340188
36386 340188 959639 1353390 1487520 1442599 1112346 589185 288713 391100 572967 488705
36376 488705 202118 83587 526625 1605261 2691103 2749970 1540817 178626 -119646
36367 -119646 513523 1117933 1430375 1887673 2412886 2413973 2002524 2027005 2651523 2958779
36357 2958779 2330632 1318384 755973 807267 1241887 1855556 2208389 1700589 415479
36348 415479 -673935 -765137 -64480 655140 845621 427201 -155113 -62015 1010849 1978293
36338 1978293 1371174 -612362 -2093807 -1899507 -862649 -227125 51360 535464 908233
36329 908233 567805 -45701 17971 687766 1015647 699002 390994 485003 596127 458145
36319 458145 445405 777240 869632 82147 -1193548 -1791541 -1174143 -147477 126745 -391378
36309 -391378 -648456 -78892 486420 -11935 -1286803 -2062927 -1744753 -877469 -68634
36300 -68634 599429 1013064 847909 211220 -342077 -656218 -1050763 -1425979 -1238030 -555612
36290 -555612 -99878 9870 385257 942546 722803 -326395 -851279 -149818 730986
36281 730986 865850 826319 1010175 343344 -1659851 -3161395 -2481150 -988485 -1021341
36272 -1021341 -1957365 -1290527 869827 1620295 -90928 -1730857 -1094987 718936 1624017
36263 1624017 1545920 1469583 1362599 866728 649176 1276836 1797608 1081467 -302390 -1058791
36253 -1058791 -1170935 -1399591 -1566782 -1011648 -198764 -164164 -674904 -584282 158868 511197
36243 511197 329904 646841 1648396 2059308 1236161 437189 994839 2284844 2689356
36234 2689356 1927193 1206229 1295229 1595665 1319990 681503 387217 473144 318592 -281824
36224 -281824 -676596 -231458 736119 1271085 870280 -63665 -739777 -643482 155686 962060
36214 962060 865330 -303109 -1510253 -1587624 -712902 -160649 -549344 -1130697 -1027383 -355737
36204 -355737 271341 608717 657462 357538 -43223 83788 863723 1495672 1291529 611373
36194 611373 167712 -49496 -441085 -852925 -740453 -18079 874636 1504457 1575478 935053
36184 935053 -43040 -528684 -198148 358994 626522 851980 1227740 1294125 921105 885624
36174 885624 1465548 1522653 303591 -907436 -636365 217422 -202217 -1354222 -927109
36165 -927109 1190242 2285288 900442 -952451 -939834 329231 856032 439531 361392
36156 361392 874365 929558 57746 -998495 -1466622 -1292883 -795276 -349592 -253981 -348504
36146 -348504 -125773 329467 158640 -898604 -1714416 -1227091 -46863 372062 -311497
36137 -311497 -1165256 -1410666 -1079564 -518980 -78723 -69095 -364100 -397171 -122769 -334931
36127 -334931 -1255842 -1626433 -364285 1553302 2261205 1574248 837197 538783 -118140
36118 -118140 -1200408 -1508243 -657528 -41159 -781060 -2040231 -2425762 -1976468 -1561524
36109 -1561524 -1165678 -170843 1075891 1363813 349836 -879153 -1231902 -803980 -312864
36100 -312864 13533 471329 1124005 1550006 1399765 899254 606293 753401 1029352 1059702
36090 1059702 932113 1089553 1772970 2704723 3294569 3101124 2194907 1142353 502997
36081 502997 287149 103592 -127544 22859 786192 1674314 2008379 1705252 1219815 968485
36071 968485 1127334 1705972 2450384 2926350 3012912 2991116 2875401 2198819 922782 -56511
36061 -56511 -13794 511422 536625 94881 -34237 357558 880130 1493630 2331007 2793163
36051 2793163 2089680 664496 -149775 48503 482013 772209 1314954 1892065 1531247
36042 1531247 285539 -408425 110421 717015 530115 372921 990417 1337752 299948
36033 299948 -1094726 -1104224 -84535 183370 -494445 -566235 419540 989110 308334 -346789
36023 -346789 329446 1593287 1849869 926791 -56558 -446409 -510192 -455374 -91446 482552
36013 482552 705800 353377 -27869 161127 680499 663380 -249023 -1262808 -1197720 134408
36003 134408 1631684 2118172 1562461 835653 543698 528149 426742 287087 493007 1264588
35993 1264588 2291701 2841550 2383536 1208884 250058 198626 1008688 2211140 3217962
35984 3217962 3287718 1991766 101759 -787834 -156752 653439 324091 -547145 -534430
35975 -534430 299458 639760 186238 51888 716771 1142764 520592 -397502 -548514 -191118
35965 -191118 -384281 -1420602 -2519698 -2712641 -1607941 241250 1447646 966710 -466248
35956 -466248 -881994 451159 1980147 1943289 579750 -617567 -999639 -962097 -689678
35947 -689678 -36326 620927 673674 364880 457917 854428 685870 -131440 -595452 -126108
35937 -126108 724161 1405802 2080184 2662659 2334357 932211 -97720 663502 2516208
35928 2516208 3404878 2612126 1522484 1548763 2374291 2766561 2334704 1715607 1403361
35919 1403361 1193358 811647 471119 492380 684440 484422 -294382 -1105329 -1199592 -460263
35909 -460263 404172 565486 -19095 -484794 22679 1292840 2134548 1713075 620603
35900 620603 223139 953927 1758782 1492690 415374 -212552 210744 994596 1224585
35891 1224585 896743 693878 975615 1362608 1258856 573692 -119141 -153861 453363 953116
35881 953116 806623 494011 910599 1992346 2583140 1927159 689832 20904 116332
35872 116332 373265 571054 973758 1329424 791899 -773272 -2188417 -2278771 -1306402
35863 -1306402 -475532 -343024 -397800 -78211 489784 882947 974084 904725 792993 658033
35853 658033 432270 -10388 -605426 -901440 -488680 320278 681793 278272 -234912 -105036
35843 -105036 589890 1219473 1413957 1159400 450374 -537037 -1130835 -720782 350189
35834 350189 1058051 942392 512045 330239 376759 557813 1106155 1955154 2317618 1592683
35824 1592683 327230 -432251 -491397 -480482 -677655 -747708 -675562 -991121 -1711768 -1908577
35814 -1908577 -922855 603486 1575862 1835564 1963121 2103808 1922749 1566787 1614003
35805 1614003 1875395 1267966 -566744 -2334832 -2600962 -1731271 -1387427 -2243020 -3156499
35796 -3156499 -2807986 -1346862 54426 721740 936063 1144479 1373185 1496711 1616613
35787 1616613 1900879 2208592 2078511 1138670 -428905 -1807931 -2110930 -1248150 -133527
35778 -133527 285192 163774 508186 1684617 2727027 2564041 1514471 854752 1034866
35769 1034866 1158520 452799 -536940 -767883 -153791 501542 689448 564286 290334
35760 290334 -182431 -643569 -659370 -268230 -10477 -75640 -65467 146733 17571 -793680
35750 -793680 -1754531 -2129492 -1813979 -1094523 -165301 648617 838769 467033 310464 621553
35740 621553 551168 -344728 -958508 -261182 741693 366979 -951470 -1234883 -252570
35731 -252570 -22129 -1486695 -2857203 -2408421 -1109824 -926666 -1839142 -2266488 -1616302
35722 -1616302 -762375 -428636 -493599 -636412 -573897 5499 793869 694573 -658910 -1864712
35712 -1864712 -1457500 -15181 822410 808176 916281 1226304 930651 287737 481302
35703 481302 1326376 1212211 -123323 -818790 221301 1581440 1674555 1086998 1104361
35694 1104361 1406902 1018431 411048 695300 1416095 1144491 -52494 -664679 -262437
35685 -262437 -94182 -801254 -1299461 -727891 -29653 -419238 -1296807 -1087701 284316
35676 284316 1157200 498876 -630676 -582298 645437 1541325 1221213 492416 508168 1154796
35666 1154796 1459629 1117193 700501 482100 14538 -885868 -1568067 -1392961 -548443
35657 -548443 370914 1017603 1145958 512097 -480122 -658900 585508 2241020 2745862
35648 2745862 1856545 659486 -42773 -402818 -585884 -199994 871440 1796981 1626948
35639 1626948 489975 -597637 -985345 -916470 -756774 -276898 832976 2027701 2205023
35630 2205023 1119121 -105192 -282486 493276 1317000 1730648 1737342 1070667 -374526
35621 -374526 -1552577 -1068897 779380 2045626 1695299 882897 963437 1454470 1070799
35612 1070799 -134259 -963915 -935476 -750791 -1076150 -1765862 -2225844 -1923981 -737067
35603 -737067 716594 1431663 1120644 459479 -99900 -885601 -1842108 -1992507 -1065515
35594 -1065515 -489976 -1342572 -2293660 -1369304 923526 2242735 1892763 1544502 2296338
35585 2296338 3053753 2506698 1062241 -71563 -492531 -477138 -227143 31060 -45592
35576 -45592 -378923 -497103 -368844 -435851 -653720 -436891 242138 695777 677783 656048
35566 656048 739279 506713 171380 597305 1689152 2076753 1066099 -278227 -722351
35557 -722351 -453772 -338403 -576747 -851854 -973232 -775355 -200989 147581 -410031 -1221211
35547 -1221211 -855987 522589 1038848 61273 -630686 193972 1008963 -18234 -1979316
35538 -1979316 -2658730 -1823995 -978067 -699746 -371446 1130 -207644 -678782 -479022
35529 -479022 163646 106865 -781649 -1491660 -1510416 -1130012 -390749 746499 1491843 1133967
35519 1133967 550067 1073970 2169777 2137938 876626 -176317 -695039 -1642314 -2662582
35510 -2662582 -1987310 342864 1759007 845436 -579405 -474605 495342 756971 599156
35501 599156 1059668 1537439 794079 -589721 -917302 47 842617 1042384 1248456
35492 1248456 1733059 2032878 2174103 2701678 3356061 3137812 1946303 886232 602753
35483 602753 476017 -59767 -452843 4938 884997 1102390 399776 -314063 -143343 697397
35473 697397 1211885 908800 364726 278715 366353 -188102 -1359641 -2185685 -2109919 -1562270
35463 -1562270 -1013235 -419385 51194 -153927 -806168 -659772 753872 2106729 2082532
35454 2082532 1250683 901777 901990 253979 -810756 -1041666 -281578 292716 132630 4971
35444 4971 453972 937216 872585 384941 -303820 -1106106 -1453420 -704952 497009 642941
35434 642941 -355581 -733457 457754 1664204 1034001 -829225 -1819017 -1315203 -620690
35425 -620690 -690511 -990968 -820508 -464444 -482576 -706359 -579704 -46781 417870 471174
35415 471174 246867 93344 151493 223220 51486 -290231 -410481 -52450 611460 1189394
35405 1189394 1388280 1103534 509659 168116 660068 1882401 3073175 3820398 4639696
35396 4639696 6094898 7644791 7951075 6318265 3445836 780446 -589500 -532654 213341
35387 213341 699363 593056 341882 400198 569367 406621 -30184 -339581 -442457 -495212
35377 -495212 -310110 379072 1061861 731613 -666097 -1858088 -1854741 -1271097 -1305486 -1903757
35367 -1903757 -1907889 -880051 244068 563624 412363 635154 1275235 1657700 1479995
35358 1479995 1148942 1080039 1216533 1341054 1449033 1654684 1984085 2340099 2454173 1920118
35348 1920118 659553 -602898 -808409 233003 1457484 1671117 815728 -145216 -348259
35339 -348259 245996 999400 1148962 436505 -496606 -580881 480770 1757384 2203278
35330 2203278 1857474 1416373 1058925 540968 183152 659599 1706567 2143519 1554488
35321 1554488 925251 1046671 1286694 784167 -23868 -192065 52358 -242125 -910473
35312 -910473 -728611 547867 1565383 1289784 389517 -6053 59792 -70840 -228905
35303 -228905 281888 1283444 1821947 1690962 1743108 2352822 2559484 1428903 -381765
35294 -381765 -1278103 -707478 312462 673766 447959 337886 417938 78700 -857273 -1590640
35284 -1590640 -1251877 -57217 883437 888524 402929 186385 193320 -278540 -1454504 -2635037
35274 -2635037 -3026970 -2602269 -1867650 -1130981 -396172 221106 463636 348089 232882
35265 232882 340829 458638 250767 -265120 -652150 -425504 454036 1377439 1549032 862488
35255 862488 135349 158866 703623 922545 599688 373302 682406 1180314 1423220 1477060
35245 1477060 1464193 1139684 467855 97159 561183 1311014 1241953 70911 -1371694
35236 -1371694 -2125956 -1880672 -896053 309756 1206025 1580989 1590673 1265890 337690 -1040472
35226 -1040472 -1918561 -1643388 -937495 -961166 -1534621 -1369677 -65487 1259415 1595189
35217 1595189 1275758 1145386 1356547 1532314 1459087 1124626 590141 166489 189613 413643
35207 413643 265544 -164644 -207963 169089 273880 66176 363219 1173911 1273468 314692
35197 314692 -113694 1147664 2708277 2538623 993018 46844 249920 513692 526675
35188 526675 1136395 2274892 2715653 2337440 2549762 3726705 4170795 2683449 455124
35179 455124 -825870 -1196955 -1357746 -854611 846720 2486961 2239265 409442 -901193
35170 -901193 -710098 -58491 60100 -10822 162736 65458 -690065 -1291322 -762183 476340
35160 476340 1027256 327365 -717461 -980837 -437393 66409 67292 23570 478067 1132581
35150 1132581 1273150 912721 770337 1039507 1044814 503045 212712 762841 1383518 1129765
35140 1129765 572739 976966 2111669 2401407 1360469 354441 418723 689822 -104555
35131 -104555 -1628164 -2451920 -1912891 -494647 1115426 2380687 2731735 2041942 1118766
35122 1118766 860679 1068404 900897 311604 71286 414987 687431 475295 111162
35113 111162 -209179 -820852 -1657825 -1860321 -966453 237094 738785 551256 271019
35104 271019 57909 -131359 76451 841953 1349781 829231 9195 250139 1354189
35095 1354189 1729567 957282 605149 1753738 3118194 2809978 990694 -572045 -1007350
35086 -1007350 -1009501 -1224349 -1333901 -977240 -513646 -398509 -471926 -310434 110025 409003
35076 409003 223536 -467651 -1193006 -1179583 -53927 1592325 2630981 2457037 1475639
35067 1475639 651776 752774 1777324 2833014 2860406 1833639 906033 941902 1344706
35058 1344706 969878 -197766 -1081535 -991107 -253472 479318 765167 362720 -508226
35049 -508226 -1041411 -769681 -357122 -557678 -771754 115045 1724071 2520741 2118074
35040 2118074 1600922 1415825 804738 -182310 -123773 1348525 2421901 1722775 431834
35031 431834 259045 793953 654319 3656 -99647 98887 -339225 -898980 -334857 798129
35021 798129 669566 -701770 -1138732 363896 2051169 2005528 648880 -356435 -360256
35012 -360256 194254 931841 1717726 2261797 2341784 2051697 1462591 568619 -225205 -305422
35002 -305422 194406 422981 74133 -202225 51124 420895 479006 455340 611201 742020
34992 742020 746700 919965 1260720 1283313 938724 896902 1457415 2018639 2097904 1982350
34982 1982350 1849863 1249023 164589 -388417 238609 1156656 1168669 481249 110119
34973 110119 140608 -190044 -915906 -1047948 -1092 1540419 2429122 2191329 1204670
34964 1204670 147666 -533112 -753477 -526894 211114 1256048 1881202 1548782 769575
34955 769575 502190 748150 690121 265996 397221 1323305 2001659 1773624 1358580 1371823
34945 1371823 1116532 -53758 -1298361 -1519352 -1112076 -1103379 -1313974 -870538 26064
34936 26064 378787 71775 -193887 -348648 -862445 -1408321 -1153262 -355704 -153595 -641798
34926 -641798 -684734 39404 321221 -605147 -1630546 -1219373 479218 1785846 1398998
34917 1398998 -327973 -1807158 -1777333 -656823 -134921 -1045789 -2166716 -1908124 -630592
34908 -630592 -39980 -579362 -946614 -340167 350607 147488 -526927 -760655 -585215 -630039
34898 -630039 -975124 -1128430 -810109 -225986 231917 294739 35996 -181922 -221262 -389904
34888 -389904 -741454 -646386 181060 781538 204063 -785839 -678472 361587 733692 69639
34878 69639 -216999 545342 1117354 511428 -401520 -497439 -105613 29436 112430 409477
34868 409477 308078 -411362 -623637 340951 1141086 392585 -830464 -452465 1309614
34859 1309614 2216936 1335102 49445 -358930 -249476 -294686 -280055 53161 233834 -110243
34849 -110243 -563358 -671727 -608340 -584316 -339396 242906 637932 359209 -297254 -661221
34839 -661221 -546883 -345929 -443978 -746459 -691027 211833 1648441 2526671 2132127 1054037
34829 1054037 438175 503347 461018 -164911 -893940 -1095060 -754630 -165809 598670 1528166
34819 1528166 2321461 2556202 2138725 1434730 927879 672655 118955 -1193555 -2678087
34810 -2678087 -2977389 -1584030 310166 1135938 713302 91159 28848 402870 858553
34801 858553 1221092 1323558 1112543 866653 757473 432335 -320069 -832350 -348839 692885
34791 692885 1127355 658446 -9790 -530190 -1257872 -2148482 -2459354 -1863405 -918507 -165493
34781 -165493 352028 520109 138169 -338757 -187170 188441 -446494 -2000508 -2642684
34772 -2642684 -1366833 393685 812825 92958 -516999 -1000330 -2077541 -3094683 -2456382
34763 -2456382 -240648 1417038 1096583 -130231 -422204 398291 1030759 647900 -267428
34754 -267428 -816335 -707844 -345072 -278410 -647202 -1007205 -748459 191162 1100872 1141629
34744 1141629 220826 -892658 -1381650 -1207754 -966083 -972202 -861561 -305552 287676 322685
34734 322685 29068 205232 953893 1443062 1121707 419059 -91878 -460309 -800607 -715139
34724 -715139 40083 914062 1343379 1651974 2315542 2790692 2143843 668837 -220619
34715 -220619 150084 883240 813403 -100863 -1053354 -1489466 -1503973 -1443303 -1442440 -1309288 -837244
34704 -837244 -242341 -8146 -133094 -17226 515868 698176 1713 -774097 -600557 83101
34694 83101 33233 -728853 -1007867 -597069 -686980 -1708696 -2427930 -1981185 -1292557 -1371071
34684 -1371071 -1552000 -816483 226230 277101 -459744 -672741 -123886 180240 -138565
34675 -138565 -308874 133105 689243 909712 932026 847960 581486 491598 1008441 1584906
34665 1584906 1184319 -32235 -720587 -267278 576121 1226009 2020117 2986777 3318216
34656 3318216 2748519 2100147 1756567 1044012 -47989 -197497 988149 1712440 642746
34647 642746 -673473 -102356 1549677 1702813 -12222 -1488420 -1630476 -1525854 -1877335
34638 -1877335 -1777883 -839740 -368561 -1256337 -2376734 -2263907 -1088246 66961 713603
34629 713603 806789 263125 -389853 6139 1577878 2727480 2101726 325186 -1155590
34620 -1155590 -1900944 -2083420 -1381811 306681 1824421 1881847 784021 -170311 -528078
34611 -528078 -752783 -978377 -964612 -917790 -1121644 -1065190 -155181 971918 1089881 180038
34601 180038 -588090 -583567 -308549 -297572 -433680 -365808 192468 1370564 2570183 2495286
34591 2495286 819787 -711830 -199099 1781863 2924856 2286074 1015675 145076 -538394
34582 -538394 -1189230 -1249373 -648353 -197675 -246935 -250899 -83996 -385843 -1147576 -1433613
34572 -1433613 -1067725 -1073909 -1770198 -2016959 -1229147 -528764 -782763 -1035843 -262113 719135
34562 719135 681142 178874 509393 1336442 1265826 340122 74065 1028733 1992657 1830787
34552 1830787 845897 -31415 -376861 -251136 172579 635964 920292 1038976 1005184 658643
34542 658643 127777 2480 432926 566871 -303717 -1482903 -1701278 -876573 -53528
34533 -53528 170148 106418 -10113 -376984 -905713 -1116864 -932746 -770101 -712148 -362526
34523 -362526 340807 908523 1050782 977571 855632 648417 562261 897154 1322038 1078225
34513 1078225 134181 -605637 -550887 -198503 -279219 -730441 -962057 -697044 -136476 378326
34503 378326 554014 325438 127100 629472 1852355 2811488 2453162 863908 -735265
34494 -735265 -1202038 -517295 383939 677583 406053 151882 175710 187307 -75302 -456663
34484 -456663 -697349 -747864 -606516 -266447 -26038 -347307 -1080734 -1337021 -550300 792350
34474 792350 1894210 2575965 2948356 2778409 1938876 1032164 739033 847328 697361
34465 697361 294923 161500 305924 191957 -378722 -1099618 -1757287 -2304800 -2514435 -2264544
34455 -2264544 -1969706 -2007429 -1981628 -1348693 -482188 -213769 -569955 -918975 -1104081 -1346327
34445 -1346327 -1251062 -198344 1263410 1710449 779883 -311167 -473353 43947 425722
34436 425722 302350 -306086 -1175719 -1778592 -1804041 -1823822 -2517530 -3323085 -3039422 -1758777
34426 -1758777 -836142 -822086 -913562 -685056 -690796 -883261 -247377 1153717 1532409 -22999
34416 -22999 -1812796 -1787244 -322065 695381 523813 -143524 -700662 -979445 -697580
34407 -697580 128434 720098 562755 259679 371735 299750 -479118 -1050713 -439387 536958
34397 536958 511033 -41980 420710 1774089 2292766 1373694 250516 -161941 -300603
34388 -300603 -519479 -380396 118234 204574 -170918 22737 1090793 1854753 1491542 830465
34378 830465 889040 1260513 1012418 274336 -171274 -217029 -294845 -359635 29900 841612
34368 841612 1530974 1746997 1574890 1248722 978114 829266 568274 -6991 -464607 -94784
34358 -94784 894091 1317242 619821 -239517 -191266 361668 265020 -574752 -1153587 -987111
34348 -987111 -732742 -1008868 -1422777 -1216392 -393032 289841 283209 -188742 -562639 -658751
34338 -658751 -755314 -1040586 -1302840 -1260485 -898749 -297041 519275 1253644 1309442 617504
34328 617504 79002 432129 997551 528651 -811013 -1463770 -649891 625293 1178238
34319 1178238 1177307 1380455 1778983 1894646 1760764 1676678 1433514 678019 -222621 -477385
34309 -477385 100429 969019 1602721 1864182 1864378 1898719 2212820 2432165 1727517 86048
34299 86048 -1192243 -1033176 -53075 448382 412910 729260 1370611 1312971 402917 -167904
34289 -167904 253171 700296 157694 -817507 -989824 -239984 555851 1002496 1490741 2135751
34279 2135751 2383622 1930877 1363342 1441352 2047073 2256835 1479806 272772 -221223
34270 -221223 337470 970516 571630 -601501 -1174595 -424062 825676 1351113 996131
34261 996131 487421 243373 89056 -29122 152379 568170 700694 463402 597676 1570877
34251 1570877 2465791 1825049 -351602 -2269401 -2398674 -1249722 -496458 -820819 -1474554
34242 -1474554 -1745611 -1804591 -1905186 -1740926 -1122429 -512949 -248412 108892 899731 1464204
34232 1464204 1023928 13724 -480290 -300006 -156562 -228097 -59034 183939 -254302
34223 -254302 -1165574 -1261547 -162332 823765 692087 251543 602753 1278298 1282343 1058986
34213 1058986 1720212 2797079 2613066 958196 -326500 100421 1398213 2080798 1949566
34204 1949566 1580430 988290 55131 -410789 496603 2042928 2346950 950932 -314397
34195 -314397 207068 1615169 1731374 278079 -767563 -225594 509134 -201810 -1457982
34186 -1457982 -1177720 404407 833244 -759788 -2205351 -1636210 -231187 31768 -291970
34177 -291970 715277 2776967 3537160 2089368 138830 -646143 -465808 -89284 436972
34168 436972 1055479 1264901 1216192 1817122 2976968 3202206 1836333 268457 -127802
34159 -127802 146724 113648 154695 919346 1579593 955297 -394509 -929092 -424190 112797
34149 112797 348984 789171 1362135 1493213 1402653 1742877 2085001 1398659 -4664 -685472
34139 -685472 -323851 -75025 -491829 -834751 -795196 -1070459 -1607834 -1127932 632538 1905332
34129 1905332 1387835 303050 467863 1472446 1513947 323249 -533080 -90346 840529
34120 840529 1133420 766821 364149 124093 -285010 -1082617 -1921624 -2083433 -1231174 35960
34110 35960 731814 657744 528015 792906 1018894 744855 192564 -366053 -1173803 -2244433
34100 -2244433 -2787077 -2245574 -1325783 -1009651 -1010624 -323683 952867 1582758 1078172 498652
34090 498652 954219 2139858 2888274 2629422 1757364 863260 157125 -333284 -376344 311340
34080 311340 1456860 2085810 1456726 137228 -426252 337804 1357106 1335008 440451
34071 440451 -57237 457868 1280434 1448166 881803 294732 281047 645371 596848 -320990
34061 -320990 -1554827 -2131383 -1906054 -1645647 -1732995 -1583426 -796670 -57446 -108804 -516118
34051 -516118 -450059 -177934 -566520 -1354182 -1279100 -87591 857420 461598 -661208 -1310054
34041 -1310054 -1387245 -1571603 -1869120 -1536560 -339618 1022492 1918713 2469129 2866911
34032 2866911 2662583 1416331 -229560 -961972 -390967 504466 829676 906753 1342274
34023 1342274 1687039 1060550 -261031 -1070919 -990415 -794750 -833044 -417841 730342
34014 730342 1647985 1503274 831015 580185 782875 1004133 1282513 1678495 1629907 773422
34004 773422 -213372 -561026 -546156 -674825 -498460 470791 1323575 785347 -639437 -1114783
33994 -1114783 753 1523965 2364921 2609983 2498322 1795501 694879 112403 434654
33985 434654 888529 717995 214052 64719 328368 523134 295079 -263407 -619274 -185883
33975 -185883 817653 1195232 240207 -961365 -776800 617138 1416179 768153 -207265
33966 -207265 -281730 337686 855579 1073049 1047142 588197 -155601 -410824 247825 1271830
33956 1271830 1963195 2238185 2173940 1595507 616238 -120506 -211838 86795 443913 689763
33946 689763 356063 -937357 -2336486 -2237358 -488602 1087947 1091237 272044 23673
33937 23673 369615 612282 916628 1788313 2637464 2351759 1042470 -41776 -242204
33928 -242204 -53154 -3862 3534 94313 -7544 -493519 -1032260 -1075849 -424992 566463
33918 566463 1287175 1440654 1268903 1026404 504817 -421427 -1093348 -757851 192391 676606
33908 676606 571023 719777 1250936 1294493 698739 509589 1114737 1373884 427539 -981356
33898 -981356 -1870202 -2313000 -2396761 -1401206 653859 2035140 1466264 167066 112519
33889 112519 1237474 2035863 2030626 1845304 1554171 842698 292142 657669 1247134 817318
33879 817318 -236018 -425487 290064 407123 -639340 -1674808 -1693798 -1015182 -297932
33870 -297932 197629 184312 -510463 -1251694 -1227324 -699029 -413635 -87099 1008750 2246397
33860 2246397 2221650 1047251 211329 111451 -318171 -1341824 -1843380 -1413799 -974764
33851 -974764 -781742 82731 1464441 1563571 -254603 -2061047 -2151041 -1457026 -1625564
33842 -1625564 -2266826 -1931967 -678312 179219 173715 -46090 -63490 28780 297141 787368
33832 787368 1047237 747467 352362 404543 675948 715008 587464 432961 72106 -305791
33822 -305791 -16022 839621 1056632 163596 -609749 -256522 368946 173915 -119628 776158
33812 776158 2329050 2873135 2111880 1211790 823057 670454 757866 1284904 1584271 805233
33802 805233 -470103 -906602 -581453 -767479 -1594186 -1766687 -835604 76231 251741
33793 251741 347577 805305 984609 622915 502336 719755 -57894 -2302607 -4031843
33784 -4031843 -3188342 -654681 886209 577084 100783 873296 2227797 2820006 2491476
33775 2491476 1954917 1462647 666094 -496515 -1444860 -1538882 -735537 352634 937663
33766 937663 673803 -42181 -389966 115334 1087499 1549686 900576 -375775 -1164834
33757 -1164834 -1007212 -667349 -1092140 -1999067 -2064194 -633359 1275020 2044971 1238838
33748 1238838 -117602 -863877 -835196 -605770 -562470 -581117 -437591 -138423 206996 511105
33738 511105 542999 -36517 -1126406 -1890819 -1532855 -386303 281166 -229502 -1175166
33729 -1175166 -1341085 -556927 222892 236654 -157698 -16915 980163 2093879 2308350
33720 2308350 1422275 191147 -591353 -835552 -828925 -617414 -197355 25536 -307400 -742224
33710 -742224 -505117 279414 763332 803872 1104161 1666932 1424874 98886 -871292 -352541
33700 -352541 631175 485796 -380941 -291177 878155 1497529 825325 12551 68970 506760
33690 506760 689154 975355 1547734 1476158 250492 -798750 -118051 1668732 2525775
33681 2525775 1866766 1067017 1057575 1015667 43750 -1196504 -1544269 -1144840 -1011599 -1249222
33671 -1249222 -970598 38882 775214 530528 -23755 52110 503981 436489 -104582 -165268
33661 -165268 535847 1083430 727559 -66421 -415448 -201710 146601 548712 1201183 1839603
33651 1839603 1800049 907587 -157386 -536883 -33506 777891 1178790 1070105 1066722 1637805
33641 1637805 2273183 1976608 604635 -888581 -1677628 -1825821 -1574581 -777765 380620
33632 380620 984612 573535 31189 295911 798097 373625 -708723 -1012630 -105138
33623 -105138 899505 1089415 778551 512375 260136 25215 162043 559397 495874 -125895
33613 -125895 -338071 475422 1612669 2192446 2375567 2616100 2515024 1474843 -49491
33604 -49491 -1007911 -1114883 -809102 -224996 725150 1476233 1221894 275103 -104305 493711
33594 493711 1055852 792844 307781 371656 430559 -553009 -2261693 -3294218 -3219452 -3081829
33584 -3081829 -3500287 -3506102 -2146355 -280236 509261 281277 520126 1612589 2159705
33575 2159705 1294955 155306 41230 374870 -119919 -1087824 -1037880 221876 1275699
33566 1275699 1218714 614835 166898 -179014 -460667 -335320 28500 -118951 -752844 -813597
33556 -813597 68452 767302 402421 -220422 62512 940016 1300557 1032603 898759 1064677
33546 1064677 999773 664573 675570 1228043 1693742 1424637 483226 -348812 -26617 1823216
33536 1823216 4074111 4995530 4569075 4864297 7135042 9861723 11478167 13904710 20420341
33527 20420341 29770636 35391762 32245177 22662618 13541431 8910346 7275300 5613703
33519 5613703 3479200 2421128 3037061 4071300 4083678 3009059 1862822 1394698 1410574
33510 1410574 1339241 1069893 923281 978504 929225 718576 833147 1605322 2516736 2639329
33500 2639329 1696233 334437 -648891 -1034334 -1083348 -1052880 -1058480 -1233854 -1640729 -1955252
33490 -1955252 -1623250 -625348 201180 99000 -495292 -446640 388612 775297 -167087 -1588510
33480 -1588510 -2014171 -1315570 -679097 -866298 -1433993 -1652049 -1337736 -664873 125217
33471 125217 677531 795088 785612 916456 678577 -480217 -1754047 -1556472 175229
33462 175229 1516044 1065291 -204705 -520807 243352 834258 629425 119387 -239515
33453 -239515 -442706 -354619 205403 809501 799783 334024 196641 589259 983855 1149206
33443 1149206 1353727 1487613 1034411 149216 -277176 -18643 21799 -716778 -1459301 -1285399
33433 -1285399 -513960 -57024 -14926 162294 531624 608130 244210 -282043 -928493 -1828195
33423 -1828195 -2602110 -2548918 -1674387 -844539 -668755 -797322 -628327 -234400 -180025 -683281
33413 -683281 -1336720 -1577291 -1187378 -374532 427843 781157 431083 -490149 -1388662 -1570014
33403 -1570014 -917582 -55779 440619 740138 1169089 1277063 436388 -709611 -706412 410451
33393 410451 724783 -714617 -2069578 -1256591 797566 1435290 163566 -987627 -852555
33384 -852555 -446870 -491327 -84604 1101080 1516131 171152 -1404716 -1393965 -432235
33375 -432235 -263114 -869497 -947759 -299157 306742 896137 1794651 2011255 449030 -1639790
33365 -1639790 -1866217 -302976 627014 5192 -496528 117879 597979 154231 51104
33356 51104 1032483 1636179 894514 428772 1650605 2886420 1880317 -398147 -1246898
33347 -1246898 -428161 1143 -647547 -1115375 -975372 -1103219 -1307038 -302740 1543374
33338 1543374 2155464 1124422 557857 1605992 2643610 2192413 1282145 1256757 1371266
33329 1371266 590399 7456 1134809 2998598 3339975 2038180 1078069 1400922 1877512
33320 1877512 1454289 475247 -408267 -1098253 -1469022 -1241617 -807701 -1030497 -1866235
33311 -1866235 -2235875 -1630621 -827390 -562877 -462630 90131 788700 859349 269109 -192588
33301 -192588 55844 693369 921726 501292 216555 965664 2313237 2614367 1112889
33292 1112889 -745576 -1035580 75328 710581 82524 -568271 -187316 387905 -120905
33283 -120905 -1293449 -1587020 -660814 66266 -675251 -2360675 -3338819 -2759063 -1413940
33274 -1413940 -679019 -911725 -1187171 -595670 617002 1487831 1555336 1143701 644678
33265 644678 124487 -375796 -701291 -807476 -707713 -277431 403825 710857 189798 -505751
33255 -505751 -297581 656903 1015289 225551 -633110 -524517 56135 81073 -368056 -478311
33245 -478311 -177851 -162438 -689785 -1263577 -1411656 -1037533 -179837 791670 922593 -433218
33235 -433218 -2412131 -3249682 -2346391 -934971 -356659 -471030 -361731 40476 -53443
33226 -53443 -876557 -1585826 -1426017 -794321 -634438 -1061296 -1191590 -401041 755411 1173235
33216 1173235 459000 -730674 -1380546 -859681 733012 2510076 3271386 2567122 1243492
33207 1243492 521740 701167 1257321 1890160 2624223 3039505 2526032 1498124 1227399
33198 1227399 1989562 2420760 1409364 -295270 -1219519 -1126810 -834904 -659329 -182872
33189 -182872 650057 1237171 1169707 696735 320358 370933 821550 1156857 780530 -49883
33179 -49883 -220735 793225 2113517 2729927 2855502 3166173 3463422 3205772 2689247
33170 2689247 2404414 1836739 441978 -682423 25281 1859349 2320192 682316 -857440
33161 -857440 -350420 1349509 2268108 2024235 1514918 1058679 385719 -209285 -170690 163067
33151 163067 -55165 -750038 -944211 -266520 466416 433311 -70040 -98399 618378 1232957
33141 1232957 843764 -192240 -556864 202813 876251 329949 -669292 -599089 322597
33132 322597 432642 -642630 -1448467 -1337791 -1637465 -3141716 -4287136 -3403870 -1375997
33123 -1375997 -266210 -348681 -423685 -280333 -703266 -1387756 -1072629 74471 256474
33114 256474 -1185947 -2573112 -2312782 -1062715 -395044 -435817 -97922 992349 2026036
33105 2026036 2254445 1761960 1031178 444806 244243 399800 432550 -154559 -1137569 -1697542
33095 -1697542 -1488271 -1134871 -1263561 -1414125 -636869 902096 1814150 1332999 397692
33086 397692 213398 542190 463866 154049 452502 1011714 617523 -556078 -873394 71766
33076 71766 592825 -295773 -1061597 -98883 1584104 1998320 1334841 1365201 2345147 2713472
33066 2713472 1753960 568250 177330 331607 542857 845848 1151406 1094435 857369
33057 857369 1005225 1279402 760301 -502975 -1258549 -820947 85331 653390 1011199
33048 1011199 1409470 1485252 974635 299077 -104487 -279941 -201968 393699 1208194 1310656
33038 1310656 386713 -736290 -1255511 -1272230 -1104901 -654157 9292 328093 164609
33029 164609 192515 713164 899657 26248 -1225765 -1569565 -775012 245928 694006
33020 694006 558689 272426 230401 525760 869755 948877 891445 966983 906906 253576
33010 253576 -617486 -800713 -370451 -452656 -1347390 -1786800 -844087 502186 753016 15443
33000 15443 -398427 49632 675642 828337 630345 565694 981156 1798057 2245743 1341457
32990 1341457 -768741 -2469746 -2389031 -972319 348020 960374 1160077 1024010 391428
32981 391428 -299595 -351619 24161 -78520 -817240 -1359869 -1234347 -953790 -994750 -1022241
32971 -1022241 -582779 117135 630977 958801 1296092 1442592 988125 -4905 -846807
32962 -846807 -774088 390506 1952114 2669321 1729205 -293328 -1686063 -1252957 308082
32953 308082 1130998 402830 -671070 -531475 621154 1220109 644210 4251 308247
32944 308247 983984 1014152 593001 540343 752823 554302 167761 386804 922690 608360
32934 608360 -573311 -1151840 -319884 898991 1249552 853696 524835 507347 675857
32925 675857 1129504 1807112 2190906 2043647 1814497 1816351 1724461 1362404 1172919 1396553
32915 1396553 1616919 1615208 1748768 1959428 1483799 252847 -514638 6486 970473 1187437
32905 1187437 753623 375823 64949 -356141 -352365 456369 1287126 1308165 1054157 1441812
32895 1441812 2070444 1941160 1309840 1263783 1768243 1696222 747178 -99206 -164153 162308
32885 162308 465207 1000167 1942120 2731506 2611623 1475716 40530 -694815 -385179
32876 -385179 166178 -35053 -651025 -378912 901549 1675895 1195195 861620 2015184
32867 2015184 3686468 4120197 3403422 2803612 2504535 2088251 2490792 4978377 8301095
32858 8301095 9336576 7078170 3980822 2694225 3212752 4008147 4315295 4178352 3454066
32849 3454066 2065859 712242 359041 1165676 2358248 3008473 2771247 2067741 1579573
32840 1579573 1428800 1094383 330366 -324890 -336347 91212 533494 975166 1398891 1471820
32830 1471820 1222853 1225625 1523597 1366614 672483 516030 1297493 1813274 1251926 624956
32820 624956 883315 1219870 873762 938562 2367115 3799633 3710098 3186543 3940244 5017767
32810 5017767 4606857 3956476 5941906 10215442 13286931 13392405 12012053 10473943 8391873
32801 8391873 5952824 4633481 4837887 5343256 5559331 5961578 6213020 5469252 4513952
32792 4513952 4843721 5856354 5960856 6034816 8200597 11514833 12993311 12895447 14527839
32783 14527839 18560096 22374611 25552072 30624536 37461082 42948468 47954542 58009923
32775 58009923 74432283 92413935 113171213 150802021 217819322 305052593 381752021
32768 381752021 415885292 393829132 326729371 243994541 176262218 135896100 112834105
32761 112834105 92097212 71711199 58816669 54001114 49504431 41560941 34636136
32754 34636136 31922832 29962333 25481658 20695451 18418504 17363563 15578023 13972829
32746 13972829 13396862 12268070 9950513 8741556 9795139 10619797 9302985 7798563
32738 7798563 8225420 9114915 8291905 6604051 5763887 5036703 3158164 1402782 1710694
32729 1710694 3434142 4640427 5131898 5713411 5950800 5093261 3969744 3759974 4017673
32720 4017673 3808985 3521362 3728061 3707029 2992734 2900481 4438759 6101546 5910174
32711 5910174 4422516 3524395 3352075 2704443 1634471 1318771 1857134 2236946 2122169
32702 2122169 1949804 1694473 1152096 946850 1665101 2473409 2154536 1089117 724289
32693 724289 1452632 2397313 2924217 3059050 2770589 2090172 1647091 2005273 2773564 3220717
32683 3220717 3261831 3065145 2438843 1502556 1149610 1869612 2887088 3326036 3298505 3021797
32673 3021797 2082696 626387 -49840 636951 1399769 1158949 862248 1621655 2495613
32664 2495613 2115705 1248853 1492916 2437031 2516796 1920256 2100820 2860579 2534011 1000349
32654 1000349 7860 288234 685575 547935 751267 1704234 2356410 2037038 1595338
32645 1595338 1861898 2409437 2616564 2661000 2715900 2356722 1515335 975473 1200046 1563848
32635 1563848 1406236 1071591 1302614 2200095 3239988 3862293 3817453 3355274 3072359
32626 3072359 3137262 2946423 2137445 1424913 1539491 1919517 1627850 1006573 994940 1308177
32616 1308177 997213 447130 822963 1641439 1140314 -646302 -1519257 -533533 504185
32607 504185 82519 -618183 71894 1524086 2049506 1541219 1021527 671168 225442
32598 225442 421731 1955036 3506711 2965288 591178 -990426 -285874 1259534 1507226
32589 1507226 252902 -1169622 -1822459 -1758290 -1283596 -484111 633690 1934053 3039152
32580 3039152 3419637 2891688 1974192 1323691 875719 101303 -911608 -1342591 -757064
32571 -757064 351804 1367443 2154212 2512742 1886658 297213 -1136432 -1511068 -1442712
32562 -1442712 -1984259 -2624775 -1778245 633359 2573072 2518493 1450266 1210173 1857320
32553 1857320 1978573 1058151 80442 -113398 273095 890692 1827334 2904714 3408746
32544 3408746 3040068 2392969 2094441 2140803 2326729 2506142 2176255 820799 -894336
32535 -894336 -1371570 -217471 923143 561888 -566531 -722725 361780 1492542 1930280
32526 1930280 1959686 1822137 1362659 714323 272668 -20935 -455943 -688550 -76406 1092926
32516 1092926 1646989 977317 -284088 -1155231 -1261999 -881567 -572292 -690786 -833616
32507 -833616 -94002 1560006 2715522 2205662 853144 399593 1092017 1655258 1460385
32498 1460385 1257362 1649826 2221688 2460005 2330142 1687645 349921 -987947 -1219418
32489 -1219418 -547017 -349044 -887275 -717164 831490 2173455 1723401 366785 139451
32480 139451 1246328 1981113 1259241 -194254 -1141972 -1147257 -456981 516854 1341843 1745194
32470 1745194 1804118 1670628 1246604 477475 -273765 -588867 -552710 -557888 -719759 -805428
32460 -805428 -553462 161388 1191322 1961241 1874722 1095892 443290 310103 324436 296322
32450 296322 599774 1146818 1024811 -6347 -626543 281786 1757447 2022996 1080920
32441 1080920 485383 776541 884861 296727 82186 1030306 2157669 2114462 1121335
32432 1121335 430847 496096 713653 604357 291569 -18441 -227048 -110032 427378 965965
32422 965965 1075320 1038627 1343159 1598109 923824 -473183 -1184704 -539153 320104 97268
32412 97268 -704742 -613958 470867 1083830 373612 -759702 -1115145 -723438 -292084 6746
32402 6746 349173 479564 60258 -536020 -658536 -402459 -384457 -647537 -640546 -245385
32392 -245385 39918 26134 114368 487873 825015 1066091 1672400 2738917 3543887 3433078
32382 3433078 2594694 1586388 694908 148772 266184 835113 998888 433423 40760
32373 40760 677655 1755839 2130483 1999391 2649155 4278164 5367889 4741310 3225802
32364 3225802 2454997 2690406 2800228 2096025 1164858 763696 793731 835014 1009302 1555093
32354 1555093 1904713 1131115 -595163 -1883931 -1891396 -1455345 -1758060 -2453811 -2180157
32345 -2180157 -738254 423953 200576 -719242 -1001644 -501557 -112846 -223630 -239896
32336 -239896 376632 1324381 1910860 1828138 1271299 584935 15522 -313180 -352456 -108678
32326 -108678 298627 603400 601972 472728 695599 1497992 2508698 3087306 2872995 1946874
32316 1946874 699920 -301894 -596293 -254599 125577 85273 -243608 -599146 -1161560
32307 -1161560 -2124649 -2877798 -2393354 -678461 808587 731542 -503231 -1311335 -928549
32298 -928549 -128318 131911 22971 352457 1279086 2131731 2286600 1708434 799380 201523
32288 201523 511594 1570594 2251764 1724312 760673 809186 1804992 2142633 1111662
32279 1111662 -12207 -1646 518803 378717 -165959 -156261 203129 -51015 -861967 -1296925
32269 -1296925 -1163978 -1016582 -783719 62760 1080666 1193092 504257 201720 522260
32260 522260 462200 -251300 -651742 -414012 -443541 -973387 -907150 100962 736650 252417
32250 252417 -184992 374183 975090 722748 669411 1840396 2943559 2282248 698214
32241 698214 155504 347112 -593674 -2524915 -3259464 -2091531 -672868 -45618 587808
32232 587808 1503663 1477158 289970 -149107 1249015 2649094 1981457 221650 -84664
32223 -84664 1359987 2337403 1350245 -656006 -1912579 -1793292 -838582 210406 947560
32214 947560 1331586 1478694 1392429 1052690 774825 977656 1409549 1232644 227506 -722032
32204 -722032 -779794 -154744 518767 1083795 1544834 1566429 1037972 538491 496931 505652
32194 505652 234184 269736 1024214 1530011 663647 -900690 -1452241 -768463 -328984 -921588
32184 -921588 -1612326 -1526702 -1170919 -1212670 -1180003 -378801 744960 1162023 644230 -211781
32174 -211781 -868375 -1043710 -522137 474751 1125807 918583 337295 18781 -233234 -786466
32164 -786466 -1113611 -486472 623757 1051057 669970 346716 200722 -581122 -1880225
32155 -1880225 -2219603 -1053155 -35792 -690396 -1905209 -1446702 626373 1967714 1401670
32146 1401670 500809 999088 2185790 2152201 685825 -591219 -666368 -249855 -223653
32137 -223653 -304780 -7658 56684 -937186 -2246784 -2050822 8774 1980260 2026251 755680
32127 755680 74472 381606 356839 -610329 -1393050 -1024532 -233635 -137636 -406134 98212
32117 98212 1421826 2419494 2311934 1391867 335278 -346805 -318224 296381 730276 413782
32107 413782 -167063 -179384 293097 621588 956382 1952006 3206701 3316447 1821880
32098 1821880 -36255 -931082 -808359 -233566 528035 1179411 1142022 421413 -22197
32089 -22197 494815 1374704 1585028 932833 -52129 -883765 -1214282 -804826 -7443 288887
32079 288887 -266609 -1019063 -1317108 -1258425 -1014976 -363927 494361 679205 36316 -184408
32069 -184408 917635 2361446 2663621 1949812 1418906 1387119 1242606 834324 525783
32060 525783 262031 -88317 121287 1412844 2803302 2855465 1840755 1246084 1311809
32051 1311809 848403 -437184 -1312720 -1114927 -710190 -744709 -573363 238861 807631
32042 807631 336573 -516054 -683109 -188090 307315 668642 1154723 1729145 2155216 2235324
32032 2235324 1613173 123205 -1380662 -1590919 -556327 227221 39400 -73434 744836
32023 744836 1631207 1498752 781253 428648 288401 -158004 -497211 -307109 -381975 -1342332
32013 -1342332 -1887060 -403241 2206032 3373130 2371595 954665 443242 235956 -363463
32004 -363463 -788535 -483789 28436 212042 360381 625278 452131 -254332 -630737 -325925
31994 -325925 -228808 -831496 -1150215 -370058 692787 1072416 1365432 2352498 3011761 1925300
31984 1925300 -45160 -741895 -97396 -153364 -1503835 -2214557 -1137858 29202 -524394
31975 -524394 -1824477 -1812600 -571268 215356 126601 179761 593662 527940 5200 14554
31965 14554 427694 -145853 -1793627 -2555300 -1294622 406479 615347 -103274 125908
31956 125908 1465836 2363589 2042036 1230946 576307 -63327 -646440 -720034 -420536 -463297
31946 -463297 -837170 -653929 361812 1324906 1528714 1286323 999304 489482 -102934
31937 -102934 181925 1780230 3496325 3758682 2591011 1434200 1206170 1345121 823036
31928 823036 -464912 -1553236 -1513917 -605340 -79507 -601255 -1270193 -898835 132960
31919 132960 478095 143537 583673 2030086 2533916 858744 -1223388 -1263831 327584
31910 327584 1128211 458644 -13774 566123 830595 -308487 -1722114 -1866010 -1082245
31901 -1082245 -718365 -987718 -1161944 -1177120 -1502367 -1747662 -963371 580597 1317592
31892 1317592 512487 -696220 -1024194 -832810 -1273265 -2297239 -2671934 -1851102 -774268
31883 -774268 -513701 -903456 -1000477 -397569 486679 1136256 1370554 1139244 442792 -421953
31873 -421953 -937243 -876322 -497961 -104942 349966 1046232 1844398 2227648 1689287 226901
31863 226901 -1419579 -2147342 -1459190 -122022 452708 -358724 -1781331 -2539067 -2103309
31854 -2103309 -941327 161275 759256 884715 787908 608943 341882 138179 363799
31845 363799 1027596 1425525 962570 203301 264080 1017386 896267 -939040 -3117020
31836 -3117020 -3656905 -2468267 -1173194 -779962 -798051 -698310 -892974 -1678980 -2296738
31827 -2296738 -1976351 -1213063 -924603 -759251 471142 2621154 3810087 2837935 972124
31818 972124 294989 936017 1261094 587979 174553 1055576 2267751 2253144 1150599
31809 1150599 455250 793872 1236157 803647 -306968 -1165551 -1104268 -214649 643192
31800 643192 522853 -333081 -336158 1431105 3526458 3774081 2281257 1222241 1615336
31791 1615336 2177074 1806241 1216532 1153382 895215 -43856 -394214 862165 2288364
31782 2288364 1891341 290145 -274886 480054 765990 111530 278192 2104831 3705913
31773 3705913 3094567 992088 -376268 -192221 579072 967041 866433 500866 92996
31764 92996 -2883 439865 1136143 1560355 1474747 971649 298951 -156780 -127205 91722
31754 91722 -55631 -430232 -195707 879613 1822276 1715562 953862 552284 691928 738912
31744 738912 400094 33676 -101218 -173879 -314020 -398137 -375425 -317462 -98031 480513
31734 480513 1166878 1403102 1181929 1234707 1989548 2763724 2549715 1418529 522959 646947
31724 646947 1348734 1817158 2007596 2363852 2804745 2790685 2329774 2074303 2213059 2069862
31714 2069862 1240377 442266 627459 1734604 2908650 3526100 3441892 2744248 1986032
31705 1986032 2142245 3398148 4335973 3393839 1008255 -727204 -530266 921826 2289956
31696 2289956 2892726 2556005 1332855 -103337 -686654 -140543 708991 1123305 1208166
31687 1208166 1214709 1029873 823105 1227148 2208702 2653122 1913208 1033754 1469395 3070804
31677 3070804 4282130 4074131 2913219 2005968 2179859 3274429 4162566 3747435 2401088
31668 2401088 1857422 3046412 4656776 4734481 3211004 1777286 1520774 1852141 1834119
31659 1834119 1506020 1498727 2012908 2574883 2501910 1531304 270217 -134895 795471 2194490
31649 2194490 2860592 2660846 2302851 2073521 1738462 1517248 2007655 2941425 3107241
31640 3107241 2002744 664424 220066 369999 121253 -486344 -365186 983031 2639419
31631 2639419 3332090 2838094 2001590 1614443 1649185 1616254 1374252 1298182 1682258 2289938
31621 2289938 2657409 2631303 2411560 2239327 2240346 2383274 2374536 1832550 852699 142545
31611 142545 220671 715359 904799 738265 764064 1161909 1481012 1398529 1167971 1143518
31601 1143518 1299027 1398308 1327879 1173819 1224702 1805950 2731943 3104797 2261135 829668
31591 829668 108659 364282 617098 325375 261972 1117792 2133162 2077835 1064617 348478
31581 348478 539765 1039558 1283520 1535205 2064588 2355265 1799930 763264 257931
31572 257931 651658 1260021 1313314 868839 512343 473611 432021 113226 -317540 -576003
31562 -576003 -691849 -912906 -1319657 -1710198 -1780123 -1317132 -380772 571341 940527 596596
31552 596596 73408 -69353 106496 186400 110723 212189 648663 1213896 1691891 2017610
31542 2017610 2078757 1727659 1057848 414440 132652 421940 1250332 2012138 1710164 134079
31532 134079 -1397188 -1302906 314086 1829877 2157384 1633445 815338 -283841 -1300551
31523 -1300551 -1249215 -100086 514781 -574079 -2099008 -1950356 -190392 1115245 872189
31514 872189 96883 -145282 -336975 -1288199 -2489630 -2693519 -1566826 15108 1007205
31505 1007205 1015236 393308 -53240 288578 1201044 1875310 1904253 1656106 1569081 1585033
31495 1585033 1454022 1088913 461178 -306322 -653171 -105400 779729 875924 130416 -316422
31485 -316422 -42306 -52526 -800098 -955507 460169 1942139 1383173 -664040 -1708871
31476 -1708871 -1010751 -332254 -839915 -1490307 -1203115 -602207 -489563 -314396 510434
31467 510434 1218021 1065116 848088 1458516 2011736 1218089 -178718 -292802 991948
31458 991948 1938708 1665383 1052047 806926 452289 -323555 -930356 -1095952 -1415433 -2059081
31448 -2059081 -2244939 -1652033 -1069788 -908104 -357740 1060335 2335902 2448886 1954613
31439 1954613 1916117 2162114 1862081 1088492 515689 158691 -312933 -521161 53685 871773
31429 871773 1025700 796255 1148929 1933752 2058662 1390876 995827 1358955 1813000 1980901
31419 1980901 2330003 2846800 2591263 1296285 204452 445606 1511823 2177847 2154123
31410 2154123 2006531 2074873 2261619 2439232 2453295 2127196 1664511 1509236 1505825 954365
31400 954365 -134221 -779077 -563154 -377840 -857020 -1151144 -368283 702961 688136
31391 688136 -212732 -643289 -265452 35487 -17501 342009 1282720 1744540 1015241 -156581
31381 -156581 -651908 -363747 81032 309960 363606 357782 430546 655991 755530 322670
31371 322670 -469521 -869131 -460420 381216 1089955 1442259 1356447 769929 -46874 -596474
31361 -596474 -774506 -857419 -813466 -386913 -7242 -613472 -2120750 -3078086 -2603947 -1751386
31351 -1751386 -1934397 -2728360 -2514567 -934222 680386 1334590 1497003 1806746 1815704
31342 1815704 795168 -915768 -2190865 -2394793 -1727394 -598530 605896 1269999 898990
31333 898990 -53404 -392652 361382 1265149 1255226 687384 728431 1446083 1626779 735727
31323 735727 -93832 235114 1022452 809556 -401865 -1238021 -1033452 -517252 -342063
31314 -342063 -206971 174163 361654 28851 -385385 -449524 -389786 -437546 -317460 65463
31304 65463 262401 209104 602521 1595933 2086039 1307468 258227 321846 1199761 1581742
31294 1581742 1285498 1169223 1255811 652381 -621320 -1366924 -1113846 -838513 -1277217
31285 -1277217 -1821890 -1723552 -1247260 -909049 -545420 91420 622213 666324 501461 437892
31275 437892 183451 -507192 -1137857 -1080938 -405560 425698 1163595 1602616 1417048 708522
31265 708522 136901 -7878 -238522 -870398 -1327326 -1065795 -433653 96359 746117 1654458
31255 1654458 2120536 1666991 1102354 1317212 1676668 997619 -348005 -830042 -47905
31246 -47905 884471 1196843 1202209 1079466 469284 -364001 -442757 297868 622186 -119001
31236 -119001 -952479 -879276 -334959 -170146 -218850 126452 793719 1473067 2342609 3303957
31226 3303957 3322288 1789338 -95730 -671654 -87326 202323 -102103 171432 1438487
31217 1438487 2477742 2345862 1776476 1798550 2041476 1522468 470683 175526 1128199
31208 1128199 2253204 2230350 1062134 21089 190067 1248832 1836913 1179929 107401
31199 107401 59643 1201350 2137661 1673415 265395 -648416 -325708 686911 1291114
31190 1291114 765666 -716409 -2066187 -2074860 -717962 578751 489098 -597906 -1061063
31181 -1061063 -3201 1850202 3118918 3026924 1728029 56241 -911857 -657346 181694
31172 181694 471262 -34028 -494706 -266123 335501 817419 1285010 1897799 2202072 1715071
31162 1715071 759330 42105 -281332 -504653 -653816 -543231 -293119 -138423 24097
31153 24097 251477 75770 -773393 -1522018 -1271078 -538164 -624587 -1422141 -1277633 507681
31143 507681 2372159 2479101 970983 -636597 -1429995 -1481237 -974777 -66404 769403
31134 769403 1198464 1539826 2043709 2111155 1173042 -56103 -309795 436678 1010640 825532
31124 825532 490659 503503 429420 -226809 -1180353 -1815834 -1850395 -1293779 -399474 139745
31114 139745 -316683 -1392587 -1948750 -1589925 -1119299 -1114668 -980561 -118191 757418 461051
31104 461051 -901919 -1973980 -1837506 -893836 -63091 206076 22161 -271036 -271871 231138
31094 231138 929191 1118178 376918 -913461 -1826987 -1722016 -855017 -121291 -88896 -389513
31084 -389513 -272825 369393 916891 913930 556121 208895 -2762 83528 745435 1766908
31074 1766908 2288237 1817367 983742 688553 858816 738029 147167 -350108 -428096 -284843
31064 -284843 81141 926746 1832905 1736957 548080 -146384 989029 2946760 3473873
31055 3473873 2129402 848312 1065703 1664099 831342 -1034724 -1819216 -784107 434546
31046 434546 251549 -821692 -1295243 -790530 -10595 640072 1257472 1624215 1312351
31037 1312351 552912 90679 135327 231276 171246 238021 475472 513849 241985 -99152
31027 -99152 -565475 -1374426 -1974780 -1305628 559204 2007963 1830605 778012 401186
31018 401186 998601 1634777 1729147 1597097 1554593 1417654 1018688 561507 299746 305974
31008 305974 615051 1179068 1642124 1572223 1018448 532097 554405 1002167 1450835 1487480
30998 1487480 930414 29946 -489883 79513 1655622 3192465 3531754 2525429 1213700
30989 1213700 752447 1221161 1714371 1585897 1187949 1191081 1647092 2148735 2500983 2652383
30979 2652383 2319049 1416942 611468 569233 794750 197866 -1118820 -1661347 -435089
30970 -435089 1806334 3511392 3800184 2809823 1418956 840856 1610661 2757112 2853089
30961 2853089 1925462 1179569 866320 76230 -1069832 -1060949 325754 1075471 36479
30952 36479 -1027535 -335730 802952 178068 -1472162 -1628473 -170271 579264 -283778
30943 -283778 -1243992 -1369987 -1466414 -1697031 -851263 1024878 1845634 708806 -376494
30934 -376494 358287 1557709 993717 -847048 -1625993 -668667 474573 541370 -167130
30925 -167130 -846605 -1017074 -334436 1157306 2539551 2781536 1986972 1087674 492451
30916 492451 -87183 -659070 -771356 -340743 137158 304732 292711 348299 581727 978795
30906 978795 1250269 918824 36462 -509307 -7851 1026741 1465797 1028488 507884
30897 507884 679821 1554017 2560828 2951917 2216639 678988 -486752 -406179 469340
30888 469340 992581 743463 232665 -84385 -281403 -502589 -654818 -580230 -97569 987947
30878 987947 2444348 3425071 3313253 2529380 1860307 1273654 238476 -979961 -1416588
30869 -1416588 -924925 -572083 -1122731 -1995325 -2297544 -2216184 -2617242 -3576920 -4053707 -3144367
30859 -3144367 -1284472 76621 33431 -708171 -651536 559814 1590365 1185171 -111801
30850 -111801 -794315 -496369 -153389 -204946 48727 964537 1669091 1384427 701151 643054
30840 643054 1151918 1447808 1383783 1414179 1500755 1094970 168520 -680850 -1228788 -1825726
30830 -1825726 -2388946 -2093484 -556785 1320013 2248916 1876151 790733 -303346 -894552
30821 -894552 -600563 461460 1433839 1564654 1251804 1558258 2648448 3453807 3122651
30812 3122651 2058674 1065836 148848 -1081131 -2236592 -2356404 -1315656 -225028 -117943
30803 -117943 -785923 -1256308 -991093 -207759 664082 1336020 1560367 1137330 172379 -871227
30793 -871227 -1498453 -1533497 -1190590 -877898 -864721 -1026801 -973550 -545120 -105952 -142319
30783 -142319 -558443 -607136 303328 1820934 2853715 2593210 1244555 -238196 -975764
30774 -975764 -708713 193525 1034133 1269407 972792 727817 821676 771189 87724 -726561
30764 -726561 -707510 34744 256891 -556683 -1228147 -544607 905401 1605010 1272231 874852
30754 874852 721176 7527 -1453726 -2431096 -1948398 -778578 -347511 -768918 -913179
30745 -913179 -133494 933844 1281805 644253 -386583 -1006799 -941098 -707886 -1011471
30736 -1011471 -1753199 -1990619 -1145010 154732 874639 863183 728639 665574 207833 -740121
30726 -740121 -1403905 -1146500 -475585 -401252 -996617 -1331788 -959910 -713931 -1475689 -2694472
30716 -2694472 -3020644 -2245769 -1555703 -1611691 -1495939 -315592 1061689 1059412 -264362
30707 -264362 -1212106 -776388 209643 546762 273996 226201 665634 1003853 630349 -380604
30697 -380604 -1317665 -1514429 -1081732 -760231 -826131 -617965 319625 1213828 1110011 455394
30687 455394 413005 899579 799553 111082 179296 1381021 2235988 1591428 225023 -657971
30677 -657971 -1154528 -1759572 -1955262 -1065261 350016 1248915 1579988 1847513 1922241 1487875
30667 1487875 999417 929341 668665 -473901 -1698452 -1607623 -380155 399977 9777
30658 9777 -655863 -671685 -243596 -66524 -407620 -982758 -1143670 -343840 998589 1554096
30648 1554096 758984 -162809 161039 1254063 1681854 1333483 1296951 1829924 2064683
30639 2064683 1608644 931018 255207 -452947 -582603 373310 1322304 723116 -751735
30630 -751735 -807994 931621 2243184 1806706 1060820 1434808 1963725 1299079 238629
30621 238629 297617 1118087 1298101 826698 749662 1097504 1010193 477489 217947 139463
30611 139463 -406953 -1033148 -637049 676421 1566928 1505108 1368362 1713112 1898996 1451121
30601 1451121 995187 1100308 1248218 838503 447243 1093746 2621773 3692945 3357714
30592 3357714 2025236 803053 320793 390966 551990 617549 653122 675301 653712 736256
30582 736256 1133539 1722954 2084279 2008152 1644065 1116956 470126 67574 408402 1268315
30572 1268315 1697612 1288195 757615 742605 774975 235734 -409700 -405428 -175520 -676445
30562 -676445 -1528312 -1259141 412906 1913939 1920587 975911 366202 398309 583568 689578
30552 689578 687083 280693 -541304 -941447 -200116 1043439 1482388 880574 130692 -286826
30542 -286826 -728348 -1143305 -703814 714520 1757034 1221845 -228072 -940183 -381056
30533 -381056 599733 1266126 1668797 1898313 1743907 1315401 1133029 1305228 1347544 1076443
30523 1076443 931375 1082461 975544 215007 -766715 -1400452 -1723417 -1942398 -1880112 -1429052
30513 -1429052 -1002494 -946228 -988134 -770016 -346080 324406 1581844 3078746 3487867
30504 3487867 2212011 625258 411926 1283303 1670429 1175246 792463 935394 878561
30495 878561 275321 -271949 -449685 -693723 -1048561 -817363 209741 1291049 1894709
30486 1894709 2251536 2410536 1922941 944117 513894 1148860 2112243 2552326 2400852
30477 2400852 1786739 697264 -347403 -500517 28149 44594 -706656 -1159334 -1034014
30468 -1034014 -1534842 -2943730 -3429765 -1836614 19881 -156265 -1642469 -1949256 -716891
30459 -716891 34611 -787197 -2087478 -2703033 -2709379 -2284493 -1126614 435284 1280656
30450 1280656 1036007 528328 294839 -77322 -702665 -833800 -155066 566812 784308
30441 784308 988880 1523225 1708281 1049231 301505 284599 496089 138111 -140077 955767
30431 955767 2971417 3672668 1916442 -611041 -1402770 -182565 1085645 951531 48125
30422 48125 -365842 -287083 -489713 -915895 -829354 -346904 -415025 -1027184 -845719 754927
30412 754927 2491420 2940918 2470057 2288155 2474276 2278918 1711856 1342062 950875
30403 950875 -35677 -980731 -590669 845886 1435592 326287 -1155336 -1638498 -1509021
30394 -1509021 -1660769 -1777760 -1145222 -238857 -44749 -269543 317576 1798413 2672078
30385 2672078 1859605 140570 -983648 -1150983 -1116925 -1242982 -894003 479803 2281428
30376 2281428 3229499 2620408 797505 -1344185 -2856528 -3010255 -1782102 -103519 977203
30367 977203 1389807 1658454 1576059 378869 -1547562 -2473736 -1571269 -183281 137648
30358 137648 -217006 8491 657097 632409 118645 478637 1900854 2803056 1986360 109159
30348 109159 -1417887 -1944259 -1592057 -743389 -12604 -4178 -673977 -1372125 -1579347 -1131306
30338 -1131306 -9313 1296564 1599774 331243 -1212462 -1266602 -109678 361832 -375975
30329 -375975 -691442 508191 2052658 2381046 1663480 978341 604438 301192 285515
30320 285515 722356 1001685 637352 251026 636897 1437532 1745199 1473653 1138957 775112
30310 775112 107652 -551568 -592045 -87088 358254 548046 720148 845560 681731 407242
30300 407242 496935 985216 1394779 1374438 1019565 646442 520929 647457 688678 415603
30290 415603 275141 904974 1939756 2114411 959699 -387946 -611007 242348 1171629
30281 1171629 1487329 1096725 239473 -448437 -288337 449870 659353 44645 -289105
30272 -289105 397825 1197641 1022856 325307 126842 231300 -191652 -929715 -1109667 -762923
30262 -762923 -576805 -494727 -9444 488291 149390 -748914 -1095083 -648906 -52549 603442
30252 603442 1634151 2363134 1676550 59345 -749166 -392616 -301860 -1018215 -1170569
30243 -1170569 -44993 782911 -191808 -1942631 -2454594 -1630701 -954286 -968279 -817414
30234 -817414 -41618 724470 968929 1044499 1412025 1923841 2092813 1600598 532033 -495556
30224 -495556 -627834 297515 1324879 1436120 812849 408104 455750 234316 -613665 -1369882
30214 -1369882 -1273602 -692415 -658202 -1462809 -2309307 -2411219 -1907072 -1373191 -867257 -97869
30204 -97869 601176 340616 -951403 -2020213 -1832094 -1052443 -1104306 -2127937 -2891753
30195 -2891753 -2600420 -1742957 -1059049 -659556 -404111 -246102 70877 794369 1391500
30186 1391500 964938 -205105 -590568 549127 2076834 2634451 2394483 2236111 2079668
30177 2079668 1240398 -123847 -1122202 -1389953 -1198801 -586444 557045 1682238 1909568
30168 1909568 1198854 349811 -111966 -223544 88013 944142 1765095 1657485 783406
30159 783406 366756 1001079 1849924 1931658 1335949 664129 95287 -318071 -131735 863165
30149 863165 1907207 1984015 1084465 100711 -398140 -637288 -922448 -1084384 -795836 -29647
30139 -29647 942272 1713584 1861385 1268173 461967 269960 852771 1339005 803726 -488314
30129 -488314 -1262519 -766441 310489 779490 464754 203859 471424 738888 416018
30120 416018 -249282 -658271 -693127 -493280 91594 1045922 1538328 710156 -898520 -1639782
30110 -1639782 -696448 1020180 2139111 2249513 1746257 1024143 347432 -20058 -51681
30101 -51681 43135 295269 886292 1385023 958113 -173236 -500290 665823 1771286
30092 1771286 966254 -1149504 -2230036 -1396759 -166185 -3408 -495372 -555321 -148932
30083 -148932 64594 -101725 -454182 -998261 -1574486 -1490035 -428955 673480 617322 -385549
30073 -385549 -925805 -306042 571325 451881 -723984 -1850855 -1925409 -1022918 -113808
30064 -113808 -13449 -523669 -725288 -143626 664253 868717 408832 -59556 -75738 110748
30054 110748 -107374 -1019685 -2213995 -2838607 -2480078 -1764975 -1652909 -2096641 -2060601 -1080917
30044 -1080917 10405 396187 448438 833070 1261855 1195112 1104398 1681776 2212000 1323475
30034 1323475 -640375 -1615302 -585473 1077247 1661305 1187882 607598 121599 -574331
30025 -574331 -1234817 -1470250 -1667179 -2358193 -3038879 -2743291 -1620074 -838859 -905959 -1094929
30015 -1094929 -782213 -459722 -942269 -2102159 -2879200 -2395325 -879310 419512 320592
30006 320592 -1031227 -2130927 -1701005 -175451 897081 848286 604648 1199501 2227704
29997 2227704 2356910 1100796 -535421 -1268160 -960034 -539753 -709898 -1163065 -1198301
29988 -1198301 -752411 -441684 -719450 -1421183 -2150287 -2669528 -2792225 -2355169 -1593992
29979 -1593992 -1186639 -1548244 -2284397 -2651960 -2390763 -1829002 -1354521 -1093131 -984926
29970 -984926 -877313 -574512 20458 834885 1703783 2321719 2167099 959821 -618548
29961 -618548 -1227901 -387175 704897 505555 -890335 -1788012 -992234 741120 1694930
29952 1694930 1253398 450431 461693 1095853 1277048 789116 693852 1682664 2834685 2826193
29942 2826193 1784799 845712 263269 -612107 -1539441 -1268352 292007 1409182 931026
29933 931026 -91995 -311608 -201274 -766760 -1363817 -738577 510765 606189 -575494
29924 -575494 -1405792 -1266163 -1327090 -2144845 -2478711 -1401103 61735 545998 343634
29915 343634 545349 1140807 1300136 1014389 1186999 2175643 3188236 3299465 2552363
29906 2552363 1871038 2021722 2686446 2697595 1441378 -194082 -780925 -84820 822024
29897 822024 1026760 536713 -322005 -1263286 -1738323 -1340695 -698017 -880295 -1718494 -1931812
29887 -1931812 -1213648 -751624 -1127966 -1287677 -532953 10454 -735383 -1787504 -1583131
29878 -1583131 -456526 118042 -11140 149806 588922 286695 -769547 -1467229 -1546433
29869 -1546433 -1842235 -2313203 -1792232 -312568 272779 -909498 -2026722 -1096969 1013475
29860 1013475 1880600 986621 25310 54529 239451 -252569 -759797 -394653 318732 199303
29850 199303 -721901 -1161586 -356729 979499 1698974 1595146 1329540 1333600 1287792 704363
29840 704363 -290161 -936820 -610500 416898 1102871 743754 -100160 -203245 696615
29831 696615 1439499 1006148 -62868 -543042 -343252 -390788 -888287 -963062 -300386 135932
29821 135932 -360245 -1060528 -1014766 -561090 -624720 -1185414 -1521125 -1483043 -1419002 -1188460
29811 -1188460 -412778 493314 708222 373108 444808 1137979 1656800 1630805 1624742 1873234
29801 1873234 1696109 768298 -92213 -201593 -197049 -989817 -2162017 -2475372 -1687834 -846325
29791 -846325 -758797 -1035474 -902670 -345218 -10860 -258637 -724840 -864358 -626513 -330305
29781 -330305 7747 736376 1767114 2252494 1613784 493626 -56875 -60995 -348282 -932264
29771 -932264 -847716 143736 906229 594455 -118487 -304648 -284406 -766138 -1269886 -780408
29761 -780408 414573 943097 371161 -279265 -211525 142695 190284 179696 539171 1035643
29751 1035643 1250686 1266509 1232124 784769 -367801 -1634712 -2043361 -1434407 -583518
29742 -583518 -198376 -292467 -535037 -754588 -979343 -1254507 -1512952 -1528744 -1094210 -373890
29732 -373890 108803 43996 -312142 -584671 -805325 -1166061 -1532956 -1633718 -1482616 -1153482
29722 -1153482 -448776 543968 868212 -346311 -2327647 -3130746 -2010137 -349862 283023
29713 283023 13990 -192525 -291457 -840753 -1528449 -1445053 -682124 -289356 -487042 -217967
29703 -217967 1094366 2484440 2753782 1893888 558331 -934396 -2208694 -2307272 -766028
29694 -766028 1207236 1815774 838706 -300840 -610381 -609877 -1091078 -1776088 -1820895 -1089174
29684 -1089174 -292916 -70705 -360650 -632116 -487606 -30764 282931 168020 -190354
29675 -190354 -446763 -535690 -574763 -497625 -131675 425876 853400 1006803 979800 823215
29665 823215 538774 303260 334877 542277 635462 551197 428645 234450 -175989 -656206
29655 -656206 -859815 -739296 -548109 -377369 -143195 9899 -162712 -457903 -395429 -23871
29645 -23871 59904 -334282 -636211 -385765 102666 265223 227 -437888 -805828 -887594
29635 -887594 -634736 -518252 -1149887 -2241281 -2590983 -1569871 -22332 850683 939665
29626 939665 922760 1032043 921585 491088 85028 -46992 70997 399275 854206 1161405
29616 1161405 1133118 901985 578881 60187 -459665 -351312 467049 970342 271678 -1005158
29606 -1005158 -1520778 -1057032 -544432 -481658 -474460 -347202 -542707 -1160174 -1621871 -1662365
29596 -1662365 -1752459 -2139726 -2297157 -1790245 -980679 -418536 -164951 -86053 -142102 -22647
29586 -22647 735782 1807861 2079516 1226701 516273 1205302 2762502 3622191 3277829
29577 3277829 2629231 2453416 2509328 2220445 1462029 496930 -308536 -566538 -110164 734647
29567 734647 1421073 1692730 1543701 888793 -222754 -1192481 -1295244 -611426 -14644
29558 -14644 -42129 -210846 257430 1307224 1976746 1425595 -136847 -1601650 -1981163
29549 -1981163 -1187677 178156 1495668 2298931 2147698 1036705 -114496 -229346 449970
29540 449970 551516 -335519 -777079 461084 2382686 2981151 1911439 575515 -152888
29531 -152888 -760420 -1582743 -2027147 -1831717 -1758171 -2229305 -2371706 -1401652 -119923 122861
29521 122861 -550645 -734277 193107 1250853 1268220 301726 -672973 -953404 -665966 -422909
29511 -422909 -659296 -1179259 -1310941 -665638 302973 738780 363050 -252358 -397899 85268
29501 85268 884413 1634261 2061385 2020475 1736234 1828058 2633395 3503359 3292390 1793699
29491 1793699 220557 -180999 385391 777698 580191 355433 316113 -96915 -926832
29482 -926832 -1132611 -128556 1009771 939300 -5277 -442196 -36541 377471 512223
29473 512223 971113 1776345 2016198 1380844 762805 766674 792645 269132 -298566 -293867
29463 -293867 -4069 185296 649538 1582749 2091799 1426885 411687 332117 909171 798757
29453 798757 -161441 -715484 -278801 173182 -255013 -1020639 -1075279 -347044 346612 335771
29443 335771 -432905 -1504982 -2092957 -1585617 -307650 578125 318412 -561482 -966846
29434 -966846 -512848 284485 835748 1015896 965073 839688 874400 1305113 1973640 2270354
29424 2270354 1843720 1248366 1395043 2264341 2724720 1977141 649013 -126180 -231061
29415 -231061 -325675 -470031 -160644 318712 -41879 -1194889 -1654691 -613773 776429
29406 776429 1177619 961927 1098259 1169443 168916 -1271194 -1271929 611243 2624418 3058910
29396 3058910 2053383 799949 11372 -363537 -699142 -1361440 -2237854 -2491178 -1475328
29387 -1475328 89612 726810 102199 -594131 -367376 403394 812637 573518 -81357
29378 -81357 -862830 -1370479 -1250695 -760205 -529306 -535413 -111571 735865 975732 82566
29368 82566 -924380 -733850 523278 1507681 1286937 163910 -829868 -880157 -123990
29359 -123990 327675 -479828 -2007652 -2590657 -1420189 441363 1367920 892702 -250231
29350 -250231 -1184169 -1490755 -1229259 -826371 -641252 -445275 215944 1094544 1415022 1126282
29340 1126282 1052772 1461477 1507153 682346 -198570 -279726 -31273 -336800 -904470 -696959
29330 -696959 441559 1583293 1930072 1445199 511753 -334768 -581514 -285499 -178285
29321 -178285 -679021 -1202061 -1040014 -463571 -247406 -545575 -959075 -1265209 -1316257 -705352
29311 -705352 577357 1574308 1389746 459890 -106449 -67082 74578 316848 1056336 1948455
29301 1948455 2175659 1849950 1864810 2236942 1950728 803526 45968 503726 1238264
29292 1238264 1018387 231689 207318 1141800 1853909 1521517 674704 225601 241570 145549
29282 145549 -255770 -499047 -209424 314320 496350 229223 -94894 -183743 -108342 3894
29272 3894 129353 158025 -19179 -152556 130258 582205 418974 -570067 -1578089 -1842509
29262 -1842509 -1595551 -1477824 -1531945 -1374800 -970468 -613444 -393141 -180206 58559 284314
29252 284314 453315 343433 -228541 -826019 -711793 -36777 153105 -454393 -825908 -299828
29242 -299828 190705 -348035 -1230559 -1212896 -531651 -304497 -486027 -80011 909967 1425128
29232 1425128 1233314 1285819 2002358 2632186 2645313 2483762 2534672 2468942 2009251 1412682
29222 1412682 864227 233435 -373391 -668353 -878918 -1471434 -2122086 -1954911 -889679
29213 -889679 236215 916545 1290725 1257326 539346 -282308 -157497 773170 1238573 831077
29203 831077 542953 947170 1319669 1115622 861677 908522 737632 305593 628891 2016216
29193 2016216 3047274 2503902 1221806 819323 1526553 2433964 2994227 3075102 2352000
29184 2352000 927090 -105190 76653 773079 896187 676708 994262 1626603 1584966
29175 1584966 815534 177030 -51904 -300406 -470548 62444 1135691 1742548 1526845
29166 1526845 1230473 1342222 1313297 577470 -448987 -917389 -592193 46025 383114
29157 383114 104624 -660121 -1476335 -2074969 -2591772 -3049201 -2896625 -1691144 -76451
29148 -76451 748162 652800 792564 1766891 2407204 1325708 -746633 -1416392 261710
29139 261710 2226225 1915331 -309347 -1604184 -449482 1540675 2201747 1656612 1270782
29130 1270782 1043001 29650 -1197747 -818638 1227878 2562474 1521313 -650942
29122 -650942 -1766777 -1452160 -772214 -296576 64252 75594 -554096 -1265630 -1133990 -97859
29112 -97859 1083483 1839644 2085771 1870603 1426515 1277958 1677793 2161567 2102725 1431590
29102 1431590 536583 -118065 -126384 467000 810818 164772 -730187 -396634 1030407 1719599
29092 1719599 950733 249250 713743 1033221 -253190 -2076396 -2392599 -1305832 -554099
29083 -554099 -625290 -462452 395256 1332330 2041638 2588833 2387073 947071 -585837
29074 -585837 -568904 556820 776036 -372944 -1196284 -621808 426784 909530 1004284
29065 1004284 904795 126390 -1097658 -1369049 -124880 1271505 1463626 919470 809102
29056 809102 1191080 1410984 1375319 1329832 1101170 581896 377835 1030631 2055184 2549438
29046 2549438 2339063 1825799 1163064 325424 -343858 -379665 132607 613256 640240 310155
29036 310155 101719 435251 1107442 1290460 573853 -206907 45503 1013597 1294533 483842
29026 483842 -233715 46776 629266 439048 -350679 -728890 -264822 619775 1355536 1600384
29016 1600384 1261394 611034 102467 -166497 -411434 -501842 8224 1011484 1757910
29007 1757910 1925215 2018321 2351555 2443720 1917570 1248104 1021236 1076052 996345 933276
28997 933276 1310948 2038057 2491583 2105374 831637 -657362 -1290172 -699943 102952
28988 102952 -38827 -680688 -389497 919654 1730430 1336886 885024 1259422 1538534
28979 1538534 733304 -336648 -395082 167466 196392 -22147 673734 1955702 2135719
28970 2135719 781152 -515657 -471019 201734 199013 -336079 -193763 959034 1965677
28961 1965677 1626450 235003 -715367 -310421 706068 965202 259440 -393372 -367561
28952 -367561 -141713 -117294 230216 1305654 2323681 2237808 1257447 527874 595994 1014040
28942 1014040 1238261 1124781 665270 -18324 -430435 -94591 721862 1104641 397883
28933 397883 -1151086 -2519105 -2618192 -1278764 330267 779609 53957 -512866 -182630
28924 -182630 237617 -137912 -896959 -1230571 -1274858 -1517314 -1637681 -1106510 -340730 -68843
28914 -68843 -56991 291753 558060 -38303 -895384 -510018 1239948 2739132 2810874 1960977
28904 1960977 1135424 503150 -16333 -131118 240093 571764 508402 390816 551128 718420
28894 718420 558225 208242 -130859 -571683 -1106896 -1329802 -1001908 -471600 -193559 -221921
28884 -221921 -407065 -637787 -681287 -302220 230783 330097 58305 267869 1329401 2324649
28874 2324649 2145093 986782 36021 -137261 -113907 -461213 -743758 -218509 786848
28865 786848 905567 -590631 -2641101 -3511885 -2847053 -1850049 -1396916 -934026 270786
28856 270786 1664473 2055884 1191082 -186379 -1449523 -2375461 -2665020 -2190389 -1600859
28847 -1600859 -1747121 -2530566 -3123282 -3173930 -2896640 -2173653 -718685 860736 1370431
28838 1370431 644488 -204425 -403003 -331619 -435001 -443785 -147336 89785 120456 387471
28828 387471 986604 1288016 1009217 692235 569968 44201 -1025364 -1688366 -1482845
28819 -1482845 -1471886 -2467049 -3247771 -2130348 320283 1823312 1406915 343807 41991
28810 41991 488695 1098470 1746031 2306467 2174801 1054627 -325290 -964904 -791536
28801 -791536 -606414 -954509 -1423686 -1158714 36768 1281673 1503097 669016 -257928
28792 -257928 -613018 -660857 -728562 -505155 234640 927617 1011701 818931 832268 659528
28782 659528 -201734 -1117211 -1125889 -654463 -965869 -1991605 -2281160 -1318005 -308702 -178050
28772 -178050 -325455 -157699 -373544 -1541202 -2587586 -2176720 -871572 -422381 -1208441
28763 -1208441 -1777007 -983937 536658 1328180 778313 -469341 -1332139 -1335378 -1011032
28754 -1011032 -1154168 -1642268 -1515195 -470950 510194 639634 577074 1236329 2068193
28745 2068193 1880806 951229 745516 1528546 1849986 832612 -484861 -847875 -619978
28736 -619978 -911190 -1728911 -2106024 -1622477 -821915 -307093 -189212 -339268 -573620 -623741
28726 -623741 -360878 -1592 187389 212262 140137 -140783 -641744 -1056527 -1153842 -1093252
28716 -1093252 -1047380 -864675 -448201 -67607 123056 467894 1203071 1838846 1736820 1045394
28706 1045394 491403 445541 711617 994277 1014011 429870 -674423 -1421213 -1012415 82262
28696 82262 559538 -50707 -891953 -1079488 -700847 -189132 526672 1563641 2236825 1558136
28686 1558136 -330881 -1912257 -1906761 -775476 -54558 -339791 -702809 -352418 382
28677 382 -755208 -2250993 -2996513 -2433640 -1489253 -1070576 -1195026 -1715719 -2545660 -2854049
28667 -2854049 -1578439 628837 1532995 307040 -1163262 -1090080 -248783 -125544 -263704
28658 -263704 484758 1414670 1113097 231349 523706 1676762 1792827 822564 743249 2126404
28648 2126404 3220587 2938889 2193421 1614547 522846 -924104 -1112690 255686 1092896
28639 1092896 33504 -1481621 -1683359 -1038481 -811513 -976738 -1149031 -1720950 -2425756
28630 -2425756 -1712661 578684 1861921 288470 -2190219 -2625858 -1314493 -605286 -875718
28621 -875718 -635658 279104 601181 251024 291809 533779 -192269 -1521711 -1862654 -1149972
28611 -1149972 -776277 -776375 272073 2250406 3040575 1741442 23766 -514293 -271970
28602 -271970 -133326 33933 485239 846433 984710 1160746 914624 -500825 -2228703
28593 -2228703 -2325915 -728894 354228 -230292 -972557 -425484 562250 712803 538367
28584 538367 1025093 1571810 1019297 -233773 -725607 64198 1377457 2286619 2277128 1345773
28574 1345773 170666 -489001 -885831 -1783394 -2707933 -2222728 -373576 924270 705278
28565 705278 292271 765821 1039879 -40510 -1425026 -1495065 -602690 -133120 -178138 13053
28555 13053 240663 -137679 -689726 -637615 -381752 -643222 -858229 -151599 841041 941349
28545 941349 515824 660035 923261 -2763 -1685921 -2308943 -1625335 -1358057 -2305721
28536 -2305721 -3090899 -2460087 -1120757 -442158 -622553 -958534 -980360 -653103 -131567
28527 -131567 271707 392748 549708 993247 1243831 770344 19355 -207445 -73056 -283720
28517 -283720 -694299 -639208 -371573 -691419 -1292186 -1096260 -257259 -102460 -835724 -1078239
28507 -1078239 -229536 442854 -95326 -981790 -942473 -209766 160393 -51794 -334356 -513805
28497 -513805 -744442 -910292 -828127 -698062 -805929 -1112283 -1436774 -1604081 -1298924 -449104
28487 -449104 195747 -214728 -1211098 -1409059 -574259 -3810 -406663 -823556 -425349 19462
28477 19462 -410837 -1078279 -855245 -11184 348501 62503 -213012 -376151 -772599 -1117248
28467 -1117248 -882547 -510835 -887436 -1715878 -1768935 -828891 -73679 -260357 -702103 -490655
28457 -490655 234159 725705 577560 -172550 -1180572 -1694736 -1064713 241445 876337
28448 876337 360349 -158357 461607 1651780 1935164 961152 -248016 -879690 -1137905
28439 -1137905 -1395811 -1522792 -1428433 -1475896 -1795173 -1785251 -963876 113659 537743 412759
28429 412759 736616 1918287 3172257 3549346 2902703 1608568 7634 -1494154 -2353117
28420 -2353117 -2398803 -2013997 -1464127 -565070 596168 1273054 1026135 500655 474701 639141
28410 639141 232457 -511073 -619608 59284 609824 402952 -215262 -673867 -775917 -479296
28400 -479296 93240 366165 -136265 -928221 -1132619 -866530 -992531 -1480257 -1307577 -241910
28390 -241910 645784 728282 719728 1127274 1140159 42648 -1393177 -2025581 -1936928 -1843421
28380 -1843421 -1777658 -1469531 -1218630 -1197158 -645243 955183 2576282 2868673 2108170
28371 2108170 1523901 1262140 612664 -184055 -182423 327537 -29518 -1430714 -2462210
28362 -2462210 -2369731 -2000830 -1959462 -1526190 -271511 808358 891821 782766 1497819 2444410
28352 2444410 2404803 1598988 1299130 1764670 1979986 1446613 1012640 1572487 2739141
28343 2739141 3241445 2309940 484723 -797630 -488979 1008741 2200045 2049043 926974
28334 926974 -92633 -440203 -301905 -137301 -310099 -814119 -1069193 -454532 657345
28325 657345 1019331 125190 -948645 -963217 -170412 270658 24065 -279877 -372761 -738343
28315 -738343 -1561721 -2149534 -1731281 -393373 958389 1343601 540309 -567716 -803620
28306 -803620 -203532 -163363 -1474944 -2872366 -2577524 -874606 161894 -508872 -1634788
28297 -1634788 -1559973 -268219 991314 1271444 534617 -691198 -1702333 -2019250 -1746945
28288 -1746945 -1312704 -849542 -268139 192611 165495 -160924 -323018 -463477 -1014785 -1581866
28278 -1581866 -1310586 -469165 -328019 -1131850 -1612505 -1094859 -602751 -980131 -1355281
28269 -1355281 -702688 314996 527893 282529 684865 1555109 1797083 1329962 1020674
28260 1020674 987847 569215 -171879 -463785 -313804 -470643 -871183 -647752 182999 582989
28250 582989 298738 256125 782814 1036738 762442 965817 1971277 2375722 1162556
28241 1162556 -418723 -528057 597740 1131788 291956 -899247 -1290164 -866758 -341220
28232 -341220 -334691 -971264 -1668914 -1488883 -251591 991561 1213287 746704 603543 854232
28222 854232 707904 44761 -290559 57276 264096 -373242 -1260511 -1384160 -852657 -662607
28212 -662607 -1067936 -1131950 -225902 811907 733977 -337872 -1108164 -968226 -609871 -552524
28202 -552524 -211703 869238 1880866 1892760 1368911 1323158 1571041 1218448 439996 168037
28192 168037 236960 -383490 -1448370 -1433828 -82902 926776 572476 -45767 252394
28183 252394 949451 1228739 1468257 1941507 1605240 -117012 -1664627 -1329885 114480
28174 114480 678098 154856 -149223 23784 -220723 -834310 -788912 -94399 131986 -306420
28164 -306420 -463786 -177354 -311155 -822653 -526078 727390 1496504 1054474 502885
28155 502885 764488 1117252 730994 155238 97591 22997 -719093 -1431821 -1138241 -351193
28145 -351193 -364522 -1201164 -1569540 -755076 496846 1059988 630043 -277250 -1009997 -1292444
28135 -1292444 -1286515 -1259567 -1257766 -1199786 -1070024 -739545 42043 977597 1054247 -84805
28125 -84805 -1066616 -326415 1523971 2335462 1432561 330813 134881 14479 -950104
28116 -950104 -2071911 -2346904 -2084486 -2008654 -1878619 -1302417 -928695 -1458832 -2265841 -2315568
28106 -2315568 -1765386 -1384894 -1099846 -442392 215630 267873 97869 284543 251889 -672967
28096 -672967 -1489475 -764266 702826 635178 -1196316 -2416673 -1571997 -122026 76759
28087 76759 -550195 -497364 326966 856778 753887 577086 536952 314585 -123026 -487964
28077 -487964 -738823 -915421 -705107 73334 847375 880209 203195 -675516 -1535545 -2129932
28067 -2129932 -1673734 178156 2138645 2421721 1115303 103238 374626 808499 222634
28058 222634 -758169 -925309 -467450 -367313 -530608 -32438 1048481 1532345 960090
28049 960090 192580 -78706 -210859 -590960 -866451 -747283 -570391 -463462 60831 985407
28039 985407 1304584 572507 -42939 599744 1739324 1785797 642113 -454545 -930748
28030 -930748 -1182591 -1185714 -486010 406863 297345 -743760 -1298911 -904347 -798600 -1645760
28020 -1645760 -2093346 -769887 1450197 2505097 1785096 559253 174683 750694 1400947
28011 1400947 1119513 -258544 -1598768 -1477608 46594 1416342 1664522 1505603 1766847
28002 1766847 1923265 1225541 288981 235852 875497 1062566 525950 115221 352372 776407
27992 776407 731689 58093 -913755 -1493223 -1061575 64551 655585 69543 -824588 -892232
27982 -892232 -230913 350822 579589 507035 -122692 -1172134 -1591831 -886931 -282262 -931405
27972 -931405 -1784114 -1070886 717531 1458749 715379 167991 673994 1191050 1052203
27963 1052203 1068285 1606041 1658095 827549 315217 744106 795754 -551250 -1975277 -1629046
27953 -1629046 172630 1650126 1985152 1576692 773574 -111352 -256773 650464 1403024
27944 1403024 717675 -823552 -1693922 -1721151 -1854529 -2061832 -1331221 195101 911717
27935 911717 67624 -1073437 -1068125 -165811 370884 -20629 -866694 -1473915 -1504433 -1073979
27925 -1073979 -641520 -576445 -736499 -759714 -673677 -732401 -759948 -299465 569741 1204928
27915 1204928 1279612 1119616 1084252 1144373 1105585 736047 -237624 -1622899 -2383407 -1621998
27905 -1621998 25937 884932 296322 -702806 -984454 -648239 -324185 -108960 152286
27896 152286 262991 62033 -116548 33953 297852 459524 736202 1141857 1073492 237120
27886 237120 -610870 -665041 -308103 -454721 -1077299 -1373854 -1134322 -900712 -862634 -621547
27876 -621547 -131442 80071 -150766 -277965 85764 613997 817214 586210 51538 -525954
27866 -525954 -667223 -130951 505428 468283 27640 207248 1114036 1608506 993325 -59173
27856 -59173 -799340 -1472013 -2282560 -2413532 -1284722 14542 -33984 -1123527 -1508748
27847 -1508748 -523678 614328 654824 -219365 -1115681 -1616202 -1726281 -1367059 -500150
27838 -500150 581372 1423101 1690009 1276006 461539 -127372 -153366 -61839 -481859 -1305546
27828 -1305546 -1897971 -1987150 -1703362 -1034191 -66012 534181 337490 253780 1509258 3468497
27818 3468497 3942790 2131350 -109517 -682552 217981 876045 388017 -782274 -1883833
27809 -1883833 -2514859 -2581242 -2364471 -2306822 -2306500 -1782235 -764027 -65462 65977 390838
27799 390838 1132004 1252729 268629 -508737 89637 1058466 803371 -189120 -229559 669984
27789 669984 940834 243837 -149737 121405 -105441 -1083990 -1327390 -161609 888137
27780 888137 550002 -92757 462381 1505987 1286378 -84651 -817426 -163971 784987
27771 784987 993543 662295 320977 30315 -139794 123469 681779 825366 277568 -339145
27761 -339145 -418341 -120650 194057 638351 1315412 1682736 1159150 129806 -419011 -239141
27751 -239141 -50675 -296567 -461551 -87202 236200 -306896 -1343321 -1709073 -1215771
27742 -1215771 -974490 -1620267 -2166855 -1337959 584731 2058607 2112141 1158547 149314
27733 149314 -428640 -723290 -1139586 -1780469 -2075611 -1300589 260032 1221968 691860
27724 691860 -610165 -1462095 -1732760 -1979311 -2101665 -1630249 -954596 -881276 -1133573 -726949
27714 -726949 192734 459696 329 83140 932156 930590 -744365 -2351288 -1970611 -422406
27704 -422406 -8861 -1085236 -1780495 -947258 384207 808463 375598 -355 13273
27695 13273 43054 -172952 -444981 -466906 -187214 131882 160171 -183841 -724387 -1264902
27685 -1264902 -1557400 -1149094 134961 1493116 1761129 1046221 785301 1556366 1905370
$$ [...]
##END NTUPLES=NMR SPECTRUM
##END=
