##TITLE=31Pdec_LY-15Dix.4.B
 CD3CN, 24 sc
 4.06.2021
##JCAMPDX= 6.0         $$ Bruker NMR JCAMP-DX V2.0
##DATA TYPE= NMR SPECTRUM
##DATA CLASS= NTUPLES
##ORIGIN= UXNMR, Bruker Analytische Messtechnik GmbH
##OWNER= root
$$ XWIN-NMR		Version 3.5
$$ Fri Jun  4 10:08:05 2021 Russian Standard Time (UT+4h)  she@DPX200
##.OBSERVE FREQUENCY= 81.013821
##.OBSERVE NUCLEUS= ^31P
##.ACQUISITION MODE= SIMULTANEOUS
##.ACQUISITION SCHEME= undefined
##.AVERAGES= 24
##.DIGITISER RES= 16
##SPECTROMETER/DATA SYSTEM= spect
##.PULSE SEQUENCE= zgpg30
##.SOLVENT NAME= CD3CN
##.SHIFT REFERENCE= (INTERNAL, CD3CN, 0, 248.564)
##AUDIT TRAIL= $$ (NUMBER, WHEN, WHO, WHERE, WHAT)
$$ ##TITLE= Audit trail, XWIN-NMR		Version 3.5
$$ ##JCAMPDX= 5.01
$$ ##ORIGIN= Bruker BioSpin GmbH
$$ ##OWNER= she
$$ F:/spectra/data/she/nmr/P31/1/pdata/1/auditp.txt
$$ ##AUDIT TRAIL=  $$ (NUMBER, WHEN, WHO, WHERE, WHAT)
(   1,<2021-06-04 10:07:03.45 +0400>,<she>,<DPX200>,
      <created by zg, POWCHK disabled, PULCHK disabled
       configuration hash MD5:
       00 E9 B6 7A A2 85 ED C7 34 08 36 98 17 FE 4E 26
       data hash MD5: 32K
       4D 40 9F D5 27 EE FF CE 83 0F 81 E9 64 B9 02 AE>)
(   2,<2021-06-04 10:07:07.60 +0400>,<she>,<DPX200>,
      <Start of raw data processing
       efp BC_mod = 2 LB = 1 FT_mod = 6 PKNL = 1 PHC0 = -5966.97 PHC1 = 251.8705 SI = 64K 
       data hash MD5: 64K
       D1 EB AF 04 29 2E DF CC 9D F2 E5 DE BB 49 80 91>)
(   3,<2021-06-04 10:07:28.00 +0400>,<she>,<DPX200>,
      <pk PHC0 = 5.506649 PHC1 = 0 
       data hash MD5: 64K
       BB 90 2D A9 31 38 68 9B 9F 50 43 45 59 EA 32 70>)
(   4,<2021-06-04 10:07:30.95 +0400>,<she>,<DPX200>,
      <abs ABSG = 5 
       data hash MD5: 64K
       89 0A E7 C6 0C 0B 91 E3 F8 EA 24 5F 5A 92 71 33>)
$$ ##END=
$$ 
$$ hash MD5
$$ B9 92 E6 F3 E8 CC E8 9A CF 25 DF 81 72 CB EC A8
##$RELAX= 
##$RELAX= 
##$RELAX= 
##$RELAX= 
##$RELAX= 
##$RELAX= 
##$RELAX= 
##$RELAX= 
$$ Bruker specific parameters
$$ --------------------------
##$DU= <F:/spectra>
##$EXPNO= 1
##$NAME= <P31>
##$PROCNO= 1
##$TYPE= <nmr>
##$USER= <she>
##$AMP= (0..31)
100 100 100 100 100 100 100 100 100 100 100 100 100 100 100 100 100 100 
100 100 100 100 100 100 100 100 100 100 100 100 100 100 
##$AQSEQ= 0
##$AQ_mod= 1
##$AUNM= <au_zg>
##$AUTOPOS= <>
##$BF1= 81.014009
##$BF2= 200.13
##$BF3= 200.13
##$BF4= 200.13
##$BF5= 200.13
##$BF6= 200.13
##$BF7= 200.13
##$BF8= 200.13
##$BYTORDA= 1
##$CFDGTYP= 0
##$CFRGTYP= 5
##$CHEMSTR= <none>
##$CNST= (0..31)
1 1 145 1 1 1 1 1 1 1 1 1 1 1 1 1 1 1 1 1 1 1 1 1 1 1 1 1 1 1 1 1 
##$CPDPRG= <waltz16>
##$CPDPRG1= <>
##$CPDPRG2= <waltz16>
##$CPDPRG3= <>
##$CPDPRG4= <mlev>
##$CPDPRG5= <mlev>
##$CPDPRG6= <mlev>
##$CPDPRG7= <mlev>
##$CPDPRG8= <mlev>
##$CPDPRGB= <>
##$CPDPRGT= <>
##$D= (0..31)
0 1 0 0 0 0 0 0 0 0 0 0.03 2e-05 3e-06 0 0 0 0 0 0 0 0 0 0 0 0 0 0 0 0 
0 0 
##$DATE= 1622786822
##$DBL= (0..7)
120 120 120 11 120 120 24 19 
##$DBP= (0..7)
150 150 150 150 150 150 150 150 
##$DBP07= 0
##$DBPNAM0= <>
##$DBPNAM1= <>
##$DBPNAM2= <>
$$ [...]
##$SUBNAM3= <"">
##$SUBNAM4= <"">
##$SUBNAM5= <"">
##$SUBNAM6= <"">
##$SUBNAM7= <"">
##$SUBNAM8= <"">
##$SUBNAM9= <"">
##$SW= 501.771253377433
##$SWIBOX= (0..15)
0 1 3 0 0 0 0 0 0 0 0 0 0 0 0 0 
##$SW_h= 40650.406504065
##$TD= 32768
##$TD0= 1
##$TE= 0
##$TE2= 300
##$TE3= 300
##$TEG= 300
##$TL= (0..7)
0 120 53 12 22 120 120 120 
##$TP= (0..7)
150 150 150 150 150 150 150 150 
##$TP07= 0
##$TPNAME0= <>
##$TPNAME1= <>
##$TPNAME2= <>
##$TPNAME3= <>
##$TPNAME4= <>
##$TPNAME5= <>
##$TPNAME6= <>
##$TPNAME7= <>
##$TPOAL= (0..7)
0.5 0.5 0.5 0.5 0.5 0.5 0.5 0.5 
##$TPOFFS= (0..7)
0 0 0 0 0 0 0 0 
##$TUNHIN= 0
##$TUNHOUT= 0
##$TUNXOUT= 0
##$USERA1= <user>
##$USERA2= <user>
##$USERA3= <user>
##$USERA4= <user>
##$USERA5= <user>
##$V9= 5
##$VALIST= <valist>
##$VCLIST= <CCCCCCCCCCCCCCC>
##$VD= 0
##$VDLIST= <DDDDDDDDDDDDDDD>
##$VPLIST= <PPPPPPPPPPPPPPP>
##$VTLIST= <TTTTTTTTTTTTTTT>
##$WBST= 1024
##$WBSW= 4
##$XGAIN= (0..3)
0 0 0 0 
##$XL= 0
##$YL= 0
##$YMAX_a= 2371
##$YMIN_a= -9430
##$ZGOPTNS= <>
##$ZL1= 120
##$ZL2= 120
##$ZL3= 120
##$ZL4= 120
##$ABSF1= 248.5645
##$ABSF2= -253.2056
##$ABSG= 5
##$ABSL= 3
##$ALPHA= 0
##$AQORDER= 0
##$ASSFAC= 0
##$ASSFACI= 0
##$ASSFACX= 0
##$ASSWID= 0
##$AUNMP= <proc_1d>
##$AZFE= 0.1
##$AZFW= 0.5
##$BCFW= 0
##$BC_mod= 2
##$BYTORDP= 0
##$COROFFS= 0
##$CY= -3
##$DATMOD= 1
##$DC= 0
##$DFILT= <>
##$DTYPP= 0
##$F1P= 0
##$F2P= 0
##$FCOR= 1
##$FTSIZE= 65536
##$FT_mod= 6
##$GAMMA= 0
##$GB= 0
##$INTBC= 1
##$INTSCL= 5.30512e-09
##$ISEN= 30
##$LB= 1
##$LEV0= 0
##$LPBIN= 0
##$MAXI= 10000
##$MC2= 0
##$MEAN= 0
##$ME_mod= 0
##$MI= 50
##$NCOEF= 0
##$NC_proc= -5
##$NLEV= 6
##$NOISF1= 182.463
##$NOISF2= 159.3651
##$NSP= 0
##$NTH_PI= 0
##$NZP= 0
##$OFFSET= 248.5645
##$PC= 4
##$PHC0= -5961.463
##$PHC1= 251.8705
##$PH_mod= 1
##$PKNL= yes
##$PPARMOD= 0
##$PSCAL= 0
##$PSIGN= 0
##$REVERSE= no
##$SF= 81.014009
##$SI= 65536
##$SIGF1= 159.3651
##$SIGF2= -187.1042
##$SINO= 113.3802
##$SIOLD= 16384
##$SREGLST= <1H.CDCl3>
##$SSB= 0
##$STSI= 65536
##$STSR= 0
##$SW_p= 40650.406504065
##$SYMM= 0
##$S_DEV= 0
##$TDeff= 32768
##$TDoff= 0
##$TI= <>
##$TILT= no
##$TM1= 0
##$TM2= 0
##$TOPLEV= 0
##$USERP1= <user>
##$USERP2= <user>
##$USERP3= <user>
##$USERP4= <user>
##$USERP5= <user>
##$WDW= 1
##$XDIM= 65536
##$YMAX_p= 469112803
##$YMIN_p= -86767270
$$ End of Bruker specific parameters
$$ ---------------------------------
##NTUPLES= NMR SPECTRUM
##VAR_NAME=  FREQUENCY,     SPECTRUM/REAL,   SPECTRUM/IMAG
##SYMBOL=    X,             R,               I
##VAR_TYPE=  INDEPENDENT,   DEPENDENT,       DEPENDENT
##VAR_FORM=  AFFN,          ASDF,            ASDF
##VAR_DIM=   65536,         65536,           65536
##UNITS=     HZ,            ARBITRARY UNITS, ARBITRARY UNITS
##FACTOR=    0.620285442955139, 1,           1
##FIRST=     20137.2065510759, 0,            0
##LAST=      -20513.1999529892, 0,           0
##MIN=       -20513.1999529892, -86767270,   0
##MAX=       20137.2065510759, 469112803,    0
$$ Real data points
##PAGE= N=1
##DATA TABLE= (X++(R..R)), XYDATA
$$ [...]
37753 2911938 1272999 350246 721304 1362507 1078064 57974 -479476 1613 809436
37744 809436 1259547 1483643 1655949 1443372 837908 549227 794801 665999 -377048
37735 -377048 -1331858 -1069783 -43729 632463 953679 1470805 1732472 907127 -511977
37726 -511977 -1238860 -1136913 -1096242 -1236142 -825804 104331 613109 342538 -172682 -599300
37716 -599300 -910601 -661149 384361 1189659 626404 -567958 -782452 -196410 -390217
37707 -390217 -1400704 -1495910 -178034 921214 738588 154630 -69337 -550708 -1564286
37698 -1564286 -2143187 -1908552 -1782761 -1885079 -901723 1240984 2373159 1292780 -245575
37689 -245575 -509218 -480522 -1437169 -2088923 -841202 940800 995152 76768 531025 1959655
37679 1959655 1840830 57407 -796597 166670 878656 196756 -254145 652747 1437282
37670 1437282 853606 251931 1062958 2040657 1319785 -342973 -791165 99007 578161
37661 578161 49513 -362403 -176097 -347777 -1297758 -1916799 -1297116 -168426 235688
37652 235688 -157274 -550545 -600254 -607964 -698513 -525338 226180 1444507 2638255 3138663
37642 3138663 2521079 1215541 424970 855209 1679460 1497723 322711 -343102 251427
37633 251427 872880 173053 -1155309 -1468261 -846865 -923700 -2042550 -2524232 -1428168
37624 -1428168 -243265 -571111 -1545342 -1193375 553438 1945691 1995934 1293586 525986
37615 525986 -115946 -92908 1193892 2961274 3441872 2195943 636895 -205779 -896845
37606 -896845 -1822671 -1842085 -50250 2297658 3199214 2535761 1789556 1643455 1484570
37597 1484570 1126218 1322810 2238339 2874425 2661288 2401368 2805509 3140267 2442688
37588 2442688 1342070 1319520 2412444 3025651 2224429 988031 613708 870164 610975
37579 610975 -421689 -1419671 -1854252 -2008372 -2142086 -2002075 -1432516 -848560 -778324 -1305795
37569 -1305795 -2097962 -2593317 -2161859 -655817 1077767 1822807 1329246 498992 119673
37560 119673 46264 -201169 -762204 -1611652 -2632503 -3200668 -2558411 -1034273 16596
37551 16596 27800 -10897 691794 1283653 632015 -763170 -1461727 -1054309 -243407 461608
37541 461608 884800 565569 -632907 -1675269 -1418218 -149762 1165843 2514653 4090816
37532 4090816 4641677 2794339 -149133 -1184840 266233 1567728 882656 -428359
37524 -428359 -578509 -199956 -641689 -1268918 -617952 913497 1637758 1172305 573374
37515 573374 276959 -333502 -1387781 -2038778 -1638780 -380607 1179524 2373409 2452779
37506 2452779 1313016 -23184 -484616 -231575 -90221 -189890 -116431 19600 -271180
37497 -271180 -931218 -1499689 -1830284 -1847524 -1217054 -261743 -368922 -2065800 -3456537
37488 -3456537 -2389307 311237 1824900 1341906 812352 1498294 2242456 1995975 1711401
37479 1711401 2270337 2479037 1004500 -1076974 -1679218 -770820 -36541 28198 631877
37470 631877 2264479 3669735 3819565 3438304 3678974 4298374 4176934 3106576 2025570
37461 2025570 1574378 1344189 874776 671067 1464502 2713937 2819594 1193547 -680271
37452 -680271 -982777 192745 1255595 1406948 1338270 1691060 2117268 2237746 2375699
37443 2375699 2748142 2919259 2710578 2699954 3059120 2865835 1556098 194458 102588
37434 102588 882239 1095085 401121 -395578 -1080727 -2176212 -3321658 -3173711 -1422359
37425 -1422359 459668 1134813 904910 615474 245525 -418779 -691151 154719 1469704
37416 1469704 1909663 1298702 718903 844911 1246907 1400010 1348953 1113954 377375 -801843
37406 -801843 -1729973 -2015435 -2061014 -2071609 -1329648 640225 2688650 2989834 1388860
37397 1388860 -217566 -154812 1195750 2273881 2301082 1663758 861488 24213 -556767
37388 -556767 -273943 1016211 2457847 2836700 1699801 -263950 -1836062 -2227139 -1640315
37379 -1640315 -1020075 -1144351 -1896355 -2505526 -2468795 -2034221 -1739784 -1704520 -1524264 -749112
37369 -749112 637998 2097304 2813219 2325532 1125346 464841 1156055 2481868 2756581
37360 2756581 1318288 -434591 -667159 422178 790203 -487826 -1675203 -872320 905557
37351 905557 932046 -1203570 -2866555 -2255551 -1001197 -1536423 -3464782 -4452439 -3766214
37342 -3766214 -2792906 -2398718 -1903650 -870516 11587 391815 972246 2004143 2439669
37333 2439669 1450058 -297871 -1666051 -2344140 -2405786 -1652632 -306594 600657 515137
37324 515137 232850 563391 978494 639888 -63502 -257949 -192329 -706003 -1513189 -1479480
37314 -1479480 -501010 261781 171132 -58138 355189 1090754 1297140 732848 -45770 -369717
37304 -369717 -209147 -304248 -1254667 -2379708 -2220232 -637328 513138 -273500 -1944585
37295 -1944585 -2291033 -975734 319717 510242 286350 537991 1019722 1022863 350080
37286 350080 -724420 -1649547 -1659490 -546148 619399 541886 -533697 -1205337 -995574
37277 -995574 -737594 -844136 -703324 -94201 326952 421772 917730 1767710 1776099 707249
37267 707249 151105 1129433 2313961 2038164 812856 233028 413646 293822 -219340
37258 -219340 -277821 75020 -105260 -854315 -1112482 -573757 -261952 -808064 -1373655 -939259
37248 -939259 194944 859978 450176 -610927 -1491604 -1618610 -921752 186221 959940
37239 959940 644125 -919500 -2699590 -2929985 -965767 1471851 1963604 402171 -916679
37230 -916679 -548313 296955 55071 -687932 -485185 437643 819948 731202 1247741 2133284
37220 2133284 1942638 537087 -454859 -118635 532891 466908 218949 687904 1512647
37211 1512647 1615593 645370 -827268 -1994742 -2254877 -1563710 -668046 -391283 -535441
37202 -535441 -215840 656556 1182838 936365 564237 611001 775851 735375 689885 664096
37192 664096 286665 -314958 -526418 -607694 -1680292 -3591678 -4245715 -2327070 453601
37183 453601 1350353 51342 -1390446 -1588390 -1134554 -967575 -994820 -745568 -283059
37174 -283059 94189 439726 1051148 2076135 3283928 3964456 3304892 1373251 -515741
37165 -515741 -1057209 -434567 98468 -45083 -270297 -69651 51535 -628278 -1808277
37156 -1808277 -2278249 -1276894 508118 1489045 816193 -713440 -1693136 -1821168 -1873895
37147 -1873895 -2016879 -1300985 557082 1990323 1369434 -629931 -1772078 -1142707 43884
37138 43884 564539 723995 1265217 1933394 2069147 1953809 2494098 3677752 4226206 3121680
37128 3121680 1028308 -289037 89228 1318624 2032095 2024353 2047588 2213390 1723141
37119 1723141 503596 -77250 946693 2445165 2573259 1335078 386753 486029 666886
37110 666886 195635 -143059 552418 1747871 2282006 2000675 1626040 1433512 978199
37101 978199 5818 -1077752 -1677214 -1529734 -817627 -71530 180391 -64176 -315584
37092 -315584 -368233 -645952 -1373456 -1850690 -1247948 86677 897686 637944 63724 -17470
37082 -17470 123996 -237571 -1062542 -1644835 -1701674 -1647291 -1774845 -1863603 -1810836 -1978779
37072 -1978779 -2442169 -2429658 -1216748 675117 1883841 1759323 902700 227425 172342
37063 172342 802529 1805027 2214517 1119294 -912934 -2023594 -1302606 -13085 155173
37054 155173 -771217 -1573419 -1710915 -1488173 -996524 -298374 -267727 -1688143 -3616375
37045 -3616375 -4228957 -3410161 -2862827 -3317899 -3407405 -2083826 -472361 -83726 -534102
37036 -534102 -537603 -188898 -594291 -1741230 -2355037 -1806423 -828517 -218418 103410 545006
37026 545006 1158825 1640136 1463170 207168 -1617460 -2485099 -1552016 -73292 88034
37017 88034 -855847 -918868 565811 1848655 1442715 356330 442772 1608356 2136321
37008 2136321 1262928 -18927 -678484 -916445 -1359986 -1848098 -1610904 -392248 998723
36999 998723 1400717 661181 131479 1274390 3653293 5042673 4024781 1755808 392313
36990 392313 445825 785489 723730 603071 415641 -451852 -1614701 -1464105 413538 1883482
36980 1883482 766151 -2089153 -3772872 -2986575 -1202631 -193608 5696 218471 612628
36971 612628 960315 1458074 2250919 2669331 1941518 462721 -502370 -383638 110506
36962 110506 55712 -623767 -1339623 -1635111 -1518405 -1248816 -1028534 -825138 -427416 214452
36952 214452 711637 533237 -295139 -978476 -681765 532280 1680603 1856880 1128446
36943 1128446 331913 125761 475550 945116 1079246 516487 -642504 -1322774 -113613
36934 -113613 2844784 5214094 4797330 2308106 626698 1273610 2917349 3684054 3487370
36925 3487370 3223197 2930175 2066117 861776 71909 -229461 -474719 -586271 -238284
36916 -238284 230533 352534 642964 1830786 3207403 3286545 2121305 1300003 1362437
36907 1362437 1017497 -392102 -1467633 -1008079 -147731 -628689 -2046112 -2657612 -2281918
36898 -2281918 -2377660 -3273646 -3245734 -995900 2299997 4272430 3903225 2127194 493563
36889 493563 -130253 113112 474410 414067 195038 426182 985844 955049 -75418 -1190675
36879 -1190675 -1236129 -394201 48876 -516082 -1241449 -1170081 -711625 -989509 -1923695 -1962436
36869 -1962436 -162980 2205182 2971886 1672878 -58918 -708600 -572460 -921950 -2243219
36860 -2243219 -3838261 -4694535 -4304957 -3034772 -2013089 -2151002 -2930686 -2847213 -1504869
36851 -1504869 -359740 -536975 -878368 422001 2862975 4140940 3554675 2933892 3572783
36842 3572783 4118293 2802206 355906 -1026934 -827957 -440723 -543707 -191623 1040939
36833 1040939 1735946 547154 -1626923 -2652947 -1847965 -475216 271035 579989 1034303
36824 1034303 1322925 725026 -558362 -1375291 -995496 1599 430077 -194475 -1285599
36815 -1285599 -1967295 -1946222 -1578168 -1279962 -1056159 -596899 274918 1317816 2012156
36806 2012156 1990518 1381987 716951 408188 358689 232332 44722 126672 416858 332195
36796 332195 -220552 -223459 1207240 3160601 3622937 2096604 449347 496390 1688852
36787 1688852 2236298 1827207 1826621 2906772 3919084 3579613 2213853 1119451 859790
36778 859790 929026 771330 461978 402962 746313 1202777 1306075 867761 144758 -513551
36768 -513551 -1014880 -1313279 -1112026 -219875 930306 1605622 1582618 1249463 1048512 1240982
36758 1240982 1944099 2803166 2936729 1982617 904050 803075 1197588 675641 -856373
36749 -856373 -1993005 -2013306 -1698560 -1576416 -983875 354986 1353414 1212801 728461
36740 728461 810339 943040 403512 -139989 278824 1164257 1387909 970048 541561 -155497
36730 -155497 -1562248 -2776289 -2531124 -1269171 -507931 -526608 -445474 -211327 -521752
36721 -521752 -975489 -428260 721376 742350 -595836 -1494393 -981614 -253184 -377075
36712 -377075 -630957 -200325 214637 -231732 -964261 -1063853 -764337 -716984 -794379 -710067
36702 -710067 -863869 -1515121 -1972980 -1576968 -714522 -89374 176103 86299 -504604 -1066460
36692 -1066460 -574000 697039 1002311 -230847 -1165363 -317440 982565 660317 -839524
36683 -839524 -1397483 -468302 588544 935894 1049840 1279026 1326815 1102742 701602 -213172
36673 -213172 -1679485 -2553347 -1859646 -570545 -399747 -1218270 -1413733 -482260 647566
36664 647566 1679381 3241397 4960381 5278885 3685078 1448762 -248534 -1306762
36656 -1306762 -1581207 -587539 1175536 2322279 2522349 2691984 2847562 1743875 -621333
36647 -621333 -2161756 -1475365 258430 1284349 1540467 1767768 2002120 2249203 3068839
36638 3068839 4108636 3684950 1379902 -606764 -524737 159481 -729272 -2325255 -2222045
36629 -2222045 -666498 -132645 -1062475 -1244870 167110 1065651 -75928 -1630744 -1392522
36620 -1392522 142180 834102 44483 -926240 -862404 224849 1547309 2124887 1307943
36611 1307943 -444529 -1649481 -1354569 -261906 285476 13125 -234219 191285 1013604
36602 1013604 1442566 887168 -492502 -1643289 -1447138 -60129 1054129 851718 -88319
36593 -88319 -630211 -701096 -970930 -1372131 -1088636 -47834 621512 33087 -1243342 -1913128
36583 -1913128 -1510951 -751547 -480273 -662612 -512842 502222 1941503 2806628 2645165
36574 2645165 1963236 1443256 1146104 816947 589345 782384 1178360 1205809 869129 767309
36564 767309 977559 703174 -417205 -1272502 -431865 1814852 3406848 2753124 509633
36555 509633 -1193663 -978937 645776 2173503 2706212 2562232 2508225 2719294 2696812
36546 2696812 2078875 1158933 477042 227792 309574 632242 1012455 1069116 727654 592523
36536 592523 1190763 1995523 1970554 1088338 424423 517554 560853 -270023 -1485993 -1967273
36526 -1967273 -1387885 -305618 617471 828559 -57277 -1580339 -2357244 -1595560 -219184
36517 -219184 447518 529661 942778 1473238 1153828 344753 587933 2089597 3086063 2321101
36507 2321101 591306 -879214 -1999468 -2793763 -2458543 -866214 284346 -503788 -2212357
36498 -2212357 -2651146 -1457937 -144780 319365 270360 16296 -504759 -795860 -227932
36489 -227932 476692 -155398 -1943596 -2854712 -1762376 47734 825428 497430 65913
36480 65913 67917 558901 1572601 2545684 2162062 -57848 -2597163 -3484726 -2621888 -1586785
36470 -1586785 -1446665 -1790365 -1804831 -1315835 -591539 173489 893879 1455801 1689084 1413736
36460 1413736 714562 231491 662070 1689872 2034572 1080079 -184355 -557845 -336587
36451 -336587 -646399 -1527376 -1910886 -1390658 -758394 -591702 -509386 -263600 -439640 -1324744
36441 -1324744 -1984106 -1436047 -185754 440684 228324 306943 1386682 2675911 2949284
36432 2949284 2085751 1032797 543727 446226 136179 -553994 -1147538 -1134005 -700490 -697685
36422 -697685 -1686597 -3079186 -3572617 -2592456 -990286 -29025 12796 -246092 -514485
36413 -514485 -1160214 -2161678 -2587255 -1769590 -460228 13908 -508562 -1003216 -916072
36404 -916072 -847530 -1315907 -1803222 -1668998 -1307184 -1567771 -2405410 -2884532 -2337225 -866067
36394 -866067 1057130 2739848 3236901 2144872 486012 -180897 221588 167669 -1113896
36385 -1113896 -2236256 -1506738 666316 2419885 2943833 2906704 2566091 1183298 -1121491
36376 -1121491 -2469433 -1393292 992104 2310911 1932139 1306816 1488659 1794006 1274046
36367 1274046 230506 -468360 -640112 -503589 108464 1219679 1886695 1113398 -501457
36358 -501457 -1206010 -418806 482736 231405 -481131 -198142 913503 1191172 -25660
36349 -25660 -1322384 -1198588 -117615 408157 146700 265210 1214403 1888147 1393553
36340 1393553 439883 22016 -309271 -1515306 -2971287 -2932931 -1144942 559532 729888
36331 729888 32753 -170977 231002 546304 696757 1050353 1455569 1514091 1379521 1355571
36321 1355571 1151536 438808 -364979 -824814 -1405795 -2538643 -3393592 -2990536 -2061757
36312 -2061757 -2214961 -3517119 -4611061 -5059383 -5610682 -6045016 -4989304 -2492340 -573320
36303 -573320 -153123 441881 2429597 4012595 2949442 253522 -1049627 -99034 1149130
36294 1149130 1117523 293509 -348702 -674039 -745958 -415412 8639 -71356 -407005 -130660
36284 -130660 696305 1066491 808491 958053 1863672 2328184 1388465 -262731 -1462905
36275 -1462905 -2064860 -2301298 -1763843 -263474 1092084 1104801 375476 589223 1965214
36266 1965214 2755518 1670086 -220756 -691842 1006123 3299007 3951518 2269413 -327909
36257 -327909 -1791373 -1460660 -536856 -522584 -1454787 -2003857 -1206521 358142 1297099
36248 1297099 1006980 223521 558 432141 621465 -128212 -1390720 -2116945 -1916501
36239 -1916501 -1467557 -1544704 -1980591 -1935801 -1077310 -69857 252456 -110828 -475398 -459884
36229 -459884 -353639 -424503 -395594 90 369687 199036 -172819 104939 1040386 1600442
36219 1600442 1143348 274890 -189975 -384971 -819569 -1259744 -1121619 -687063 -916217
36210 -916217 -1970295 -2758692 -2264181 -756704 659630 1353488 1651128 2101487 2536775
36201 2536775 2123783 500598 -1394110 -2168345 -1658742 -1092524 -1378312 -2037775 -2272445
36192 -2272445 -2203877 -2259220 -2076608 -1088998 249196 900955 680331 285862 113091 -24544
36182 -24544 -194340 -325642 -702249 -1492167 -1983619 -1334221 89252 1187688 1717437
36173 1717437 2204245 2532009 2092281 1299066 1372030 2400292 3110237 2786061 1889479
36164 1889479 583258 -1532385 -3764929 -4409218 -3315896 -2457427 -2881486 -3066142 -1699681
36155 -1699681 -131157 -136892 -894964 -499735 644533 439442 -1426964 -2980292 -2909656
36146 -2909656 -2000110 -1396528 -1101065 -567482 401769 1546547 2101442 1166065 -921478
36137 -921478 -2230138 -1559239 -369892 -705373 -1892240 -1523286 555446 1741493 516516
36128 516516 -1555898 -2451220 -2211806 -1808989 -1317117 -523130 56068 47184 39299 493590
36118 493590 875438 769856 689501 797181 108298 -1757752 -3162857 -2323215 112226
36109 112226 1784241 1458027 -73558 -1443128 -1864317 -1208568 -60309 546571 316454
36100 316454 182147 789919 1240546 494219 -716870 -883695 -113852 175676 -270822
36091 -270822 -246221 574242 857790 -151262 -1228332 -995854 63726 537712 146087
36082 146087 -286864 -375845 -542683 -997657 -1274397 -904686 -37249 706766 754769 61636
36072 61636 -743530 -904893 -424225 -125236 -658040 -1790522 -2870925 -3499229 -3419352 -2338310
36062 -2338310 -486769 1019012 1115353 -11248 -1245618 -1945060 -2398813 -2950531 -3391428
36053 -3391428 -3420862 -3116676 -2652596 -2011346 -1293086 -903648 -1059136 -1404050 -1502102 -1460565
36043 -1460565 -1655945 -2027641 -2119622 -1763248 -1243403 -739490 -84856 708506 1103302 607021
36033 607021 -497005 -1363789 -1488406 -1079051 -531435 90887 845048 1463725 1531672 1114061
36023 1114061 837576 1126289 1601643 1589864 1118138 926771 1337602 1588381 772662 -773320
36013 -773320 -1631596 -975255 408466 1086552 642446 -79930 -275022 -187877 -602958 -1661511
36003 -1661511 -2612588 -2718231 -2034166 -1152714 -518495 -313528 -710282 -1649202 -2416391
35994 -2416391 -2138066 -940661 5820 -1741 -259856 185900 1042184 1308186 926258 793117
35984 793117 1164993 1171781 224621 -1017403 -1543696 -1175104 -466047 -20957 -192382 -829978
35974 -829978 -1120784 -435625 482328 170401 -1372988 -2346308 -1607622 -238080 251663
35965 251663 -1719 -164919 -467961 -1283370 -1414094 545541 3503870 4685486 3240208
35956 3240208 1075066 -125501 -637966 -949691 -489498 728805 1085521 -403342 -2161322
35947 -2161322 -2090084 -633234 -74458 -1261794 -2655703 -2552651 -955233 823929 1431966
35938 1431966 392256 -1348720 -1897281 -341388 1898796 2570496 1327705 -70402
35930 -70402 -283312 143574 230006 276454 1192751 2756324 3595185 2902546 1474924 789083
35920 789083 1342839 2162379 1931440 464318 -1075123 -1420306 -499574 616243 924504
35911 924504 481209 209608 800826 1844637 2230464 1565974 840979 1112628 1785816
35902 1785816 1202745 -871095 -2495486 -1986037 -110151 1187719 1464984 1799400 2572116
35893 2572116 2895777 2406642 2061487 2537608 3120321 3014701 2678674 2788828 2748605 1581652
35883 1581652 -124519 -634709 485996 1634426 1335635 111856 -505518 -50488 688516
35874 688516 1097332 1322279 1458789 1134418 301068 -243573 241681 1322435 1783896
35865 1783896 1100037 -6475 -572820 -501946 -363031 -401087 -244110 351198 891935 669197
35855 669197 -222936 -846480 -611322 -157952 -601888 -2026879 -3272306 -3322354 -2387857
35846 -2387857 -1330891 -491710 403690 1399586 1936421 1433288 14478 -1422822 -1883832
35837 -1883832 -1186885 -185982 206215 133510 384358 924450 805618 -138977 -667179
35828 -667179 -4963 762072 414930 -270856 141236 938779 719 -2605172 -4089580
35819 -4089580 -2815520 -683163 -318327 -1466145 -1852219 -584171 1096846 1970994 2093099
35810 2093099 1942126 1674384 1455926 1583458 2002474 2309534 2334997 2242648 2080342 1699149
35800 1699149 1082066 391061 -202065 -470255 -197200 403069 679223 293822 -384037
35791 -384037 -916124 -1316779 -1614302 -1531131 -1058371 -696268 -629011 -402302 15930 -232776
35781 -232776 -1480612 -2544341 -2198279 -855987 332477 1214602 2077264 2170352 648828
35772 648828 -1345198 -1535331 333736 1931011 1398148 -518466 -1947276 -2118093 -1389783
35763 -1389783 -260060 752234 1071982 716061 407111 547913 748740 769927 1059009
35754 1059009 1733036 1865435 668470 -1134694 -2021147 -1562091 -880518 -1192535 -2386276
35745 -2386276 -3225340 -2770788 -1380227 -143556 516912 1123152 1874104 1984326 1026340
35736 1026340 142891 695515 2126918 2577234 1536236 421644 330954 681164 569972
35727 569972 136802 -182230 -648506 -1586511 -2534902 -2821025 -2424223 -1707866 -863254 -59682
35717 -59682 469466 846482 1367821 1646621 851752 -799808 -1802249 -1234689 15579
35708 15579 577830 329775 94682 331703 848467 1261273 1204167 619457 112911 256509
35698 256509 426877 -474005 -1913169 -1955170 -240260 1067489 458369 -570076 22233
35689 22233 1567722 1975252 1070605 315220 -14420 -808231 -1598224 -763840 1351634
35680 1351634 2038163 -41873 -2683306 -3054895 -1402151 -383952 -1492358 -3469936
35672 -3469936 -4091149 -2592736 -213830 1249255 1209440 539476 166174 -12383 -467888
35663 -467888 -1027838 -1303357 -1532765 -2006655 -2167852 -1464527 -670331 -961944 -1934433 -2070440
35653 -2070440 -1120758 -355715 -283139 90962 1183221 1752936 846093 -586005 -1087131
35644 -1087131 -607281 16196 487999 876100 843579 196902 -389578 -207469 400927 640763
35634 640763 438953 207639 -27863 -402452 -585421 -244665 245159 333466 144136 85296
35624 85296 82536 -38805 87971 785322 1572656 1863127 1935768 2267782 2402080 1602961
35614 1602961 252941 -634975 -1046212 -1791144 -2808618 -3074865 -2400985 -1946837 -2479377
35605 -2479377 -3292678 -3424826 -2919724 -2256574 -1457647 -478472 284421 587404 794756
35596 794756 1120707 1115353 573899 198630 510009 811740 270437 -594163 -753407 -560245
35586 -560245 -1249731 -2572849 -2632493 -696032 1307899 1230091 -381390 -1202293 -437381
35577 -437381 377545 -13838 -691768 -124227 1328854 1724884 193909 -1820674 -2387959
35568 -2387959 -1441428 -617835 -1049983 -2118159 -2540098 -2004704 -1210975 -705648 -396009
35559 -396009 -142790 -109139 -281700 -233261 213223 499218 28676 -886003 -1317531 -884953
35549 -884953 -125270 311476 377001 420439 647262 947192 1002134 473690 -636352 -1717250
35539 -1717250 -1954907 -1199729 -223985 60515 -476046 -1120735 -1072594 -264366 471761 225558
35529 225558 -793255 -1202499 -98606 1534255 1901912 844348 154145 1087323 2587331
35520 2587331 2777252 1462656 121689 -213699 -5804 -152765 -760474 -1215730 -960864
35511 -960864 12926 1170513 1889516 2060802 2055180 1985754 1522679 797596 783047 1972544
35501 1972544 3212001 2888293 1041418 -733639 -1324682 -920811 115549 1806050 3633425
35492 3633425 4357675 3479653 1983046 972827 417539 -113952 -394904 -139729 62126
35483 62126 -525189 -1517969 -1824137 -1076587 134525 1184817 1782324 1697673 1004340 420324
35473 420324 547475 880989 451818 -618837 -1178882 -737757 -100479 -45646 -334483 -490658
35463 -490658 -681757 -1156408 -1481888 -1121876 -351766 136522 259815 470984 842760 942270
35453 942270 620047 292607 295492 407675 156032 -728153 -2150101 -3537495 -3916415 -2697977
35443 -2697977 -585338 855109 861794 256908 198386 689934 948261 817418 895967 1295965
35433 1295965 1222809 166732 -1169056 -1675814 -1199909 -611926 -730686 -1553385 -2391734
35424 -2391734 -2495635 -1731950 -835433 -663418 -1013102 -737501 544656 1553642 1000252
35415 1000252 -416623 -860649 13827 723744 472564 419195 1549244 2668329 2079843
35406 2079843 513513 481188 2617260 4452144 3745763 1835294 2262923 6364168 11422227
35397 11422227 13512147 11468299 7601958 4937137 4361207 4517680 3939489 2718683
35389 2718683 2012517 2387399 3172916 3413346 2923712 2140676 1363321 652709 262039
35380 262039 505579 1110560 1290489 729110 -3936 -344028 -502280 -835352 -973291 -390019
35370 -390019 458541 563688 -61657 -262133 519652 1346341 1153083 175444 -678468 -1187973
35360 -1187973 -1724004 -2285544 -2488944 -2221500 -1573037 -450074 969591 1753240 1124213
35351 1124213 -306141 -1115150 -790604 -39724 475008 741233 780300 451209 -6701
35342 -6701 -148575 -133284 -459711 -911235 -841991 -533658 -975591 -2092749 -2586623 -1912659
35332 -1912659 -955290 -267225 651441 1524664 689329 -2225375 -4673514 -4147844 -1546949
35323 -1546949 367686 774798 800039 631783 -604993 -2310634 -2583986 -1372911 -853773
35314 -853773 -1874310 -2516510 -1415432 -155268 -646527 -2112323 -2756106 -2809983 -3494069
35305 -3494069 -4053964 -2592973 431872 2176590 1293285 -311316 -339504 1046041 2159496
35296 2159496 2130815 1230486 -47094 -1103290 -1196711 -322016 383793 -28922 -1033759
35287 -1033759 -1408632 -806635 221361 1245822 2091947 2393270 2036929 1769372 2286210
35278 2286210 2896003 2270516 536755 -644546 -380438 290212 64206 -899862 -1641331
35269 -1641331 -1807263 -1525585 -699945 540654 1305259 932591 95471 -118763 142461
35260 142461 -128127 -1036437 -1594687 -1260149 -565575 -123759 47590 171435 565261 1686260
35250 1686260 3252227 3607954 1490651 -1602504 -2619174 -896825 980343 961634 140591
35241 140591 371660 1258861 1383805 996578 1238020 1662218 891372 -732323 -1430075
35232 -1430075 -821307 -347456 -728239 -1029786 -645808 -283171 -347556 -75301 927143
35223 927143 1761602 1692762 1228261 947159 492300 -413431 -1093639 -963018 -443558 -29017
35213 -29017 526225 1256333 1347356 477004 -237043 206006 1047463 903265 -167347 -966554
35203 -966554 -980623 -684980 -432858 -186191 -92839 -342258 -654037 -680164 -576257 -518072
35193 -518072 -223019 332693 479529 -14086 -287136 107256 140879 -844989 -1415874 -128159
35183 -128159 1593311 1116806 -1263949 -2551041 -1562879 -479169 -1099795 -2212669 -2103048
35174 -2103048 -1411070 -1577425 -2127815 -1646709 -420107 -36920 -857606 -1670230 -1677599 -1351682
35164 -1351682 -1357309 -1801126 -2492969 -2995676 -2608837 -1250108 -122673 -528605 -2176038
35155 -2176038 -3541794 -3678321 -2770726 -1260131 434730 1486748 1198825 124444 -377026
35146 -377026 118144 724573 746953 549252 622366 714362 387226 -206012 -544921 -326868
35136 -326868 370952 1095239 1172247 407849 -435567 -539500 -254253 -477510 -893102 -140563
35126 -140563 1894978 3286891 2382803 -46649 -1845211 -1878043 -554840 1261277 2798914
35117 2798914 3376582 2956224 2410188 2358002 2172325 1133465 30374 205155 1243616
35108 1243616 1283164 -120039 -1099514 -212127 1401014 1779977 970732 584808 1174085
35099 1174085 1712988 1599671 1519541 1860925 1690083 222315 -1654465 -2431633 -2009411
35090 -2009411 -1549728 -1535804 -1149351 231135 1913026 2774270 2596286 1961898 1317966
35081 1317966 779290 585012 1035105 1878537 2244945 1471673 -93323 -1245827 -980995
35072 -980995 478007 1750922 1623005 286090 -999735 -1377467 -1038978 -460451 214705
35063 214705 762649 712070 194462 211138 1231867 2149340 1635884 97830 -845014 -561730
35053 -561730 105086 440210 625567 752804 378554 -476756 -995630 -777179 -429296 -429124
35043 -429124 -365301 70958 305358 -131091 -651099 -469481 271264 993988 1610267 2157043
35033 2157043 2209332 1548382 827276 720106 998929 1254404 1762365 2651196 3056786 2374781
35023 2374781 1590276 1860831 2433769 1768947 316822 84065 1386715 2216509 1392946
35014 1392946 278324 358786 960389 775015 199904 468870 1383563 1619136 839665
35005 839665 3750 -238044 -134739 77296 414685 412600 -603772 -2163197 -2652443 -1314005
34995 -1314005 514508 912767 -278513 -1379685 -1056349 93921 412883 -755779 -2349392
34986 -2349392 -2913049 -2204387 -1211290 -868098 -1204839 -1687072 -1878867 -1599051 -828302
34977 -828302 214821 1080426 1426829 1313136 1055903 877427 773364 672140 661583 974306
34967 974306 1597170 1969518 1475561 350869 -430901 -473544 -519089 -1143161 -1599022 -898240
34957 -898240 495241 1245233 1113601 1014577 1212741 987876 286337 80101 527916 388160
34947 388160 -836135 -1684857 -917708 411804 587119 -136124 -324380 -56569 -753844
34938 -753844 -2500460 -3593584 -3134675 -2266092 -2121061 -2118960 -1350773 -418403 -532741 -1468757
34928 -1468757 -1785987 -880603 352455 963402 1017883 913426 523991 -341289 -1185080
34919 -1185080 -1283803 -689259 -109616 85660 51822 -239760 -957701 -1505543 -800937 960708
34909 960708 1965571 1179363 6513 176131 962457 458790 -995206 -1131634 404214
34900 404214 1173582 -221012 -1885951 -1698497 -474976 -140958 -476956 10600 1180464
34891 1180464 1650048 1400414 1642011 2424088 2594597 2032579 1820131 2137601 1995983
34882 1995983 1235672 838940 991049 786456 241670 586853 1953790 2764024 2241847
34873 2241847 1609239 1754976 1627905 331556 -895952 -517848 780017 1234599 779724
34864 779724 852258 1930821 2957460 3050399 2394675 1458711 484691 -206997 -336639 -129582
34854 -129582 -17407 -65964 -287072 -1060958 -2419201 -3335019 -2751330 -1121105 46767
34845 46767 104261 -157556 176282 1101358 2057905 2602135 2521421 1802960 691157 -432946
34835 -432946 -1179952 -1128739 -184367 804395 573585 -815857 -1598953 -567722 1096887
34826 1096887 1483882 751893 642910 1512412 1724356 276193 -1731465 -2906839 -3292479
34817 -3292479 -3359972 -2701633 -1046936 433641 380624 -695243 -1050335 -219794 478357
34808 478357 56112 -805379 -970751 -384599 238540 499552 361344 -347725 -1624901
34799 -1624901 -2704241 -2605232 -1370809 -138723 217837 11503 37342 414164 568928
34790 568928 108895 -778340 -1711790 -2436467 -2671647 -2043554 -481568 1398928 2550046
34781 2550046 2313638 1086703 83112 208458 1137099 1726124 1340509 407168 -361763
34772 -361763 -683876 -403077 734402 2322447 2980415 1813358 -157437 -1104416 -766424
34763 -766424 -549588 -1269361 -2115306 -2195187 -1811094 -1549487 -1225047 -564343 -6451 103859
34753 103859 337561 1208722 2043819 1894184 1080871 715816 994609 1065104 468198 -300104
34743 -300104 -675134 -628520 -358141 -66818 2357 -76652 258691 1179658 1763671 1085524
34733 1085524 -300663 -1071789 -1102445 -1403852 -2135184 -2234262 -1411531 -926238 -1537972 -2093260
34723 -2093260 -1378781 -276264 -504245 -1828956 -2253213 -972055 452179 364631 -800261
34714 -800261 -1460771 -1142571 -686863 -551294 -84404 1202773 2500623 2557666 1359166
34705 1359166 209762 59524 375953 61268 -947440 -1633210 -1400816 -970703 -1390923
34696 -1390923 -2495392 -2946399 -1957888 -508002 -312522 -1697671 -3149162 -3235981 -2327544
34687 -2327544 -1769028 -1879280 -1780063 -1041105 -299863 -8296 259255 685212 486751 -827433
34677 -827433 -2367593 -3050126 -3157509 -3573745 -4053583 -3608250 -2347294 -1547093 -1806877
34668 -1806877 -2325635 -2216372 -1525188 -739395 -214720 -284876 -1048699 -1866950 -1932496 -1467538
34658 -1467538 -1453624 -2097301 -2589438 -2489780 -2182109 -1757535 -752786 626074 1382428
34649 1382428 1350369 1504015 1973923 1368415 -828662 -2728789 -2427023 -693161 394623
34640 394623 441589 442093 338883 -821889 -2537204 -2957577 -1681273 -423880 -303276 -296438
34630 -296438 705603 1912487 1905307 736436 -450432 -1043102 -1038346 -199825 1555106
34621 1555106 3229534 3441479 2157266 839952 630851 1057722 931084 78893 -411913
34612 -411913 252006 1299839 1268221 17176 -1003022 -838431 -353730 -583637 -810583
34603 -810583 113874 1215692 378015 -2094456 -3331577 -2082953 -622917 -1050043 -2029861
34594 -2029861 -1452845 -371182 -1251577 -3435678 -3784734 -1684016 19281 -321004 -861232
34585 -861232 -8956 605490 -889649 -3044033 -3237592 -1823972 -1257502 -2014716 -2316018
34576 -2316018 -1594218 -1314559 -1987627 -2088927 -925530 -250432 -1546640 -3432067 -3465068
34567 -3465068 -1445760 646075 1269904 458925 -1099625 -2654666 -3262594 -2386955 -763494
34558 -763494 247074 249391 25813 227971 670338 933273 839973 221723 -968032 -2040530
34548 -2040530 -1837141 -110485 1803379 2168486 555741 -1814691 -3228871 -2890967 -1467288
34539 -1467288 -356320 -252039 -485347 -27399 1099627 1951069 2010976 1603623 920436
34530 920436 -334805 -1870155 -2391737 -1221949 314547 309765 -1135368 -1939373 -807365
34521 -807365 1180123 2254667 2233719 2209308 2609413 2734842 2142939 1404188 1113186 945320
34511 945320 291382 -678226 -1275787 -1361092 -1398741 -1468149 -996414 210341 1323149 1461727
34501 1461727 913957 686873 1028647 1220732 926683 819042 1339011 1634916 690577
34492 690577 -915333 -1546571 -789740 49044 104371 292654 1548434 2845585 2505924
34483 2505924 897510 32747 505842 742593 -146048 -686070 505319 2144933 2016383
34474 2016383 355301 -582761 -21747 429253 -313546 -1046362 -431116 649679 310720
34465 310720 -1608216 -3366743 -3506580 -2150001 -327619 1041603 1488143 1059781 267540
34456 267540 -344887 -589433 -490161 -98512 281927 152485 -425768 -563365 333884 1475367
34446 1475367 1481294 210415 -931549 -686153 602044 1529375 1305000 502151 167099
34437 167099 499281 752815 452647 188262 722711 1685326 1931238 1097095 -52478
34428 -52478 -825706 -1143595 -775572 647890 2335631 2450277 549518 -1275298 -1024844
34419 -1024844 432072 806377 -149181 -585856 288613 1105867 765456 74859 111178
34410 111178 466996 259995 -231909 -222683 12896 -445054 -1444631 -1693996 -582011 859009
34400 859009 1238498 472657 -375667 -619491 -628571 -880086 -1011572 -427071 525033 841893
34390 841893 306423 -280099 -478950 -787670 -1390026 -1453269 -486840 577511 663000 37788
34380 37788 -544316 -1252337 -2390265 -3117381 -2613837 -1763696 -1780569 -1835135 -368137 1630686
34370 1630686 1458015 -913687 -2206688 -581066 1753600 2215472 1595677 1949500 2774272
34361 2774272 1965130 -571822 -2816822 -3555214 -3191406 -2138702 -626569 120643 -1190279
34352 -1190279 -3552450 -4222654 -2198360 508955 1626202 1125748 334870 637 189626
34343 189626 973740 2088440 2569560 1719048 101865 -1083856 -1282149 -687614 434759
34334 434759 1765953 2524578 1924713 230292 -1246506 -1539260 -1059755 -869978 -1201149
34325 -1201149 -1266065 -535839 459458 923605 794195 415785 -223059 -1114582 -1546562 -901824
34315 -901824 34807 -189241 -1588440 -2671422 -2701377 -2554319 -2810665 -2602280 -1358694
34306 -1358694 -241571 -456535 -1262238 -1184308 -345244 9107 -353286 -633977 -670544 -966087
34296 -966087 -1325403 -1096424 -640410 -925003 -1647034 -1432575 -124123 771163 361277
34287 361277 -416040 -471438 -88467 67 -111665 -41645 -30910 -407517 -771855 -540721
34277 -540721 90076 379069 2309 -651459 -1003940 -899910 -787470 -1187748 -1833066 -1786418
34267 -1786418 -858460 -242315 -892832 -1916508 -1736905 -315602 1180344 2396949 3692549
34258 3692549 4335257 3013276 393170 -1075924 -588672 -50724 -778189 -1373856 -366477
34249 -366477 1098109 1189058 395172 348783 814199 282017 -1055875 -1356033 -89123
34240 -89123 1189831 1324322 995915 1204849 1814630 2205102 2219434 1914297 1278903 647422
34230 647422 637929 1322162 2023976 2093179 1389672 147073 -989858 -1099746 -79064 680297
34220 680297 -138438 -1683529 -1770164 84466 1903286 1960659 906608 481358 1226803
34211 1226803 2292773 2641303 1688385 -426859 -2453265 -2739083 -1192167 253682 80541
34202 80541 -707326 -131836 1774704 3092974 2880208 2213522 2093904 1931038 949488
34193 949488 -146020 -90769 1065816 2150950 2516044 2391690 1864444 737087 -510691
34184 -510691 -849040 -230907 44494 -834419 -1871094 -1627465 -231679 958275 1203815
34175 1203815 834784 196970 -647924 -1265651 -1119269 -635108 -848701 -1743426 -2094569
34166 -2094569 -1324753 -332400 16405 -9252 -64095 -588696 -1674066 -2289343 -1796131 -1088954
34156 -1088954 -919520 -325192 1504213 2906837 1680157 -1162486 -2190014 -306727
34148 -306727 1826797 1831378 626987 133829 135320 -658229 -1920980 -2215744 -1402454 -639403
34138 -639403 -410271 -236284 -55144 -234770 -339019 462515 1647988 1643911 242393 -853919
34128 -853919 -549118 79019 -269482 -920456 -438415 814597 1073506 -70350 -1006498
34119 -1006498 -594161 176971 -67859 -801205 -446256 942164 1422765 -66974 -1979702
34110 -1979702 -2111748 -551758 475774 -436412 -2173385 -2691832 -1527062 -59685 364548
34101 364548 -112490 -369180 207129 1107587 1511588 1330029 1108589 1032613 624815 -267322
34091 -267322 -733164 232776 2169020 3297353 2434018 294510 -1257761 -922160 1046120
34082 1046120 3039217 3277033 1400118 -982311 -1908139 -1282315 -737988 -1209419 -1757967
34073 -1757967 -1328774 -492700 -367668 -651195 -107415 1341453 2369897 2096820 998513
34064 998513 -152062 -1118310 -1674931 -1359190 -317417 471820 461069 309352 755264
34055 755264 1430886 1636188 1696157 2431811 3511710 3549074 2086989 445116 14428
34046 14428 500985 657617 180160 -213476 -392806 -1157597 -2519105 -2906234 -1237986
34037 -1237986 997183 1293921 -409155 -1523849 -501747 969918 579795 -1193617
34029 -1193617 -1984269 -1062323 25691 213026 312580 1124449 1863191 1532729 685944
34020 685944 588619 1317915 1828602 1526694 772827 21572 -633032 -1074502 -1083567 -759294
34010 -759294 -493123 -409318 -197712 426910 1341723 2093244 2230111 1688504 930561 451438
34000 451438 119250 -528112 -1243231 -1076502 161585 1224010 950862 -147385 -739201
33991 -739201 -635607 -811389 -1651719 -2316495 -2009183 -959541 109220 744854 756696
33982 756696 119111 -818144 -1505322 -1743872 -1679413 -1347730 -784565 -375238 -317351 24541
33972 24541 1183078 2204508 1626333 -65196 -678842 398198 1008755 -486790 -2454265
33963 -2454265 -2359317 -627318 171327 -629746 -1067618 20331 1260780 1213641 516416
33954 516416 350964 421948 -25255 -391494 353578 1639275 1890818 902861 76581 275257
33944 275257 862517 1119921 1281448 1585419 1395668 117035 -1650904 -2661824 -2419460
33935 -2419460 -1505829 -794135 -735238 -1139115 -1343846 -918428 -388713 -702748 -1684647 -1848577
33925 -1848577 -444348 1107573 907833 -835893 -2222997 -2375141 -2203904 -2386912 -2298602
33916 -2298602 -1612257 -1350371 -2148931 -2742279 -1700612 176289 875634 73571 -769596
33907 -769596 -1033715 -1677205 -2981669 -3514804 -2363008 -849300 -647315 -1278495 -1035989
33898 -1035989 284995 1235200 1054845 556896 480607 422618 -29016 -303166 135460 579732
33888 579732 -108348 -1839635 -3318272 -3608122 -2970991 -2152188 -1513417 -1091332 -984581
33879 -984581 -1243840 -1538270 -1295594 -311501 838179 1156156 234760 -1046517 -1200720
33870 -1200720 159982 1607235 1455574 -122801 -1327796 -1162687 -649110 -1065487 -1938566
33861 -1938566 -1899963 -983397 -649990 -1518593 -2428997 -2169133 -977420 248173 1168158
33852 1168158 1679825 1378143 318233 -489868 -415721 -330712 -1229384 -2407494 -2430911 -1421821
33842 -1421821 -760021 -768620 -484701 244794 387998 -122648 170696 1778932 3012186
33833 3012186 2426093 1016163 542806 935949 964450 470112 205551 170224 -166002 -506226
33823 -506226 -283477 -107644 -864086 -1736787 -1131245 561118 1304380 719327 699423 2057634
33813 2057634 2948396 1917599 351542 59502 229348 -870840 -2403947 -1924230 539375
33804 539375 2062213 947692 -1002934 -1305477 -68974 847471 669653 192373 75946
33795 75946 56949 -240767 -695356 -979493 -889423 -411642 126747 147139 -535052 -1385063
33785 -1385063 -1850720 -2026503 -2139636 -1868963 -950225 -82939 -236899 -1169707 -1653752
33776 -1653752 -1213610 -566254 -160689 505951 1626369 2355717 2209270 2153693 3133997
33767 3133997 4236517 3699776 1492722 -422090 -510956 664170 1433677 907828 -373853
33758 -373853 -1169553 -787679 103302 158549 -813962 -1350505 -395829 913773 811729 -328719
33748 -328719 -488922 856831 1962572 1535714 469994 129876 472547 818106 1117981
33739 1117981 1378598 1000863 -161052 -1087716 -1066604 -933084 -1679219 -2724664 -2847796
33730 -2847796 -2081698 -1385077 -1068064 -828182 -770466 -1098597 -1299744 -888349 -436104 -605801
33720 -605801 -777902 -60229 946385 1032434 547140 847724 1826080 1933359 748511
33711 748511 -369565 -499805 -252296 -224884 -105780 98688 -388707 -1577757 -2229179
33702 -2229179 -1725682 -996558 -741939 -248059 954400 1749893 1207244 472714 1176648
33693 1176648 2742448 3112457 1837637 654221 800390 1333279 791943 -572165 -1220256
33684 -1220256 -549574 256840 -196755 -1677504 -2622316 -2157225 -1117913 -727119 -923413
33675 -923413 -764465 -75604 323382 -5780 -522225 -709188 -799526 -1110276 -1338242 -984151
33665 -984151 -81905 789916 990081 330915 -564095 -658927 253763 1111768 1072015 854444
33655 854444 1496676 2313725 1668087 -405561 -2080569 -2379853 -2152445 -2053099 -1490769
33646 -1490769 -393352 -140637 -1454400 -2827990 -2479560 -784705 543229 757053 321602
33637 321602 -288174 -822019 -990885 -977897 -1440448 -2168138 -1854885 -233616 915313
33628 915313 315452 -608497 35530 1344458 946282 -1064473 -2102472 -1021251 374051
33619 374051 299350 -605502 -722862 327261 1837337 3053480 3214387 1772403 -491355
33610 -491355 -1628425 -792409 525020 514444 -524128 -967380 -461561 -251497 -979849
33601 -979849 -1605661 -1081568 -63187 12259 -914041 -1319813 -151318 1734594 2578619
33592 2578619 1654292 -240238 -1801684 -2213234 -1462167 -295152 301270 78729 -223010
33583 -223010 -12362 281226 130041 19899 561841 1110835 728338 89593 619099 1838300
33573 1838300 1671477 -234305 -1641045 -990159 465896 906935 435479 -20758 -518033
33564 -518033 -1175607 -982789 665974 2467326 2972400 2698069 2760431 2663094 1468273
33555 1468273 75556 57411 963629 1068577 312354 227381 1167515 1788164 1323847 506516
33545 506516 153768 438014 1425366 2828156 3561068 3053417 2409129 2690719 3095944
33536 3095944 2846360 3438039 6109418 8571489 8523107 9755142 19088713 35481490 47351048
33527 47351048 44604271 30329737 16733033 11456748 11793647 11294510 7754330 3717492
33519 3717492 2047294 2966049 4623415 5327319 4968522 4414656 3990077 3301009 2352507
33510 2352507 1621130 904733 -456601 -1869779 -1689533 152676 1476250 888154 -211049
33501 -211049 -50755 710332 413734 -692672 -1097022 -758469 -1029369 -2119160 -2580197
33492 -2580197 -1463281 477947 1902591 2113194 1211915 19890 -320848 400503 928528
33483 928528 241153 -717521 -284770 1342077 2307814 1776812 805798 341659 -31690
33474 -31690 -735566 -1035527 -270712 753946 800566 84173 -68196 712535 1291125 857027
33464 857027 270126 777744 2012879 2384290 1337876 27457 -558883 -883321 -1539432
33455 -1539432 -1894206 -1304077 -684024 -1207038 -2112155 -1736958 -370857 124861 -434841
33446 -434841 -164070 1441763 2215349 779105 -1019979 -1013845 -147173 -667576 -2193380
33437 -2193380 -2225470 -107095 1981041 2155981 997560 126821 146892 588620 822907
33428 822907 473081 -387096 -1106728 -1016272 -226855 510153 620766 4635 -1133980 -2202913
33418 -2202913 -2361666 -1423765 -314924 4466 -274031 -333085 12119 384799 786108
33409 786108 1508123 2244944 2177525 1047621 -431987 -1304481 -1167759 -372058 292689
33400 292689 320221 90460 403708 1320913 2050631 2118680 1872886 1609458 1137282 559080
33390 559080 443238 732925 568314 -246995 -763271 -483261 -149737 -209582 59279 985185
33380 985185 1671935 1861370 2826975 4851947 5677141 3604448 568455 -411797 392094
33371 392094 389033 -890629 -1470900 -769782 -558995 -1662871 -2559048 -2094621 -1155541 -685550
33361 -685550 -209101 663239 1228306 1237579 1599460 2405522 2055291 -229574 -2522400 -2461001
33351 -2461001 -411268 1180979 1003723 62141 -143441 477412 743792 -196348 -1664716
33342 -1664716 -2110193 -1091239 82083 320243 439416 1564307 2684499 1818773 -643100
33333 -643100 -2021933 -1089827 445315 853912 641095 821110 907353 141282 -739288
33324 -739288 -567742 392986 1035237 1054820 823151 372238 -323784 -674144 -175903 643916
33314 643916 872726 429280 2599 189491 1084001 2141657 2246654 817084 -932597
33305 -932597 -1030385 549744 1589909 651164 -1069732 -1776454 -1488994 -1258156 -1277338
33296 -1277338 -1126402 -863309 -604128 34146 923567 949077 -220678 -1079160 -441475
33287 -441475 546363 256241 -695435 -577879 490009 959431 702556 1052033 2062728
33278 2062728 2078012 442335 -1375293 -2006566 -1820536 -1624191 -1262924 -416091 401919
33269 401919 567287 277617 57674 -23662 -135762 -259854 -324846 -241090 306057 1397717
33259 1397717 2175522 1507080 -433770 -2148277 -2638162 -2346370 -1977960 -1413794 -384134
33250 -384134 677929 1275987 1751468 2680268 3640577 3399861 1471622 -971145 -2063426
33241 -2063426 -1150778 463911 982222 272799 -37450 1114354 2661920 2950820 2107413
33232 2107413 1617283 1886937 1714035 376204 -1116775 -1436860 -594220 459878 1102456
33223 1102456 1266743 1013283 526555 190604 226545 507079 869403 1166792 977057 -15722
33213 -15722 -1176224 -1324564 -386259 239395 -425757 -1484700 -1465559 -484356 -56216 -922681
33203 -922681 -2042921 -1974351 -636377 678227 842594 145911 -151740 516306 1208261
33194 1208261 756708 -469576 -932670 -55677 1014044 1128892 636751 456148 496880
33185 496880 14775 -913031 -1316444 -657592 578098 1634732 2208965 2407625 2483213
33176 2483213 2591501 2452887 1489895 -227159 -1520235 -1323746 -183033 288781 -548093
33167 -548093 -1675306 -1916891 -1330315 -754108 -611180 -647842 -495129 -73443 395122 573934
33157 573934 371204 148166 297795 630307 564531 -42326 -689904 -927823 -819562 -652253
33147 -652253 -645735 -993863 -1668377 -2151326 -1996174 -1678784 -2042098 -2737089 -2300946 -308075
33137 -308075 1645412 1965828 1123756 600918 608107 266059 -471932 -727312 -443450 -598928
33127 -598928 -1397098 -1749156 -1097575 -366760 -339694 -369490 268537 838525 263374 -949964
33117 -949964 -1313417 -537875 235282 308941 256604 650525 1078969 939433 435250 190833
33107 190833 302600 265717 -322745 -1259049 -1873631 -1668117 -921023 -470144 -652960 -809606
33097 -809606 -309948 354958 346975 61305 718745 2213107 2706475 1126272 -1023590
33088 -1023590 -1510660 -376075 258556 -804045 -2395359 -2855042 -2187106 -1621841 -1739401
33079 -1739401 -1876918 -1174622 391144 1945400 2358793 1211583 -509774 -1045261 227366
33070 227366 1828178 1896698 653555 67136 963567 1778399 899100 -890834 -1530826
33061 -1530826 -551869 620393 994297 1120545 1619782 1999476 1637598 934177 650519
33052 650519 776585 816505 651416 368057 -296017 -1504635 -2608567 -2697545 -1781100 -739215
33042 -739215 -121869 375463 1154707 1970556 2194411 1589924 651742 176652 458859 956234
33032 956234 935082 352461 -238752 -528863 -629771 -477635 167595 1005818 1334194 1147843
33022 1147843 1182088 1531935 1325265 315745 -395970 -38102 653039 952446 1516239
33013 1516239 2782225 3284786 1601189 -851399 -1319235 249571 1073572 -313794 -2127063
33004 -2127063 -2289324 -1227417 -526389 -479323 -417588 -301422 -512966 -757565 -425294 338800
32994 338800 858018 901059 744130 603623 564583 709759 888197 769923 438213 375783
32984 375783 576019 361952 -515918 -1287899 -1124848 -121209 987226 1481572 922766
32975 922766 -381312 -1084752 -145775 1341212 1146567 -784492 -1820618 -451282 1286743
32966 1286743 884166 -782730 -1008135 385575 1009518 13124 -563768 794449 2680852
32957 2680852 3031135 2028728 1239098 1041726 563186 -420077 -1053794 -843321 -341979
32948 -341979 -160240 -102722 341109 1132390 1690547 1602087 1109546 903857 1427544 2332887
32938 2332887 2735402 2157132 1127762 626795 959733 1457502 1361999 740150 329297
32929 329297 669535 1622425 2597805 2991078 2548798 1660601 1189607 1601702 2345231 2573564
32919 2573564 2347527 2400852 2753650 2575317 1726317 1326067 2095202 3110089 3126964 2312730
32909 2312730 1602404 1092362 328431 -396573 -424173 -37847 -21385 -207212 137356 755202
32899 755202 766998 409630 739243 1644037 1939172 1549027 1664264 2397056 2352694 1216862
32889 1216862 695139 1814486 3184540 3245819 2529791 2200642 1943366 1065594 389338
32880 389338 1063683 2360521 2605192 1795536 1470580 2192328 2808625 2295173 1052120
32871 1052120 220870 580311 2060098 3666097 4179588 3541274 3010991 3362219 3841530
32862 3841530 3838425 4428770 6691709 9314556 9807192 7861529 5665953 4808478 4658583
32853 4658583 4238663 3973757 4607864 5587363 5730887 4951912 4288100 4405235 4911088
32844 4911088 5225065 5418560 5803919 6160321 6022434 5595532 5593754 6034158 6114437 5699926
32834 5699926 5818899 6841980 7365458 6251189 4678213 4391262 4889837 4592305 3992731
32825 3992731 4861492 6652413 6905692 5471249 4979006 6371339 7442976 7044394 7122303
32816 7122303 8731811 9598881 8141964 6575659 7042052 7834775 7055221 7136652 11302018
32807 11302018 17419653 20018310 17552054 13509117 10833965 9241856 7953470 7310293
32799 7310293 7213467 6938445 6821586 7716868 8973766 9288696 8967697 8972718 8786805 7901867
32789 7901867 7972324 10251021 12451605 11969333 10702753 12359496 16462221 19970573 23428181
32780 23428181 29668658 37502541 43604664 50414456 64193952 84268389 103661071 124704283
32772 124704283 165133768 239816330 338582476 427152527 469112803 447566565 373789267
32765 373789267 281085291 204569075 158085577 130325362 105340565 81659257 66871664
32758 66871664 60965090 55478818 46604388 38757035 34626811 30655793 24516921 19470667
32750 19470667 18099640 17741975 15556076 13203447 13044113 13692844 12756669 10817580 9612160
32741 9612160 8889699 7833534 7267561 7884294 8329379 7411441 6369117 6757759 7835952
32732 7835952 8182827 8248356 9050294 9694772 8495598 5748299 3454111 2808253 3412439
32723 3412439 4402045 5137394 5335702 5430651 6139661 7089985 6947097 5543981 4503269
32714 4503269 4824769 5270500 4309435 2369717 887057 302693 321117 995079 2095644
32705 2095644 2446112 1469437 555036 1269591 2905872 3493227 2736556 2192784 2735487
32696 2735487 3561566 3833374 3777886 3786605 3659720 3216042 2724485 2335100 1869120 1494199
32686 1494199 1819231 2896805 3807289 3743178 3011792 2456184 2275502 2016396 1559398
32677 1559398 1474819 2212482 3329687 3867734 3402545 2442780 1747371 1492453 1288907
32668 1288907 879094 529693 637009 1108701 1395101 1238810 1136794 1623956 2170644
32659 2170644 1577490 -122901 -1060313 136515 2052286 2086589 160346 -1041660 68973
32650 68973 1843583 2118564 1212954 615419 245953 -852439 -2093172 -1967953 -697620
32641 -697620 -6515 -256145 34757 1483223 2710756 2615575 1996782 1961726 2144935 1587185
32631 1587185 357293 -698080 -1115124 -972189 -476810 59669 348908 509340 746766
32622 746766 672993 -113214 -785033 37743 2056011 3163976 2224341 665526 417627
32613 417627 1391644 2081461 1801016 1189027 1012600 1411765 2019695 2241732 1796319 1271495
32603 1271495 1451889 1872788 1140326 -837137 -2242063 -1797870 -536509 -34246 -172472
32594 -172472 -90756 -191520 -1310924 -2619178 -2403905 -749460 450175 209863 -539857
32585 -539857 -799762 -595574 104309 1735603 3702877 4297118 3066337 1821204 2112431
32576 2112431 3034535 2932310 2068960 1799604 1968153 1293453 61849 124037 1797812
32567 1797812 2933971 2074641 683307 716390 1424335 575606 -1865688 -3422509 -2486362
32558 -2486362 -170599 1646381 2541302 3044921 3205823 2744859 1961581 1546922 1774152
32549 1774152 2379701 2895894 2825802 2047706 1287417 1438135 2140435 2042265 927736 327558
32539 327558 1115947 1792432 615013 -1508939 -2107633 -741055 386262 -388029 -2037894
32530 -2037894 -2520693 -1394767 32355 490081 13964 -300998 465320 1929938 2655841
32521 2655841 1834734 342040 -427910 -284065 19885 270086 870813 1669544 1949099
32512 1949099 1646303 1462528 1637880 1667546 1379121 1236067 1363602 1302246 993084 1026611
32502 1026611 1608522 2175888 2307701 2159360 1810833 1109329 344432 108380 274692
32493 274692 88400 -548767 -905672 -669257 -232563 381147 1539248 2696993 2605548
32484 2605548 1374362 827648 2020811 3763093 4461857 4088160 3337653 2210348 678339
32475 678339 -405772 -471779 -394749 -1124047 -1955214 -1621011 -488243 -152948 -1150817 -2422172
32465 -2422172 -2921096 -2606820 -1922258 -1287096 -1055792 -1175674 -1037858 -349986 194595
32456 194595 -119260 -837194 -1008885 -635350 -414095 -352031 227662 1375791 2299883 2574453
32446 2574453 2650339 2933772 3100627 2646395 1667005 836405 760805 1347938 1785583 1427167
32436 1427167 698702 548844 937414 794177 -177409 -780134 -137081 873496 1051210
32427 1051210 764913 1080444 1755144 1654139 776170 315879 771654 1343521 1279958 676947
32417 676947 -88619 -658408 -489239 533217 1344641 762706 -704194 -1361042 -703519
32408 -703519 77720 221302 554785 1863764 3312456 3418144 1886464 -249174 -1768667
32399 -1768667 -1997355 -957858 617507 1754196 2092983 2023295 1887652 1571446 1021944
32390 1021944 587030 587826 995598 1626841 2166395 2029783 897047 -552456 -1168171 -700525
32380 -700525 68874 581847 969948 1158515 626755 -497822 -1125248 -608738 359110
32371 359110 848552 871383 813395 554655 17717 -144716 547574 1299359 935269 -310343
32361 -310343 -921936 -48971 1532258 2566231 2720989 2522943 2349736 1943901 967102
32352 967102 -150889 -310970 886737 2111842 1516020 -799550 -2492132 -1804916 152956
32343 152956 925998 -110693 -1325393 -1301014 -377207 428849 788749 832964 515595 -116669
32333 -116669 -652326 -894894 -1190129 -1646355 -1567108 -316398 1610419 2993885 3128982
32324 3128982 2220744 952685 189107 590634 1757165 2194690 1068030 -394867 -402554
32315 -402554 767185 1118828 175 -912597 -314962 737754 691590 -129428 -567159
32306 -567159 -872107 -1969044 -3205993 -2977928 -1400426 -280396 -306035 -341477 96954
32297 96954 -134496 -1411968 -2067992 -947294 456554 163391 -1241560 -1593373 -380275
32288 -380275 864009 989614 367547 -251394 -566146 -446546 -19876 43692 -660713 -1460593
32278 -1460593 -1594333 -1455585 -1609279 -1288900 384829 2215725 2113666 359488 -646688
32269 -646688 -202121 -337553 -2118749 -3409940 -2014573 910637 2605548 2436114 1762194
32260 1762194 1203078 393460 -146142 651423 2198300 2611008 1605268 996311 1728659
32251 1728659 2389612 1676629 558129 543708 1195985 1103488 419902 532780 1591133
32242 1591133 2258932 2005024 1826233 2198744 2012473 521247 -1045432 -1173879 -406827
32233 -406827 -451906 -1492332 -2022685 -1266916 -177799 243169 191784 114483 -188948 -770416
32223 -770416 -929096 -274961 481067 652357 630591 869295 696389 -617607 -2235836
32214 -2235836 -2563643 -1364315 173831 1223219 1907648 2298961 2182511 1844829 1809494
32205 1809494 1706848 708819 -772371 -1241778 -327522 605735 625672 610742 1588872 2904103
32195 2904103 3144701 2075952 625444 -420113 -783073 -338430 683317 1531596 1729157
32186 1729157 1660253 1799790 1922434 1720388 1542791 1706221 1689739 972806 179561 334511
32176 334511 1253359 1665511 830139 -769649 -2197808 -2809141 -2436581 -1567067 -1133112
32167 -1133112 -1475412 -1810825 -1373166 -586442 -254706 -140834 507400 1426731 1670991
32158 1670991 1293359 1279612 1755106 1715690 862756 300028 800040 1577226 1550447 875191
32148 875191 417366 432803 536682 458918 201110 -150376 -354088 -198313 30439 -102385
32138 -102385 -232856 450650 1620609 1755126 308162 -1234168 -1378159 -603315 -163789
32129 -163789 47109 867593 1784089 1318804 -552631 -2014545 -1767516 -468381 579561
32120 579561 998377 1028870 626500 -365798 -1644251 -2608869 -2848516 -2262594 -1084741
32111 -1084741 83374 704823 904400 1248646 1941035 2694296 3283899 3605542 3314093
32102 3314093 2221677 1041648 816554 1469604 1855192 1457040 1027194 1181573 1416922
32093 1416922 1113744 577649 369566 395791 393097 573980 1008284 1062575 328833 -474349
32083 -474349 -444281 103719 44198 -1082876 -2727399 -4060760 -4387651 -3377067 -1663804
32074 -1663804 -637392 -768326 -808296 306800 1512013 1011218 -883824 -2004345 -1323154
32065 -1323154 -35161 545915 543996 504984 335119 2339 49973 537148 459786 -857216
32055 -857216 -2527355 -3101485 -2257212 -830969 299544 765803 669010 565679 1022530
32046 1022530 1731428 1646376 483200 -596884 -451534 502123 966523 498073 -253459
32037 -253459 -703795 -877634 -890115 -627921 -71975 494971 691691 256918 -806114 -2074670
32027 -2074670 -2850571 -2679503 -1636567 -98426 1440118 2298480 1904141 478856 -888145
32018 -888145 -1129434 -25628 1798200 3324721 3689054 2856915 1810577 1540801 1915290
32009 1915290 2152664 2182631 2560036 3117108 2935304 1877154 906323 498653 -1822
32000 -1822 -908776 -1382897 -851134 -31406 301122 405426 555629 200679 -774383 -1235141
31990 -1235141 -584229 -142921 -1145125 -2418154 -1940127 51806 1491143 1505489 942250
31981 942250 159590 -1425734 -3337426 -3787259 -2239789 -510809 -318369 -1073270 -1134171
31972 -1134171 -176049 846003 1383094 1736538 2005490 1589171 71417 -1824004 -2644470
31963 -2644470 -1751825 -179384 538997 250536 70823 349447 36233 -1274691 -2024247
31954 -2024247 -700877 1789136 3248151 3012261 2149253 1443626 895182 841568 1709167
31945 1709167 2648971 2168463 340112 -1136109 -1252850 -630267 -45599 395822 446311
31936 446311 -273486 -1119383 -894402 139198 363191 -619599 -1247681 -516026 484021
31927 484021 456103 -203743 -427891 -68474 528574 1329448 2073520 2128123 1730608 2058898
31917 2058898 3159060 3302807 1626122 -67971 261917 1828465 2165874 601774 -1187309
31908 -1187309 -1728508 -1259145 -709290 -458499 -328416 -101738 35501 -615490 -2411119
31899 -2411119 -4190186 -3970624 -1439182 1280313 2108714 1187455 -240993 -1739878 -3136791
31890 -3136791 -3373103 -1750470 404220 1143159 551965 316956 974241 1347907 674047
31881 674047 -381967 -1010113 -1128651 -770279 82369 804738 522200 -484633 -886596
31872 -886596 -149225 773799 936168 568153 286713 46213 -488617 -1100928 -1144918 -311785
31862 -311785 952793 1675509 1142435 -243143 -1186169 -1031275 -655024 -1175824 -2237479
31853 -2237479 -2531485 -1752997 -927312 -772738 -793996 -266014 713861 1499264 1657615 1216935
31843 1216935 511370 -175256 -1021440 -2381549 -3753978 -3754121 -1931281 67724 321772
31834 321772 -846634 -1505629 -925287 -187334 -42316 113869 730205 1159932 932582
31825 932582 642043 764027 740265 127507 -332482 241157 1507568 2474227 2775645 2579979
31815 2579979 1899334 893098 295884 609297 1268427 1432383 1165630 978573 682689
31806 682689 -202424 -1175567 -1113209 7383 842051 464870 -488718 -913980 -693980 -444796
31796 -444796 -366218 -108280 420540 791469 669863 242537 -95410 -174606 -43731 225139
31786 225139 540215 729866 655936 382378 171705 303097 820244 1365632 1395263 799549
31776 799549 192063 176724 396917 -36994 -1017256 -1184109 208623 1937412 2269484
31767 2269484 1256140 413416 418988 487799 60995 -339395 -332910 -392144 -696582 -524398
31757 -524398 412044 1196764 1226405 1353448 2326642 3128307 2350330 490575 -721298
31748 -721298 -828198 -843522 -1183630 -1112403 -393993 50033 -448436 -1453274 -2337805 -2927465
31738 -2927465 -2945322 -2046391 -864123 -813929 -2171016 -3360361 -2914460 -1274322 121468
31729 121468 715452 883773 777687 211654 -544176 -821758 -443376 93932 346471 314569
31719 314569 97832 -313575 -749199 -770417 -163111 668643 1099360 1048466 1034904 1318503
31709 1318503 1361558 633368 -282078 -179058 1071621 2210270 2341657 2036883 2037404 1913951
31699 1913951 1118937 454003 944103 1804797 1330644 -314306 -1077768 -76142 1189622
31690 1189622 1345606 1100822 1607220 2392031 2374473 1850305 1881678 2379217 2335109 1634904
31680 1634904 1218965 1512332 1913867 1909437 1667195 1444077 1314328 1551612 2380182 3237173
31670 3237173 3168174 2143406 1164561 887592 993231 1131767 1494706 2000939 1917621 1033294
31660 1033294 368207 761967 1380655 758728 -999591 -2237407 -1926256 -721193 300605
31651 300605 850253 1025607 777602 397862 635023 1581310 2228920 1949126 1610544 2175350
31641 2175350 2915788 2422365 980641 383382 1383504 2822426 3499100 3447520 2977812
31632 2977812 1958785 744272 405225 1090899 1377760 347633 -753858 -194528 1748233
31623 1748233 3287377 3483157 2765997 1602986 96545 -1215670 -1460641 -514313 829270
31614 829270 1757989 1878602 1081605 -209145 -956125 -551361 293229 469183 -58935
31605 -58935 -488809 -417474 43428 857610 1751091 1854004 804747 -293691 -230367 547595
31595 547595 849349 776645 1207637 1779687 1325209 92099 -486852 -222303 -281729 -720219
31585 -720219 -133237 1714903 3115053 3064713 2611647 2582790 2086351 611421 -362064
31576 -362064 403756 1649114 1518577 520256 559041 1777945 2389348 1424488 -74647
31567 -74647 -723051 -361698 267433 540517 445490 510241 1180554 2056484 2164490 1223505
31557 1223505 17521 -755942 -1207605 -1520528 -1494784 -1285064 -1493464 -1952532 -1628692
31548 -1628692 -459959 61711 -863136 -1880404 -1548592 -584420 -488392 -1033171 -938327
31539 -938327 -264862 -192958 -791988 -860319 69732 1155248 1709038 1860672 1709393 1087886
31529 1087886 268551 -168667 -193137 -137529 126867 843595 1536136 1625877 1513305 1848994
31519 1848994 2186455 1785150 1327326 2110687 3683962 4117630 2776929 1069723 168748
31510 168748 -206379 -297645 468083 1889466 2372535 1128058 -380040 -489352 277188
31501 277188 287157 -595700 -1012837 -307071 705714 1147545 1136014 1215386 1480848 1520830
31491 1520830 846786 -644087 -2312566 -3008501 -2104307 -315306 866870 669011 -214980
31482 -214980 -446362 486869 1736439 2070760 1220897 -37580 -1027743 -1763894 -2232956
31473 -2232956 -1954172 -932988 -304168 -990601 -2212737 -2512552 -1916018 -1684779 -2038148
31464 -2038148 -1762264 -428840 621962 317696 -474363 -361214 516666 976449 601248
31455 601248 -49890 -496092 -564433 -4223 1133086 2063434 2125675 1723197 1531632 1231645
31445 1231645 154368 -1162589 -1435169 -635765 -138639 -563335 -821310 58033 1345395
31436 1345395 1792745 1492419 1417836 1657984 1353604 280113 -639315 -643166 -104998 168424
31426 168424 -12821 -278575 -347404 -208558 36313 172330 -28060 -409925 -414709 230457
31416 230457 1071345 1520364 1606716 1692706 1703979 1258552 516275 265833 948363 1997599
31406 1997599 2394749 1688227 387311 -466882 -153135 1038534 1987071 1842027 818913
31397 818913 -351195 -1390828 -2298154 -2544072 -1462730 455230 1674470 1452056 728179
31388 728179 643048 969170 808858 224709 129040 743964 1179059 747383 -47724 -273951
31378 -273951 126851 385490 213456 431782 1769781 3351832 3340522 1389261 -524075
31369 -524075 -497445 925352 1934647 2184967 2603752 2920348 1695674 -789773 -1998509
31360 -1998509 -609953 1434407 1829921 1100361 1046982 1501045 925283 -656740 -1746389
31351 -1746389 -1981679 -2333086 -2776194 -2111813 -430842 492034 -835 -277519 915491
31342 915491 2388073 2452069 1499295 1054569 1252631 973430 12950 -542374 -141514 401763
31332 401763 242575 -383001 -851659 -1104765 -1270019 -1014439 -168281 395811 -347721 -1752238
31322 -1752238 -1844652 -103476 1367830 663939 -952274 -724863 1473162 2930502 2146359
31313 2146359 706584 348701 522969 241211 123158 678158 511139 -1354161 -2951795
31304 -2951795 -1954786 364161 799809 -834592 -1671300 -546701 577943 429845 373747
31295 373747 1438107 2298562 1734934 676557 229853 -157459 -938472 -938611 580608 2121405
31285 2121405 2129924 1415702 1451118 1704050 807227 -744627 -1278994 -604138 13471 -17422
31275 -17422 -290248 -675200 -1211261 -1247113 -339775 538832 337202 -184873 281147 1097515
31265 1097515 602753 -827602 -991479 733563 2399445 2377681 1307253 535057 324149
31256 324149 325403 343749 -56260 -1349715 -2815713 -2834280 -1085905 830794 1649442 1970864
31246 1970864 2742008 3519467 3314484 2153872 787773 -298061 -726246 -70979 1178754
31237 1178754 1493557 264170 -1019982 -782556 312491 478690 -464632 -1135512 -928764
31228 -928764 -538323 -250974 450969 1317107 1143172 -184952 -1054882 -495792 191019
31219 191019 -576140 -2109615 -2427840 -1193901 -75983 -230153 -848405 -579126 653970
31210 653970 1777357 1858990 853764 -491710 -1207758 -951647 -415731 -497963 -1107214
31201 -1107214 -1376420 -999318 -507223 -97881 771084 2135491 2837089 1875476 -201173
31192 -201173 -1998501 -2807000 -2754289 -2096964 -1216839 -746059 -792620 -599185 117281 253422
31182 253422 -989372 -2262500 -1664572 244806 1079775 291721 -69833 1134700 2158703
31173 2158703 1247821 -391998 -384912 1249951 2296495 1508857 -214538 -1578401 -2182906
31164 -2182906 -2027899 -1162892 -164688 88656 -514307 -1182901 -1298080 -950680 -377422
31155 -377422 374120 1069396 1266466 921670 550734 638203 1214249 1959429 2357499 1937362
31145 1937362 859109 48479 184200 789980 969125 730301 742296 1028131 975850 619124
31135 619124 736531 1441299 1821258 1432610 1043522 1211632 1157705 39562 -1435179
31126 -1435179 -1860894 -1185842 -710606 -1139891 -1780444 -1851235 -1551928 -1386471 -1247183 -782636
31116 -782636 -131256 314082 487020 440013 -66599 -1099361 -1943411 -1751050 -741688
31107 -741688 41754 249362 625824 1593449 2333961 1944408 843896 200708 355920
31098 355920 651091 595919 377554 268253 266908 354135 493032 416895 3479 -295889
31088 -295889 -103621 30873 -640546 -1624020 -1652392 -712442 -304157 -1233710 -2420156 -2637232
31078 -2637232 -2274675 -2346096 -2707639 -2533932 -1965340 -1946977 -2634062 -3118715 -2757136 -1842820
31068 -1842820 -926169 -288476 -145679 -588142 -1177472 -1285743 -988266 -975649 -1401039 -1520198
31058 -1520198 -895911 -373117 -1119005 -2819740 -3605027 -2195441 314384 1562074 782564
31049 782564 -350831 -180070 671705 572295 -372433 -526439 502974 1188135 601965
31040 601965 -200810 -193326 -89578 -786114 -1520331 -1128871 -36732 636344 1010053 1720646
31030 1720646 2076126 967513 -828310 -1390204 -623657 -406239 -1559350 -2722979 -2753092
31021 -2753092 -2263025 -1941318 -1149404 608787 2252409 2506453 1721856 1084897 806364
31012 806364 289275 -488134 -896383 -649571 -24864 626637 974282 744186 206928 54804
31002 54804 260947 -121599 -1285767 -1801402 -615759 949126 820312 -708789 -1380931
30993 -1380931 -452292 341812 -74080 -123728 1741875 3922638 3419290 144622 -2740592
30984 -2740592 -3049342 -2124873 -2293293 -3436290 -3649318 -2388140 -1200224 -1422984 -2553356
30975 -2553356 -3171360 -2512080 -878294 732082 1273305 658753 122010 758380 1866407
30966 1866407 1880068 825780 291067 770354 939150 242186 114103 1287972 1907089
30957 1907089 357137 -1654568 -1439688 306826 438802 -1656630 -3053490 -1763902
30949 -1763902 523796 1258284 324799 -800958 -1370399 -1372240 -657186 483222 935028
30940 935028 240152 -484224 -215864 409651 385011 116255 516426 1208596 1198122 721828
30930 721828 844317 1575264 1903051 1515672 1049649 699734 26869 -719109 -508402 779529
30920 779529 1732461 1124347 -503828 -1558593 -1170667 182007 1413570 1792827 1390195
30911 1390195 825000 541997 422897 212752 -20336 -172914 -394997 -545680 125294
30902 125294 1887179 3503289 3435869 1993841 1044626 1384094 1691148 684143 -884307
30893 -884307 -1378725 -580535 336287 652259 697779 730531 437043 -165110 -336960 302102
30883 302102 996246 826052 28598 -372748 -64089 181811 -270673 -960840 -963432 -94993
30873 -94993 947888 1474614 1381309 864762 15745 -1052522 -1928745 -2131588 -1653799 -1042452
30863 -1042452 -807347 -897833 -940047 -860015 -944019 -1259251 -1430865 -1250031 -1133870 -1530840
30853 -1530840 -2120143 -2188503 -1695571 -1282591 -1171472 -823358 25838 746040 758625 505984
30843 505984 803788 1595563 2025128 1585898 685861 189331 725838 2192883 3641002
30834 3641002 4023308 3343624 2534594 1944791 872113 -802823 -1698426 -878279 252263
30825 252263 -309223 -2074940 -2651220 -1277422 271525 649064 736818 1605348 2478241
30816 2478241 2031885 441426 -1157573 -2218094 -2568801 -1681388 377155 2008477 1697065
30807 1697065 189640 -435904 312824 888455 267770 -568592 -317072 691362 1151253
30798 1151253 728598 349218 681945 1164379 859493 -147217 -725917 -81871 1309870
30789 1309870 2407885 2809254 2748580 2279970 1297307 276155 51892 669106 1288546
30780 1288546 1431076 1372947 1061817 -129426 -1922633 -2664957 -1458498 188547 178549
30771 178549 -1332276 -2320549 -1765116 -642183 -60669 166111 694495 1493353 2055295
30762 2055295 2059418 1439956 382629 -474429 -432361 366039 918565 518670 -483817 -1243545
30752 -1243545 -1288273 -684401 140584 518134 10057 -915399 -1155441 -333434 527554 239379
30742 239379 -914664 -1476474 -778860 104446 -199062 -1482714 -2264836 -1817728 -998303
30733 -998303 -793838 -952785 -771722 -493149 -806233 -1342373 -984005 292463 1165580
30724 1165580 875025 180522 -77242 -207696 -745354 -1337991 -1441436 -1266854 -1146617
30715 -1146617 -775649 -32174 291415 -280313 -720470 66924 1194434 799322 -1029034
30706 -1029034 -1976445 -545833 1947760 3115452 2359256 1214157 1210030 2096026 2373529
30697 2373529 1339769 83182 9374 815505 990053 268486 94201 1103531 1787603
30688 1787603 817418 -754501 -1190365 -745910 -776917 -1153283 -760149 30160 -232922
30679 -232922 -1383221 -1733166 -997954 -742469 -1441462 -1447924 209312 2082012 2504548
30670 2504548 1819757 1255322 1088320 1047222 1158059 1123495 202646 -1264580 -1615677 -227307
30660 -227307 1349430 1805841 2023072 3068309 3818380 2637193 342077 -717706 2559
30651 2559 873082 797558 383879 377114 586668 623712 434407 -79150 -938116 -1574730 -1381038
30640 -1381038 -649053 -89147 259073 670139 795437 308571 13144 855082 2141124
30631 2141124 2307191 1318181 666063 937732 1049493 156565 -1250697 -2490602 -3378726
30622 -3378726 -3396089 -1842480 540036 1725104 1058705 263134 778834 1582709 995264
30613 995264 -586938 -1398945 -957382 -355690 -294254 -335227 -72460 235729 370546 534461
30603 534461 843450 1147601 1465518 2004605 2679697 3100190 3075509 2779847 2467770 2262519
30593 2262519 2018190 1250941 -287573 -1726877 -1570909 331027 2152952 2340312 1670434
30584 1670434 1800737 2465025 1922313 88741 -785760 731837 3040553 3579618 2064468
30575 2064468 438845 240498 1189807 2107375 2201565 1457949 498722 102030 374868
30566 374868 523562 -79524 -855470 -703757 427800 1440891 1620556 1499364 1889073
30557 1889073 2693200 3175695 2994549 2389237 1513810 203308 -1421947 -2564540 -2422014
30548 -2422014 -1220468 -181619 -241053 -1058660 -1625196 -1608432 -1513809 -1541964 -1088084 198311
30538 198311 1495625 1653495 636678 -528713 -1021018 -773212 6314 1015180 1597901
30529 1597901 1221020 401269 302163 1073617 1428437 374873 -1398692 -2546549 -2827453
30520 -2827453 -2999344 -3374317 -3409147 -2642652 -1297097 51168 830695 617042 -430263
30511 -430263 -1307733 -1013558 259122 1319195 1384935 710013 -175199 -1066892 -1722859
30502 -1722859 -1669447 -831873 198136 986113 1855771 3135093 4212360 4036876 2486348
30493 2486348 708833 14431 675610 1803757 2233419 1616732 775899 807741 1753930
30484 1753930 2509046 2263957 1575310 1515015 2123341 2411240 1794511 784777 104741
30475 104741 -233525 -623580 -1110688 -1383351 -1282165 -963008 -684585 -657867 -915585 -1114491
30465 -1114491 -739756 165549 747531 293746 -735323 -1199244 -732131 -22068 426989
30456 426989 942417 1675265 1844111 887205 -219994 13145 1412352 2209435 1476476
30447 1476476 285203 -58120 209173 135960 -266687 -285270 161428 602447 1050119 1801217
30437 1801217 2475104 2491315 2353851 3040697 4017909 3459271 1006151 -1202079 -1222874
30428 -1222874 213655 1120231 1086861 1187055 1724516 1796627 1016341 130548 -325511 -693626
30418 -693626 -1114253 -946348 112289 1214309 1375983 709342 59753 -93863 131844
30409 131844 429802 431314 -171983 -1172999 -1879266 -1967239 -1834132 -1710491 -1093055 256440
30399 256440 1388785 1261437 405084 337248 1328511 1926837 1045099 -508368 -1209886
30390 -1209886 -781248 -214328 -281546 -782317 -1121706 -1012824 -547832 42480 580226 993895
30380 993895 1158519 779667 -204246 -1097462 -914069 353905 1518516 1671150 1266518
30371 1266518 1116472 944874 -52054 -1558225 -2257901 -1673897 -776768 -451872 -387242
30362 -387242 -21836 322811 74619 -442517 -412696 194016 585908 367989 95524 411789
30352 411789 1067656 1101579 -45347 -1668867 -2201601 -769512 1639356 3002193 2454428
30343 2454428 1198632 885401 1565756 1869381 984987 -288594 -678054 -126216 151226
30334 151226 -684634 -1838590 -1825071 -630650 -55620 -1289085 -2981009 -2963608 -1397902
30325 -1397902 -517997 -1224353 -1877853 -1111399 132937 582445 813497 1705277 2242168
30316 2242168 1060743 -855149 -1416233 -692562 -404470 -540137 651358 3065130 4096121
30307 4096121 2552605 593854 370400 1014172 673072 -415717 -856956 -578731 -350709
30298 -350709 9433 949834 1653199 1200431 527215 1198258 2759401 3333470 2522418
30289 2522418 1703241 1590189 1543495 1381843 1830691 2752510 2809098 1536741 142787
30280 142787 -451708 -845890 -1642689 -2123029 -1450187 -102409 881844 1231412 1195739 810826
30270 810826 198324 -198304 -401315 -1070159 -2147782 -2342322 -991948 462557 195691
30261 195691 -1383688 -2136642 -1099615 452843 947202 343389 -344815 -498326 -336886
30252 -336886 -359228 -745230 -1172945 -1113221 -415600 444272 797832 295379 -1046191 -2845621
30242 -2845621 -4178915 -4012688 -2376047 -640732 1855 -85110 130229 563036 234806
30233 234806 -821948 -1146928 210386 2280679 3375468 3089512 2380817 2002644 1653074
30224 1653074 767845 -415922 -984406 -420463 778668 1714643 2089207 2211987 2121635
30215 2121635 1399018 157181 -541802 -37741 664233 44121 -1669062 -2570830 -1667505
30206 -1667505 -251214 -72672 -1075115 -1830264 -1571289 -743974 122010 959826 1548551
30197 1548551 1388390 560895 -72318 -26991 73620 -451531 -1069219 -692062 550085
30188 550085 1201344 443559 -709195 -852658 -178849 -30657 -767791 -1282147 -828205
30179 -828205 -148496 -154556 -497838 -386076 -34413 -138616 -445256 -190918 309892 3130
30169 3130 -950346 -1134753 -172597 528426 70569 -415584 284108 1306911 1057473 -161922
30159 -161922 -609852 203052 995483 879357 463733 494328 750940 818898 881921 1160241
30149 1160241 1374449 1298577 1207837 1358368 1565902 1574400 1299119 586510 -565841 -1437536
30139 -1437536 -1095802 268531 1372468 1492997 1171855 952480 519698 -293868 -724362
30130 -724362 -204091 555237 578458 103806 103242 816098 1635743 2045755 1900965 1238753
30120 1238753 552461 687706 1633722 2050093 1011478 -380948 -359966 989631 1979602
30111 1979602 1893261 1817121 2720056 4061146 4789301 4684970 4171061 3583714 3136507 3008383
30101 3008383 3021297 2625881 1487859 -150786 -1673722 -2370172 -1814623 -488867 342005
30092 342005 73969 -301109 463585 2040206 3086168 3192105 2954994 2438810 1169639
30083 1169639 -356741 -857721 -212444 392003 559649 1137292 2070220 1837604 47742
30074 47742 -1319180 -688051 752898 1138671 889064 1559394 2824647 2887511 1392895
30065 1392895 -217357 -1106177 -1776501 -2312646 -1882789 -535740 203861 -608533 -1909704
30056 -1909704 -2125783 -1212949 -375608 -332733 -606628 -296444 865931 2115568 2260071
30047 2260071 977064 -576118 -919636 35110 956296 727997 -486086 -1826491 -2713149
30038 -2713149 -3015026 -2745458 -1928153 -679920 586835 1112501 440508 -657537 -651227
30029 -651227 738919 1762773 837775 -1135893 -1953664 -1177804 -463840 -830342 -1250063
30020 -1250063 -469398 1117516 2151489 1917234 682549 -710917 -1122095 80477 1952039
30011 1952039 2675392 1892075 1254037 1940485 2871437 2545704 1532533 1512234 2515853
30002 2515853 2970224 2338821 1819028 1983105 1474921 -881212 -3872418 -5153139 -4164234
29993 -4164234 -2547469 -1822633 -1858797 -1882451 -1895336 -2319231 -2819555 -2436721 -922093 707812
29983 707812 1216729 440313 -652994 -1009677 -501798 -7519 -429773 -1488939 -1789353
29974 -1789353 -557595 1018014 1118494 -44768 -157516 2020110 4613569 4936792 2997641
29965 2997641 1198396 906542 1008114 102236 -1424853 -2281070 -2123274 -1599811 -1207510
29956 -1207510 -975931 -904117 -960815 -836477 -259047 559562 1179214 1468111 1577875 1624492
29946 1624492 1715188 2018625 2424849 2372810 1452456 49395 -988757 -1215961 -774555
29937 -774555 86219 1135074 1814996 1439782 121451 -934566 -662079 472760 983032
29928 983032 386084 -66391 767205 2056347 2032730 553440 -729388 -915055 -1057205
29919 -1057205 -2067325 -2843137 -1901361 52236 934912 359053 144292 1526523 3374774
29910 3374774 3833494 2648168 1083526 204860 -51009 -396729 -1219033 -1999997 -1760079
29901 -1760079 -335295 1118395 1473087 1098688 1134966 1647513 1664348 912043 183226
29892 183226 -181546 -837413 -2041249 -2914728 -2671840 -1625492 -512292 273323 455502
29883 455502 -60626 -588552 -286207 324498 -129649 -1425101 -1515052 416925 2409292
29874 2409292 2449946 1170044 357146 273291 226334 515539 1708679 2869936 2679143
29865 2679143 1748643 1676738 2202800 1609130 -129883 -1027364 -326082 255665 -556675
29856 -556675 -1416121 -441283 1927430 3604890 3547315 2477847 1413224 596926 -178930
29847 -178930 -959393 -1520310 -1658399 -1508322 -1402384 -1269091 -613274 444159 719923
29838 719923 -521826 -2099909 -2201516 -924432 -159812 -906529 -2120834 -2474498 -1835395
29829 -1835395 -611771 909557 1961686 1482171 -228015 -1276951 -541513 901654
29821 901654 1622537 1803080 2141004 2129215 1165432 410532 1457019 3524113 4092119
29812 4092119 2478180 791565 733462 1274734 649773 -770686 -1214466 -403773 40525
29803 40525 -805995 -1689769 -1094919 331736 527694 -1026639 -2427304 -1950265 -432869
29794 -432869 99369 -450519 -156861 1747777 3319660 2573071 467402 -336632 814523
29785 814523 1767073 642540 -1681908 -2847078 -1874880 33066 1104310 687528 -522876
29776 -522876 -1390286 -1328210 -611373 134974 613731 905359 1028036 832443 353549 -96959
29766 -96959 -286265 -209378 143741 753637 1211165 922711 -34344 -763912 -706097 -492081
29756 -492081 -1017243 -1981982 -2188914 -1285349 -373077 -589892 -1738242 -2729037 -2873443
29747 -2873443 -2288470 -1459731 -899301 -882542 -1036498 -558751 623382 1365088 715507
29738 715507 -592160 -1040376 -463645 -91781 -463870 -688479 -204193 102476 -594164
29729 -594164 -1556508 -1625326 -1065414 -1032800 -1703020 -2178254 -2029082 -1791893 -1995352 -2649989
29719 -2649989 -3612056 -4527635 -4549701 -3144786 -1177239 -187679 -527062 -1134793 -1151287
29710 -1151287 -703593 -80178 667582 1133905 835689 373619 962850 2343199 2650799
29701 2650799 1189431 -160287 433478 1952964 1993286 267645 -1128930 -746600 576874
29692 576874 1323858 1200165 926887 1060521 1569511 2048446 2006147 1333719 648929 777908
29682 777908 1797693 2961060 3557199 3404166 2550241 1110313 -454630 -1458743 -1684905
29673 -1684905 -1588830 -1587343 -1513759 -1076775 -539048 -473240 -878749 -967641 -80357 1383725
29663 1383725 2314234 2171587 1487921 902456 262213 -759543 -1651197 -1612228 -907558
29654 -907558 -552389 -589765 39166 1532270 2533128 2220005 1756390 2388895 3203748
29645 3203748 2479689 644521 -30305 1355816 3201924 3835572 3485358 3172605 3000739
29636 3000739 2516823 1830995 1337831 874078 68728 -789361 -1026143 -575839 -38803
29627 -38803 239348 600352 1426088 2395638 2691490 1975989 959372 704161 1371522 2079469
29617 2079469 2135409 1794354 1405591 595325 -818367 -1721152 -808336 1367351 2759268
29608 2759268 2358104 1128260 207082 -443090 -1024689 -916503 274948 1608703 1856737
29599 1856737 1103505 392619 261881 469314 727271 858941 560914 -232398 -1052459
29590 -1052459 -1576281 -2119235 -2776730 -2761314 -1624324 -555357 -1098051 -2769941 -3398890
29581 -3398890 -2029890 -195004 208522 -755266 -1526249 -1067142 312493 1680137 2357987
29572 2357987 2254267 1749752 1232813 699564 24860 -507754 -480666 -119070 -96305 -443197
29562 -443197 -461341 -26048 -40756 -927558 -1524389 -558838 1286488 2062883 1230286 319752
29552 319752 576074 1231554 1010923 326512 559875 1585138 1677101 211963 -1093243
29543 -1093243 -620300 660606 620657 -768999 -1407936 -308397 961695 757367 -274686
29534 -274686 -451113 454921 1323538 1535228 1318752 767751 -62839 -413777 321507 1151066
29524 1151066 507137 -1207187 -1825523 -592130 632291 161309 -1167871 -1631437 -1177707
29515 -1177707 -830828 -641714 24368 865843 1103230 1145598 1976572 3043568 2692505
29506 2692505 926423 -198088 427962 1342398 893241 -308945 -675887 -183157 -19703
29497 -19703 -408467 -403138 416642 1490022 2421341 3227453 3400870 2129557 -169320 -1747198
29487 -1747198 -1528822 -270462 799892 1502662 2162370 2487872 2008374 1052678 331734
29478 331734 -43599 -246211 101806 1357585 2715815 2834665 1626255 331400 -278618
29469 -278618 -615230 -967620 -805995 -15187 383993 -270909 -966796 -321120 1391266
29460 1391266 2644377 2681939 2008953 1166573 247216 -415345 -297264 334895 516115
29451 516115 -33751 -509777 -304719 202293 507885 737601 1056552 1188924 1098067 1285204
29441 1285204 1697210 1224058 -682729 -2580502 -2535302 -771687 537262 240862 -347295
29432 -347295 450846 2199509 2977338 2000103 519497 -17466 192787 -57439 -980663
29423 -980663 -1401781 -606469 324657 -97729 -1516474 -2058811 -989149 240427 168944
29414 168944 -608493 -623650 49693 16074 -1048843 -1706720 -802479 945585 2032016
29405 2032016 2056903 1780696 1712869 1444389 464069 -841207 -1374904 -583151 711595
29396 711595 1122234 360273 -483123 -582556 -548045 -1233459 -2061613 -1735002 -345500 592998
29386 592998 360025 -74712 171589 540717 292059 -29305 420384 1113783 873442 -81336
29376 -81336 -247078 896140 2024654 1864827 910565 469648 684144 514216 -456930
29367 -456930 -1170828 -442629 1391824 2773095 2703598 1653584 603506 -187809 -1007752
29358 -1007752 -1748176 -1899011 -1420249 -897297 -655468 -352988 230355 562347 9727
29349 9727 -1209730 -2193943 -2300227 -1592321 -570176 173547 204369 -423928 -1088768 -1112011
29339 -1112011 -388405 567033 1090133 863109 176512 -259317 -69237 215864 -172570
29330 -172570 -945603 -877654 405232 1558091 1188481 -204142 -934913 -447498 165741
29321 165741 -71205 -826486 -1333056 -1508630 -1643513 -1633812 -1197646 -533265 -216909 -577571
29311 -577571 -1474494 -2462338 -2896466 -2215481 -587128 916197 1268976 547979 -380172
29302 -380172 -1090555 -1886656 -2777392 -2954766 -1869808 -335212 265950 -239709 -652096
29293 -652096 -157378 594748 641932 202842 254182 1073952 2053237 2670883 2746116 1926444
29283 1926444 47877 -1914835 -2465508 -1572063 -907538 -1455879 -1973910 -858151 1313680
29274 1313680 2427056 1620864 129582 -618295 -552096 -375819 -454382 -786393 -1414016
29265 -1414016 -2270740 -2891971 -2706154 -1635929 -324276 292971 -147230 -909140 -834345
29256 -834345 263109 1288867 1190848 34821 -1546187 -3152409 -4237478 -3872677 -2002153
29247 -2002153 -231605 -51416 -793783 -784417 -8734 171197 -338518 -219286 544947 252755
29237 252755 -1321919 -1730831 521492 3159669 3107713 847884 -600733 -155044 485664
29228 485664 190477 -33013 701146 1536102 1436148 740744 211864 -170606 -572684 -609456
29218 -609456 -179385 8919 -380783 -554269 80762 771594 659653 267034 469796 710938
29208 710938 -229029 -2002651 -2803526 -1799719 -118848 857410 976014 701190 150772
29199 150772 -635217 -1304712 -1671040 -1910462 -1846951 -868501 842774 1848854 1098671
29190 1098671 -575657 -1501912 -1204088 -457574 217321 958227 1666972 1938937 1984468
29181 1984468 2506214 3389451 3552250 2548880 1415734 1318022 2052502 2542882 2317040
29172 2317040 1857012 1776571 2138139 2428502 2030650 1014360 409994 1011630 1875459
29163 1875459 1098927 -1431844 -3264072 -2364490 25010 878785 -711018 -2542486 -2220601
29154 -2220601 147296 2436121 2758603 935298 -1542658 -2687244 -1682259 369049
29146 369049 1680443 1674863 1155462 844350 629313 314833 201050 536032 1021927 1228751
29136 1228751 1050317 530999 -297045 -1205550 -1820679 -2022400 -1916969 -1427387 -424934
29127 -424934 746202 1471942 1611165 1431740 896337 -147362 -1044397 -660656 979151
29118 979151 2297112 1962935 397001 -1008692 -1464841 -1029606 24680 1344944 2400710
29109 2400710 2881001 2947724 2747891 2099195 1024655 87203 -266326 -236032 -132808 146445
29099 146445 611373 703286 -32157 -1195589 -2046308 -2415506 -2577412 -2588002 -2318158 -1825200
29089 -1825200 -1185120 -308619 595603 836837 141389 -670279 -601118 221672 828129 724351
29079 724351 262578 -72893 -45587 524169 1628026 2743478 3200664 2931192 2486064
29070 2486064 2358809 2566570 2726632 2308769 1137896 -80580 -215291 896037 2014593
29061 2014593 1972204 1040548 240443 -103138 -306911 -364883 -35385 411719 510063 473490
29051 473490 822536 1267723 925416 -341840 -1652187 -2213396 -1966855 -1171276 -135961
29042 -135961 627004 745036 527812 557401 857306 1095335 1289361 1476960 1082381 -262083
29032 -262083 -1556261 -1443543 -291829 206714 -402585 -818951 -406288 -345927 -1476457
29023 -1476457 -2585132 -2179826 -780344 29434 -6649 70596 431012 181067 -907652
29014 -907652 -1781034 -1563811 -657558 34438 269323 403030 616104 656421 252709 -450092
29004 -450092 -955224 -983285 -913122 -1369510 -2321653 -2990908 -2848265 -2298534 -2084534 -2368845
28994 -2368845 -2707286 -2590687 -1745222 -318951 914094 1037430 111746 -698723 -632252
28985 -632252 -372572 -841931 -1524352 -1127331 267174 982351 5444 -1577650 -2046281
28976 -2046281 -1221635 -399153 -506706 -1165505 -1548089 -1431427 -1113917 -792038 -512537
28967 -512537 -546832 -1232197 -2267062 -2624877 -1627822 74394 1111825 996904 598968
28958 598968 840897 1475678 1617824 1093189 579753 490899 445676 118244 15186 792777
28948 792777 2018971 2344156 1147197 -519524 -1105699 -356786 685017 1284389 1735755
28939 1735755 2297322 2390371 1575793 606370 499152 942096 737018 -255040 -758359 85887
28929 85887 1529076 2282950 1988747 1201621 627897 770751 1582263 2048571 977538
28920 977538 -1237229 -2564312 -1832189 -356933 -22779 -615085 -525349 463466 901060
28911 901060 170168 -555631 -388480 -150277 -769537 -1549994 -1316794 -443949 -335760 -1275211
28901 -1275211 -2112969 -2026794 -1387519 -740384 -69278 547607 597811 86888 -38310 737603
28891 737603 1379589 630377 -922872 -1370657 -116267 1290903 1437326 970243 1272974
28882 1272974 2093964 1908625 407906 -839984 -601722 324753 392812 -514123 -1154101
28873 -1154101 -798234 -60469 140537 -334875 -970517 -1182617 -568647 840260 2210084
28864 2210084 2299934 784275 -1103426 -1819508 -1242672 -559628 -534477 -722953 -624364 -694350
28854 -694350 -1481125 -2367052 -2178026 -871333 350766 677305 522360 503042 528520 397505
28844 397505 464212 986058 1417922 1138254 424196 -91434 -546007 -1523861 -2824615 -3513473
28834 -3513473 -3229350 -2597447 -2188365 -1808406 -1081294 -151733 485981 497407 -95425 -926714
28824 -926714 -1506131 -1735322 -2044081 -2622349 -2853947 -2180142 -1229311 -1161085 -1943594 -2273375
28814 -2273375 -1399760 -141280 243106 -511584 -1662443 -2266302 -1796467 -549715 433850
28805 433850 449944 105542 492682 1528864 2115798 1866142 1428202 1026673 149058 -989657
28795 -989657 -1272854 -612459 -441820 -1361558 -1889607 -797606 790043 1163314 611096
28786 611096 490796 767210 421872 -409781 -683282 -350081 -118784 254005 1404503
28777 1404503 2401090 1608535 -425536 -1250475 -83059 1156959 1062992 717810 1329598
28768 1329598 1999906 1443559 280968 -159430 -95990 -574274 -1430467 -1741741 -1622856
28759 -1622856 -1822871 -2006752 -1205915 233840 873188 370533 -172563 -259158 -776449
28750 -776449 -2196631 -3430794 -3326762 -2282687 -1491835 -1316494 -1233758 -857050 -247611
28741 -247611 429885 932634 916838 413485 32614 224261 663295 838012 851384 1030088
28731 1030088 1092495 492986 -523780 -993231 -463085 438332 788848 248328 -879664
28722 -879664 -1910208 -2043557 -993585 468095 1161053 866654 455347 487600 483364 -20442
28712 -20442 -525200 -385276 83531 139930 -198305 -345628 -168121 37549 290462 768194
28702 768194 1122817 838852 92910 -606982 -1362479 -2443678 -3204269 -2728731 -1458166
28693 -1458166 -756074 -803883 -478819 459488 824415 197759 -163776 451162 865342 160051
28683 160051 -528833 6788 781113 308289 -662992 -373948 828243 1036315 20642
28674 20642 -558193 -121777 107046 -355560 -417848 257590 407839 -419153 -804017 -496
28664 -496 567692 -119273 -609117 498035 1612472 255601 -2857628 -4495500 -3454661
28655 -3454661 -1937567 -2001659 -2834826 -2547287 -1068641 34520 -193470 -1122581 -1504708
28646 -1504708 -766353 501723 1069573 342277 -808102 -920857 273051 1500829 1502389
28637 1502389 329574 -1071660 -1873864 -1670443 -533299 708312 907710 -36865 -825956
28628 -825956 -469989 248115 -7378 -954083 -1101395 -227999 140345 -769261 -1512669 -555969
28618 -555969 1282592 2000160 1342964 895875 1439672 1977254 1705209 1264032 1212415 715053
28608 715053 -984730 -2786823 -2909775 -1376560 58173 320641 89741 356501 1074197
28599 1074197 1643175 1858115 1819840 1448045 634869 -304579 -682507 -1138 1471160
28590 1471160 2649307 2467072 1030983 -361607 -658552 -108247 474788 871742 1189881
28581 1189881 1028571 -28785 -1345137 -1722911 -947597 76979 689708 1025494 1227327
28572 1227327 1112030 736542 400506 34793 -522046 -749075 -64947 880469 919409 385987
28562 385987 742152 1881066 1763007 -377981 -2356802 -1966439 -15605 1230202 1311572
28553 1311572 1291376 1206644 150871 -1440879 -1929488 -1142003 -803483 -1664332 -2103057
28544 -2103057 -691058 1382766 1936566 883778 50013 258987 275160 -969136 -2447405
28535 -2447405 -2350414 -660535 787856 797544 202444 265364 686417 275596 -925211 -1524338
28525 -1524338 -793153 440526 1202551 1509572 1599939 1181162 248392 -311483 79721
28516 79721 625512 330157 -346244 -122644 1194882 2533714 3059615 2824520 2037378
28507 2037378 736245 -697102 -1532601 -1428305 -695780 138327 616871 463677 -36797
28498 -36797 -73060 695932 1558906 1776763 1608641 1491138 914025 -641214 -2205269 -2339109
28488 -2339109 -1414983 -1159881 -1841351 -1763247 -103867 1548739 1529536 479585 56864
28479 56864 372708 283377 -370497 -451238 540727 1537799 1317810 27210 -1154826 -1392281
28469 -1392281 -811579 26767 846993 1681007 2337464 2266454 1260191 35058 -400628
28460 -400628 64078 578370 499157 112352 49512 465184 1000484 1168427 583322 -827541
28450 -827541 -2607175 -3963764 -4289468 -3444191 -1817040 -378534 -155196 -993224 -1318557
28441 -1318557 -57435 1612408 1646968 7375 -1383106 -1574063 -1674547 -2511298 -3097636
28432 -3097636 -2513294 -1637208 -1534155 -1486106 -374850 1026586 1096381 21522 -606891
28423 -606891 -477521 -709874 -1333470 -848448 1117372 2697294 2339435 924695 209831
28414 209831 428120 680211 686685 750978 624193 -186499 -1218084 -1344196 -252741 1232248
28404 1232248 2209480 2289488 1310938 -568020 -2436924 -3165426 -2600649 -1623479 -954992
28395 -954992 -603157 -527602 -937117 -1605074 -1745156 -1087420 -368267 -186243 -90403 450162
28385 450162 863227 318758 -674607 -789494 46401 408622 -433308 -1302071 -854579 378817
28375 378817 719228 -375061 -1738206 -2055421 -1189567 -532 498597 -141448 -1315927
28366 -1315927 -1673508 -569428 867949 888530 -645009 -2037053 -1962666 -979205 -407624
28357 -407624 -570048 -849933 -873156 -782764 -675616 -539207 -552364 -755469 -599717 422443
28347 422443 1765363 2250173 1608559 832969 709362 750989 129727 -899186 -1261013
28338 -1261013 -561205 375154 544001 -179416 -1199707 -1974210 -2283347 -1987092 -975554
28329 -975554 531652 1863176 2286379 1615710 458899 -255761 -207510 -105099 -824828
28320 -824828 -2041493 -2297167 -902564 814206 1097155 289599 434496 2136389 3362627
28311 3362627 2320380 198144 -516484 409376 1019587 475465 101741 721098 1118976
28302 1118976 338751 -300169 762726 2485502 2488864 639457 -736614 -306494 582416
28293 582416 307741 -648809 -904592 -572024 -945812 -2255653 -3147349 -2537465 -946531
28284 -946531 384030 941777 986368 687253 -29176 -878922 -1188402 -745815 -224418 -353663
28274 -353663 -963963 -1319618 -1179884 -928705 -735948 -332040 231500 375463 -57441 -359299
28264 -359299 -34648 336219 78548 -302070 155088 1182839 1477439 566783 -618207
28255 -618207 -1210063 -1329969 -1195517 -499355 572587 746359 -784023 -2837677 -3515116
28246 -3515116 -2685646 -1943257 -2092277 -2045507 -745035 981788 1486835 605025 -197768
28237 -197768 162048 1201327 1864550 1842947 1419348 622169 -702793 -2127656 -2641792
28228 -2641792 -1666555 190239 1539947 1311831 -392051 -2247359 -2651382 -1196882 720565
28219 720565 1180988 -247713 -2136902 -2890257 -2295351 -1230055 -480535 -301654 -612015
28210 -612015 -1007785 -912523 -283142 121129 -280138 -985671 -1151258 -898851 -1058426 -1786596
28200 -1786596 -2346185 -2257266 -1812008 -1382421 -1048894 -988031 -1350315 -1669606 -1388527 -1095359
28190 -1095359 -2010080 -3867498 -4694020 -3457305 -1602699 -839452 -643754 477671 2164957
28181 2164957 2586284 1320289 -72974 -516292 -657039 -1137114 -1286624 -490930 428055
28172 428055 381608 -278706 -410968 90080 295403 -129220 -378541 265200 1429828 2121958
28162 2121958 1718549 350725 -1263476 -2188175 -1845462 -533521 738873 1139727 769981
28153 769981 502302 1059204 2234056 3013863 2474326 549746 -1981205 -4031807 -4706648
28144 -4706648 -3719545 -1737101 -91990 308331 -270891 -1012985 -1600487 -2132860 -2367221
28135 -2367221 -1893695 -953095 -196876 318575 918025 1158369 243000 -1169663 -1173623 604594
28125 604594 2015223 1405722 163324 495212 1848437 1836360 202268 -697894 337444
28116 337444 1480551 748682 -1098891 -1856107 -798435 970035 2194753 2313368 1310147
28107 1310147 -160810 -973738 -747100 -396379 -725300 -1128417 -635344 392719 771946
28098 771946 292579 -201422 -340225 -659293 -1487242 -2449022 -3194293 -3694336 -3671042 -2629649
28088 -2629649 -744939 972636 1627775 1061811 -380342 -1949355 -2463009 -1243868 672741
28079 672741 1269390 -76361 -1800251 -2196490 -1373542 -534519 -144427 253121 884749
28070 884749 1394693 1541087 1514883 1517446 1471885 1154624 338127 -1061766 -2729663 -4033691
28060 -4033691 -4578415 -4441448 -3772283 -2650932 -1555117 -1284071 -1911467 -2421352 -2024617
28051 -2024617 -1265134 -1033515 -1038400 -329102 960010 1604380 1104929 415286 543844 1313387
28041 1313387 1885460 1772707 948712 -361936 -1560834 -1912152 -1339783 -553552 -97327
28032 -97327 206429 604691 877023 873904 940175 1240504 1223252 404850 -737737 -1303135
28022 -1303135 -1077674 -557116 -193520 -159923 -498933 -941143 -958644 -567655 -586201 -1381350
28012 -1381350 -1907025 -975148 875264 1869540 1190282 -391669 -1966257 -3365313 -4469636
28003 -4469636 -4808328 -4252891 -3277126 -2282249 -1420985 -1076836 -1490364 -1895767 -1270295
27994 -1270295 -52987 325783 -145482 118184 1481117 2077748 792281 -629398 -123198
27985 -123198 1595017 2419533 2039249 1552174 987927 -270526 -1302040 -653213 697155
27976 697155 256981 -1842780 -2578334 -727613 1055974 376201 -1243938 -958531 1042957
27967 1042957 2249546 1812241 1352170 2057234 2982697 2525489 362676 -2293848 -3709000
27958 -3709000 -3076378 -1485531 -951865 -1998367 -3041330 -2815015 -2208210 -2554283 -3291224
27949 -3291224 -2997147 -1950027 -1730373 -2573953 -2986000 -2076922 -632652 416616 1107052
27940 1107052 1572147 1367771 336141 -748966 -1019933 -483277 154241 203548 -507910
27931 -507910 -1399379 -1522062 -665547 234832 367288 184353 465489 900140 773376 509878
27921 509878 1097421 2280041 2817934 2386219 1725634 1065496 43777 -877412 -761856
27912 -761856 -101503 -418230 -1608242 -1734683 -116069 1457911 1553595 1102790 1318089
27903 1318089 1546947 870263 186341 740901 1789131 1733801 767482 455425 1235086
27894 1235086 2113570 2471573 2511208 2185012 1245414 198305 -193724 -159638 -343205 -325458
27884 -325458 726116 2152528 2291786 1002833 19009 366372 964657 465142 -823518
27875 -823518 -1704217 -1808147 -1611013 -1342894 -774259 93607 728245 559983 -330105 -1037367
27865 -1037367 -578063 972608 2392712 2673018 2028047 1144249 102730 -1153013 -1907257
27856 -1907257 -1382183 -65337 804588 923182 1004682 1352617 1560749 1583785 1801569 1917164
27846 1917164 1151480 -169082 -568671 531055 1933406 2399938 2076151 1517282 505026
27837 505026 -1176465 -2712453 -3098109 -2441542 -1559315 -830091 -284606 -260104 -981603
27828 -981603 -1822140 -1865453 -1015463 131685 1192919 2013072 2104135 1025495 -702895
27819 -702895 -1907719 -2120042 -1969499 -2074138 -2147429 -1501123 -34624 1570011 2442714
27810 2442714 2168899 1026935 -264802 -1095555 -1308448 -1052880 -508466 94643 414622
27801 414622 295543 66248 216195 732508 1059796 859053 540277 743021 1403362 1745876
27791 1745876 1325932 673379 536333 802196 748529 207435 -263505 -399766 -532252 -601930
27781 -601930 120973 1687289 2755378 2173901 594187 -506598 -763675 -715226 -312139
27772 -312139 790611 1774035 1279021 -344672 -1092148 -55918 1379834 1645879 833545
27763 833545 -216161 -1175233 -1703291 -1109762 311310 863634 -355159 -1927651 -2123567
$$ [...]
##END NTUPLES=NMR SPECTRUM
##END=
