##TITLE=31Pdec_LY-15Dix.3.B
 CD3CN, 24 sc
 3.06.2021
##JCAMPDX= 6.0         $$ Bruker NMR JCAMP-DX V2.0
##DATA TYPE= NMR SPECTRUM
##DATA CLASS= NTUPLES
##ORIGIN= UXNMR, Bruker Analytische Messtechnik GmbH
##OWNER= root
$$ XWIN-NMR		Version 3.5
$$ Thu Jun  3 10:17:27 2021 Russian Standard Time (UT+4h)  she@DPX200
##.OBSERVE FREQUENCY= 81.013821
##.OBSERVE NUCLEUS= ^31P
##.ACQUISITION MODE= SIMULTANEOUS
##.ACQUISITION SCHEME= undefined
##.AVERAGES= 24
##.DIGITISER RES= 16
##SPECTROMETER/DATA SYSTEM= spect
##.PULSE SEQUENCE= zgpg30
##.SOLVENT NAME= MeOD
##.SHIFT REFERENCE= (INTERNAL, MeOD, 0, 248.564)
##AUDIT TRAIL= $$ (NUMBER, WHEN, WHO, WHERE, WHAT)
$$ ##TITLE= Audit trail, XWIN-NMR		Version 3.5
$$ ##JCAMPDX= 5.01
$$ ##ORIGIN= Bruker BioSpin GmbH
$$ ##OWNER= she
$$ F:/spectra/data/she/nmr/P31/1/pdata/1/auditp.txt
$$ ##AUDIT TRAIL=  $$ (NUMBER, WHEN, WHO, WHERE, WHAT)
(   1,<2021-06-03 10:16:00.68 +0400>,<she>,<DPX200>,
      <created by zg, POWCHK disabled, PULCHK disabled
       configuration hash MD5:
       00 E9 B6 7A A2 85 ED C7 34 08 36 98 17 FE 4E 26
       data hash MD5: 32K
       2B CA E6 C6 8D AF F3 EA 59 5F 54 87 9D DD 0D 76>)
(   2,<2021-06-03 10:16:03.54 +0400>,<she>,<DPX200>,
      <Start of raw data processing
       efp BC_mod = 2 LB = 1 FT_mod = 6 PKNL = 1 PHC0 = -5636.925 PHC1 = -418.7296 SI = 64K 
       data hash MD5: 64K
       3C C8 DD BB AE 5B 9E B8 62 1B BD 50 EA 8C F0 98>)
(   3,<2021-06-03 10:16:47.95 +0400>,<she>,<DPX200>,
      <pk PHC0 = 384.7177 PHC1 = -747.0003 
       data hash MD5: 64K
       2C 7A 92 8C D1 1C C7 59 C9 79 55 FA FB A6 77 CD>)
(   4,<2021-06-03 10:16:52.07 +0400>,<she>,<DPX200>,
      <abs ABSG = 5 
       data hash MD5: 64K
       01 E7 6D 19 13 B8 48 DC 93 73 90 75 EB 73 8F 99>)
$$ ##END=
$$ 
$$ hash MD5
$$ CA B4 3F AF 36 AF FE 9F 30 42 3E 9D BB D4 A4 26
##$RELAX= 
##$RELAX= 
##$RELAX= 
##$RELAX= 
##$RELAX= 
##$RELAX= 
##$RELAX= 
##$RELAX= 
$$ Bruker specific parameters
$$ --------------------------
##$DU= <F:/spectra>
##$EXPNO= 1
##$NAME= <P31>
##$PROCNO= 1
##$TYPE= <nmr>
##$USER= <she>
##$AMP= (0..31)
100 100 100 100 100 100 100 100 100 100 100 100 100 100 100 100 100 100 
100 100 100 100 100 100 100 100 100 100 100 100 100 100 
##$AQSEQ= 0
##$AQ_mod= 1
##$AUNM= <au_zg>
##$AUTOPOS= <>
##$BF1= 81.014009
##$BF2= 200.13
##$BF3= 200.13
##$BF4= 200.13
##$BF5= 200.13
##$BF6= 200.13
##$BF7= 200.13
##$BF8= 200.13
##$BYTORDA= 1
##$CFDGTYP= 0
##$CFRGTYP= 5
##$CHEMSTR= <none>
##$CNST= (0..31)
1 1 145 1 1 1 1 1 1 1 1 1 1 1 1 1 1 1 1 1 1 1 1 1 1 1 1 1 1 1 1 1 
##$CPDPRG= <waltz16>
##$CPDPRG1= <>
##$CPDPRG2= <waltz16>
##$CPDPRG3= <>
##$CPDPRG4= <mlev>
##$CPDPRG5= <mlev>
##$CPDPRG6= <mlev>
##$CPDPRG7= <mlev>
##$CPDPRG8= <mlev>
##$CPDPRGB= <>
##$CPDPRGT= <>
##$D= (0..31)
0 1 0 0 0 0 0 0 0 0 0 0.03 2e-05 3e-06 0 0 0 0 0 0 0 0 0 0 0 0 0 0 0 0 
0 0 
##$DATE= 1622700960
##$DBL= (0..7)
120 120 120 11 120 120 24 19 
##$DBP= (0..7)
150 150 150 150 150 150 150 150 
##$DBP07= 0
##$DBPNAM0= <>
##$DBPNAM1= <>
$$ [...]
##$SUBNAM3= <"">
##$SUBNAM4= <"">
##$SUBNAM5= <"">
##$SUBNAM6= <"">
##$SUBNAM7= <"">
##$SUBNAM8= <"">
##$SUBNAM9= <"">
##$SW= 501.771253377433
##$SWIBOX= (0..15)
0 1 3 0 0 0 0 0 0 0 0 0 0 0 0 0 
##$SW_h= 40650.406504065
##$TD= 32768
##$TD0= 1
##$TE= 0
##$TE2= 300
##$TE3= 300
##$TEG= 300
##$TL= (0..7)
0 120 53 12 22 120 120 120 
##$TP= (0..7)
150 150 150 150 150 150 150 150 
##$TP07= 0
##$TPNAME0= <>
##$TPNAME1= <>
##$TPNAME2= <>
##$TPNAME3= <>
##$TPNAME4= <>
##$TPNAME5= <>
##$TPNAME6= <>
##$TPNAME7= <>
##$TPOAL= (0..7)
0.5 0.5 0.5 0.5 0.5 0.5 0.5 0.5 
##$TPOFFS= (0..7)
0 0 0 0 0 0 0 0 
##$TUNHIN= 0
##$TUNHOUT= 0
##$TUNXOUT= 0
##$USERA1= <user>
##$USERA2= <user>
##$USERA3= <user>
##$USERA4= <user>
##$USERA5= <user>
##$V9= 5
##$VALIST= <valist>
##$VCLIST= <CCCCCCCCCCCCCCC>
##$VD= 0
##$VDLIST= <DDDDDDDDDDDDDDD>
##$VPLIST= <PPPPPPPPPPPPPPP>
##$VTLIST= <TTTTTTTTTTTTTTT>
##$WBST= 1024
##$WBSW= 4
##$XGAIN= (0..3)
0 0 0 0 
##$XL= 0
##$YL= 0
##$YMAX_a= 6702
##$YMIN_a= -9639
##$ZGOPTNS= <>
##$ZL1= 120
##$ZL2= 120
##$ZL3= 120
##$ZL4= 120
##$ABSF1= 248.5645
##$ABSF2= -253.2056
##$ABSG= 5
##$ABSL= 3
##$ALPHA= 0
##$AQORDER= 0
##$ASSFAC= 0
##$ASSFACI= 0
##$ASSFACX= 0
##$ASSWID= 0
##$AUNMP= <proc_1d>
##$AZFE= 0.1
##$AZFW= 0.5
##$BCFW= 0
##$BC_mod= 2
##$BYTORDP= 0
##$COROFFS= 0
##$CY= -3
##$DATMOD= 1
##$DC= 0
##$DFILT= <>
##$DTYPP= 0
##$F1P= 0
##$F2P= 0
##$FCOR= 1
##$FTSIZE= 65536
##$FT_mod= 6
##$GAMMA= 0
##$GB= 0
##$INTBC= 1
##$INTSCL= 5.30512e-09
##$ISEN= 30
##$LB= 1
##$LEV0= 0
##$LPBIN= 0
##$MAXI= 10000
##$MC2= 0
##$MEAN= 0
##$ME_mod= 0
##$MI= 50
##$NCOEF= 0
##$NC_proc= -4
##$NLEV= 6
##$NOISF1= 182.463
##$NOISF2= 159.3651
##$NSP= 0
##$NTH_PI= 0
##$NZP= 0
##$OFFSET= 248.5645
##$PC= 4
##$PHC0= -5252.207
##$PHC1= -1165.73
##$PH_mod= 1
##$PKNL= yes
##$PPARMOD= 0
##$PSCAL= 0
##$PSIGN= 0
##$REVERSE= no
##$SF= 81.014009
##$SI= 65536
##$SIGF1= 159.3651
##$SIGF2= -187.1042
##$SINO= 113.3802
##$SIOLD= 16384
##$SREGLST= <1H.CDCl3>
##$SSB= 0
##$STSI= 65536
##$STSR= 0
##$SW_p= 40650.406504065
##$SYMM= 0
##$S_DEV= 0
##$TDeff= 32768
##$TDoff= 0
##$TI= <>
##$TILT= no
##$TM1= 0
##$TM2= 0
##$TOPLEV= 0
##$USERP1= <user>
##$USERP2= <user>
##$USERP3= <user>
##$USERP4= <user>
##$USERP5= <user>
##$WDW= 1
##$XDIM= 65536
##$YMAX_p= 405610480
##$YMIN_p= -15338134
$$ End of Bruker specific parameters
$$ ---------------------------------
##NTUPLES= NMR SPECTRUM
##VAR_NAME=  FREQUENCY,     SPECTRUM/REAL,   SPECTRUM/IMAG
##SYMBOL=    X,             R,               I
##VAR_TYPE=  INDEPENDENT,   DEPENDENT,       DEPENDENT
##VAR_FORM=  AFFN,          ASDF,            ASDF
##VAR_DIM=   65536,         65536,           65536
##UNITS=     HZ,            ARBITRARY UNITS, ARBITRARY UNITS
##FACTOR=    0.620285442955139, 1,           1
##FIRST=     20137.2065510759, 0,            0
##LAST=      -20513.1999529892, 0,           0
##MIN=       -20513.1999529892, -15338134,   0
##MAX=       20137.2065510759, 405610480,    0
$$ Real data points
##PAGE= N=1
##DATA TABLE= (X++(R..R)), XYDATA
$$ [...]
##PAGE= N=2
##DATA TABLE= (X++(I..I)), XYDATA
37853 -1074929 -990068 -525580 120110 526088 646540 740559 758545 375843 -280094 -571132
37843 -571132 -285943 -45011 -346543 -728346 -475706 195267 387652 -141773 -611917 -336197
37833 -336197 368550 723949 552357 356785 475694 596375 254400 -438849 -858101 -642404
37823 -642404 -140983 71309 -95091 -302905 -409933 -604571 -891979 -905740 -441858 187417
37813 187417 584567 703655 570733 -14463 -1008386 -1684370 -1345787 -405561 -66325 -781389
37803 -781389 -1639696 -1578605 -713719 -40603 -143994 -681998 -1008755 -856602 -381747 106480
37793 106480 328970 163142 -262761 -668874 -870320 -876626 -767364 -585196 -368381 -167283
37783 -167283 27079 278283 570378 765201 761460 611963 408215 159878 -90177 -166534
37773 -166534 61 129521 -91768 -462009 -439347 6708 190731 -297627 -819589 -466670
37763 -466670 624342 1400518 1297351 830596 648391 668590 516048 281055 337861 688982
37753 688982 920576 685553 260 -753713 -1003037 -504006 158725 72882 -753546 -1229450
37743 -1229450 -671523 197506 377080 70839 124684 478424 351992 -207358 -237981 513736
37733 513736 1080929 799884 280010 265805 469128 279117 -134324 -267141 -236084 -414128
37723 -414128 -576020 -326032 -49543 -459843 -1319160 -1560721 -760563 331592 882289
37714 882289 861655 644002 424778 345564 600815 1044270 1159568 775838 384424 386986
37704 386986 463731 146114 -349331 -431758 -83354 108938 -128107 -353690 -119318 335389
37694 335389 416945 22409 -276848 69705 896338 1442490 1150451 264658 -415398 -348641
37684 -348641 264322 808383 914428 668862 280178 -185490 -639809 -794067 -449165 85878
37674 85878 201205 -268391 -789482 -830849 -555516 -494611 -752252 -979839 -1011032 -966052
37664 -966052 -728129 20419 1029615 1416924 803717 -34450 -198131 123449 122542 -327009
37654 -327009 -632690 -547831 -435050 -479797 -446346 -333398 -501376 -902000 -877420 -79226
37644 -79226 958799 1480135 1248502 411369 -758088 -1649574 -1510975 -384456 661318
37635 661318 762903 268932 7110 77058 52819 -60918 100813 483105 699893 769277
37625 769277 1003260 1251384 1033282 426418 47198 68686 33719 -195023 -116105 437643
37615 437643 750039 166977 -941886 -1701387 -1818016 -1632264 -1388123 -1000473 -437335
37606 -437335 110083 449410 533066 421247 251734 147007 42877 -243937 -710649 -1142320
37596 -1142320 -1426352 -1581332 -1429465 -700507 356003 969474 795007 400591 396245 546923
37586 546923 320341 -89496 -40548 448322 664371 302511 -132208 -191624 -100639 -218209
37576 -218209 -422538 -404073 -179253 51408 260057 468066 509992 255465 -101694 -260820
37566 -260820 -183694 -24416 133193 236804 160992 -95295 -297436 -330976 -428810 -697610
37556 -697610 -711152 -125082 501660 253599 -709603 -1086277 -184072 968390 908576 -337902
37546 -337902 -1404514 -1423288 -883312 -624960 -776613 -975787 -1018088 -872298 -481262 41111
37536 41111 316594 152937 -176013 -375798 -519791 -682905 -608054 -195786 76193 -181143
37526 -181143 -529818 -367459 -55799 -439088 -1269351 -1200674 284204 1907552 2200185
37517 2200185 1345733 654324 719143 971950 805249 251192 -442801 -1127145 -1476038 -1064019
37507 -1064019 -34536 764329 667648 -40192 -520285 -354878 114783 315770 86707
37498 86707 -216537 -153271 318853 822249 997007 828541 495639 112038 -198589 -185873
37488 -185873 245514 731772 762368 280948 -316756 -747032 -1053920 -1264762 -1250350 -1056267
37478 -1056267 -990616 -1170868 -1294335 -1081143 -650719 -216478 262374 766983 865327 213440
37468 213440 -698741 -900137 -171739 574904 441859 -308207 -655101 -168359 515062 589189
37458 589189 66127 -350009 -182977 285896 431735 67078 -353144 -341711 -33042 9885
37448 9885 -378441 -689616 -485450 -54643 92635 97396 461326 968894 751125 -297153
37438 -297153 -1012741 -518107 385026 274481 -840314 -1574598 -1180138 -404658 -123498
37429 -123498 -154591 36471 307796 266453 143644 426070 923188 970466 440846 -119450
37419 -119450 -347580 -447555 -619290 -622145 -143503 693162 1397506 1575564 1257043 832601
37409 832601 644009 605833 372919 -84537 -364093 -240505 -42109 -121090 -267649 -68192
37399 -68192 372934 535105 217937 -220814 -332051 12640 596333 995331 888663 469652
37389 469652 325287 646726 889114 572146 24082 -164625 -32084 25320 26369 152266
37379 152266 67433 -578261 -1191409 -845874 191490 680051 271758 -46202 298169 535701
37369 535701 29532 -489265 -110336 718907 914419 393530 -71409 -191936 -300543 -438284
37359 -438284 -334272 -150608 -285090 -504960 -228835 319486 226081 -654593 -1286752 -881980
37349 -881980 23290 404501 81188 -316377 -323815 -74969 60088 -107363 -471550 -757560
37339 -757560 -816124 -786756 -802598 -669322 -226633 69682 -463631 -1634848 -2302456 -1769104
37329 -1769104 -736414 -381868 -860602 -1294177 -1049005 -438673 -132676 -318275 -597541
37320 -597541 -478829 135642 851596 1173122 1030300 776377 607295 305084 -198569 -372285
37310 -372285 282364 1315006 1668365 1022230 233053 185253 688253 918622 613615 288802
37300 288802 361706 575667 448645 -37164 -438641 -410988 -57571 269143 378119 373004
37290 373004 404210 402364 188037 -165899 -283236 48063 471488 357876 -463807 -1440655
37280 -1440655 -1844736 -1499358 -895182 -645648 -884511 -1178516 -1010720 -349050 305058
37271 305058 468801 204188 -9075 120151 357273 241949 -354210 -1004174 -1074096 -389641
37261 -389641 424476 472711 -402685 -1367588 -1591150 -1227204 -978555 -919596 -456619 481658
37251 481658 1001115 427892 -628044 -989915 -378865 416184 652666 349658 -65898
37242 -65898 -304695 -304828 -143606 4966 11875 -92524 -274104 -620887 -1093765 -1343883 -1098948
37231 -1098948 -573904 -158730 115544 394917 505157 191335 -265695 -302039 67641 293152
37221 293152 254963 453598 1007325 1222551 634987 -147574 -273161 111117 142941 -431660
37211 -431660 -898391 -569855 366775 1121671 1101074 352640 -537460 -916968 -606346 -13830
37201 -13830 358776 440030 500787 691005 891994 956671 865493 659679 404799 200562
37191 200562 54826 -219600 -779536 -1410130 -1613525 -1131158 -258810 439160 642391 432965
37181 432965 50613 -346043 -674667 -864211 -915334 -916071 -845840 -483513 229901 824032
37171 824032 715304 72289 -215255 300940 963086 935576 370889 36605 94843 36964
37161 36964 -269548 -327946 49030 348835 243053 171521 570390 1065584 1014071 506974
37151 506974 256910 622703 1198094 1341664 828104 9198 -490578 -303306 350865 932667
37141 932667 1141343 1003817 551002 -148616 -681942 -615713 -229234 -271421 -779260 -878904
37131 -878904 -153165 571461 432270 -179870 -386353 -318005 -771377 -1619993 -1732589 -628468
37121 -628468 763423 1357230 1154738 801379 541612 198430 -208823 -446234 -524795 -667028
37111 -667028 -811745 -575146 159012 913665 1113965 759097 356120 247347 293589 272737
37101 272737 256468 373875 481779 387471 178425 -26697 -404458 -1012524 -1289533 -677344
37091 -677344 314196 477539 -478252 -1445288 -1364358 -461774 342744 592232 381875 -79400
37081 -79400 -425060 -173217 598345 1066498 704999 60800 -64605 283268 553390 634982
37071 634982 733781 731449 455120 245976 471164 763485 537528 -10823 -233661 -105587
37061 -105587 -116160 -296401 -233657 87256 317271 466827 724499 745229 101581 -712526
37051 -712526 -819893 -410295 -444200 -897727 -684649 394208 1051272 458995 -492148 -686861
37041 -686861 -405461 -472516 -719006 -431657 279300 678599 614592 538520 537165 255889
37031 255889 -278700 -527861 -185170 481761 1026685 1155189 773125 110021 -323775 -248263
37021 -248263 80434 351119 669225 1168676 1506862 1265301 610176 51161 -237057 -357977
37011 -357977 -215718 313208 911631 1153753 1198141 1502309 1898355 1677908 719719 -156882
37001 -156882 -245370 205929 545057 615339 661924 707565 549313 228264 42209 116913
36991 116913 326667 625405 1080833 1520882 1541025 1068435 602735 601571 865360 901826
36981 901826 731708 843543 1349658 1710830 1486647 909004 427221 83837 -281771 -547552
36971 -547552 -501484 -312928 -330665 -513099 -492115 -139161 324026 704466 935923 885386
36961 885386 493530 62111 -26867 150028 214836 123693 163831 335251 271298 -130243
36951 -130243 -475366 -414623 -33894 381907 615967 527315 186717 3502 288479 718138
36941 718138 719025 343138 185398 432937 646650 562517 428890 402387 297414 126476
36931 126476 177628 319677 -1296 -735423 -995944 -338453 470980 574252 248007 296973
36921 296973 755407 1002260 850926 741619 954950 1251417 1286430 983736 549421 349706
36911 349706 581168 895473 716200 123845 -101923 351829 741107 357436 -383595 -635126
36901 -635126 -403468 -311810 -410631 -140045 588395 1096296 855152 113633 -503433 -585990
36891 -585990 -113813 538460 778589 365826 -229745 -377478 -81472 151786 84109 -82463
36881 -82463 -209008 -398062 -651826 -760704 -589671 -207400 232405 515179 420859 17115
36871 17115 -301683 -348006 -439262 -819382 -1121417 -882401 -291514 127803 317112 540794
36861 540794 668180 333479 -252602 -386294 145777 786374 1023230 927354 762998 603789
36851 603789 505360 593473 806099 912871 864708 761525 519689 69164 -172605 303247
36841 303247 1130411 1240361 302962 -696517 -773059 -221787 17596 -223836 -346203 -150061
36831 -150061 -135039 -527997 -769626 -360980 283013 355602 -194195 -573432 -209250 563468
36821 563468 1039769 996338 735452 550362 485232 473285 394532 110861 -266355 -312198
36811 -312198 149820 612237 476245 -86892 -436830 -489909 -722111 -1163175 -1228286 -738644
36801 -738644 -277651 -208733 -143011 202486 424514 238625 79988 263058 289825 -249697
36791 -249697 -766993 -520029 197847 589648 570643 565876 586408 453845 477831 892098
36781 892098 1059927 359641 -539850 -534421 101109 138917 -537117 -817537 -372870 -173215
36771 -173215 -651974 -895711 -286005 435189 510337 335707 427036 381433 -113033 -277963
36761 -277963 544125 1497551 1329941 328286 -182885 83189 162603 -382478 -802894 -528414
36751 -528414 -82160 -160704 -613829 -860708 -747785 -490748 -159623 303455 764956 964037
36741 964037 802700 377526 -144761 -543811 -622103 -433029 -265342 -243539 -152503 123989
36731 123989 243866 -111933 -540548 -271613 652271 1132445 364874 -1002044 -1654979
36722 -1654979 -1311070 -923813 -1243883 -1924514 -2229766 -1931021 -1180348 -135652 836902
36713 836902 1125478 563658 -232149 -654539 -805515 -977336 -988141 -650369 -389846 -626806
36703 -626806 -913568 -512167 417213 1017469 952775 642341 418055 235372 127632 183035
36693 183035 157964 -139630 -233639 407590 1274655 1290852 360420 -534143 -815843 -859984
36683 -859984 -939383 -738936 -245394 -74355 -441385 -702105 -396931 49194 119098 -73317
36673 -73317 -266920 -481640 -562415 -122588 620619 823986 328743 84057 671647 1348067
36663 1348067 1291554 878884 811467 801977 215211 -611790 -844261 -541432 -465041 -745260
36653 -745260 -798881 -479068 -318948 -569122 -811336 -656953 -206498 252266 491761 328578
36643 328578 -134566 -339791 132240 896666 1206863 937830 588430 446330 370551 329973
36633 329973 492729 732298 672554 368962 384322 952658 1519327 1415216 706067 90636
36623 90636 88893 539696 882725 818321 592392 585273 760926 768013 521503 313281 295204
36612 295204 266744 105884 -41950 -210002 -734200 -1567906 -1937414 -1205708 182267 1106219
36602 1106219 990647 249385 -358632 -477651 -319803 -313955 -580224 -758584 -534518 -203271
36592 -203271 -273362 -589683 -496564 65379 394322 187718 46719 422319 873293 919771
36582 919771 853672 1024093 1044158 511125 -104061 -146890 168290 271239 304671 720303
36572 720303 1208633 1058759 348700 -184089 -277149 -241447 -135764 196171 426061 81288
36562 81288 -507307 -611319 -394898 -699677 -1494662 -1722758 -956013 -70756 157520 80438
36552 80438 231223 329908 -2663 -316346 -7120 600579 748580 513596 675687 1380977
36542 1380977 1792253 1301505 419921 21376 133184 69388 -388990 -647598 -346822 -95363
36532 -95363 -562552 -1292021 -1286626 -596173 -276202 -634610 -679414 168780 932526 540369
36522 540369 -460818 -779412 -327768 -48938 -179940 -18660 636228 1055569 778789
36513 778789 218745 -175182 -469516 -705747 -619994 -207970 108016 132566 109442 107538
36503 107538 -152348 -643476 -835862 -427272 230646 643855 678217 454642 195938 205151
36493 205151 518675 633054 127631 -545367 -556442 102786 665551 784598 851659 1093367
36483 1093367 1212569 1053670 807472 449082 -178629 -642931 -261151 660902 974284
36474 974284 368983 -156277 81834 458050 263463 -127044 -93788 119359 25544 -89472
36464 -89472 297945 904787 996682 447437 -252834 -713145 -772020 -320824 371445 532702
36454 532702 -258882 -1365674 -1781275 -1255276 -275460 679511 1331601 1430729 1026316 699696
36444 699696 991475 1722324 2220784 2012403 1069403 -222248 -1100297 -965229 -216925
36435 -216925 30821 -551849 -989955 -481471 380554 596795 262333 147063 310642 172467
36425 172467 -338708 -698886 -705061 -589930 -328572 303484 999013 1061655 377495 -396260
36415 -396260 -672380 -432951 54638 463503 435352 -45071 -406163 -193683 148913 -115186
36405 -115186 -769906 -810526 107169 1150361 1408668 860107 54745 -570445 -822721 -682787
36395 -682787 -345637 -19825 376647 981267 1506899 1470327 891848 276732 -98185 -359360
36385 -359360 -499670 -264873 311499 805874 982300 987193 873511 472376 -118958 -474695
36375 -474695 -464322 -410156 -410176 -75109 734530 1440580 1455691 962543 538578 328988 91038
36364 91038 -142580 8582 640930 1253982 1252607 621793 -32279 -114420 350226 826303
36354 826303 966623 975123 1146868 1341102 1249880 970170 826561 710000 145974 -893271
36344 -893271 -1755336 -1874264 -1340225 -517319 422400 1254549 1445011 680716 -517404
36335 -517404 -1205453 -1034279 -494843 -150930 -17585 163493 371502 341416 31464 -247760
36325 -247760 -214839 78527 391085 537948 393118 -101976 -713028 -934245 -564876 -64747
36315 -64747 76514 106539 545630 1109589 961841 164388 -112167 686069 1480385 1060912
36305 1060912 -117388 -621891 -39849 773881 1159829 1239068 1093481 491919 -346826
36296 -346826 -679441 -270751 265850 460941 578570 880246 1040657 753424 299969 28896
36286 28896 -210527 -629435 -946364 -778793 -257730 187284 387448 422492 323551 117601
36276 117601 -70960 -212013 -402375 -546823 -381990 3144 131319 -137375 -340722 -164316
36266 -164316 89072 142581 257480 599203 679990 102258 -618978 -739796 -449660 -545125
36256 -545125 -1149949 -1568443 -1349067 -761596 -223089 79336 -326 -453578 -786385 -482337
36246 -482337 147390 286227 -130787 -291365 139791 429019 22663 -430071 -67059 753381
36236 753381 940512 342871 -8123 597216 1592904 1987609 1587246 964029 594454 489480
36226 489480 492858 493109 342325 -65548 -522477 -581074 -74413 607407 928850 766266 388265
36215 388265 35303 -224252 -324157 -221963 -86742 -124834 -176474 125684 677720 836685
36205 836685 312137 -290323 -233779 364044 798327 778517 585532 370944 -47486 -642064
36195 -642064 -1015581 -941773 -603641 -202599 157760 117901 -723500 -1938159 -2292355 -1200637
36185 -1200637 322615 788971 -3697 -952222 -1142528 -675164 -83678 365040 638409
36176 638409 736686 758708 853238 973504 940083 789268 770348 975569 1267794 1553969
36166 1553969 1781706 1705157 1106492 286136 -156536 -137530 -175238 -497630 -622325 -141541
36156 -141541 587808 969729 969880 908347 799876 475626 177725 452463 1426850 2568795
36146 2568795 3179867 2903758 1906523 857449 545007 1133108 1925448 2191748 2011179
36137 2011179 1908928 1965333 1888155 1752060 1898479 2109534 1682660 531766 -494853
36128 -494853 -705382 -351567 20813 375619 838396 1089505 771640 192005 -38570 88120
36118 88120 52298 -255392 -291676 282369 998022 1154076 729893 379950 577030 1064697
36108 1064697 1296913 1219054 1279309 1629667 1722821 1039503 -55090 -671964 -509297 -77065
36098 -77065 165062 290159 421711 424540 349337 564651 1052537 1146505 467615 -385172
36088 -385172 -638568 -373824 -130773 58591 474131 908935 957927 894508 1304529 1915486
36078 1915486 1819428 983495 470102 796355 1120316 680582 95268 305800 924774 785086
36068 785086 -177832 -796722 -506404 -189661 -730849 -1604141 -1657434 -799598 -49943 -31245
36058 -31245 -219746 101305 778195 1112261 869818 457504 252212 264309 464131 937374
36048 937374 1527389 1719588 1188814 245742 -512836 -825290 -827173 -709171 -606122 -675864
36038 -675864 -957498 -1193016 -1056740 -550154 30268 465548 749109 908231 916099 779631
36028 779631 565036 360321 281504 377056 448149 220166 -151485 -95744 555887 1134861
36018 1134861 981281 422483 329385 899954 1536920 1828976 1923915 1891895 1485040 755157
36008 755157 230335 152704 117074 -201538 -530493 -597978 -679793 -1030857 -1249999 -836841
35998 -836841 -73496 273334 -29231 -495316 -638236 -389009 105269 626047 869695 715566
35988 715566 485841 569705 847801 868237 522446 136823 -49016 -57767 124261 520979
35978 520979 811753 532285 -219940 -743825 -590330 -57349 340426 455116 333778 -60354
35968 -60354 -583542 -751811 -295111 368933 616866 372711 12775 -238428 -370775 -264474
35958 -264474 149530 515312 423055 139304 342134 1021164 1298627 641615 -333068 -705943
35948 -705943 -438798 -167991 -143176 -5284 479513 1043275 1343689 1347509 1191046 973768
35938 973768 771971 618320 442260 239464 232941 576086 963927 911652 432300 71769
35928 71769 212579 677672 1072136 1163655 870122 265375 -295737 -445004 -312489 -369977
35918 -369977 -647263 -595895 36071 697620 766991 373866 77809 75379 174368 277812
35908 277812 426021 544472 566878 646388 870930 960482 646694 173604 -338 152520
35898 152520 302857 337281 402089 472845 352986 88880 -27675 110827 336594 531744
35888 531744 721000 859176 827511 632948 389524 180667 114045 305409 591998 572251
35878 572251 228676 122667 558506 997520 868204 509822 574848 890257 819027 468941
35868 468941 486629 765379 523805 -220015 -455786 176314 684833 254652 -513733 -634629
35858 -634629 -186062 136431 301593 818510 1623728 1964763 1412508 444763 -43481 417613
35848 417613 1405470 1878460 1223526 110782 -182054 576023 1250970 953952 199453
35839 199453 -51911 235789 478173 545880 702885 881518 842191 773865 977008 1194963
35829 1194963 988980 530150 271923 92600 -401066 -916036 -759618 -49983 299496
35820 299496 -70673 -502848 -430543 -141597 -101567 -210825 -138207 150418 567252 1130545
35810 1130545 1667804 1726572 1154336 430553 98359 156936 284302 355731 449966 590963
35800 590963 755588 960094 1163915 1276303 1348226 1494785 1573636 1311547 841043 650014
35790 650014 827035 889734 652236 660943 1258242 1773834 1415242 608970 522776 1314527
35780 1314527 1831049 1301192 429067 262529 697349 878284 620387 508826 728277
35771 728277 729628 234008 -235566 -181555 169062 436858 769392 1373844 1854969 1712013
35761 1712013 1170455 803348 574649 50846 -579166 -577407 195800 1027785 1376954 1356879
35751 1356879 1059583 310196 -581793 -754188 -13075 657403 395414 -416122 -898106
35742 -898106 -834085 -464283 114570 610459 385056 -477220 -738328 293543 1408654
35733 1408654 1160328 208985 352414 1588230 2047049 973865 -130917 58650 832272
35724 832272 961996 666258 831557 1271256 1072540 141202 -713765 -930508 -563710 196397
35714 196397 1084802 1577115 1346341 746543 334053 189526 186891 497212 1188443 1709567
35704 1709567 1502365 871883 560176 678903 756415 650526 678762 917479 1044819 875575
35694 875575 510137 29826 -444818 -569877 -232563 31409 -251306 -616609 -346143 170516
35684 170516 -162012 -1309479 -1834442 -868573 661251 1389439 1237221 1033342 1099231
35675 1099231 1099631 896116 692505 514135 252282 96660 280157 498532 230643 -388254
35665 -388254 -633176 -188483 475112 821671 834421 744625 663235 674580 874886 1118100
35655 1118100 1110934 940903 1071843 1561088 1747039 1120984 137727 -336408 -133732 178653
35645 178653 212229 128617 102361 -16916 -319752 -536990 -372051 134257 749044 1305748
35635 1305748 1651058 1594211 1130552 530436 23702 -407496 -739751 -669062 16763 961840
35625 961840 1487192 1319611 832967 550488 613751 771679 717409 380204 -17835 -187791
35615 -187791 -117883 -107624 -340537 -551322 -352215 170168 482976 305113 24356 243935
35605 243935 1046867 1892021 2203745 1916970 1412669 1036980 803365 541980 182417 -199326
35595 -199326 -479538 -485035 -41510 714968 1182817 837117 -48662 -619440 -454381 76635
35585 76635 577810 1127607 1671690 1597417 615504 -400762 -344612 544128 927711 202496
35575 202496 -814049 -1205622 -1076412 -947823 -825400 -481231 -115566 -68734 -199009 -129149
35565 -129149 128427 313157 453991 726751 955903 836261 564347 661377 1144243 1433662
35555 1433662 1213628 873305 878693 1145982 1333046 1391602 1457094 1441209 1173786 859326
35545 859326 940388 1407327 1616376 1052066 56466 -520154 -329941 135372 261828 23511
35535 23511 -224508 -358426 -515874 -662496 -577366 -299127 -159079 -218942 -73810 504862
35525 504862 1052091 933755 220549 -382242 -434330 -167877 74906 365770 855005 1221262
35515 1221262 943070 118815 -429887 -110138 674537 1045731 774249 454229 570321
35506 570321 891916 1001752 970468 1104044 1335978 1374789 1300693 1485412 1927003 2155344
35496 2155344 1890429 1379498 968048 721491 594072 576018 505066 129099 -413137 -552093
35486 -552093 -36336 590172 625629 123415 -194975 150894 872525 1275662 977249 289215
35476 289215 -49451 358595 1051840 1199015 649961 146607 327415 913060 1185745 946905
35466 946905 603647 528798 742316 1084182 1319458 1174791 642761 185078 275657 768345
35456 768345 1052768 842627 495244 491170 845727 1129724 951160 390529 -13846 160603
35446 160603 628386 673038 169439 -99907 443611 1143645 866016 -367350 -1275755 -979777
35436 -979777 -57858 387514 120014 -297990 -552085 -856270 -1226690 -1110569 -73294
35427 -73294 1414296 2260705 1887965 881348 348645 705811 1306787 1314156 685648 78124
35417 78124 -76094 -50263 -295524 -688813 -582624 351026 1503811 1812497 955082 -159818
35407 -159818 -390099 283038 831296 614866 153521 179911 501989 412821 -101430 -307553
35397 -307553 148644 746336 917155 836852 1057717 1677043 2232361 2312878 2012321 1752684
35387 1752684 1781364 1940810 1993558 2068653 2495422 3155702 3461137 3278327 3384996 4378509
35377 4378509 5445433 5076189 3035173 802462 -183061 20405 504262 833449 1065745
35368 1065745 1021434 429035 -352941 -554913 -37069 487480 437340 63073 -87131 22981
35358 22981 14334 -249500 -505077 -525717 -369346 -139081 213971 685243 1007003 895444
35348 895444 482343 289327 686459 1468182 2025643 1902299 1201322 528956 486443 1065617
35338 1065617 1575739 1353211 504010 -307738 -744368 -1046259 -1349246 -1317734 -779124 -221076
35328 -221076 -152749 -338942 -250719 5595 -103793 -541537 -649912 -156268 448205 700085
35318 700085 728597 789403 768884 468607 -8770 -420945 -609647 -416320 212622 869232
35308 869232 902698 240907 -441673 -617142 -496516 -469152 -501331 -487574 -660714 -1118226
35298 -1118226 -1381762 -1023185 -384188 -76551 -87486 -29300 28745 -230978 -505459 -110186
35288 -110186 826815 1254535 583233 -504523 -1020616 -888456 -710177 -740678 -694766 -437599
35278 -437599 -320736 -686486 -1315070 -1574316 -1106337 -263324 256095 217729 105670 417054
35268 417054 928873 998978 468873 -167490 -503610 -667451 -882725 -1016328 -853952 -526008
35258 -526008 -330201 -303649 -252228 -76669 180553 499525 843139 1035213 926652 646850
35248 646850 475877 495499 564455 598059 637189 638030 445703 56724 -293291 -401637 -287771
35237 -287771 -22422 416793 934123 1144482 717527 -131078 -764777 -805561 -474844 -185426
35227 -185426 -40931 83922 174148 74452 -201168 -423337 -444129 -351524 -285091 -246214 -126321
35216 -126321 195204 768390 1433393 1795978 1574212 1004952 665907 811514 1114354 1160018
35206 1160018 932356 649210 404047 243786 366719 860741 1347770 1307531 811282 560379
35196 560379 1000764 1665962 1702037 956325 222057 285584 956987 1312940 842519 18718
35186 18718 -394696 -273806 -52501 47223 210676 500268 664779 623946 663215 887319
35176 887319 907379 433027 -163395 -293322 76393 512566 778368 963073 1088268 1060092
35166 1060092 975915 1038139 1151063 1024621 739327 792138 1415087 2161104 2370386 1874208
35156 1874208 1107514 652252 744744 1138529 1415672 1441353 1385967 1270052 826755 80174
35146 80174 -296413 284480 1393297 1951147 1532636 803281 599662 1033706 1603185 1773079
35136 1773079 1352691 676849 456133 1039096 1827629 1920163 1323500 898784 1050047 1242219
35126 1242219 1061547 914953 1180424 1409231 1058968 461033 319857 659696 994611
35117 994611 1199227 1451331 1576539 1252468 719381 514378 589993 480399 299092 703334
35107 703334 1727761 2475368 2264657 1414834 603816 94013 -76012 210421 787311
35098 787311 1073144 798192 436899 449806 543355 248059 -160357 -18217 643820 1079238
35088 1079238 883230 467492 370451 583943 742601 629850 324386 73744 108230 394877
35078 394877 598565 520019 473112 862886 1459970 1593057 1126444 694122 735923 843376
35068 843376 469308 -156839 -367982 -40318 341087 457801 423734 324707 98035 -49442
35058 -49442 287251 988626 1305196 824743 88542 -180421 -66842 -155857 -534816 -735629
35048 -735629 -564864 -350081 -288324 -129159 273930 556970 315249 -275363 -582020 -161941
35038 -161941 805718 1606880 1546448 675155 -75531 152904 1067433 1564663 1199078 698469
35028 698469 768908 1048055 776714 13891 -491399 -363951 118205 647422 1134474 1374081
35018 1374081 1097720 465401 -83 -88811 -85903 -201417 -283539 -243557 -308583 -594222
35008 -594222 -763974 -403174 446128 1306180 1691493 1455751 897721 565319 757710 1195730
34998 1195730 1359339 1085763 602692 116468 -260799 -311758 43920 346788 27744 -679342
34988 -679342 -873009 -229677 497816 544803 139534 26381 441468 1020741 1384469 1391981
34978 1391981 1098688 810325 883809 1188010 1158289 693952 476650 943526 1517479 1510274
34968 1510274 1263178 1525081 2062066 1914675 955334 166957 209484 619116 738339 627588
34958 627588 605223 557669 271427 -16200 32913 246756 190383 -142926 -326099 -119299
34948 -119299 248855 438866 425834 514577 965728 1572927 1696978 942443 -224199 -834378
34938 -834378 -455645 423684 1105732 1400478 1466709 1333194 922039 336299 -185795 -486886
34928 -486886 -455837 34587 870909 1503729 1347241 429693 -542663 -836843 -330054 496636
34918 496636 1089091 1272376 1200584 996031 637955 225902 69880 314988 704198 977810
34908 977810 1258734 1664645 1806912 1266638 446927 232096 705673 934685 310985 -567090
34898 -567090 -795133 -382986 -18706 -16424 -98723 -71 256639 576487 855444 910177
34888 910177 672185 330398 24444 -371725 -864947 -1054806 -648377 8572 384223 502501
34878 502501 721044 1003596 1033680 924346 1146191 1732900 2168245 2139962 1854129 1531392
34868 1531392 1168808 910850 1037559 1372480 1306464 715805 286411 520418 933432 758659
34858 758659 62491 -424789 -361749 -104961 -55241 -210622 -388047 -469847 -373149 -114926
34848 -114926 49181 -123459 -423867 -348764 201256 725610 798640 605215 531597 526320
34838 526320 289373 -68027 -73177 348482 648867 400533 -142856 -523274 -734087 -969022
34828 -969022 -1026899 -559501 207201 623588 517716 353029 403044 420148 323124 502817
34818 502817 1059337 1420642 1270162 1218743 1825378 2485609 2217438 1234630 722707 1121234
34808 1121234 1631351 1570676 1274888 1306507 1555292 1597429 1374452 1065356 730028 466311
34798 466311 515680 842652 968531 573430 -49238 -434226 -508609 -420366 -153504 318589
34788 318589 748109 838195 633319 481510 713226 1374170 2040334 1988730 997062 -95125
34778 -95125 -237080 434188 829640 612157 621209 1231328 1473401 608657 -461876 -503833
34768 -503833 107636 78966 -652918 -897329 -189403 595633 741745 563572 477499 295326
34758 295326 -130241 -454449 -457462 -355218 -175292 391223 1204618 1590124 1417576 1401883
34748 1401883 1869309 2128156 1665921 1073269 997221 996449 403307 -330054 -252543 517343
34738 517343 945300 624360 156660 62630 260948 659479 1334422 1949886 1833661 929047
34728 929047 28758 -205158 85131 442110 689792 825787 844223 894232 1151980 1388754
34718 1388754 1195436 771309 838294 1517949 1994433 1709291 1221336 1305957 1777818 1920521
34708 1920521 1664334 1539915 1679926 1652158 1252130 776173 448103 171551 -45078 30627
34698 30627 373210 560154 328217 -81211 -305452 -283778 -162044 -69692 -112402 -306199
34688 -306199 -429289 -232646 147986 342266 357541 595924 1140701 1539134 1526961 1428686
34678 1428686 1491280 1392800 945054 749150 1381714 2262882 2234724 1193474 255534 180989
34668 180989 500616 519928 369222 515782 879172 1098831 1235939 1527735 1772790 1667329
34658 1667329 1504327 1750795 2055927 1579866 424312 -181336 475137 1535611 1756771
34649 1756771 1133099 593482 520276 483878 312151 462497 1106255 1640274 1565215 1289354
34639 1289354 1512085 2166839 2563260 2413082 2133015 2104278 2152574 1973976 1700746 1698802
34629 1698802 1951586 1999823 1569520 1007138 852243 1077702 1121481 806763 804845 1700483
34619 1700483 2849805 2923542 1693442 494110 504368 1294703 1730000 1655991 1727761 1992783
34609 1992783 1851887 1375445 1411256 2103197 2476861 2027151 1627546 2093851 2807005 2752553
34599 2752553 2151227 1890676 1895390 1375732 434522 75040 570566 1068827 1020108 827292
34589 827292 764220 439399 -138480 -112894 812080 1495336 888186 -293568 -542592 270634
34579 270634 887062 640000 265616 551605 1166275 1303473 872635 533218 816841 1564515
34569 1564515 2145090 2089716 1550353 1087610 945601 778263 309371 -89345 46522 410623
34559 410623 290398 -269912 -422657 189985 814087 669910 95320 20562 630845 1198924
34549 1198924 1182366 892777 902844 1224699 1411771 1273661 1117449 1256758 1581739 1779659
34539 1779659 1763163 1609065 1212558 407187 -532892 -951675 -604538 -31089 192017 249936
34529 249936 681695 1391503 1662641 1183360 514224 333391 631567 934686 1022528 1073171
34519 1073171 1220666 1312306 1178108 944319 903236 1071625 1043917 468895 -370658 -724320
34509 -724320 -226992 655757 1204638 1235348 1084766 1037825 1077824 1065738 879999 487710
34499 487710 92909 14906 192211 134889 -280477 -390218 301226 1125274 1036247 211174
34489 211174 -108380 549812 1214724 979439 264923 -1541 265787 500847 505724 530167
34479 530167 641826 707756 826205 1170556 1520846 1507070 1251713 1248238 1604837 1879792
34469 1879792 1720261 1266444 844969 600112 530882 620282 797193 936441 997326 1083473
34459 1083473 1321744 1693128 1957155 1801691 1223019 701942 727569 1151185 1376045 1245467
34449 1245467 1287832 1900239 2759253 3320364 3444754 3192584 2485211 1453636 708841
34440 708841 705788 1125644 1378844 1393767 1400002 1339960 1146600 1209887 1764368 2129178 1505469
34429 1505469 367581 20887 741348 1408298 1204497 651227 546126 810978 959347
34420 959347 925037 799769 407008 -212785 -461156 6806 617016 679577 391949 344651
34410 344651 488985 430697 396633 937612 1786790 1984793 1256238 415783 179201 328099
34400 328099 376653 374610 574829 827519 854901 809260 1037589 1459398 1634526 1390472
34390 1390472 1013312 822575 862810 1040424 1284499 1475750 1431925 1117706 753607 566563
34380 566563 497877 335855 136255 271490 896771 1559364 1657089 1225271 871719 863968
34370 863968 769934 295327 -9474 542565 1632479 2209069 1885632 1365607 1318851 1518092
34360 1518092 1445548 1155018 1001929 959909 823572 800907 1230963 1829183 1881737 1246948
34350 1246948 592765 503532 829273 1069362 963573 546541 39012 -149506 267228 969009
34340 969009 1303838 1203888 1276352 1750262 2024294 1720690 1475179 1933549 2521349 2153353
34330 2153353 861697 -241327 -475749 -130873 407268 1020873 1306827 786015 -64678
34321 -64678 -88191 829610 1421824 1012812 672611 1486510 2693956 2781191 1733696 859933
34311 859933 759836 817992 605284 492089 707567 877062 768725 626966 538666 267018
34301 267018 -97483 -108094 236369 437351 395436 532465 850985 796208 321577 129152
34291 129152 485512 796503 822658 1227360 2216105 2705747 1847487 518255 149787 706280
34281 706280 1032871 759530 560510 708750 666406 235258 6688 369867 936321 1253697
34271 1253697 1370536 1411799 1249434 910900 773818 1042856 1438048 1608299 1482501 1104171
34261 1104171 549790 122462 174826 595809 885524 857732 854474 1158391 1617811 1968515
34251 1968515 2112139 1978770 1541847 1060689 871638 871203 678236 342695 312228 608496
34241 608496 716803 510009 570376 1218547 1874872 1878114 1403188 1048256 979291 1027333
34231 1027333 1220829 1634427 2011218 2066982 1903817 1677780 1243091 662910 613321 1510887
34221 1510887 2566112 2618878 1790102 1327763 1729662 2048778 1467742 631239 649540 1355881
34211 1355881 1482142 449398 -826417 -1131089 -391603 480053 881751 1130428 1710708
34202 1710708 2381524 2459459 1844588 1243792 1230673 1538549 1604681 1431119 1418463 1587980
34192 1587980 1563407 1272434 1068666 1064123 915919 499988 263690 546592 982692 1031486
34182 1031486 787184 751316 1006471 1172109 1107222 1082779 1194054 1171976 983892 1071895
34172 1071895 1614624 2028720 1771716 1315664 1584032 2496456 2901126 2194453 1224334
34163 1224334 1040200 1380944 1226033 489608 158165 702055 1327073 1204858 666189
34154 666189 550905 908157 1077498 798110 516220 613119 912775 1054571 936750 696609
34144 696609 561000 740272 1178947 1447373 1206905 713509 468868 456424 237921 -203026
34134 -203026 -339003 31958 432744 512540 582005 914594 1119113 836565 572372 1028266
34124 1028266 1885853 2150247 1653082 1294884 1605254 1948270 1613807 964140 820764
34115 820764 1176368 1264675 725178 22935 -288581 -169061 129435 431928 640338 693938
34105 693938 675132 734959 863372 956423 1081925 1355900 1559606 1291320 607158 112043
34095 112043 233789 761289 1277791 1647810 1828148 1640023 1125203 770370 925659 1292982
34085 1292982 1452329 1565787 1953323 2245290 1757493 675294 47006 412549 1151304
34076 1151304 1465593 1336690 1128840 897677 640972 714585 1328387 1948618 1876257 1262866
34066 1262866 933619 1265382 1818013 2089607 2082198 2004852 1910064 1840713 1969936 2343412
34056 2343412 2701206 2739220 2405154 1855994 1297652 926450 836050 909733 962768 1004631
34046 1004631 1162024 1360698 1375982 1239410 1246979 1424001 1344248 756793 100193 7615
34036 7615 459749 857518 908871 983063 1419636 1893856 1854458 1393373 1191703 1535517
34026 1535517 1845974 1507354 851500 805017 1600519 2394602 2404747 1968965 2004354 2643002
34016 2643002 2997495 2372876 1218982 556584 732315 1152072 1192399 948227 878039 1024154
34006 1024154 1012825 779111 801018 1374330 2044213 2182724 1886116 1765478 1959914 1990467
33996 1990467 1652884 1371384 1413842 1434314 1238062 1362530 2223576 3151010 3098861 2103217
33986 2103217 1226539 1104959 1326771 1329947 1171134 1165113 1358650 1632343 1852748 1738939
33976 1738939 1089516 335545 295608 1089421 1851481 1883608 1526636 1413680 1423714 1081027
33966 1081027 621949 812179 1734054 2510980 2455406 1946144 1831716 2287265 2645122 2302802
33956 2302802 1516283 1129121 1561486 2291657 2529270 2226327 2013365 2148384 2091406 1395852
33946 1395852 510511 191878 451603 678692 631861 666937 972022 1212304 1143351 1057166
33936 1057166 1273828 1550786 1423333 971155 815873 1285663 1880571 1801418 945223 131139
33926 131139 186766 948695 1455830 1147642 522350 415599 953715 1585606 1931597 2102349
33916 2102349 2197080 2005938 1424471 799075 554240 663071 758711 665962 565353 654386
33906 654386 881630 1089851 1260608 1477911 1708591 1777656 1617162 1426468 1455544 1664239
33896 1664239 1738789 1467806 979357 567398 396777 424003 502582 525198 553402 796458
33886 796458 1324350 1850850 2038965 1995415 2120424 2420240 2412006 1913178 1459929 1559447
33876 1559447 1915400 1907207 1565734 1465509 1745232 1848909 1335471 476894 -85908 47893
33866 47893 813498 1714119 2075312 1671183 1129878 1282528 2054491 2494693 2040348 1238531
33856 1238531 971469 1443242 2250594 3014442 3518455 3552359 3097286 2516666 2189830 2055304
33846 2055304 1789898 1304146 805124 511618 541403 920106 1470707 1852284 1902486 1751257
33836 1751257 1463607 922543 302636 206670 884202 1686978 1851962 1536647 1467254 1802343
33826 1802343 2065835 2079755 2156249 2312827 2107818 1484941 1048926 1155707 1366790 1225165
33816 1225165 1016333 1267725 1922159 2495159 2719828 2613337 2243256 1850177 1853217 2284931
33806 2284931 2572110 2349386 2084320 2305145 2626103 2328998 1620862 1370905 1682442
33797 1682442 1747011 1278856 1067667 1657382 2378885 2390783 2010999 2169639 2914701 3330015
33787 3330015 2869593 2040351 1621514 1726085 1851878 1558653 917308 426918 531831
33778 531831 1125278 1607101 1566737 1262190 1215092 1500949 1745176 1705429 1492031 1230432
33768 1230432 866292 382189 -76896 -393375 -577465 -612035 -405152 34369 559567 1070538
33758 1070538 1544877 1853106 1790606 1392655 990040 807076 694885 426066 75418 -105369
33748 -105369 -54878 123307 483171 1192623 2075092 2530680 2221263 1663968 1734881 2554598
33738 2554598 3274298 3148579 2429422 1866712 1688461 1606253 1590446 1927563 2490868 2676235
33728 2676235 2298403 1931692 2040790 2334862 2349924 2111380 1782578 1244020 595818 507401
33718 507401 1314833 2219171 2243707 1674741 1622116 2332289 2931661 2833960 2409130 2103142
33708 2103142 1835862 1557867 1553464 1821502 1896079 1655911 1621848 2076621 2565365 2664917
33698 2664917 2584212 2592688 2540823 2406358 2601323 3179365 3427381 2885060 2128331 1853893
33688 1853893 1828999 1535340 1222051 1367751 1621808 1368503 984222 1351710 2271466 2569380
33678 2569380 1885079 1221446 1420214 2080276 2402460 2262629 1966156 1648872 1434248
33669 1434248 1596137 2058124 2233833 1848690 1437609 1504948 1666616 1297125 690038 764753
33659 764753 1661757 2401768 2191085 1488314 1348907 2047878 2855815 3078351 2788503 2377556
33649 2377556 1872829 1155719 581398 732788 1496609 1994133 1721273 1253286 1383686
33640 1383686 1962659 2158967 1661432 1024553 853739 1171201 1664531 2127224 2491548
33631 2491548 2711775 2775926 2720189 2620475 2639823 2929973 3337662 3442986 3129592 2849602
33621 2849602 2996467 3295906 3243393 2890672 2685825 2723167 2711791 2569414 2477606 2415866
33611 2415866 2203705 1960347 1962186 2089477 1998937 1796686 1897917 2241782 2352053 2206269
33601 2206269 2276365 2600870 2642059 2286093 2147336 2544746 2997897 3158719 3398732 3901952
33591 3901952 4004081 3217367 2245370 2083985 2607872 2988859 3135891 3642738 4418980
33582 4418980 4482817 3383881 1987591 1425761 1831656 2502846 2874616 2902805 2754612
33573 2754612 2563937 2471609 2629677 3056191 3535235 3739918 3559901 3320399 3488527 4039331
33563 4039331 4334441 3886761 3071344 2714096 3048301 3510058 3636100 3698869 4157372 4823694
33553 4823694 5048023 4638785 4125704 4012655 4194529 4349593 4510067 4818547 5008456
33544 5008456 4716867 4216660 4195977 4759248 5311030 5569905 5940804 6597036 7047021 7111831
33534 7111831 7438015 8328474 9022139 9115586 9594631 10853209 10602646 6140757 -1280576
33525 -1280576 -6787195 -7387471 -5099545 -3506788 -3266078 -2828325 -1942187 -1907110 -2918826
33516 -2918826 -3537643 -2989301 -2163649 -1923532 -1928907 -1665824 -1370750 -1297996 -1093607 -555173
33506 -555173 -178037 -292164 -355807 220310 1098430 1528863 1425551 1280738 1286276 1171237
33496 1171237 816819 504693 500219 725538 924772 966489 924182 926111 946454 806433 490492
33485 490492 357901 770367 1513529 1908061 1604262 991211 665644 742227 894891 881863
33475 881863 747604 560657 229000 -287986 -697464 -533581 256236 1011297 947795 117287
33465 117287 -533386 -255619 635058 1281441 1396284 1393549 1557124 1655958 1491487 1320492
33455 1320492 1440582 1684797 1681802 1456694 1420257 1761897 2152446 2201235 2025776 2092669
33445 2092669 2483155 2635537 2075108 1197599 906183 1474657 2216691 2426457 2206885
33436 2206885 2074907 2133080 2079807 1831500 1664979 1764610 1967133 1988569 1720126 1345214
33426 1345214 1269612 1746616 2428236 2599907 2124905 1778001 2192625 2825999 2632996 1598899
33416 1598899 824556 1014600 1657766 2009831 2154850 2490161 2682732 2012204 689604
33407 689604 -9767 702472 2011594 2517049 2066221 1822555 2463092 3147029 2798942
33398 2798942 1784148 1436960 2166815 2987973 3017097 2516988 2097308 1699470 981951
33389 981951 145692 -292203 -221276 102562 525175 940313 1078800 855126 656423 822398
33379 822398 1135403 1285843 1462636 1911629 2287962 2144730 1777949 1838599 2309830 2631338
33369 2631338 2675215 2784278 2938815 2759945 2357440 2280960 2496727 2309756 1573176 1112519
33359 1112519 1521863 2280394 2573164 2362462 2089058 1855424 1559749 1458456 1877188
33350 1877188 2488738 2503716 1661493 622311 246907 722237 1492179 1895513 1773076
33341 1773076 1508793 1570380 2062839 2696148 3072329 2982097 2571644 2273298 2391064 2698750
33331 2698750 2698848 2345306 2139612 2360486 2665078 2732173 2774059 2974592 2961231 2452248 1951060
33320 1951060 2040346 2367907 2193534 1658774 1547955 1927796 2059883 1719675 1594162 2140406
33310 2140406 2933397 3433248 3615833 3569753 3230943 2810549 2755985 3004965 3013592 2779931
33300 2779931 2988691 3761575 4164362 3550341 2625469 2473532 3111616 3713889 3804418 3546714
33290 3546714 3190630 2852514 2631504 2494683 2258945 1962270 1896053 2030291 1910814 1432469
33280 1432469 1134329 1345202 1666646 1772996 2042933 2779958 3462224 3527212 3339800 3537499
33270 3537499 3891415 3745196 3215135 2949062 2923079 2544162 1906675 1865810 2657634 3406724
33260 3406724 3384359 2969280 2892206 3169065 3347256 3361701 3524529 3849352 3927731 3505538
33250 3505538 2818379 2251339 1912082 1710426 1706980 2088804 2734523 3099026 2811544 2213500
33240 2213500 1928808 2005702 1973644 1752362 1891971 2684795 3607948 4020940 3943265 3722744
33230 3722744 3396711 2922176 2659097 2967616 3512392 3588246 3075508 2541860 2428607 2628720
33220 2628720 2869193 3036260 3062546 2906807 2740263 2822382 3117071 3307169 3218272 2967659
33210 2967659 2716070 2576315 2738640 3301556 3905774 3917527 3176878 2309453 2080371 2591578
33200 2591578 3288530 3620202 3484301 3096322 2684299 2411082 2410321 2676611 2955139 2959974
33190 2959974 2737417 2595677 2632684 2646000 2628569 2914986 3510645 3729185 3058849 2064746
33180 2064746 1744805 2189932 2638965 2733203 2820675 2985498 2788706 2276310 2271487 3118239
33170 3118239 3941271 3818059 3051703 2587628 2678557 2841620 2762863 2556575 2370451 2309658
33160 2309658 2554551 3095561 3579930 3790814 3957413 4240238 4341388 4047236 3687635
33151 3687635 3575736 3484336 3201146 3048891 3222597 3200280 2613092 2164756 2718701 3862223
33141 3862223 4435120 4245882 4139356 4418023 4368001 3582490 2726236 2554255 2937934 3293224
33131 3293224 3372534 3253886 3068703 3101296 3696912 4690551 5278971 4834841 3656032 2655711
33121 2655711 2441390 2843255 3236871 3242541 3123671 3393192 3991147 4180066 3508847 2535295
33111 2535295 2181320 2649658 3440524 4164596 4773546 5185612 5302489 5313028 5437396 5485042
33101 5485042 5205457 4890272 4972080 5185169 4896666 4220979 3976809 4449947 5009463 5135323
33091 5135323 5036703 4977844 4768091 4331946 4101136 4327345 4544590 4252748 3718020 3551292
33081 3551292 3793154 3959874 3843993 3779354 4094723 4620782 4828717 4366503 3457989 2752695
33071 2752695 2685184 3058878 3436808 3785794 4370737 5093917 5438734 5189157 4772140 4667123
33061 4667123 4800078 4759577 4387537 3947667 3843468 4279427 5071417 5742845 5937421 5735992
33051 5735992 5467578 5345457 5461782 5885575 6416801 6494540 5855227 5111005 5074559 5607342
33041 5607342 5839671 5538844 5428053 5919391 6393741 6250831 5934124 6167784 6687310
33032 6687310 6618624 5908157 5467789 5797046 6252161 6029690 5282446 4760666 4721322 4779344
33022 4779344 4695723 4697523 4910438 5025844 4857841 4830248 5443248 6454663 7066018 6863096
33012 6863096 6157499 5442116 4962423 4843500 5156225 5728347 6277081 6794593 7381838
33003 7381838 7708931 7267035 6308718 5840942 6318219 6948797 6769334 5913945 5313345
32994 5313345 5526032 6336579 7168406 7472472 7045451 6346090 6150308 6581312 6923391
32985 6923391 6695904 6326921 6361612 6663995 6932347 7313105 7827178 7860166 7061330 6205551
32975 6205551 6271093 7082139 7712790 7822575 7733633 7611808 7493753 7727437 8414907 8793777
32965 8793777 8200171 7290439 7193942 7770640 7948931 7582395 7596531 8268963 8743945 8524635
32955 8524635 8201770 8289897 8432677 8248417 8015418 7990072 7851254 7377759 7047798 7437189
32945 7437189 8441883 9461783 10031524 10077161 9854901 9711000 9666776 9398691 8905256
32936 8905256 8761966 9201980 9490591 8989006 8305619 8401071 9020419 9187946 8889432 8915890
32926 8915890 9235762 8996288 8201718 7946150 8701793 9652716 10041267 10002892 9790969 9352364
32916 9352364 8970637 9173024 9705086 9750338 9414366 9734559 10912084 11871060 11991465
32907 11991465 11920738 12144346 12138219 11622711 11326882 11685025 11979181 11650416 11347951 11753195
32897 11753195 12374781 12464824 12238344 12255807 12410658 12421462 12553223 12966389 13083506 12497422
32887 12497422 11852877 11954875 12588673 13049731 13280749 13639310 14006737 13968805 13599639
32878 13599639 13396282 13622239 14135119 14604762 14650423 14153368 13617728 13743268 14518112
32869 14518112 15279519 15690846 15975877 16230202 16352095 16607137 17249273 17611972 16783745
32860 16783745 15282114 14729342 15605836 16664172 16910056 16765069 16804123 16782046 16577245
32851 16577245 16785932 17624777 18359732 18468393 18320930 18234378 18007554 17816661 18299345
32842 18299345 19299822 19846521 19799546 20123244 21122073 21925992 22154338 22465263 22999367
32833 22999367 23018102 22581268 22730311 23486835 23677517 23301165 23818022 25368857 26174619
32824 26174619 25692670 25789983 27476117 29042396 29026819 28567181 29080356 29974071 30457767
32815 30457767 31267654 32742290 33596169 33512172 34351394 36644431 37654205 35544765 32872021
32806 32872021 33011383 35445910 37572577 38916721 40405763 41588723 41875625 42680137
32798 42680137 45184038 47830622 49014774 50092106 52615438 55077989 55866654 56793816
32790 56793816 59841970 63164015 64575628 66131238 70478786 75677890 78980551 82579825
32782 82579825 89437067 96771306 101181820 106974013 119957805 135214966 142766932 145803862
32774 145803862 159582859 185804109 198086561 162369429 69379137 -55534450 -168882146
32767 -168882146 -233698008 -239127205 -205796221 -168625880 -147772972 -137791404 -125869596
32760 -125869596 -111602853 -102430644 -98411432 -92908512 -84709812 -78806179 -76227603 -72488079
32752 -72488079 -66373486 -61996214 -60985275 -59820110 -56496834 -53534600 -52528754 -51299550
32744 -51299550 -48469995 -46003349 -45154787 -44162613 -41874802 -39847515 -39084961 -38216405 -36518148
32735 -36518148 -35395288 -35322147 -34538189 -32345818 -30645910 -30616654 -30748282 -29759303 -28723586
32726 -28723586 -28659632 -28550709 -27450957 -26293916 -25993773 -25790023 -24953000 -24221592 -24187422
32717 -24187422 -24067243 -23332191 -22811056 -23030717 -23160297 -22623404 -22039913 -21662407 -20732019
32708 -20732019 -19324128 -18866666 -19731028 -20253036 -19368311 -18333604 -18482309 -19065592 -18823618
32699 -18823618 -18101090 -17824201 -17744629 -17276087 -16933772 -17416024 -18143591 -18068548 -17239321 -16480702
32689 -16480702 -16189959 -16300670 -16698490 -16959870 -16484225 -15464493 -14819539 -14722050 -14330573
32680 -14330573 -13445231 -13062722 -13615155 -14062107 -13595254 -12922674 -12895325 -13085846 -12775395
32671 -12775395 -12281018 -12273686 -12673305 -13068436 -13346682 -13253424 -12387424 -11268983 -11183886 -12255138
32661 -12255138 -13007399 -12642588 -12256980 -12781523 -13274978 -12611690 -11456189 -10998943 -10927788
32652 -10927788 -10333575 -9627339 -9769135 -10340630 -10202227 -9577188 -9698049 -10611323 -11018012
32643 -11018012 -10316965 -9325790 -8804185 -8548016 -8237250 -8112731 -8412446 -8872033 -9105713
32634 -9105713 -9017678 -8725925 -8451585 -8439673 -8660620 -8756126 -8576981 -8474835 -8737516 -9123569
32624 -9123569 -9320344 -9422595 -9563369 -9555432 -9325187 -9190135 -9263410 -9139423 -8647881 -8317538
32614 -8317538 -8540673 -8880518 -8830696 -8695127 -9030797 -9689261 -10074107 -9962784 -9521362 -8921045
32604 -8921045 -8424497 -8370157 -8613518 -8529559 -7989400 -7654047 -7831728 -7869868 -7319806 -6846437
32594 -6846437 -7151835 -7767739 -7863475 -7609037 -7748788 -8334912 -8826256 -8992421 -8848039 -8186108
32584 -8186108 -7085909 -6393740 -6736052 -7480300 -7613111 -7202909 -7009582 -7110290 -7030392
32575 -7030392 -6876514 -7131994 -7505689 -7176701 -6185878 -5508602 -5638985 -6031420 -6078989 -5830706
32565 -5830706 -5593134 -5508154 -5651734 -6020739 -6409668 -6711101 -7128737 -7647294 -7698912 -6969363
32555 -6969363 -6069708 -5652273 -5353610 -4538299 -3634648 -3622847 -4479243 -5269191 -5618269 -5951324
32545 -5951324 -6372836 -6494317 -6393417 -6585701 -6946784 -6789251 -6138076 -5781675 -5879299 -5731267
32535 -5731267 -5230058 -5263439 -6143230 -6833938 -6496326 -5792514 -5784972 -6324661 -6454943 -5875652
32525 -5875652 -5145044 -4774319 -4841506 -5233943 -5653913 -5609495 -4949264 -4230167 -4100868 -4505236
32515 -4505236 -4895762 -5005131 -4964035 -4859841 -4698191 -4736109 -5319060 -6229067 -6587806 -5756162
32505 -5756162 -4238669 -3357026 -3864432 -5102991 -5830077 -5710897 -5480593 -5644571 -5765774
32496 -5765774 -5393205 -4966997 -5119947 -5593230 -5636754 -5147957 -4627071 -4290886 -4055966 -4129253
32486 -4129253 -4689585 -5194397 -5022601 -4652335 -5041595 -5883661 -5819748 -4602513 -3645143
32477 -3645143 -3907948 -4580086 -4608639 -4279092 -4284186 -4332901 -3917436 -3607878 -4206158 -5168872
32467 -5168872 -5278528 -4576775 -4223655 -4518457 -4497340 -3739373 -3218814 -3755529 -4679867 -4849021
32457 -4849021 -4271762 -3856656 -3962707 -4062202 -3743336 -3315355 -3260813 -3569808 -3864076 -3920302
32447 -3920302 -3834737 -3769920 -3718112 -3530741 -3119320 -2616676 -2338664 -2529076 -3088580 -3592797
32437 -3592797 -3661822 -3326590 -2990627 -3056691 -3646722 -4590247 -5496116 -5884930 -5552583 -4882869
32427 -4882869 -4503998 -4518313 -4428976 -4012740 -3782601 -4166963 -4683011 -4577216 -3999870 -3763152
32417 -3763152 -4030532 -4096683 -3595476 -3100826 -3183476 -3552447 -3582852 -3179414 -2675997 -2307675
32407 -2307675 -2196389 -2464964 -2957498 -3217019 -3131091 -3200815 -3736846 -4212591 -3965923 -3202239
32397 -3202239 -2694147 -2727094 -2954048 -3115717 -3261434 -3329639 -3136698 -2815696 -2721726 -2840445
32387 -2840445 -2785821 -2452987 -2189082 -2219695 -2386579 -2602419 -3086202 -3882816 -4526166 -4521952
32377 -4521952 -3983912 -3531819 -3629729 -4153524 -4558286 -4443010 -4006181 -3859624 -4275530 -4794747
32367 -4794747 -4812932 -4343781 -3845022 -3503704 -3214814 -3132117 -3555829 -4205377 -4323160 -3773250
32357 -3773250 -3379731 -3761540 -4419991 -4529452 -4140946 -3914052 -3980673 -3862599 -3435213 -3199742
32347 -3199742 -3426121 -3643161 -3313252 -2631790 -2314638 -2767614 -3691366 -4406424 -4444487 -3910623
32337 -3910623 -3334083 -3109206 -3134230 -3107368 -3006533 -2978515 -2892554 -2489497 -2014864 -2140569
32327 -2140569 -2972335 -3624409 -3266483 -2282221 -1805713 -2228329 -2788603 -2735932 -2305967 -2214222
32317 -2214222 -2620034 -3067815 -3231229 -3203608 -3087230 -2793439 -2394619 -2262949 -2594864 -3087246
32307 -3087246 -3367983 -3480039 -3582628 -3435333 -2721048 -1786165 -1427347 -1829686 -2331429
32298 -2331429 -2484596 -2690411 -3316859 -3817814 -3496140 -2745001 -2602844 -3181587 -3488442
32289 -3488442 -2959720 -2266017 -2205218 -2574612 -2714695 -2582731 -2617523 -2919579 -3221534 -3431796
32279 -3431796 -3594785 -3483823 -2858992 -2068897 -1795214 -2149831 -2558885 -2647080 -2719132 -3134387
32269 -3134387 -3634302 -3661945 -3156252 -2687902 -2790224 -3342050 -3722978 -3551506 -3123384 -2981842
32259 -2981842 -3192449 -3377479 -3434499 -3707089 -4243244 -4441407 -3894648 -3152819 -3039993 -3488823
32249 -3488823 -3696749 -3273151 -2565854 -1933847 -1405279 -1101290 -1299528 -1890679 -2355819
32240 -2355819 -2483040 -2580884 -2808615 -2864990 -2595358 -2362407 -2476413 -2709904 -2722986 -2580092
32230 -2580092 -2506048 -2474396 -2377040 -2325961 -2487229 -2827813 -3218034 -3546756 -3627811 -3315229
32220 -3315229 -2809361 -2485556 -2366351 -2207470 -2102407 -2369823 -2782463 -2714861 -2261422 -2261062
32210 -2261062 -2795758 -2723693 -1458382 -210269 -367863 -1416535 -1765193 -1125279 -619018
32201 -619018 -744417 -795542 -493328 -682787 -1786473 -2788956 -2655387 -1921924 -1907346 -2837913
32191 -2837913 -3685683 -3665072 -3067793 -2572564 -2379774 -2277889 -2184808 -2287902 -2696499 -3156567
32181 -3156567 -3249209 -2882732 -2453885 -2415068 -2789924 -3237696 -3448507 -3310007 -2876230 -2415165
32171 -2415165 -2286297 -2464325 -2397513 -1724362 -916923 -723622 -1147308 -1563754 -1743881 -2049314
32161 -2049314 -2567109 -2811803 -2545512 -2226367 -2271813 -2440087 -2366310 -2221513 -2350023 -2632586
32151 -2632586 -2714605 -2589320 -2476648 -2348587 -2050883 -1728557 -1655874 -1746052 -1695992 -1578510
32141 -1578510 -1813814 -2465965 -2979500 -2820730 -2124269 -1491014 -1293695 -1391430 -1486728 -1561184
32131 -1561184 -1837550 -2369468 -2839937 -2873816 -2471853 -2003705 -1800625 -1864977 -1941373 -1766299
32121 -1766299 -1315903 -922286 -1020593 -1618049 -2184750 -2302957 -2198461 -2264167 -2297443 -1781857
32111 -1781857 -833541 -197972 -223605 -506646 -738080 -1181969 -1944772 -2463543 -2293692 -1873757
32101 -1873757 -1860942 -2108651 -1988700 -1444379 -1025503 -1046214 -1356852 -1802814 -2236826 -2202807
32091 -2202807 -1391197 -443207 -508789 -1785547 -3166433 -3593272 -3135398 -2458544 -1922169
32082 -1922169 -1653734 -1873359 -2493857 -2837396 -2442441 -1865241 -1976990 -2646936 -2886958
32073 -2886958 -2300818 -1616857 -1561864 -1885238 -1911651 -1559929 -1291687 -1336053 -1494530 -1609526
32063 -1609526 -1745120 -1865094 -1733703 -1293876 -877656 -843091 -1130093 -1332634 -1167532 -794362
32053 -794362 -695340 -1226991 -2194479 -2895981 -2786457 -2158510 -1922686 -2514623 -3232193 -3019285
32043 -3019285 -1854123 -910196 -1154980 -2187674 -2864399 -2810881 -2711031 -3078065 -3428904
32034 -3428904 -3092009 -2326509 -1953129 -2069277 -1916681 -1159369 -539373 -801927 -1524301
32025 -1524301 -1685709 -1131109 -730553 -1062736 -1610913 -1539290 -803847 -120818 -76116 -595026
32015 -595026 -1175371 -1371105 -1074173 -531562 -151103 -215511 -711232 -1360247 -1781695 -1732471
32005 -1732471 -1323450 -938694 -830244 -900682 -1000716 -1207401 -1542004 -1672872 -1350846 -972501
31995 -972501 -1141607 -1715221 -1921553 -1507026 -1086088 -1126917 -1282545 -1121911 -888135 -992096
31985 -992096 -1272854 -1373018 -1431801 -1741905 -2033574 -1806376 -1191004 -798898 -798078 -772542
31975 -772542 -481730 -178245 -141618 -395392 -886163 -1463643 -1715313 -1327923 -596119 -83971
31965 -83971 135515 330749 325108 -349936 -1438533 -1943785 -1438592 -652161 -341416 -285556
31955 -285556 29235 345131 30527 -797759 -1352971 -1314453 -1198366 -1485476 -1930426 -1987786
31945 -1987786 -1570306 -1090367 -905404 -964469 -978573 -776098 -440057 -189400 -218793 -605744
31935 -605744 -1224646 -1735716 -1846098 -1666817 -1610218 -1811440 -1912998 -1643550 -1313446 -1360513
31925 -1360513 -1640968 -1672665 -1472062 -1583437 -2209525 -2814076 -2767252 -2031195 -1074466 -424897
31915 -424897 -392839 -893123 -1430884 -1565119 -1438600 -1515294 -1793311 -1745494 -1148726 -481757
31905 -481757 -267356 -426530 -556441 -524902 -517838 -721591 -1145185 -1572447 -1635627 -1205480
31895 -1205480 -717451 -754421 -1297909 -1808493 -2020129 -2097506 -1993834 -1392206 -506436 -174260
31885 -174260 -720742 -1381414 -1367348 -923196 -752543 -920705 -997770 -879323 -759449 -586414
31875 -586414 -248762 -96014 -574661 -1440494 -1969248 -1916543 -1695861 -1624327 -1571455 -1426189
31865 -1426189 -1381647 -1572804 -1804530 -1830449 -1679916 -1577073 -1639927 -1700954 -1439331 -828591
31855 -828591 -406797 -744195 -1590320 -2056663 -1830019 -1575091 -1772805 -1901426 -1433891 -947365
31845 -947365 -1256541 -1913944 -1753168 -770092 -247340 -866030 -1825264 -2183567 -2039799 -1862154
31835 -1862154 -1573414 -1017611 -620590 -786767 -1135984 -1117721 -991096 -1367013 -2034033 -2148143
31825 -2148143 -1575652 -1164411 -1450599 -1872140 -1712433 -1216995 -1138131 -1522850 -1683999 -1319545
31815 -1319545 -948807 -1015448 -1159349 -847081 -342059 -432557 -1277552 -2090602 -2104793 -1438498
31805 -1438498 -802987 -645727 -801952 -822635 -492049 -107252 -236642 -1037243 -1913079 -2157491
31795 -2157491 -1828190 -1542696 -1483566 -1232349 -679584 -383176 -698700 -1185824 -1313439 -1205309
31785 -1205309 -1199130 -1170083 -852522 -427263 -235619 -249991 -310199 -494323 -778946 -809038
31775 -809038 -548451 -605345 -1244790 -1682490 -1219078 -510430 -656605 -1475725 -1891041 -1738046
31765 -1738046 -1833943 -2311459 -2304452 -1525626 -833515 -799033 -885645 -577064 -242239 -278199
31755 -278199 -372046 -267154 -365997 -879981 -1212492 -927356 -578465 -816476 -1365704 -1664170
31745 -1664170 -1846733 -2252716 -2574621 -2399954 -2066476 -2051391 -2005022 -1402875 -745181 -979846
31735 -979846 -1946624 -2526867 -2309423 -2034710 -2275568 -2684541 -2799694 -2707485 -2567669 -2241937
31725 -2241937 -1770719 -1563848 -1726688 -1772669 -1410793 -1096067 -1335684 -1880377 -2128963 -2052015
31715 -2052015 -2168931 -2693704 -3164625 -3004030 -2168665 -1135320 -404270 -156869 -348003
31706 -348003 -923692 -1751849 -2420656 -2456639 -1897795 -1357607 -1279002 -1398785 -1267001 -1003470
31696 -1003470 -1048943 -1335314 -1304510 -803662 -411618 -650405 -1262849 -1552824 -1220594 -632036
31686 -632036 -376392 -706748 -1366310 -1902993 -2134487 -2192652 -2101829 -1637271 -834047 -284442
31676 -284442 -477404 -1079014 -1409233 -1459640 -1769081 -2335619 -2456909 -1888967 -1424718 -1846613
31666 -1846613 -2826734 -3402145 -3201213 -2684443 -2392179 -2443664 -2674499 -2838718 -2676607 -2096936
31656 -2096936 -1334301 -761631 -571203 -723344 -1069108 -1401252 -1542597 -1511608 -1453385 -1366606
31646 -1366606 -1166396 -1053106 -1378812 -1968754 -2089641 -1454346 -772817 -803872 -1291218 -1462094
31636 -1462094 -1210025 -1014423 -937881 -613437 -189650 -327425 -1051201 -1492862 -1151606 -618372
31626 -618372 -577253 -827855 -900517 -967252 -1372712 -1781536 -1669307 -1315437 -1371057 -1625186
31616 -1625186 -1218687 -144930 479616 -15280 -885240 -1109015 -800391 -779441 -1181563
31607 -1181563 -1312433 -813877 -267067 -400712 -1100734 -1528817 -1130946 -302987 41385
31598 41385 -507417 -1447886 -2050269 -2202431 -2316390 -2597811 -2836323 -2858624 -2725036 -2453459
31588 -2453459 -2019962 -1674058 -1710463 -1845735 -1474201 -721706 -464852 -934916 -1164738 -465498
31578 -465498 376577 295140 -366839 -527348 -225570 -415364 -1079649 -1089074 -183644 393034
31568 393034 -148713 -869715 -678670 -84409 -235704 -1012079 -1362113 -1090164 -979377 -1251991
31558 -1251991 -1179911 -438995 246898 257159 -8146 47908 146772 -369084 -1322214 -1765609
31548 -1765609 -1272344 -540151 -459432 -978458 -1290209 -988272 -555560 -556457 -769011 -566474
31538 -566474 33933 296617 -171718 -852213 -1090574 -956412 -895153 -912065 -671581 -200673
31528 -200673 96313 63085 -115071 -442464 -1155302 -2079953 -2498756 -2014675 -1208086 -1019913
31518 -1019913 -1604384 -2145513 -1857285 -934330 -327386 -594031 -1189363 -1145418 -373301 160749
31508 160749 -249487 -1043003 -1191248 -661414 -365839 -732652 -1130822 -954790 -564196 -643221
31498 -643221 -1112041 -1298953 -979219 -643372 -719212 -996013 -974519 -505036 87365 359849
31488 359849 99557 -609208 -1527418 -2393198 -2922736 -2840859 -2134925 -1274981 -913029 -1221817
31478 -1221817 -1716526 -1866234 -1668608 -1428435 -1220608 -934485 -716649 -898939 -1395969
31469 -1395969 -1587515 -1060704 -205686 238110 71988 -270762 -452528 -622121 -950282
31460 -950282 -1184057 -1025332 -725462 -831258 -1344042 -1587751 -1092820 -255088 162147 -60462
31450 -60462 -484531 -637404 -427292 -33459 302785 404599 324991 333707 511921 493808
31440 493808 -54409 -818330 -1147068 -953385 -786228 -917278 -924167 -453602 123391 258133
31430 258133 49524 11644 243401 355397 138105 -191690 -449509 -770562 -1296874 -1842997
31420 -1842997 -2025981 -1640965 -910010 -418215 -634460 -1318765 -1626160 -1099049 -339288
31411 -339288 -268793 -888325 -1327981 -1095859 -640116 -525055 -680188 -787759 -858762 -967143
31401 -967143 -857558 -372882 35040 -172859 -748921 -910960 -448897 -17190 -222025 -892519
31391 -892519 -1431370 -1515371 -1262317 -992138 -978108 -1203707 -1298005 -984641 -595942 -717584
31381 -717584 -1248865 -1377234 -763378 -166292 -362849 -918861 -791879 55252 500507 -156308
31371 -156308 -1214499 -1543990 -984362 -290146 -43165 -179115 -465578 -902813 -1509031
31362 -1509031 -2031535 -2089058 -1536097 -639591 53292 87720 -491435 -1101078 -1156346 -696645
31352 -696645 -333446 -502403 -915661 -912117 -284489 428914 525522 -116086 -971762 -1477909
31342 -1477909 -1547743 -1456683 -1375389 -1194727 -802735 -348629 -95816 -81608 -82449 61410 230581
31331 230581 217857 4866 -307894 -747441 -1384456 -1989870 -2089278 -1542581 -825388 -472681
31321 -472681 -435075 -310414 -46637 31789 -155002 -309221 -337351 -551121 -1068203 -1497372
31311 -1497372 -1541173 -1458698 -1511969 -1385862 -736722 -9453 -10883 -753665 -1374638 -1257221
31301 -1257221 -674213 -206035 -33397 2643 33854 50342 -98344 -612790 -1367878 -1743936
31291 -1743936 -1306087 -561140 -410841 -846286 -940077 -302746 293279 145952 -325728 -392453
31281 -392453 -203021 -350944 -707856 -587680 113424 768395 981724 965316 882072 492366
31271 492366 -322036 -1185895 -1647638 -1655531 -1445413 -1209652 -1014274 -860452 -738329 -699087
31261 -699087 -800192 -882867 -638350 -128909 50218 -473949 -1187381 -1304802 -894787 -775132
31251 -775132 -1290182 -1819918 -1669658 -919497 -148162 267373 317644 158006 -3753 -38383
31241 -38383 -75950 -351348 -790293 -1009643 -809594 -396518 -64587 33480 -230978 -888374
31231 -888374 -1549719 -1604278 -988829 -383567 -348794 -611369 -568341 -199346 -3712 -165803
31221 -165803 -286858 -31281 346379 348880 -84007 -506048 -562508 -440312 -600372 -1198293
31211 -1198293 -1966512 -2588109 -2910765 -2816042 -2260156 -1544104 -1119125 -924195 -388222 595262
31201 595262 1229348 856069 -53377 -601083 -701404 -803704 -779060 -151559 710298 800528
31191 800528 1900 -690593 -726944 -693333 -1054534 -1307514 -997606 -585907 -565891 -593003
31181 -593003 -292678 -98053 -370172 -473523 182699 834063 339867 -951222 -1630620
31172 -1630620 -1340652 -1131079 -1643674 -2223667 -2190151 -1890174 -1927229 -2159272 -2087023 -1699766
31162 -1699766 -1374892 -1258084 -1165488 -925518 -588304 -420619 -698849 -1292318 -1597661 -1274504
31152 -1274504 -860786 -1087368 -1714260 -1781105 -1026987 -242249 -17603 15283 302227 513117
31142 513117 187961 -342258 -403879 -31389 106008 -297104 -819076 -938459 -603639 -147934
31132 -147934 47008 -236890 -931315 -1683140 -2087642 -1978136 -1513994 -1067132 -1000119 -1390299
31122 -1390299 -1922634 -2166947 -1966768 -1470654 -899716 -471785 -391880 -606496 -693216 -366274
31112 -366274 16528 -111414 -674354 -1065225 -1077520 -1108541 -1343946 -1406073 -1077687 -778282
31102 -778282 -936578 -1344005 -1514337 -1327645 -986299 -657300 -450849 -452295 -544639 -512453
31092 -512453 -464723 -730848 -1199926 -1317522 -959775 -684276 -804010 -914497 -783995 -947263
31082 -947263 -1738121 -2419104 -2147922 -1308910 -934746 -1147969 -1176723 -746273 -432851 -583375
31072 -583375 -795151 -668358 -347224 -112297 -51560 -289999 -945114 -1683749 -1882573 -1415630
31062 -1415630 -802297 -460540 -319356 -257164 -343234 -479280 -366668 -45334 54351 -193147
31052 -193147 -389375 -323482 -355373 -763990 -1206695 -1218491 -867695 -554804 -489425 -679425
31042 -679425 -1089832 -1475275 -1394727 -783339 -247223 -404847 -1123622 -1734433 -1814798 -1448891
31032 -1448891 -906776 -424011 -195360 -268525 -469675 -630262 -812313 -1144668 -1547812 -1793447
31022 -1793447 -1736987 -1350508 -658877 179669 817299 913919 405625 -439311 -1184789 -1512055
31012 -1512055 -1484498 -1466656 -1624004 -1646242 -1216389 -555497 -104762 141550 429153 504309
31002 504309 -162875 -1323821 -1922359 -1453876 -668445 -495515 -886349 -1222704 -1301615 -1297515
30992 -1297515 -1182271 -835663 -457236 -310564 -295599 -246251 -353350 -797038 -1273108 -1409685
30982 -1409685 -1342206 -1341185 -1235458 -828973 -509172 -677397 -886750 -434193 363707 441045
30972 441045 -468413 -1471453 -1825241 -1729895 -1601479 -1410978 -1104414 -946839 -1030012 -1027460
30962 -1027460 -794180 -640781 -694955 -619897 -345060 -408701 -1062411 -1653975 -1530396 -1036311
30952 -1036311 -907296 -1086681 -944421 -429099 -170186 -451815 -809580 -770600 -430783 -153394
30942 -153394 -148619 -465424 -983326 -1319808 -1174031 -868336 -1079366 -1846313 -2336029 -1920468
30932 -1920468 -1059425 -654535 -839677 -986188 -770263 -581938 -749330 -943269 -705860
30923 -705860 -173136 164523 174968 84257 -99715 -620761 -1369832 -1748329 -1379811 -632795
30913 -632795 -183988 -282750 -650396 -906293 -896881 -751381 -735677 -905836 -918194 -489435
30903 -489435 -15875 -215672 -1037810 -1555802 -1237522 -645053 -415025 -271635 232356 651887
30893 651887 289755 -543499 -951261 -836204 -776412 -750549 -244549 413745 225023 -724291
30883 -724291 -1070619 -250013 580622 447981 89064 503948 1093989 634220 -611144
30874 -611144 -1242031 -888132 -595819 -1015428 -1471595 -1181113 -425987 -17330 -196514 -512137
30864 -512137 -465614 -6541 454627 474745 124435 -80899 23925 -76972 -723125 -1348818
30854 -1348818 -1251250 -720005 -598487 -943706 -1027236 -622710 -344457 -543828 -761446 -614489
30844 -614489 -462223 -740038 -1231994 -1472939 -1409390 -1234563 -973235 -655849 -566970 -887518
30834 -887518 -1307873 -1341348 -853991 -63878 721641 1120688 747772 -343930 -1463956
30825 -1463956 -1895128 -1651226 -1370730 -1505768 -1840302 -1817103 -1199916 -371466 28804 -196396
30815 -196396 -550403 -449975 21254 273926 96126 -54855 188745 446858 45250 -1051194
30805 -1051194 -2092517 -2306371 -1596397 -501458 337902 608243 368503 -133820 -608441
30796 -608441 -809460 -700625 -550566 -639827 -836528 -770492 -517946 -657886 -1353436 -1862899
30786 -1862899 -1503019 -727819 -548891 -1090444 -1514357 -1352104 -1066241 -1100190 -1180098 -974152
30776 -974152 -793988 -1084790 -1629307 -1798787 -1375364 -704802 -191280 11722 -74550 -333778
30766 -333778 -582286 -677343 -581226 -325147 -45907 5345 -266124 -593105 -720693 -854931
30756 -854931 -1273978 -1611789 -1212130 -269931 148374 -467333 -1328257 -1491863 -1126996 -1037045
30746 -1037045 -1405234 -1715150 -1652358 -1416110 -1224630 -1058599 -893313 -774000 -650088 -432217
30736 -432217 -195686 -115596 -261305 -577099 -902314 -931448 -474335 86535 9843 -838200
30726 -838200 -1620975 -1516510 -726787 -79439 68761 28001 79073 111733 -58655 -378979
30716 -378979 -586141 -397782 181377 646722 413455 -371572 -857998 -608438 -203413 -324165
30706 -324165 -736636 -779841 -467617 -388540 -702425 -922737 -682533 -196483 65487 -162267
30696 -162267 -720140 -1039243 -651637 80635 206490 -495383 -1048335 -686355 -60233 -206479
30686 -206479 -894561 -1062211 -522092 -76879 -109945 -234030 -315804 -664592 -1069233 -803429
30676 -803429 126016 791256 729050 502438 535824 460942 102811 39573 516218 787546
30666 787546 341811 -104926 236353 830815 640801 -188822 -590640 -242318 115926 -10576
30656 -10576 -236930 -154206 -22724 -276179 -847886 -1312548 -1407364 -1196302 -897821 -689448
30646 -689448 -603237 -571001 -568630 -613834 -623503 -485811 -308389 -316439 -448788 -412795 -240423
30635 -240423 -345020 -819826 -1153004 -963053 -580371 -495568 -618724 -558019 -319998 -211595
30625 -211595 -246249 -156391 92455 232823 117752 -104747 -217776 -131266 67620 132192
30615 132192 -105775 -435778 -499592 -403480 -651146 -1283556 -1644823 -1365128 -1012212 -1232158
30605 -1232158 -1725384 -1731873 -1186131 -692894 -569287 -581708 -512045 -370755 -125476 222869
30595 222869 367129 25976 -529664 -793572 -766730 -844626 -1058299 -1026792 -671144 -412115
30585 -412115 -566767 -982643 -1318568 -1332331 -945313 -388254 -148823 -369602 -513173 -121565
30575 -121565 368919 240270 -303661 -370464 244900 786332 735474 437523 303168 180900
30565 180900 -118108 -332678 -195434 130865 372823 466514 376783 113266 73035 729684
30555 729684 1750888 2109300 1405168 412735 -71106 -217173 -500089 -749485 -580517
30546 -580517 -263975 -387400 -931559 -1363204 -1445578 -1351997 -1150205 -772050 -401715 -349033
30536 -349033 -551552 -630065 -417395 -92109 142287 205967 82650 -99783 -68078 245723
30526 245723 524948 485506 230012 -62100 -435707 -791646 -644107 198634 1045519 1081032
30516 1081032 507752 231155 516696 721141 398247 -99094 -334567 -411680 -534559 -532330
30506 -532330 -271695 -84418 -255557 -408275 -7462 652730 625119 -365157 -1332932 -1210583
30496 -1210583 -300049 61290 -699934 -1572028 -1309954 -97633 810408 858246 744030
30487 744030 1110887 1570790 1518195 1223350 1372969 1876625 1888058 955880 -419119 -1396081
30477 -1396081 -1553179 -1068391 -521449 -481782 -964753 -1362030 -1191834 -737199 -568421 -650354
30467 -650354 -451538 151228 639141 576265 101581 -398932 -728768 -890060 -954117 -987157
30457 -987157 -912226 -537623 57737 408821 288446 140457 372333 539113 -16195 -898085
30447 -898085 -969613 -12897 852935 731943 95404 -123427 113743 132766 -353661 -947093
30437 -947093 -1155579 -840452 -211073 336673 519774 452544 418674 356735 9190 -379198
30427 -379198 -169221 606685 981866 347573 -586958 -756431 -202796 151250 -79977 -313598
30417 -313598 34204 753559 1137881 729606 -275616 -1155717 -1270024 -720090 -233854
30408 -233854 -234378 -335582 -15123 584094 900300 676377 38057 -820232 -1575995 -1735610
30398 -1735610 -1190428 -575319 -555868 -988382 -1282785 -1290351 -1229351 -1042899 -574136 -161917
30388 -161917 -244837 -492131 -198575 476986 599153 -96616 -795579 -929129 -975488 -1457087
30378 -1457087 -1973416 -1891640 -1371382 -999578 -872420 -740602 -710117 -1061929 -1553036 -1580276
30368 -1580276 -1024214 -409082 -229465 -544311 -1174932 -1829114 -2030817 -1431471 -349027
30359 -349027 368364 203726 -533068 -1167503 -1363340 -1245264 -1082299 -1057425 -1189780 -1273733
30349 -1273733 -988218 -267584 485781 768932 567371 360312 462118 597396 339639
30340 339639 -217986 -572314 -529906 -406559 -416504 -297480 172802 638548 573567 54591
30330 54591 -303133 -134554 325000 670936 748757 583522 216577 -240411 -579298 -645260
30320 -645260 -446849 -136565 34482 -151808 -647603 -1139965 -1401697 -1466466 -1348884 -922797
30310 -922797 -319519 -54770 -366042 -795065 -901628 -975211 -1402754 -1749717 -1344860 -518788
30300 -518788 -247889 -630494 -776201 -303024 153277 174405 178227 363188 149702 -652170
30290 -652170 -1115976 -498412 525276 830686 404826 14193 -141338 -446551 -888147
30281 -888147 -1004526 -669207 -191015 193551 335616 2903 -685520 -1056120 -795863 -601426
30271 -601426 -1120018 -1752842 -1501250 -581326 -69102 -224554 -374096 -309919 -532675 -1066900
30261 -1066900 -1283969 -1079146 -1046824 -1265094 -1091439 -454509 -127499 -322313 -265216 303138
30251 303138 504929 -69582 -428908 149024 694434 69624 -1025564 -1064310 -123289 266130
30241 266130 -494890 -1316217 -1195865 -478426 43349 269517 512421 777090 842848 659608
30231 659608 320639 -68435 -322462 -292255 -155107 -260866 -608136 -815154 -681408 -414259
30221 -414259 -200513 74876 511494 895835 933702 611956 181637 -114615 -215523 -203677
30211 -203677 -125028 123720 582807 912681 632746 -135990 -544065 -4801 973187 1395912
30201 1395912 1010787 418256 110508 -17040 -190504 -333667 -246168 159107 826294 1425245
30191 1425245 1355043 381342 -778603 -1106152 -566418 -105570 -251091 -478485 -308639
30182 -308639 -237333 -884244 -1770091 -1826622 -940613 -141506 -140100 -390555 38536 1115197
30172 1115197 1840429 1468128 351034 -522138 -630209 -371933 -443906 -983235 -1495168
30163 -1495168 -1504845 -1003391 -261919 454414 860210 690013 68532 -377824 -135228 559430
30153 559430 996093 821935 262710 -407168 -1156314 -1866065 -2179115 -1978144 -1695723 -1786094
30143 -1786094 -2093781 -2126129 -1813410 -1564082 -1588475 -1605863 -1311518 -747487 -88302 545548
30133 545548 892276 618563 -103908 -507291 -148839 401332 281214 -530261 -1342655 -1752705
30123 -1752705 -1850809 -1632107 -1024112 -475285 -620827 -1199677 -1200729 -386235 254762 29630
30113 29630 -448390 -471620 -513254 -1260413 -2098255 -1844221 -650329 124462 -105573 -511864
30103 -511864 -340265 96146 271139 306641 466569 546748 301932 -73172 -311450 -433596
30093 -433596 -439122 -190827 103295 -72465 -658616 -845145 -252717 371560 244331 -260569
30083 -260569 -242497 349349 769503 641373 293511 43841 -151684 -324567 -334440 -147317
30073 -147317 116109 375197 505049 227149 -502037 -1168043 -1226669 -800683 -381810 -49794
30063 -49794 409429 764079 475845 -341435 -822449 -482597 117116 186161 -241691 -465254
30053 -465254 -72432 624346 1023463 861879 397928 61450 -26423 -97887 -308204 -510457
30043 -510457 -591175 -695965 -831060 -605659 155172 847773 757047 90695 -343134 -372318
30033 -372318 -574737 -1132964 -1455043 -1182549 -752444 -569272 -379199 35906 254230 -57169
30023 -57169 -402261 -175765 329604 405323 76001 -48925 131745 103219 -314904 -686984
30013 -686984 -718944 -628964 -640856 -708812 -851574 -1144693 -1270045 -776394 3037 85642
30003 85642 -692924 -1141355 -317942 1016321 1487472 1164528 1302783 2097779 2053178 150477
29993 150477 -2401919 -3521758 -2769444 -1541825 -1063606 -1229233 -1462216 -1675937 -1933273
29984 -1933273 -1910326 -1337425 -566582 -149412 -124392 -188126 -290552 -543151 -775446 -771037
29974 -771037 -793593 -1234836 -1781197 -1628900 -668776 190437 164712 -471050 -924687 -896775
29964 -896775 -644127 -406284 -243733 -250031 -503295 -868067 -1101164 -1067468 -717997 -91190
29954 -91190 484086 514744 -21886 -470815 -303823 140727 170883 -242373 -522606 -452763
29944 -452763 -456035 -817480 -1176810 -1039968 -406990 351112 919045 1090085 692466 -185701
29934 -185701 -1041354 -1356214 -1133164 -805183 -643947 -523639 -306492 -147775 -195132 -207671
29924 -207671 155893 721856 910781 593206 382805 744499 1225171 1119191 613442 541221
29914 541221 1061503 1387153 1000190 366642 92247 68365 -63436 -220947 -226957 -293993
29904 -293993 -527308 -454168 219810 844562 668999 85786 60391 544911 559845 -139659
29894 -139659 -625147 -312652 128982 -71911 -564825 -487936 246048 939831 1059339 647608
29884 647608 20906 -492159 -653631 -508476 -388078 -532795 -855917 -1180951 -1459309 -1630306
29874 -1630306 -1551707 -1226555 -857409 -572998 -344237 -196500 -197921 -244848 -216582 -277292
29864 -277292 -567024 -705605 -237272 485844 639783 190254 -70327 109567 83211 -333208
29854 -333208 -313653 468059 896699 18696 -1288768 -1477897 -563007 101199 -78501 -379841
29844 -379841 -229234 49580 127268 212928 370838 179535 -520771 -1198099 -1300727 -875215
29834 -875215 -314303 37749 -81205 -681949 -1258411 -1194680 -548146 44392 262013 340905
29824 340905 406690 247151 -105711 -247827 -105689 -144627 -577898 -953169 -892124 -721417
29814 -721417 -929896 -1387101 -1544658 -1178493 -580536 -163007 -104480 -272540 -383332 -335805
29804 -335805 -325285 -436239 -341866 179076 647764 427522 -243508 -493086 -113420 176600
29794 176600 -75180 -440307 -516661 -618502 -1031966 -1287089 -848170 -48585 327593 93124
29784 93124 -265066 -310283 2695 466909 691712 288509 -605461 -1224224 -985024 -212164
29774 -212164 271250 70473 -528387 -983671 -916751 -358457 211231 350291 299855 704127
29764 704127 1537815 1920527 1333393 406128 13082 137245 201168 51578 -27416 47727
29754 47727 97806 26507 -194292 -578038 -840701 -553856 64410 186570 -298869 -333808
29744 -333808 663534 1564118 1049452 -339285 -1023427 -773082 -740611 -1307715 -1544152 -1001375
29734 -1001375 -485758 -559163 -649426 -307104 -106391 -479858 -743185 -258630 298336 -76681
29724 -76681 -1065452 -1467306 -968195 -433346 -504665 -789671 -590041 165760 894239 926797
29714 926797 81826 -1081087 -1669871 -1373245 -816041 -752778 -1133593 -1313271 -987572 -502221
29704 -502221 -302525 -437745 -617797 -517439 -35321 587664 964610 968713 798602 580026
29694 580026 191495 -356667 -710401 -619286 -315158 -145372 -101204 -31131 -19876 -151815
29684 -151815 -191020 2160 -7142 -658947 -1492984 -1559253 -800206 -253451 -580492 -1111881
29674 -1111881 -892845 -103629 320232 161403 113047 474999 558481 -203833 -1238930 -1543517
29664 -1543517 -996142 -302458 98031 341060 476482 307283 -22063 -64662 80265 -242224
29654 -242224 -1051350 -1390886 -771869 -118382 -412175 -1099324 -945680 13267 639974 561357
29644 561357 494695 679298 417194 -437248 -864884 -241367 595350 655625 263968 307497
29634 307497 747054 844470 373783 -282861 -862568 -1262046 -1241973 -848202 -715665 -1175921
29624 -1175921 -1520395 -1028472 -247813 -186613 -636865 -588409 -114955 -366802 -1500346 -2097298
29614 -2097298 -1247564 39519 352604 -165810 -365956 93878 537063 525050 352440
29605 352440 358703 498229 633416 710330 615309 263377 -209211 -667906 -1223894 -1857048
29595 -1857048 -2032330 -1281396 -83912 469127 -9733 -782718 -1049102 -897864 -905763 -1226063
29585 -1226063 -1488146 -1358915 -842093 -169927 312868 307594 -103941 -411717 -253984 92085
29575 92085 126071 -108332 -120076 200964 382549 135909 -185757 -174475 38486 162327
29565 162327 317367 703956 995005 694419 -18259 -449712 -395511 -313560 -390121 -161984
29555 -161984 597262 1265684 1166881 510447 -10828 -193257 -293638 -319798 -50680 335066
29545 335066 346856 -19481 -174632 181292 568583 381615 -350546 -1125716 -1572022 -1592388
29535 -1592388 -1159507 -339301 539801 1027051 928884 452339 -33660 -318948 -443986 -518838
29525 -518838 -499238 -232853 235164 548540 387327 -159767 -741017 -1169107 -1486494 -1679545
29515 -1679545 -1612361 -1262491 -773124 -243284 284995 612104 481274 25458 -194430 152368
29505 152368 660780 618409 -129866 -975734 -1212029 -744827 -107402 131167 -96337 -387905
29495 -387905 -380742 -140725 1939 -86362 -198285 -111873 80461 70715 -260876 -615371 -536989
29484 -536989 23598 486312 199301 -727723 -1395728 -1100676 -153031 509487 365882 -287501
29474 -287501 -829954 -884366 -461900 126481 472058 403112 108807 -201706 -563828 -927860
29464 -927860 -872740 -154043 662925 765340 239032 -48744 227982 439003 146397 -166157
29454 -166157 -3389 249302 37579 -347332 -298662 -36079 -291675 -1022176 -1356930 -889539
29444 -889539 -212397 9717 -205732 -542474 -844813 -897473 -389447 491410 978743 718656
29434 718656 360473 610640 1122294 1018247 253674 -341041 -352244 -307727 -663990 -983679
29424 -983679 -649170 54119 235492 -330828 -847645 -569458 209199 567185 135991 -510447
29414 -510447 -645170 -252733 73105 -60633 -391745 -411557 -64101 142603 -249376 -1048681
29404 -1048681 -1568066 -1373635 -737528 -262891 -198005 -311937 -372280 -449675 -662724 -895651
29394 -895651 -977678 -949461 -901340 -706458 -239387 228793 244076 -192820 -586569 -645745
29384 -645745 -616655 -721475 -698938 -295689 122241 -5899 -541587 -760421 -405053 -71083
29374 -71083 -318796 -851566 -940005 -396620 241629 379998 -85954 -811902 -1312210 -1238956
29364 -1238956 -610591 151276 542915 415064 68412 -72909 135094 424968 374298 -127784
29354 -127784 -679449 -769999 -382217 5266 31627 -200435 -458233 -710634 -938326 -952665
29344 -952665 -690266 -411925 -315085 -232894 -26846 82291 -7539 117512 705283 1135571
29334 1135571 706814 -125876 -288781 183969 104737 -930382 -1749569 -1383559 -576448
29325 -576448 -561908 -1126731 -1079338 -214592 441600 287405 -112588 -164436 -134955 -453326
29315 -453326 -861245 -830188 -387727 -15486 29098 -118741 -290623 -477322 -700839 -892027
29305 -892027 -892008 -544668 92730 616488 566951 -35980 -606228 -570172 53514 724056 934326
29294 934326 620976 91731 -343257 -596236 -661456 -428073 107970 504809 186492 -699008
29284 -699008 -1127559 -301817 1308525 2415199 2267086 1237647 241063 -59652 379259
29275 379259 985091 1027502 418846 -116226 -37514 159974 -312667 -1215231 -1523969 -960454
29265 -960454 -378647 -428229 -697206 -597587 -339028 -409083 -638303 -492195 -10753 189624
29255 189624 -223518 -908989 -1308283 -1161493 -597965 10243 273061 44218 -488648 -977858
29245 -977858 -1133938 -878709 -485233 -461133 -990144 -1583375 -1661588 -1364574 -1264223 -1364051
29235 -1364051 -1094458 -391635 11309 -316753 -833136 -869812 -508664 -149723 140650 291464
29225 291464 -113420 -1122435 -1907736 -1778194 -1266264 -1327195 -1799783 -1677444 -788712 -143516
29215 -143516 -413390 -972758 -860584 -56042 669314 789902 504828 332696 482531 637519
29205 637519 377056 -188422 -469604 -247445 -69092 -403281 -803634 -532523 251845 674253
29195 674253 408094 -9790 -179912 -383526 -889902 -1378471 -1411991 -1038723 -625302 -437041
29185 -437041 -577700 -979254 -1279898 -1091519 -562775 -300026 -554839 -874193 -755102 -277309
29175 -277309 129729 206381 -65037 -574571 -1032846 -1090118 -742929 -405778 -414202 -672377
29165 -672377 -893676 -921206 -712633 -308792 68771 187335 163536 330062 661850 723271
29155 723271 328124 -135299 -228660 21882 300621 367546 123882 -326452 -568175 -235692
29145 -235692 397553 646522 355222 66290 73875 -35387 -548884 -999886 -898153 -524588
29135 -524588 -379080 -317004 46292 430264 198733 -563522 -1031400 -717596 28277 627716
29125 627716 832063 618220 59260 -540995 -786099 -627155 -399476 -360985 -464488 -605125
29115 -605125 -775982 -898942 -775304 -342683 149608 297002 -131004 -907145 -1373144 -1024555
29105 -1024555 -202009 151977 -329088 -911613 -810062 -326486 -329480 -905322 -1298134 -1103655
29095 -1103655 -741288 -648805 -729281 -799733 -925211 -1016829 -710641 -35265 330932 -58959
29085 -58959 -702298 -829315 -488336 -369890 -699999 -898541 -405560 600601 1472296 1777502
29075 1777502 1537161 996017 400250 -42758 -190728 -71836 70924 -56873 -539579
29066 -539579 -1177818 -1677824 -1848545 -1632455 -1126655 -664327 -663428 -1166246 -1643207 -1499528
29056 -1499528 -732672 107333 531357 468840 124186 -223824 -327984 -189382 -156650 -508165
29046 -508165 -963006 -966577 -469629 -9627 54533 -68563 -135398 -280608 -567195 -586299
29036 -586299 -33517 587075 449924 -430075 -1086416 -813398 -43336 283594 -71321 -460581
29026 -460581 -286397 279752 650920 617239 502197 620979 885203 1004920 834846 392619
29016 392619 -243461 -850988 -1053201 -670064 -21002 365498 332295 184284 216913 366496
29006 366496 372524 140924 -116323 -88129 221758 306718 -356724 -1519817 -2200908 -1796862
28996 -1796862 -833471 -217773 -72178 128157 519143 701442 592335 640793 1017595 1283980
28986 1283980 1136520 855436 688677 391783 -211771 -755886 -884585 -803814 -795617 -649129
28976 -649129 -149926 277949 107522 -374789 -394762 182682 711094 720890 394119 10543
28966 10543 -497456 -1216553 -1875224 -2032831 -1476303 -397886 632368 960832 427297
28957 427297 -386876 -770858 -670031 -556560 -654308 -731404 -615547 -433571 -273487 -35749
28947 -35749 279709 515320 658131 805746 766252 174734 -810261 -1407510 -1125291 -397549
28937 -397549 42959 107506 241699 587594 758491 466156 -22589 -213102 35986 395924
28927 395924 440198 57840 -438465 -563840 -93829 657763 1026467 613567 -215093 -593247
28917 -593247 -79651 798871 1163009 818545 308983 7866 -262368 -558926 -449813 206442
28907 206442 671898 215247 -758631 -1220825 -955482 -670192 -730923 -671612 -150065 406136
28897 406136 470779 127165 -256528 -545672 -698900 -603817 -402141 -511669 -967161 -1202685
28887 -1202685 -872246 -416066 -373261 -596127 -658140 -599660 -655467 -611205 -143239 427686
28877 427686 459610 -20779 -359813 -316964 -351299 -711839 -918128 -516809 125191 263070
28867 263070 -199565 -561265 -231019 488422 723115 113135 -652796 -640179 102619 578704
28857 578704 223042 -313323 -176938 387310 447824 -156724 -598715 -342763 138325 211561
28847 211561 -237 -4191 203275 192786 -173232 -519201 -433266 114221 808823 1253891
28837 1253891 1233861 884848 583626 559228 668335 648496 487570 370401 315372 98869
28827 98869 -368897 -776097 -740200 -372870 -244653 -651796 -1159414 -1153524 -674418 -296335
28817 -296335 -254553 -220094 -27671 -23522 -385056 -666507 -513064 -349976 -731777 -1362821
28807 -1362821 -1496957 -1100230 -831898 -935927 -952047 -603404 -198631 26444 228935 383633
28797 383633 147011 -351211 -351772 365918 861681 299230 -708464 -863409 40683 999406
28787 999406 1317259 1310714 1374455 1257460 732579 320789 662140 1452490 1683076 959156
28777 959156 27074 -234909 72069 170916 -218386 -575091 -488235 -270314 -315012 -337825
28767 -337825 138418 802437 786689 -93661 -990690 -1108571 -615119 -240163 -413703 -1028726
28757 -1028726 -1637595 -1671560 -900346 120127 528385 272768 162659 569879 842573
28748 842573 482650 86783 337324 750629 440315 -348189 -595326 -143684 206979 188612
28738 188612 414797 1030775 1209620 496203 -342266 -449257 -68673 75651 -68952 -68628
28728 -68628 181548 529923 1019160 1564765 1582838 719122 -327954 -532769 38096 338867
28718 338867 -124225 -674608 -556886 58184 496022 488834 285574 187520 303696 555143
28708 555143 688907 468589 11673 -262208 -157073 46402 11427 -211988 -349975 -305885
28698 -305885 -177906 -14289 233432 563197 847896 868921 442179 -307859 -824994 -615379
28688 -615379 32772 231155 -359463 -986379 -830030 -191515 -40297 -599775 -1137006 -1161784
28678 -1161784 -1024528 -1061301 -918978 -267812 408402 447123 84350 139398 754338 1183318
28668 1183318 888232 186992 -348095 -549378 -481267 -161000 212506 216508 -206005 -481145
28658 -481145 -141396 493095 806466 743175 635621 441954 -141620 -857811 -930598 -163507
28648 -163507 605738 522497 -239583 -851900 -912798 -685616 -467598 -266275 -116571 -231826
28638 -231826 -622542 -859276 -487061 417295 1265339 1480298 927118 -34819 -768106 -763441
28628 -763441 -111150 437792 177171 -686783 -1160954 -659755 208782 404431 -194988 -700365
28618 -700365 -448019 226634 642568 670635 571373 335046 -231298 -894442 -1057831 -534316
28608 -534316 172485 523026 544113 576974 700661 690905 423811 47398 -240104 -368454
28598 -368454 -296200 70930 675399 1105532 884600 81953 -602364 -600241 -139979 154497
28588 154497 124897 57254 -62091 -555543 -1208275 -1220094 -411298 266102 34632 -559419
28578 -559419 -594369 -262339 -358813 -699180 -331395 728382 1292299 795778 74792 -106365
28568 -106365 -125965 -417857 -420040 393817 1268224 1117652 224271 -168144 302873 778871
28558 778871 606325 67000 -410356 -821790 -1113258 -929553 -215789 492587 707537 491061
28548 491061 122709 -265991 -512865 -374499 30417 124048 -427001 -1171836 -1350995 -753017
28538 -753017 113622 562422 302177 -383083 -913339 -964741 -735493 -549936 -379432 -72948
28528 -72948 124557 -181334 -791223 -1012894 -647987 -309763 -508719 -948287 -1066829 -818696
28518 -818696 -521064 -305801 -135659 -52162 -18686 184816 537208 589112 146459 -207191
28508 -207191 146211 833295 879466 77468 -678146 -557020 208044 700740 378810 -419395
28498 -419395 -835126 -304661 822989 1539516 1233719 345283 -279808 -425715 -478640 -619951
28488 -619951 -675024 -682789 -928269 -1325765 -1415462 -1123771 -891036 -854568 -597624 -7370
28478 -7370 346210 135067 -131109 -17427 16279 -516692 -1038733 -669714 296674 757274
28468 757274 477814 283817 531033 552614 -34871 -553695 -379982 35282 -39242 -486920
28458 -486920 -749489 -795056 -887712 -842729 -372549 120946 -12566 -568913 -679083 -97054
28448 -97054 504529 613468 481750 456591 422294 211414 -24184 -172657 -367298 -530369
28438 -530369 -252146 501720 1073773 966095 581936 607670 985554 1042773 447898 -432173
28428 -432173 -990621 -823621 77409 1165656 1573508 961837 -8017 -467120 -412678 -496562
28418 -496562 -916397 -1142021 -757086 559 653649 973478 946974 693002 530066 722577
28408 722577 1042234 963790 394019 -184955 -381186 -282475 -112596 11680 -116305 -642134
28398 -642134 -1095472 -649258 657678 1565382 1049161 -312464 -1074326 -719909 -43762
28389 -43762 76040 -410544 -1026403 -1360863 -1268244 -957861 -963342 -1585042 -2316173 -2295968
28379 -2295968 -1423491 -531062 -296203 -485299 -535627 -392626 -340565 -359879 -193035 82716
28369 82716 55713 -396023 -860859 -899831 -525725 -34914 405694 788115 1028436 988616
28359 988616 741578 562318 545125 440338 63607 -309221 -264717 93579 183336 -275205
28349 -275205 -852184 -968142 -586704 -120675 117263 107196 -34173 -112913 76136 448521
28339 448521 552028 112808 -486996 -647457 -346321 -68081 -2692 186405 716556 1271334
28329 1271334 1425979 1148504 687475 241307 -72845 -148969 20143 309053 581969 719851
28319 719851 581215 188548 -106443 6545 277915 157179 -402210 -850209 -827433 -548415
28309 -548415 -274419 29510 278544 111636 -466659 -836586 -628894 -339130 -523517 -853563
28299 -853563 -664652 -89657 150233 -99269 -296241 -199812 -190936 -455765 -582994 -271649
28289 -271649 143312 230284 86856 65647 197627 237232 84692 -109358 -143855 76031
28279 76031 445108 649508 451472 52086 -58433 308067 828239 1115518 1112159 945614
28269 945614 688296 418663 281430 320952 434764 592821 887001 1264636 1456195 1300456
28259 1300456 930710 537057 177874 -81737 -123544 4552 101343 162015 377365 625311
28249 625311 387917 -493546 -1339326 -1357636 -644193 -18157 6521 -350581 -656198 -739858
28239 -739858 -607573 -312791 -66840 -143933 -484444 -647043 -356090 111404 304588 186819
28229 186819 64418 33387 -139344 -513564 -701298 -353272 276600 575275 313810 -168465
28219 -168465 -502124 -629586 -531904 -64058 663704 1121947 978032 601495 515720 581593
28209 581593 265607 -416483 -845079 -714709 -406775 -284865 -160392 260699 817317 1103514
28199 1103514 977324 612136 231817 -47919 -275232 -597633 -949286 -914624 -277497 420685
28189 420685 438565 -68538 -187522 403793 969359 860258 370089 31234 -208434 -531728
28179 -531728 -618979 -164073 456236 705147 661205 620351 380006 -308482 -957727 -889963
28169 -889963 -326967 -44121 -66701 350355 1380125 2152874 1906585 947781 159728 24570
28159 24570 365394 678776 545805 -908 -443017 -341393 123971 431319 360169 44427
28149 44427 -348734 -583951 -334632 275524 478053 -113414 -650375 -98054 1125186 1591250
28139 1591250 876569 36898 -64570 191168 150387 -81238 -113417 -20570 -71560 -260839
28129 -260839 -517018 -884797 -1217028 -1209905 -946779 -823642 -800481 -438598 167590 332543
28119 332543 -104946 -482109 -412866 -248867 -120870 392649 1159947 1239682 427704 -123998
28109 -123998 277561 636083 4288 -711442 -204308 891680 925622 -23183 -271912 644575
28099 644575 1196604 332854 -936885 -1220165 -716440 -534405 -895716 -1038916 -516708
28090 -516708 238667 579605 387400 106914 201494 600918 816843 716196 823840 1469705
28080 1469705 2040880 1753300 888997 438707 635988 757215 423499 150255 345395
28071 345395 633054 587805 416134 424065 390830 -9964 -579704 -851466 -706130 -394429
28061 -394429 -158949 -53960 42354 309690 672764 717337 282946 -75484 180833 567475
28051 567475 131811 -1018831 -1725571 -1490509 -1130200 -1308572 -1471587 -934460 -125896
28042 -125896 133206 -83180 -162010 -74800 -196077 -374060 -155144 271367 289710 -61086
28032 -61086 -115805 274001 481420 158806 -219668 -157130 176084 413272 607578 927361
28022 927361 1125223 826472 185306 -206110 -84164 147650 -26806 -569667 -1003142 -1102511
28012 -1102511 -1155397 -1390762 -1454613 -846637 235300 981264 997042 778254 917412 1257187
28002 1257187 1220260 703027 193911 97616 305589 432961 233625 -224065 -642046 -780626
27992 -780626 -729299 -774359 -964160 -1043740 -912262 -832246 -979143 -1072035 -736273 -36857
27982 -36857 603215 858865 691877 284555 -40305 -55881 62303 -70349 -449995 -680495
27972 -680495 -703441 -964732 -1534175 -1691932 -955647 22363 311013 53218 141582 790650
27962 790650 1315319 1271194 948117 620654 107767 -659440 -1285163 -1454369 -1350186 -1247267
27952 -1247267 -1102497 -820088 -581485 -634560 -944773 -1202706 -1057386 -387932 457103 839840
27942 839840 543686 89606 -26639 -78106 -509351 -955160 -722085 -70916 12040 -610596
27932 -610596 -939547 -389875 395664 687996 616828 426203 -212012 -1368929 -2199921 -2021517
27922 -2021517 -1391011 -1225021 -1433984 -1349348 -945658 -621903 -242011 505496 1147768 979124
27912 979124 333975 140414 373334 202877 -377266 -440789 196760 589765 330646 251113
27902 251113 872539 1440021 1274608 906107 931053 839328 96686 -560409 -217740 560064
27892 560064 563215 -98130 -320824 44156 116987 -250913 -242272 234256 201229 -584576 -973381
27881 -973381 -279987 522491 370986 -273029 -434175 -276322 -537670 -1046309 -1073731 -675584
27871 -675584 -444313 -310423 144417 482003 -80803 -1045331 -1006950 141381 847233 200364
27861 200364 -809638 -1047584 -903365 -1164704 -1353125 -562534 734408 1166506 473838
27852 473838 -267194 -365949 -259561 -418254 -623344 -643349 -687416 -787549 -517964 237980
27842 237980 902153 995455 723957 397520 -103911 -819591 -1268811 -1102077 -719064 -660217
27832 -660217 -794512 -687314 -366270 -78749 331143 1046357 1552015 1136245 40298
27823 40298 -697034 -591446 -176639 -33041 -101501 -159526 -265498 -416345 -373715 -168962
27813 -168962 -232536 -685717 -1051316 -1031059 -987538 -1193160 -1197287 -577137 172187 263196 -185341
27802 -185341 -371988 -55313 250183 285453 403056 730264 746484 85177 -794377 -1173142
27792 -1173142 -957012 -633069 -619571 -979020 -1534548 -1936784 -1772334 -925057 201398
27783 201398 999118 1163242 837689 410811 247050 435595 690576 661038 401778 294458
27773 294458 413241 322218 -230770 -732879 -469945 425318 962213 470654 -543987 -1002683
27763 -1002683 -561723 21395 -85492 -704418 -933936 -422304 133654 -33312 -717569
27754 -717569 -1108964 -926826 -629608 -585559 -620508 -483134 -261512 -159793 -230852 -448426
27744 -448426 -701005 -694104 -303773 -22907 -446960 -1219144 -1220401 -102343 1095440 1299520
27734 1299520 697765 149361 -32906 -36682 112059 356255 223258 -504903 -1109181 -817741
27724 -817741 -62036 112406 -347341 -539263 -136050 256501 327603 485732 810670 719822
27714 719822 109205 -230200 102856 399659 82393 -263342 46699 494471 163512 -693479
27704 -693479 -983557 -400821 291105 500843 391990 193416 -195252 -710015 -949063 -765685
27694 -765685 -505820 -442240 -445436 -394288 -423861 -531072 -392018 125999 645341 785508
27684 785508 665504 571857 447924 151754 -15505 390132 1145563 1431809 926093 324819
27674 324819 372094 748450 551630 -255754 -659088 -86594 645732 486933 -259768 -363565
27664 -363565 468446 1101997 620527 -330208 -417020 617965 1709187 1830733 1069371
$$ [...]
##END NTUPLES=NMR SPECTRUM
##END=
