##TITLE=31Pdec_LY-15Dix.2.B
 CD3CN, 24 sc
 2.06.2021
##JCAMPDX= 6.0         $$ Bruker NMR JCAMP-DX V2.0
##DATA TYPE= NMR SPECTRUM
##DATA CLASS= NTUPLES
##ORIGIN= UXNMR, Bruker Analytische Messtechnik GmbH
##OWNER= root
$$ XWIN-NMR		Version 3.5
$$ Wed Jun  2 10:20:05 2021 Russian Standard Time (UT+4h)  she@DPX200
##.OBSERVE FREQUENCY= 81.013821
##.OBSERVE NUCLEUS= ^31P
##.ACQUISITION MODE= SIMULTANEOUS
##.ACQUISITION SCHEME= undefined
##.AVERAGES= 24
##.DIGITISER RES= 16
##SPECTROMETER/DATA SYSTEM= spect
##.PULSE SEQUENCE= zgpg30
##.SOLVENT NAME= CD3CN
##.SHIFT REFERENCE= (INTERNAL, CD3CN, 0, 248.564)
##AUDIT TRAIL= $$ (NUMBER, WHEN, WHO, WHERE, WHAT)
$$ ##TITLE= Audit trail, XWIN-NMR		Version 3.5
$$ ##JCAMPDX= 5.01
$$ ##ORIGIN= Bruker BioSpin GmbH
$$ ##OWNER= she
$$ F:/spectra/data/she/nmr/P31/1/pdata/1/auditp.txt
$$ ##AUDIT TRAIL=  $$ (NUMBER, WHEN, WHO, WHERE, WHAT)
(   1,<2021-06-02 10:18:37.01 +0400>,<she>,<DPX200>,
      <created by zg, POWCHK disabled, PULCHK disabled
       configuration hash MD5:
       00 E9 B6 7A A2 85 ED C7 34 08 36 98 17 FE 4E 26
       data hash MD5: 32K
       02 EA 67 32 2B CA BA 09 9A 82 C6 2C DB 48 A6 64>)
(   2,<2021-06-02 10:18:39.32 +0400>,<she>,<DPX200>,
      <Start of raw data processing
       efp BC_mod = 2 LB = 1 FT_mod = 6 PKNL = 1 PHC0 = -5892.419 PHC1 = 128.2726 SI = 64K 
       data hash MD5: 64K
       1E 59 85 61 26 1E 94 91 A4 AA B0 26 D2 71 BD 4A>)
(   3,<2021-06-02 10:19:32.28 +0400>,<she>,<DPX200>,
      <pk PHC0 = -453.2259 PHC1 = 919.1976 
       data hash MD5: 64K
       D0 C5 F1 61 5C 76 68 77 C1 5A D8 BD 0B 0C 47 BF>)
(   4,<2021-06-02 10:19:35.95 +0400>,<she>,<DPX200>,
      <abs ABSG = 5 
       data hash MD5: 64K
       29 5D 8C C8 25 63 3F 0E 23 E2 B2 07 9A 2B 83 7D>)
$$ ##END=
$$ 
$$ hash MD5
$$ D3 46 BE 20 E1 EA 05 99 B4 B7 3F B0 E4 C4 37 54
##$RELAX= 
##$RELAX= 
##$RELAX= 
##$RELAX= 
##$RELAX= 
##$RELAX= 
##$RELAX= 
##$RELAX= 
$$ Bruker specific parameters
$$ --------------------------
##$DU= <F:/spectra>
##$EXPNO= 1
##$NAME= <P31>
##$PROCNO= 1
##$TYPE= <nmr>
##$USER= <she>
##$AMP= (0..31)
100 100 100 100 100 100 100 100 100 100 100 100 100 100 100 100 100 100 
100 100 100 100 100 100 100 100 100 100 100 100 100 100 
##$AQSEQ= 0
##$AQ_mod= 1
##$AUNM= <au_zg>
##$AUTOPOS= <>
##$BF1= 81.014009
##$BF2= 200.13
##$BF3= 200.13
##$BF4= 200.13
##$BF5= 200.13
##$BF6= 200.13
##$BF7= 200.13
##$BF8= 200.13
##$BYTORDA= 1
##$CFDGTYP= 0
##$CFRGTYP= 5
##$CHEMSTR= <none>
##$CNST= (0..31)
1 1 145 1 1 1 1 1 1 1 1 1 1 1 1 1 1 1 1 1 1 1 1 1 1 1 1 1 1 1 1 1 
##$CPDPRG= <waltz16>
##$CPDPRG1= <>
##$CPDPRG2= <waltz16>
##$CPDPRG3= <>
##$CPDPRG4= <mlev>
##$CPDPRG5= <mlev>
##$CPDPRG6= <mlev>
##$CPDPRG7= <mlev>
##$CPDPRG8= <mlev>
##$CPDPRGB= <>
##$CPDPRGT= <>
##$D= (0..31)
0 1 0 0 0 0 0 0 0 0 0 0.03 2e-05 3e-06 0 0 0 0 0 0 0 0 0 0 0 0 0 0 0 0 
0 0 
##$DATE= 1622614716
##$DBL= (0..7)
120 120 120 11 120 120 24 19 
##$DBP= (0..7)
150 150 150 150 150 150 150 150 
##$DBP07= 0
##$DBPNAM0= <>
##$DBPNAM1= <>
$$ [...]
##$SUBNAM3= <"">
##$SUBNAM4= <"">
##$SUBNAM5= <"">
##$SUBNAM6= <"">
##$SUBNAM7= <"">
##$SUBNAM8= <"">
##$SUBNAM9= <"">
##$SW= 501.771253377433
##$SWIBOX= (0..15)
0 1 3 0 0 0 0 0 0 0 0 0 0 0 0 0 
##$SW_h= 40650.406504065
##$TD= 32768
##$TD0= 1
##$TE= 0
##$TE2= 300
##$TE3= 300
##$TEG= 300
##$TL= (0..7)
0 120 53 12 22 120 120 120 
##$TP= (0..7)
150 150 150 150 150 150 150 150 
##$TP07= 0
##$TPNAME0= <>
##$TPNAME1= <>
##$TPNAME2= <>
##$TPNAME3= <>
##$TPNAME4= <>
##$TPNAME5= <>
##$TPNAME6= <>
##$TPNAME7= <>
##$TPOAL= (0..7)
0.5 0.5 0.5 0.5 0.5 0.5 0.5 0.5 
##$TPOFFS= (0..7)
0 0 0 0 0 0 0 0 
##$TUNHIN= 0
##$TUNHOUT= 0
##$TUNXOUT= 0
##$USERA1= <user>
##$USERA2= <user>
##$USERA3= <user>
##$USERA4= <user>
##$USERA5= <user>
##$V9= 5
##$VALIST= <valist>
##$VCLIST= <CCCCCCCCCCCCCCC>
##$VD= 0
##$VDLIST= <DDDDDDDDDDDDDDD>
##$VPLIST= <PPPPPPPPPPPPPPP>
##$VTLIST= <TTTTTTTTTTTTTTT>
##$WBST= 1024
##$WBSW= 4
##$XGAIN= (0..3)
0 0 0 0 
##$XL= 0
##$YL= 0
##$YMAX_a= 5852
##$YMIN_a= -9504
##$ZGOPTNS= <>
##$ZL1= 120
##$ZL2= 120
##$ZL3= 120
##$ZL4= 120
##$ABSF1= 248.5645
##$ABSF2= -253.2056
##$ABSG= 5
##$ABSL= 3
##$ALPHA= 0
##$AQORDER= 0
##$ASSFAC= 0
##$ASSFACI= 0
##$ASSFACX= 0
##$ASSWID= 0
##$AUNMP= <proc_1d>
##$AZFE= 0.1
##$AZFW= 0.5
##$BCFW= 0
##$BC_mod= 2
##$BYTORDP= 0
##$COROFFS= 0
##$CY= -3
##$DATMOD= 1
##$DC= 0
##$DFILT= <>
##$DTYPP= 0
##$F1P= 0
##$F2P= 0
##$FCOR= 1
##$FTSIZE= 65536
##$FT_mod= 6
##$GAMMA= 0
##$GB= 0
##$INTBC= 1
##$INTSCL= 5.30512e-09
##$ISEN= 30
##$LB= 1
##$LEV0= 0
##$LPBIN= 0
##$MAXI= 10000
##$MC2= 0
##$MEAN= 0
##$ME_mod= 0
##$MI= 50
##$NCOEF= 0
##$NC_proc= -3
##$NLEV= 6
##$NOISF1= 182.463
##$NOISF2= 159.3651
##$NSP= 0
##$NTH_PI= 0
##$NZP= 0
##$OFFSET= 248.5645
##$PC= 4
##$PHC0= -6345.645
##$PHC1= 1047.47
##$PH_mod= 1
##$PKNL= yes
##$PPARMOD= 0
##$PSCAL= 0
##$PSIGN= 0
##$REVERSE= no
##$SF= 81.014009
##$SI= 65536
##$SIGF1= 159.3651
##$SIGF2= -187.1042
##$SINO= 113.3802
##$SIOLD= 16384
##$SREGLST= <1H.CDCl3>
##$SSB= 0
##$STSI= 65536
##$STSR= 0
##$SW_p= 40650.406504065
##$SYMM= 0
##$S_DEV= 0
##$TDeff= 32768
##$TDoff= 0
##$TI= <>
##$TILT= no
##$TM1= 0
##$TM2= 0
##$TOPLEV= 0
##$USERP1= <user>
##$USERP2= <user>
##$USERP3= <user>
##$USERP4= <user>
##$USERP5= <user>
##$WDW= 1
##$XDIM= 65536
##$YMAX_p= 328603671
##$YMIN_p= -30160096
$$ End of Bruker specific parameters
$$ ---------------------------------
##NTUPLES= NMR SPECTRUM
##VAR_NAME=  FREQUENCY,     SPECTRUM/REAL,   SPECTRUM/IMAG
##SYMBOL=    X,             R,               I
##VAR_TYPE=  INDEPENDENT,   DEPENDENT,       DEPENDENT
##VAR_FORM=  AFFN,          ASDF,            ASDF
##VAR_DIM=   65536,         65536,           65536
##UNITS=     HZ,            ARBITRARY UNITS, ARBITRARY UNITS
##FACTOR=    0.620285442955139, 1,           1
##FIRST=     20137.2065510759, 0,            0
##LAST=      -20513.1999529892, 0,           0
##MIN=       -20513.1999529892, -30160096,   0
##MAX=       20137.2065510759, 328603671,    0
$$ Real data points
##PAGE= N=1
##DATA TABLE= (X++(R..R)), XYDATA
$$ [...]
38268 -51762 -318238 -407965 -281427 -136461 -125817 -203884 -254598 -233796 -172842 -135485 -163947
38257 -163947 -206605 -149912 11550 113130 12316 -231189 -446131 -530943 -460673 -225169
38247 -225169 112233 371141 400028 238586 65172 27329 151140 322505 334447 96886
38237 96886 -157535 -63576 387767 743418 611007 118554 -299277 -405500 -272970 -52818
38227 -52818 144440 231627 213266 213002 284152 288121 116097 -88341 -122483 -41679 -71240 -264104
38215 -264104 -447136 -468590 -322431 -68338 202416 357565 337129 246763 216248 226659
38205 226659 193172 114382 -7052 -265618 -676303 -999662 -969726 -638629 -289979 -69707
38195 -69707 89853 243051 359150 441611 501740 450372 235813 42596 96214 288259
38185 288259 278174 4582 -183284 -5864 361628 518494 303464 -78668 -289714 -151860
38175 -151860 192768 381635 196455 -158280 -268973 -20315 261095 222551 -87359 -292469
38165 -292469 -123123 285324 517458 311753 -124389 -318241 -93277 214833 217398 -18862
38155 -18862 -135987 -34882 27154 -129782 -360122 -451981 -418769 -417946 -505484 -570098 -467294
38144 -467294 -193558 58579 83050 -64498 -106680 53555 158283 -8075 -246123 -224838
38134 -224838 24878 210513 246438 270401 277948 135055 -67828 -84069 35334 -27772 -291498
38123 -291498 -366442 -79421 200655 104081 -213720 -375908 -341021 -336351 -419727 -428738 -288334
38112 -288334 -115127 -32671 -37567 -27969 105651 347413 490352 347906 56562 -38203 141066
38101 141066 281777 144444 -104522 -184472 -89637 14272 79681 138028 128966 -5996 -170377
38090 -170377 -239391 -232453 -206922 -122023 21305 56197 -134511 -401474 -519958 -484580 -435376
38079 -435376 -418637 -410782 -444544 -500706 -407432 -84686 227075 241182 39240 -56703 39124
38068 39124 111927 32144 -84250 -123633 -110780 -39610 173227 460421 558666 355654 131259
38057 131259 265691 757594 1178118 1120548 620602 99924 -78200 46230 146715 22076
38047 22076 -199919 -275411 -145964 41262 135559 123340 110204 216363 445536 627638
38037 627638 560745 243132 -113409 -325667 -393383 -387319 -324261 -226983 -181177 -229620 -291247
38026 -291247 -259774 -112445 107291 306733 329203 81270 -282952 -477142 -436675 -370398
38016 -370398 -405180 -413521 -294742 -172249 -151975 -123743 1670 76310 -43326 -231348 -301051
38005 -301051 -304494 -383527 -479043 -438611 -283920 -135473 3728 163705 239216 134246 -50639
37994 -50639 -178864 -265794 -304836 -130698 272524 559527 457315 202391 168401 255806
37984 255806 96791 -279311 -481161 -392599 -283150 -284842 -233801 -74590 34092 91216
37974 91216 291443 588342 642117 344801 19142 -52317 50040 160518 275814 373140
37964 373140 310458 81221 -97803 -82665 46470 173986 220391 50731 -332122 -549917
37954 -549917 -264875 197159 212045 -128816 -71400 570478 1020748 740796 258847 257721
37944 257721 523679 496580 285937 318980 408211 74801 -449472 -467380 17227 268793
37934 268793 11424 -201195 2813 227523 74045 -182165 -130293 62761 -26060 -355612
37924 -355612 -476361 -156831 370051 699915 603773 192976 -136759 -61243 299080 532240
37914 532240 480791 372522 361766 279104 -20290 -374727 -571324 -614045 -562148 -381229
37904 -381229 -144539 -86845 -233440 -275199 -69787 55965 -162562 -413984 -272494 76044
37894 76044 105557 -183513 -257030 72409 334913 141336 -275305 -528058 -655548 -865047
37884 -865047 -1018658 -827824 -410333 -215774 -400529 -630321 -563411 -244404 68925 220268
37874 220268 174209 -62220 -365787 -491811 -325846 -61016 30928 -54187 -82981 84127
37864 84127 342922 507226 477371 255537 -58316 -272775 -253727 -99529 -33759 -97934
37854 -97934 -112023 10573 104694 31141 -63287 50810 335781 543914 559741 476889 357725
37843 357725 143860 -138522 -280775 -128230 191043 401720 402108 342547 389288 509409
37833 509409 543538 435694 295454 223436 180500 97627 12189 -32863 -135058 -380311 -593226
37822 -593226 -499981 -168103 6093 -143550 -302311 -167111 98515 175460 111166 180715
37812 180715 386711 475663 372354 233384 111409 -68222 -209496 -108872 141018 188026
37802 188026 -46650 -227745 -124018 72221 107041 32373 9732 9063 -85279 -267867 -471316
37791 -471316 -634699 -608823 -261270 194941 294994 -61459 -402420 -326125 -29478 98510
37781 98510 92671 233928 490886 560426 337438 -16997 -362654 -611773 -615536 -361145 -143800
37770 -143800 -192928 -280379 -79532 259819 347970 217212 223784 377476 343289 100416 1223
37759 1223 113881 122963 10675 182432 676212 904018 549826 120596 133039 295672
37749 295672 73093 -388281 -557873 -416587 -355393 -384829 -168656 227186 333292 79138
37739 79138 -69058 77141 102405 -266079 -647298 -611171 -353925 -335942 -551074 -609676
37729 -609676 -379151 -116132 -19239 -17951 -27146 -107686 -286329 -429706 -407806 -254367 -73784
37718 -73784 120144 372612 631547 725561 547085 219480 5879 33348 175777 242395
37708 242395 185584 48979 -164295 -412082 -495936 -251350 158545 370912 283941 167705
37698 167705 241829 370854 317115 102860 -66156 -111677 -127299 -177752 -217205 -187735 -91339
37687 -91339 22990 94138 114891 172645 323831 434335 326050 106278 90692 293143
37677 293143 304187 -89388 -461154 -286828 270730 553605 299991 -103507 -259845 -196011
37667 -196011 -66521 133781 361957 408142 240722 168712 390660 644114 592382 326433
37657 326433 164809 155892 134752 121045 265596 477019 500088 362163 361497 558559 638585
37646 638585 393290 28095 -155635 -126509 -28586 46095 45175 -71865 -205342 -153505 94369
37635 94369 307286 366995 418004 516245 438586 96465 -153419 31350 423657 539249
37625 539249 364795 323709 561546 737511 598042 316332 97727 -157702 -548001 -841672
37615 -841672 -778810 -510468 -420473 -594440 -738406 -605222 -282748 -36092 -14863 -139941
37605 -139941 -182253 35901 424297 637798 423576 -49984 -335783 -212059 71598 137288
37595 137288 -14438 -2665 390562 840570 833705 347389 -81752 -49441 218514 260589
37585 260589 42876 -92098 -4951 104977 135068 254311 539385 776182 778658 623174
37575 623174 424018 177526 2073 193985 762719 1194209 1027555 473765 108527 102067
37565 102067 134426 -16110 -210665 -290024 -308787 -334981 -305076 -202860 -163806 -267496 -375680
37554 -375680 -299801 -50356 161176 141250 -80997 -261476 -201958 -1218 76791 -7094
37544 -7094 -26859 90490 104563 -99225 -234938 -86145 49926 -193808 -604030 -685543
37534 -685543 -457366 -383223 -561208 -596013 -350400 -209068 -395328 -593441 -545593 -511221
37524 -511221 -742136 -921374 -588258 150361 765272 972649 877004 614301 245328 -77286
37514 -77286 -179913 -89712 39928 147347 201626 66958 -300025 -626254 -593808 -289410
37504 -289410 -115268 -268519 -542051 -637839 -475341 -183580 51645 132005 141996 245072
37494 245072 405009 357461 4744 -332916 -287396 55269 261483 80255 -345993 -715160
37484 -715160 -795929 -515933 -47572 271143 309709 326092 544662 716972 444856 -162667
37474 -162667 -560861 -496053 -267410 -197598 -224763 -170514 -85512 -111258 -217084 -273696 -242399
37463 -242399 -149877 -12402 102023 80563 -54979 -116861 -12866 95142 20336 -169833
37453 -169833 -235745 -65887 204140 337741 213371 -58788 -214688 -91170 194519 387147
37443 387147 380793 255058 76961 -150031 -337396 -319207 -84192 157155 219836 133912
37433 133912 25993 -53708 -112477 -149821 -192917 -289027 -391601 -365745 -184029 -8296 9761
37422 9761 -86786 -160945 -172243 -160434 -109912 42335 266088 391413 247686 -143232 -518568
37411 -518568 -575744 -285398 33628 37664 -264686 -544879 -532954 -255326 77199 275665
37401 275665 256775 65858 -127802 -157967 -34871 74187 53875 -44830 -106771 -85500 -16394
37390 -16394 40524 63715 105715 216561 297412 155458 -186167 -382051 -172373 207112
37380 207112 282894 -27750 -322708 -269619 17491 227724 227204 68025 -159175 -331388
37370 -331388 -310261 -98428 127969 242397 307087 399252 436136 308952 97147 -2741
37360 -2741 60897 121720 18500 -162781 -145565 188150 565936 596402 280514 30635 89918
37349 89918 212110 128655 29530 202039 421089 209313 -370373 -717129 -540809 -204665
37339 -204665 -91071 -113045 -71399 -48119 -150296 -235494 -214407 -310640 -673375 -990944 -859011
37328 -859011 -360775 55620 156587 89439 71033 168729 316982 354334 137885 -225557
37318 -225557 -408301 -271775 -53480 27548 105346 358306 605394 540219 208788 -75847
37308 -75847 -185077 -229479 -253252 -187745 -66813 -14025 -42548 -92181 -200771 -402749 -526703
37297 -526703 -352643 55143 390603 456302 298818 63874 -104109 -102865 7001 17008
37287 17008 -134063 -226616 -102741 46685 -32528 -283314 -509951 -703419 -875512 -801486
37277 -801486 -337637 184203 332413 216829 281159 557023 651310 444539 247545 208739
37267 208739 107816 -136682 -267247 -166004 -55819 -29432 150479 540851 763318 559054
37257 559054 198853 26930 -25973 -137300 -178532 -18704 75423 -188504 -576113 -615466
37247 -615466 -293244 -10128 58520 98587 191542 173566 14983 -68332 6552 47250 -50644
37236 -50644 -117373 -39940 23554 -38324 -35262 193423 413222 299026 -18386 -95143 131749
37225 131749 184931 -258438 -833767 -936190 -508196 -46594 99610 81949 161159 303965
37215 303965 335149 237208 85432 -137948 -444683 -683438 -697409 -548868 -395545 -240776
37205 -240776 -12970 197161 213402 39610 -165026 -327429 -464139 -501133 -334035 -44826
37195 -44826 172956 284271 382965 437771 335610 153643 94164 142370 92400 -60825 -81397
37184 -81397 96785 258126 304771 417271 653792 728539 431936 4388 -177019 -92214
37174 -92214 -10093 -79674 -223324 -326313 -329771 -219992 -82797 -77219 -225806 -337875 -256769
37163 -256769 -65201 54040 19487 -173091 -482633 -706417 -548029 6162 544543 660019
37153 660019 393034 85216 -52346 -43525 20707 38153 -101211 -366005 -531613 -447795
37143 -447795 -248417 -131660 -67829 81263 281670 385580 378026 359856 356143 319390 250441
37132 250441 167532 55822 -17486 110096 427005 642085 561519 396170 442091 621640
37122 621640 637468 448582 272249 206186 172765 174499 284449 422216 439190 378147 352742
37111 352742 255492 -60623 -392978 -409610 -225417 -273484 -562723 -604641 -240541 11159
37101 11159 -250977 -647237 -579483 -113196 180634 50978 -230611 -372417 -333220 -146216
37091 -146216 120972 230709 -26371 -455752 -616303 -405778 -161968 -113744 -93213 63021
37081 63021 189368 114786 10917 101271 243727 163361 -37164 5686 323717 525737
37071 525737 356465 6478 -239776 -345649 -357176 -199482 129744 391622 381905 212531
37061 212531 101106 52844 -21145 -63589 -25553 -70600 -295258 -423438 -176709 193573
37051 193573 209865 -83911 -209161 -71575 -88882 -390691 -528386 -248867 42617 -18570
37041 -18570 -133081 94875 423326 387763 108189 54177 230077 228897 -28010 -221578
37031 -221578 -247466 -301900 -364683 -189777 140582 238185 80949 74846 294467 272724 -196316
37020 -196316 -633422 -613964 -403056 -406900 -457842 -197006 181342 195370 -98940 -171137 133958
37009 133958 388602 300933 119650 134868 212043 100672 -113102 -187046 -153145 -226108 -369960
36998 -369960 -296519 61496 363417 293686 -13730 -184005 -118275 -57987 -156658 -256021 -183025
36987 -183025 -38462 -9359 -53899 10840 199972 350428 363152 265820 99563 -51196
36977 -51196 4395 329511 602261 403985 -199580 -664720 -634721 -314939 -87508 -50343
36967 -50343 -92110 -143949 -150049 -17315 191786 214804 -54717 -358096 -424674 -327254 -252140
36956 -252140 -145806 91867 255878 78358 -263953 -297083 75362 410524 319842 -83409
36946 -83409 -428469 -502868 -309648 32033 294712 267071 25509 -103529 6524 74214
36936 74214 -165667 -529515 -632396 -434170 -245530 -241994 -273868 -194338 -96134 -104879 -156962
36925 -156962 -143547 -118931 -193883 -336071 -452702 -577112 -771311 -909592 -803345 -539072
36915 -539072 -430256 -556884 -600087 -281911 233740 565467 575258 393480 126518 -188002
36905 -188002 -400089 -316713 6131 265880 272991 134158 24899 -48755 -181342 -388880
36895 -388880 -576531 -616249 -446362 -167953 5196 4029 17007 167672 212965 -121181
36885 -121181 -572814 -542410 53762 558300 423868 -75159 -287858 -52430 249664 306657
36875 306657 147371 -107605 -380868 -515330 -341611 51691 341550 341516 186891 99372
36865 99372 112214 94364 -44472 -232822 -305428 -196274 -39076 11428 22159 156439 305091
36854 305091 138767 -353188 -702129 -574508 -246431 -142157 -170265 54176 509080 774137
36844 774137 677950 474527 375100 340782 361597 488129 522044 151408 -470825 -755884
36834 -755884 -488395 -145170 -132059 -160746 208175 766913 912217 503205 -15723 -271618
36824 -271618 -306581 -267561 -156499 8695 86528 12628 -75794 -35896 76441 88651 -64232
36813 -64232 -253056 -285118 -133813 -24203 -194777 -557445 -743696 -556929 -209917 -4279
36803 -4279 35258 38212 -7724 -176745 -347864 -303631 -47730 203052 311469 298195 179578
36792 179578 -38490 -232492 -269451 -240969 -351343 -561930 -595990 -340388 369 221420
36782 221420 359719 523289 682543 744176 669216 434208 51691 -288364 -301701 37370
36772 37370 403644 516015 451347 413653 374063 159290 -217119 -540453 -668378 -642683
36762 -642683 -566008 -520799 -566905 -664181 -635992 -374581 -65759 -42620 -394765 -851916 -1072186
36751 -1072186 -934818 -552989 -140593 100346 96853 -11890 9310 224161 429039 382558
36741 382558 93236 -176451 -184872 43566 261838 284852 194956 208034 354387 411382 206964
36730 206964 -130118 -334650 -324090 -207600 -54215 146725 308770 259056 2970 -203104
36720 -203104 -163640 2374 49946 -54255 -137479 -102218 -28904 5351 50277 154511 222209
36709 222209 111113 -149090 -334179 -261210 2737 229953 315274 382645 566419 774615
36699 774615 791365 595924 437379 533207 798886 970054 923670 762853 612074 461007
36689 461007 252523 27821 -101665 -93380 -7865 93497 209519 326374 357099 241439
36679 241439 77492 39941 145816 222720 173325 133591 229747 302309 110827 -221564 -262473
36668 -262473 132972 544543 507199 114855 -155102 -96509 56039 84519 85743 217697
36658 217697 419383 551386 623729 700123 718086 596589 417609 305927 212828 28782
36648 28782 -156632 -156907 -32434 -53707 -262487 -345156 -82763 310247 493022 454287 423700
36637 423700 466371 444318 319969 212239 138379 -36005 -322473 -512841 -456364 -249108
36627 -249108 -48511 121258 261060 270868 97065 -117761 -194951 -140551 -66639 9392 128445
36616 128445 233699 221650 103502 -28045 -138484 -217290 -180012 15736 208225 182682
36606 182682 -31459 -197456 -194558 -118199 -60623 5461 91487 126597 77963 -7992 -101206
36595 -101206 -175259 -126155 84955 227196 15317 -433395 -662735 -491181 -241346 -207160
36585 -207160 -235618 -86552 110287 102289 -26061 -38506 -23871 -245458 -587596 -616840 -243403
36574 -243403 98854 61340 -189104 -318104 -285644 -241983 -215896 -155574 -104709 -106113 -68428
36563 -68428 54401 83488 -142632 -445455 -495835 -286511 -145804 -263504 -464538 -526280
36553 -526280 -472645 -414459 -311035 -100243 70563 -11012 -290279 -486745 -481660 -449209 -537180
36542 -537180 -623813 -524750 -279283 -57835 97057 235405 284157 109677 -200566 -351135
36532 -351135 -206897 31583 106373 -474 -140121 -215675 -208043 -109751 29404 74900 -53514
36521 -53514 -272506 -437004 -465651 -318282 -4355 293050 288990 -48976 -391602 -481625
36511 -481625 -483660 -636518 -746128 -425343 216906 565028 277683 -279516 -544606 -404826
36501 -404826 -137351 34321 74798 6208 -99817 -98306 49932 158004 58773 -127132
36491 -127132 -187784 -201310 -439931 -882228 -1107300 -809137 -224076 129719 36883 -257968
36481 -257968 -421575 -372904 -224021 -55014 115946 213722 125619 -127009 -355488 -416698
36471 -416698 -385807 -434674 -588435 -693531 -605812 -334551 -20475 157637 88897 -156306
36461 -156306 -330638 -239185 13489 101274 -158251 -589497 -855516 -815967 -637416 -568473
36451 -568473 -653844 -706522 -571442 -354925 -292242 -408013 -472652 -349021 -190506 -161166
36441 -161166 -151900 1855 172140 102815 -157749 -311335 -276738 -255783 -296443 -176325 130783
36430 130783 243220 -108547 -629109 -835340 -687462 -517892 -476632 -413745 -262551 -168043
36420 -168043 -173943 -98419 146321 356731 335232 212638 271503 532238 708561 567913
36410 567913 182542 -209607 -457523 -525599 -381365 -28369 349599 460354 227714 -77263
36400 -77263 -170334 -122140 -205637 -443966 -564598 -422381 -198949 -81740 -4250 120714
36390 120714 147989 -57165 -291298 -250533 -26054 -18141 -324333 -555007 -406668 -123621
36380 -123621 -123909 -357208 -388197 -88329 130652 -65746 -380088 -267156 256789 581458
36370 581458 340891 -90024 -167946 44290 44737 -316129 -646511 -632540 -429632 -288517
36360 -288517 -152798 117299 386773 420557 261078 139158 110650 68966 46877 182625
36350 182625 377431 316191 -57892 -369874 -308904 -94700 -191139 -648444 -1014533 -937095
36340 -937095 -601629 -419914 -463350 -452777 -249339 -60645 -75814 -163993 -134112 -88512 -236082
36329 -236082 -476280 -503150 -298011 -177359 -299109 -455088 -465222 -443592 -486830 -413569
36319 -413569 -85861 255636 289008 71583 -102587 -162077 -249822 -363220 -354386 -241874
36309 -241874 -173745 -94108 183008 523917 495974 -5649 -496358 -503039 -163773 41961
36299 41961 -40337 -161003 -146957 -119911 -200183 -267430 -147734 112545 291949 248224 38914
36288 38914 -174524 -275726 -264028 -223872 -222626 -229390 -164055 -32816 50483 21331 -29684
36277 -29684 5300 70434 41029 -25366 83637 406797 687679 688403 470760 237384 57751
36266 57751 -70666 -57171 125819 236450 23210 -354600 -485846 -283192 -60009 5045
36256 5045 94416 310499 399387 171790 -112908 -106137 103923 166465 30599 -13511 184362
36245 184362 417558 424059 188489 -107226 -286428 -290312 -184672 -84231 -41611 -36866 -67870
36234 -67870 -147439 -205505 -144076 -10008 71125 151625 396518 702164 704448 326745 -4881
36223 -4881 68425 348448 440535 317829 179740 4568 -328336 -635038 -603903 -323314
36213 -323314 -220078 -459589 -755553 -806964 -624867 -388625 -229366 -185862 -183631 -80538
36203 -80538 105303 119171 -181881 -554050 -679025 -575712 -426689 -215773 101325 287460
36193 287460 138982 -61333 89117 421622 425730 90837 -93010 19079 20124 -303780
36183 -303780 -644373 -767122 -837265 -908783 -673655 -58455 441511 415816 109647 -37187
36173 -37187 -40524 -164132 -389559 -504745 -481358 -411332 -287215 -145014 -172354 -369781 -380797
36162 -380797 -6641 369549 264389 -202656 -489392 -376164 -146997 -98511 -200793 -230182
36152 -230182 -14659 406187 725092 610984 145790 -194151 -152850 -16025 -106300 -283292
36142 -283292 -262326 -131193 -157388 -310134 -377552 -373010 -426118 -440554 -268284 -68752 -78043
36131 -78043 -170953 -90774 37299 -83941 -322637 -284518 -34484 -54061 -420375 -625069
36121 -625069 -378721 -40033 10619 -71857 7579 154525 136678 44018 90232 175877 47256
36110 47256 -248612 -438395 -466895 -515336 -612487 -580811 -415543 -390588 -645450 -908560 -821109
36099 -821109 -392661 40281 208049 87056 -225360 -588248 -783138 -646980 -311654 -103236
36089 -103236 -109592 -75640 133316 242641 7801 -309814 -297007 -54114 -37991 -305951
36079 -305951 -437943 -259680 -100691 -170961 -214232 -49481 41811 -169097 -392300 -292632
36069 -292632 -62853 -68727 -235550 -270605 -226333 -324863 -437772 -284914 -3106 27020 -175986
36058 -175986 -259600 -179532 -230281 -444385 -498241 -263997 35322 269398 516659 688616
36048 688616 543338 166692 -45732 12035 59080 12191 111651 317012 186875 -363409
36038 -363409 -755804 -562076 -111610 112887 191738 394155 538839 335646 54400 194511
36028 194511 634610 739949 294795 -238197 -439357 -386100 -261411 -12001 342964 458156
36018 458156 85956 -453407 -586775 -215388 176203 172892 -75915 -157337 9934 146803
36008 146803 123077 174667 486943 828988 852177 586351 350279 271161 211411 126226 147278
35997 147278 282371 358685 325748 302695 264267 30823 -323476 -427714 -156609 136457
35987 136457 145698 33556 69676 179622 167188 95052 90949 22311 -256955 -540652 -547842
35976 -547842 -400856 -416842 -556104 -520280 -326853 -321946 -600017 -834751 -766404 -489397
35966 -489397 -164450 200591 547230 659899 445882 98806 -161695 -317061 -400770 -335461
35956 -335461 -81483 197179 268110 69415 -240596 -401411 -244496 95467 220297 -78953
35946 -78953 -476107 -500307 -219046 -133946 -360818 -414336 -29399 302896 44584 -516349
35936 -516349 -650594 -242765 128235 119002 33340 183859 397049 435629 463563 692372
35926 692372 875973 626642 90207 -158042 106452 484156 547671 358704 212516 148656
35916 148656 -16542 -309274 -511679 -441854 -149604 180658 411923 526375 587760 647603
35906 647603 674936 613444 503540 449221 438790 334469 105993 -84060 -141556 -213922 -423484
35895 -423484 -594472 -505382 -295450 -291497 -462084 -410958 -603 360082 246631 -210901
35885 -210901 -518891 -417951 -68762 246323 387304 369970 295102 262408 262812 204423 106922
35874 106922 139940 340529 437485 172798 -281382 -476979 -264697 19185 7196 -260353
35864 -260353 -473204 -477043 -390947 -364121 -392036 -404983 -412381 -470618 -559792 -584540 -496135 -342446
35852 -342446 -188568 -64241 -4703 -36000 -67518 69223 359580 510206 299930 -55105
35842 -55105 -117887 204609 549273 577749 332279 43779 -174103 -311261 -343870 -288017
35832 -288017 -226942 -166031 -16179 173421 171192 -88388 -317348 -248705 -22398 50851 -34401
35821 -34401 -24672 156601 313351 295396 155301 -12744 -157588 -186512 -20287 236684
35811 236684 373756 345393 292171 294665 303748 319878 420128 560423 552741 311977 -25000
35800 -25000 -266846 -319247 -183529 15451 24139 -284843 -651338 -681538 -387174 -179623
35790 -179623 -273207 -432411 -433156 -408358 -510981 -573511 -420868 -256856 -368654 -624308 -644870
35779 -644870 -370526 -86459 52909 154081 247420 183716 -69527 -328745 -459042 -476837
35769 -476837 -355782 -32068 332400 414452 177087 -46865 -51404 -21589 -128466 -204769
35759 -204769 -96713 -28367 -252439 -567792 -594937 -383282 -305460 -416660 -387260 -115462
35749 -115462 49861 -139278 -436322 -488980 -324157 -179466 -79929 112327 352691 416056
35739 416056 224456 -41245 -160757 -56926 213168 491390 556387 298345 -99974 -279424
35729 -279424 -65973 349029 625987 610203 400724 145849 -124052 -424718 -668787 -716178
35719 -716178 -569496 -372027 -165439 164168 576940 740975 462434 75083 30662 199924
35709 199924 48678 -467229 -719747 -324380 269388 458546 328539 342294 509705 439704
35699 439704 70871 -224206 -260662 -254215 -329820 -271987 73400 504859 749119 766471 635790
35688 635790 397333 152845 80019 188281 256397 152145 32014 86764 251580 310971
35678 310971 176280 -47664 -184660 -127183 47442 102364 -80450 -277057 -171873 185180
35668 185180 405909 262441 -85411 -388529 -570235 -634311 -578821 -487063 -465862 -431676
35658 -431676 -214973 76356 112203 -150481 -344741 -218378 35394 128122 41252 -126544
35648 -126544 -345471 -490419 -333393 61541 272901 116239 -44560 110687 321947 203232
35638 203232 -99510 -188161 -93934 -143893 -311003 -260595 6995 101556 -126574 -379860
35628 -379860 -428670 -404753 -447898 -438182 -264411 -78135 -98667 -339650 -625545 -737243 -544573
35617 -544573 -185898 -65623 -407415 -856463 -858927 -423966 -111453 -204342 -341625 -157919
35607 -157919 146464 197957 79211 155141 454238 644595 580278 493227 580912 712027
35597 712027 682775 546706 500053 554618 523674 317381 85083 9503 73149 108327 1417
35586 1417 -229441 -469962 -516491 -163405 517979 1058063 1011630 515361 152304 207709
35576 207709 367887 275994 30784 -117620 -240233 -509512 -718436 -484462 103601 470388
35566 470388 276776 -170049 -371432 -254852 -148607 -272813 -451380 -352344 71783 476387
35556 476387 509190 228463 -3893 621 109288 190557 275761 316757 133390 -214199 -346384
35545 -346384 -109046 138899 87951 -21733 142987 383146 296985 -21523 -165947 -117257
35535 -117257 -176454 -317645 -229791 32897 76492 -115070 -119377 151796 245386 -61743 -372459
35524 -372459 -333722 -163066 -168712 -204200 -3386 288527 322722 54745 -284412 -538192
35514 -538192 -680891 -700903 -647079 -624291 -585749 -339666 94910 389368 328179 85914
35504 85914 -77145 -142663 -199376 -246015 -297740 -431732 -571633 -498498 -224870 -61830 -159869
35493 -159869 -301571 -308941 -297729 -337691 -255787 -27478 34638 -210589 -415210 -280223 -53178
35482 -53178 -102544 -328058 -422142 -423432 -541523 -663614 -525368 -225706 -117061 -276490
35472 -276490 -477312 -588479 -637877 -587695 -406975 -262573 -292167 -307781 -82181 196849
35462 196849 151826 -191098 -427922 -355265 -160457 -52189 -32018 -36218 -28798 41188 160666
35451 160666 188527 52337 -115116 -205470 -286781 -324853 -68659 467160 744443 374844
35441 374844 -221535 -331690 94597 525088 677355 692227 627067 400078 176383 206610
35431 206610 311395 118554 -220355 -192708 180883 295035 -93944 -533010 -644432 -583430
35421 -583430 -509622 -247307 213642 444727 169172 -320589 -631009 -723399 -656576 -355500
35411 -355500 71652 249752 78798 -75945 -11333 -17722 -273497 -437899 -251747 -43882
35401 -43882 -167049 -377367 -290214 -63896 -88455 -315838 -430595 -408703 -398377 -313425 -51237
35390 -51237 145487 48693 -106758 -50962 -36059 -355602 -620109 -265525 406816 529776
35380 529776 -17353 -424687 -200018 192627 218656 96631 311108 806271 1133908 1130653
35370 1130653 1086284 1370951 2064441 2807688 2995111 2368846 1414044 829031 639933 306556
35360 306556 -286110 -567006 -219696 233068 184659 -207813 -407037 -337183 -305137 -345645
35350 -345645 -209406 107656 326376 349267 336043 316428 135863 -157651 -253680 -45200
35340 -45200 139975 -41313 -474821 -700440 -409712 264049 883534 1066408 758922 221676
35330 221676 -231493 -462652 -510688 -473894 -435518 -403412 -264587 88638 522680 701338
35320 701338 474870 88970 -134492 -178098 -210601 -237078 -126865 77276 150115 363
35310 363 -219868 -352966 -400073 -417798 -418555 -406680 -368722 -220131 76676 339741 310594
35299 310594 10433 -240496 -225004 -65098 23520 18453 7290 -9638 -64627 -86724 6320
35288 6320 141621 163027 38719 -109935 -159439 -93026 -7515 -59424 -307279 -543266 -428282
35277 -428282 71048 519848 485178 67776 -267686 -322388 -332136 -499645 -684358 -689712 -578805
35266 -578805 -485962 -319605 76446 577708 867020 828004 611511 340423 18566 -246020
35256 -246020 -230587 60751 296150 238578 66930 65831 178396 143784 -39825 -115395 -7594
35245 -7594 59443 -51651 -176544 -147744 -71581 -144420 -365946 -584695 -677949 -558320 -182294
35234 -182294 283856 491615 314864 63029 48705 108640 -120689 -559805 -720800 -409454
35224 -409454 -10075 59885 -137425 -271609 -206897 -35954 153682 310807 339862 207241
35214 207241 60217 59204 140035 102045 -99293 -290876 -306188 -159608 15711 137947
35204 137947 261747 481783 729273 746962 407760 -1538 -51553 259025 483993 369588
35194 369588 198666 299548 512420 460244 148794 -59862 22579 225230 309141 166925
35184 166925 -209437 -684403 -958257 -868259 -651276 -621473 -674490 -465735 -19023 264373
35174 264373 217032 90046 60338 6695 -94872 -23616 227278 303929 87682 -9011 286659
35163 286659 562881 336215 -124785 -169366 240718 521906 396042 219426 303168 453025
35153 453025 386273 170643 3026 -114023 -234181 -278851 -214270 -181210 -234096 -182855 67001
35142 67001 233709 6930 -476081 -801106 -828359 -773775 -783845 -738332 -521830 -237020
35132 -237020 -53653 -21616 -104877 -240363 -301766 -178725 19602 11354 -285378 -584320
35122 -584320 -593633 -406179 -320126 -375122 -339305 -143836 -32863 -173697 -363546 -312807 -58500
35111 -58500 119530 100418 16239 -19513 -46757 -84319 -28068 161955 305075 175799 -199216
35100 -199216 -522220 -515959 -196246 153097 266050 147730 26067 61717 175247 193539
35090 193539 76367 -84519 -209458 -259469 -191001 -23582 98597 69294 -577 49533
35080 49533 121349 -35650 -374077 -474421 -68141 557049 863832 681343 353819 306695
35070 306695 571902 758092 486987 -125131 -507603 -275297 278033 551267 415025 276327
35060 276327 365779 407796 179928 -39260 62538 241527 31012 -504926 -814957 -621763
35050 -621763 -228875 -27036 -53646 -141650 -202302 -204595 -81658 183008 480199 668857
35040 668857 670068 468328 149232 -64821 18331 313665 512601 429912 190976 46260
35030 46260 103040 266074 355518 267463 80196 -22576 6301 -6602 -188226 -368913 -278979
35019 -278979 60588 340390 339960 123765 -124279 -268452 -217752 39730 340754 444074
35009 444074 287179 36349 -134330 -183684 -117884 70031 314730 457133 386258 150113
34999 150113 -95546 -208511 -156225 -41500 15367 51888 205693 429652 462453 228261
34989 228261 48564 210542 500112 470747 64548 -348103 -466108 -281064 111767 570196
34979 570196 820101 687292 410454 370996 533803 542487 338751 217289 237874 115236
34969 115236 -179516 -261106 -14705 82868 -328646 -899860 -1072740 -808738 -420576 -16994
34959 -16994 427561 705434 567269 157901 -142632 -221121 -238949 -260892 -221728 -164084 -177799
34948 -177799 -178292 -39281 142795 190479 134387 88816 -3097 -186471 -233050 55989 426612
34937 426612 471996 254750 178992 302961 278264 3447 -168091 -15150 193107 129511
34927 129511 -144742 -370971 -448233 -404582 -249090 -32199 126145 190944 225979 199125
34917 199125 143 -291578 -423570 -338296 -249540 -256986 -188995 36212 210927 189522 141652
34906 141652 229174 312129 241164 181519 328403 508134 412192 88750 -143268 -172433 -144016
34895 -144016 -100233 54868 223651 125832 -244124 -483006 -287891 115044 252163 -16244
34885 -16244 -385782 -516833 -378194 -164145 4711 193944 463369 655642 518869 78574
34875 78574 -270756 -205451 88170 135241 -179112 -438722 -275397 109081 212584 -99260
34865 -99260 -449054 -467769 -229703 -79647 -192196 -444133 -634792 -676002 -577179 -375597
34855 -375597 -125841 108051 282617 371301 351907 250281 156019 107279 10721 -183857
34845 -183857 -277039 -19923 445875 633218 350172 23360 112371 427371 415993 10036
34835 10036 -282894 -170566 17823 -85114 -309726 -286063 -58466 33691 -81148 -173834
34825 -173834 -174501 -252783 -407901 -376917 -94372 95342 -86178 -414611 -481579 -288527 -205695
34814 -205695 -385939 -534277 -345392 61342 297262 171557 -143800 -361308 -365261 -258332
34804 -258332 -207669 -263825 -306309 -189475 39445 140332 -27513 -279339 -295098 -8782
34794 -8782 333706 505249 515243 451207 302684 79191 -63374 -17288 59912 -52345 -281485
34783 -281485 -360928 -267763 -268079 -454559 -531862 -234580 269482 606833 655443 546855 363159
34772 363159 111747 -80459 -46781 145221 255199 218543 183442 184076 73192 -134949 -161721
34761 -161721 121222 434769 474794 338549 310143 397187 390856 280871 274637 419074 510584
34750 510584 418379 231586 40646 -161753 -297060 -200179 76197 217018 64848 -149596
34740 -149596 -176664 -111287 -154649 -235269 -181005 -112544 -290544 -619332 -688742 -376353 -65432
34729 -65432 -113706 -384935 -517187 -444406 -384660 -416925 -360291 -109419 137688 127979 -76100
34718 -76100 -143822 92798 400300 445925 250858 157253 339615 568420 572494 433474 406808
34707 406808 488446 440577 211728 44730 112561 287033 361321 300320 165333 -20348
34697 -20348 -194359 -203024 12749 285033 414330 408558 395617 389037 299826 133339 19945
34686 19945 50519 188860 343543 437883 417729 282521 128532 98210 245820 452825
34676 452825 485972 184617 -348277 -767583 -794887 -509700 -233848 -133033 -85281 24294
34666 24294 84194 -24579 -150307 -41029 247125 339348 17152 -442470 -543763 -160035
34656 -160035 284425 288942 -147059 -561030 -623075 -482976 -421978 -397179 -200691 74146
34646 74146 93850 -190520 -443338 -462669 -459455 -651717 -885257 -895328 -708875 -528175 -399231
34635 -399231 -256413 -141949 -111272 -45984 159876 327917 210393 -75978 -143249 122994
34625 122994 397803 374873 155881 52823 152825 230100 57626 -287145 -481293 -339539
34615 -339539 -65346 14821 -75231 64 326640 533815 340701 15097 -16819 208133
34605 208133 326313 247204 200785 248824 176788 -82293 -285748 -237443 -10961 257559
34595 257559 515241 656023 527896 187278 -101266 -215292 -285870 -385996 -388192 -248559
34585 -248559 -147890 -181552 -165802 38420 221115 84663 -318592 -627203 -588104 -284567
34575 -284567 5645 82790 -5229 -36250 88726 186964 87585 -20270 163221 485712
34565 485712 439079 -79004 -526635 -469345 -180029 -161941 -405251 -534024 -459373 -419754
34555 -419754 -478452 -430439 -206925 5805 84438 86327 27908 -138192 -291833 -219635 6797
34544 6797 51977 -169002 -316861 -141781 129119 163936 40047 70438 263814 310865 94033
34533 94033 -109625 -32877 208108 300456 154178 -40504 -119117 -128790 -170487 -192923 -66304
34522 -66304 176669 310413 188069 -40651 -90227 105935 323210 360687 301198 342384
34512 342384 451232 380195 63411 -192426 -69098 311607 501087 284430 -71312 -197337
34502 -197337 -73763 32926 -45094 -225575 -347547 -328879 -169245 66514 264165 353451
34492 353451 356515 259677 -58240 -590927 -992331 -885738 -402392 -112475 -306024 -615833
34482 -615833 -541174 -106414 266924 375843 395737 474959 498766 338791 95548 -45220
34472 -45220 -58461 -69031 -190486 -452556 -784908 -990641 -860036 -450233 -157303 -313746
34462 -313746 -730644 -850986 -429532 126190 241489 -127909 -486228 -438160 -117437 69346
34452 69346 -64513 -362992 -573180 -581892 -460347 -365572 -367804 -342099 -107659 292327 570557
34441 570557 526010 268597 24820 -132962 -231947 -233424 -123899 -54923 -153471 -257670 -92203
34430 -92203 307792 590992 531674 256226 -10337 -200312 -323191 -329690 -193756 -21884
34420 -21884 32580 -71992 -222380 -230601 2092 327390 435253 214914 -72119 -141148
34410 -141148 -71011 -97715 -156556 9668 331107 416572 150131 -115861 -109858 -12285 -73373
34399 -73373 -203330 -218425 -217241 -389165 -627043 -638809 -350640 37963 321010 422882
34389 422882 363818 254842 240207 330907 415225 495176 685792 879791 726096 154977
34379 154977 -378161 -457049 -237758 -99875 -55347 80338 184111 22759 -183041 29449
34369 29449 585191 858386 555036 110037 9624 153505 151701 -93333 -391362 -592298
34359 -592298 -635818 -475301 -207181 -114981 -348002 -683115 -808707 -710392 -563967 -381378
34349 -381378 -26893 470048 863366 965562 807948 528934 251185 65664 -6084 -50886
34339 -50886 -157819 -274975 -275244 -150059 -19854 40324 57725 46953 -6240 -13911 181928
34328 181928 538142 722781 473966 -31281 -357841 -341468 -240104 -325842 -535687 -644508
34318 -644508 -609007 -549107 -486885 -322985 -60295 138374 151282 18904 -158907 -315434
34308 -315434 -386976 -329266 -197582 -86988 15485 166954 264153 131250 -133578 -167912
34298 -167912 147338 434137 293627 -162020 -524122 -674358 -816907 -993405 -955580 -610402
34288 -610402 -267020 -244543 -438177 -489210 -270289 6424 113493 38827 -121537 -310054
34278 -310054 -450662 -392547 -88017 226766 232361 -56089 -264365 -147324 95269 160075
34268 160075 104726 194798 411656 470870 320200 243587 373980 453105 256292 -36535
34258 -36535 -119427 16232 160895 200792 141442 -2711 -128867 -32175 303600 566530
34248 566530 496451 241471 101157 94650 61137 20010 100056 218854 165629 -50615 -224156
34237 -224156 -263773 -214614 -63274 184386 332305 232112 100943 239140 511762 523901
34227 523901 265905 117106 183161 129669 -198176 -469007 -393113 -148589 -35984 -66301
34217 -66301 -145885 -324538 -564836 -582079 -260584 24672 -128234 -551721 -748809 -596116
34207 -596116 -426739 -475000 -611552 -654393 -620606 -578883 -492184 -322661 -144522 -63920 -112566
34196 -112566 -250136 -389475 -421065 -308413 -156415 -93509 -99058 -48769 78324 150552 54670
34185 54670 -181847 -458246 -688966 -781233 -625455 -217854 231875 435942 335391 198907
34175 198907 303551 544058 523758 94143 -370236 -398819 -15228 309003 243881 -81582
34165 -81582 -359371 -461861 -433104 -320282 -164744 -50928 -22979 4550 159101 445917
34155 445917 709239 747709 490964 107000 -120297 -108060 -97658 -325927 -652554 -722198
34145 -722198 -459930 -155026 -35459 -34430 -62575 -227847 -598710 -950650 -968441 -608585
34135 -608585 -118064 216413 241969 3358 -239394 -191551 136287 387551 293856 16690
34125 16690 -103399 -3982 97467 63751 -29259 -85659 -99475 -59753 66341 211060 222731
34114 222731 75306 -56327 -18073 104457 94475 -92640 -253381 -222985 -142862 -283423
34104 -283423 -606280 -723859 -427115 -49489 -48705 -355619 -480730 -241690 4347 -50195
34094 -50195 -228085 -239543 -160480 -221968 -351618 -291278 -57908 70636 6132 -37266 73681
34083 73681 171495 59884 -185951 -313695 -185035 107635 349769 390384 269325 164951
34073 164951 181546 244951 274091 347110 543346 709043 613005 325951 189216 334939
34063 334939 486999 386471 182831 156777 222581 49599 -355103 -562210 -336140 3746
34053 3746 77522 16495 178208 474462 456759 55974 -261548 -217007 -123989 -296671 -483017
34042 -483017 -304000 62215 138611 -95966 -234807 -140249 -79193 -153065 -124864 69849
34032 69849 130835 -90547 -307440 -270590 -160685 -238627 -407849 -408534 -213640 24730 225976
34021 225976 358353 357524 261132 227735 256470 129368 -183180 -340062 -101755 273805 398314
34010 398314 295302 263505 378086 455642 404275 316749 283781 333958 470672 596312 535445
33999 535445 294530 122159 156391 243521 274065 391671 631442 695732 417548 116504
33989 116504 108364 183827 20304 -209778 -177909 -64603 -260412 -596918 -553455 -137214
33979 -137214 128263 70622 29921 113728 16077 -277929 -330985 -54944 1797 -479045 -1028003
33968 -1028003 -1102949 -836674 -630169 -475606 -187338 74589 45054 -144395 -186144 -104939
33958 -104939 -102393 -100609 96140 342400 323171 90017 -21170 42377 1785 -224485 -353482
33947 -353482 -184899 117898 308487 362017 385655 422400 454754 474667 473353 438991 384405
33936 384405 316798 213599 96563 58088 124711 184296 153022 110412 149861 213970 218195
33925 218195 210406 241132 200955 -18990 -311468 -496640 -575098 -625190 -564229 -283637 41498
33914 41498 74421 -232265 -554185 -609617 -455200 -323667 -345229 -483316 -605372 -573218
33904 -573218 -366504 -126365 5638 47684 80579 84506 26486 18258 187206 445050 579121
33893 579121 523822 360092 135542 -90622 -135231 71775 213838 -78665 -621892 -801978
33883 -801978 -388168 160835 344704 201100 34886 -63113 -119898 1704 399344 795767
33873 795767 773928 309985 -198431 -403242 -280068 11038 285489 359833 150347 -202266
33863 -202266 -452170 -508033 -459415 -382261 -272340 -151247 -75411 -30215 50547 154373 196829
33852 196829 152396 70206 -16434 -83890 -63886 70489 202219 195238 82294 -18708 -114352
33841 -114352 -268780 -374291 -230565 130326 426410 478553 373692 239122 87564 -45270
33831 -45270 -52887 43238 72417 8686 49046 257119 389419 282042 160404 291369 535795
33820 535795 572071 414232 348853 439863 468987 354154 259862 245165 153013 -51046 -161856
33809 -161856 -108159 -138592 -421509 -709324 -667558 -376379 -227949 -392163 -626289 -626983 -408410
33798 -408410 -282212 -510541 -973607 -1204089 -870560 -233115 76642 -194869 -620130 -687515
33788 -687515 -457601 -353478 -479598 -525373 -316748 -94514 -136235 -373710 -539634 -508085
33778 -508085 -339077 -126534 39916 55076 -97105 -245553 -170271 134100 400939 337502
33768 337502 -76415 -543419 -716827 -527986 -230177 -108571 -195080 -306323 -301144 -220332
33758 -220332 -196262 -291264 -415023 -379102 -95945 244440 310236 22388 -313492 -394317
33748 -394317 -301959 -322999 -521821 -731715 -860710 -909899 -761982 -316037 164520 241678
33738 241678 -62837 -224886 18616 272667 126386 -192400 -204895 65712 209499 136815
33728 136815 163912 417553 623684 568881 381752 236049 107091 -35887 -84655 -105
33718 -105 66656 6482 -93250 -139713 -173507 -209545 -162528 -55764 -75264 -264273 -382132
33707 -382132 -238872 27091 173814 161193 65339 -93800 -246087 -220609 -29600 22604
33697 22604 -228714 -499789 -478987 -314091 -309928 -368614 -197010 89441 111384 -84114 -50872
33686 -50872 288524 477211 282869 69577 151016 273238 97921 -209635 -284538 -144808
33676 -144808 -55345 -38253 79847 294550 464396 596812 761975 840524 672443 350378
33666 350378 79438 -125672 -328117 -435786 -405834 -478219 -805071 -1039109 -776728 -269011
33656 -269011 -127692 -381904 -453380 -125298 128150 -16824 -205482 -75237 99739 -88685
33646 -88685 -452677 -512011 -251433 -51740 -39547 -15331 52597 -52740 -371527 -674384
33636 -674384 -847128 -1006161 -1157450 -1088954 -742179 -406457 -362949 -529500 -620834 -511876
33626 -511876 -290683 -69196 95007 143421 29242 -196359 -380816 -385399 -205252 18597
33616 18597 117188 41007 -119189 -250127 -299789 -245496 -86569 82266 110571 -2056 -54783
33605 -54783 79347 246212 240921 129729 117200 167078 33302 -329375 -671402 -828731
33595 -828731 -913135 -999675 -913623 -551918 -182381 -123292 -268977 -261661 -67421 -28461 -314312
33584 -314312 -664481 -795096 -755398 -697276 -568855 -305629 -115359 -234152 -502372 -533729
33574 -533729 -289485 -134533 -256070 -368674 -172968 164518 241237 -24307 -307033 -284013
33564 -284013 52684 449072 609772 406513 -3013 -292028 -295569 -175534 -174011 -296592
33554 -296592 -372878 -348236 -332540 -373806 -362796 -226379 -99549 -191073 -481735 -650367 -406375
33543 -406375 111203 427132 306671 51317 54494 300286 600728 1062957 1835515 2643908
33533 2643908 3324541 4679735 7671850 11408013 13118582 11108551 6976714 3822195
33525 3822195 2783433 2553261 1920483 1228668 1107357 1207180 935061 500653 438031 683391
33515 683391 812733 768662 762764 777742 658552 441984 221471 -45624 -304141 -312704 -73162
33504 -73162 34897 -154147 -290590 -129065 22187 -117134 -246733 -29819 234124 80466
33494 80466 -298833 -336943 14155 281799 241508 126488 131850 205312 295874 383423 311556
33483 311556 -18458 -358390 -387372 -181827 -54496 -57297 -33634 -25827 -193266 -415980 -410341
33472 -410341 -183772 16247 129897 269273 365230 250426 34145 -19311 60823 24846
33462 24846 -129465 -169597 -64848 -3698 -11103 53560 158256 152688 97811 130391 93782
33451 93782 -218832 -537964 -396958 72155 227923 -110357 -399858 -271803 -82843 -236463
33441 -236463 -472500 -291910 244086 609322 545809 300539 172773 147021 51380 -103091
33431 -103091 -89465 209251 532875 474731 23240 -342632 -249738 93704 242382 117597
33421 117597 -38640 -134262 -281846 -477742 -579974 -557568 -470004 -292437 -55116 -7734
33411 -7734 -285848 -555488 -392390 102849 478890 585777 596299 522438 258257 18581
33401 18581 129171 380005 210905 -376003 -709847 -426681 28873 118687 -89004 -223772
33391 -223772 -180106 -67394 74188 228693 317645 338082 360473 312170 58070 -252363
33381 -252363 -278364 -2761 222997 230359 230166 358029 442776 367848 265144 204931 81331
33370 81331 -56801 38525 376605 631979 624631 505686 350354 14796 -438346 -631682
33360 -631682 -415007 -114118 -29782 -73547 -87165 -115024 -154877 -43001 196031 269340 80035
33349 80035 -115178 -173339 -253251 -368028 -247980 114038 286685 71287 -125551 69608
33339 69608 419972 498529 297641 67941 -97237 -186097 -115290 40401 -5925 -306953
33329 -306953 -525572 -459300 -322562 -277566 -155694 73889 74909 -259006 -488338 -314967
33319 -314967 -75453 -93999 -75868 289457 613272 376971 -153023 -297676 -2779 206102
33309 206102 144548 130691 267247 244598 -36751 -210187 5779 405340 622531 570265
33299 570265 402241 240947 81290 -114660 -283953 -240328 123646 608984 853692 740547
33289 740547 475528 250902 82501 -10005 12589 236 -252563 -607648 -712526 -582853
33279 -582853 -589974 -781067 -751536 -358337 6068 81490 111352 277125 352870 250465 304303
33268 304303 615480 708133 302744 -136007 -138336 18540 -139897 -463736 -499665 -236300
33258 -236300 24304 174456 189296 -83937 -540526 -674348 -323021 -59043 -287109 -501113
33248 -501113 -104517 553293 722258 389755 77605 -117677 -453279 -807911 -845222 -691264
33238 -691264 -690350 -708603 -429546 -112371 -273487 -791997 -1088717 -1030173 -926563 -829845 -595265
33227 -595265 -441699 -646184 -851608 -510514 122877 303884 -6967 -154050 58563 154075
33217 154075 -26328 -47169 233991 349389 48994 -267469 -207443 112162 407089 543376
33207 543376 413104 18905 -274619 -107176 275818 347250 137387 100623 244757 153536
33197 153536 -153802 -200961 54966 129651 -79591 -108655 176254 301240 45462 -177987
33187 -177987 -79103 78202 87965 162982 375634 387037 69993 -185986 -113495 39299 45844
33176 45844 79163 248839 294924 72850 -130266 -71059 83718 120339 92406 61739 -50511
33165 -50511 -169519 -54343 262179 458833 467458 547329 717269 658435 329358 119501
33155 119501 203955 282716 151406 -1763 -55659 -170326 -341195 -279407 41709 230319
33145 230319 75290 -176063 -287947 -277607 -86850 400728 891034 862068 371034 28368
33135 28368 22661 -89379 -427088 -466237 -30641 228735 -152133 -689819 -763963 -530915
33125 -530915 -436894 -421573 -250137 -122660 -283447 -440165 -222304 128892 149927 -72520
33115 -72520 -132130 -43611 -124446 -312024 -217955 192023 512831 519903 438434 522628 697464
33104 697464 727069 545104 324124 273564 393891 479546 433242 440629 627238 711999 372961
33093 372961 -148839 -289637 -3262 156541 -114192 -455939 -460936 -224198 -38381 54934
33083 54934 144162 197207 167433 112352 66152 18474 59510 265997 452384 379675 189159
33072 189159 232707 489522 582609 370829 85012 -111378 -246632 -265911 -108856 -660
33062 -660 -163299 -333752 -118211 311819 494888 468519 554029 558701 96878 -424105 -202494
33051 -202494 542847 693752 -24920 -578662 -281052 203397 77927 -370741 -473185 -272064
33041 -272064 -187290 -225290 -184982 -136678 -152775 -44092 202034 235260 -40842 -231913 -158144
33030 -158144 -156950 -353698 -347295 -9742 147724 -143645 -402783 -258864 -77502 -193539
33020 -193539 -250332 91170 451305 372474 84499 44857 253159 540920 969513 1425092
33010 1425092 1412882 797681 191087 93585 214508 119868 -51948 -16878 118817 234173
33000 234173 498694 856968 865149 475286 258913 406068 325222 -235622 -568314 -178689
32990 -178689 289816 105381 -359568 -351103 23522 164180 31659 -23580 -28100 -200849
32980 -200849 -388701 -335918 -129215 122959 543082 975859 889442 271253 -122596 62292
32970 62292 195959 -150185 -365455 90975 647268 568669 139911 -5244 32560 -80106
32960 -80106 -83868 249418 406916 25627 -237164 251357 887635 744240 53068 -325115
32950 -325115 -324861 -443581 -602693 -382196 854 4932 -270089 -338638 -175180 9264 348674
32939 348674 871375 1042300 597200 208945 458256 836281 691822 405208 587805 887704
32929 887704 727161 482787 717596 950337 485501 -179674 -133374 333934 274889 -234377
32919 -234377 -349463 -7222 128409 -46339 -108563 -116270 -377834 -560134 -203256 263830
32909 263830 195169 -34113 317156 938473 996591 630709 583338 758657 526269 93556
32899 93556 176677 605390 626014 316653 348935 611131 430170 -64933 -142104 168088
32889 168088 196170 -64781 -22486 337166 508531 480324 589674 665375 383665 82388
32879 82388 168193 231536 -159479 -429618 49050 685883 645087 342563 586053 986318
32869 986318 713582 116037 81154 509173 884891 1493784 2510022 2885155 1905583 825596
32859 825596 1034483 1666400 1152182 72374 63322 809781 729059 -56138 -108654 484939
32849 484939 371548 -333465 -256535 517273 577990 -98569 -154746 526372 721690 303731
32839 303731 303902 662577 376404 -267400 -64367 718870 788756 319006 472151 901746
32829 901746 426067 -346796 56558 1003884 765193 -124402 209261 1298988 1111113
32820 1111113 -34414 -58013 825996 593880 -434034 -79602 1362415 1659474 1245462
32811 1245462 2570974 4935242 5015153 2785903 1711967 2602864 2671708 1308704 1108234
32802 1108234 2278020 1931163 64138 114425 2247403 2538346 412521 42588 2393362
32793 2393362 3162931 1082240 577224 3163777 4264858 2214288 1934258 5349662 7185351
32784 7185351 5460152 6383863 12408623 16096994 14308879 17064788 30824552 44718497
32776 44718497 50385729 67268771 125705110 222171039 307897903 328603671 268433823
32769 268433823 156926599 45946590 -20339485 -30160096 -8989654 6733999 4470186
32762 4470186 -1502224 1128407 6148550 4431884 40355 826587 4216424 3431499
32754 3431499 146024 333928 3031801 3066738 932124 951437 2652021 2212066 181518
32745 181518 209111 1873571 1711237 -54043 -212653 1194098 1300553 104411 159928
32736 159928 1384344 1378063 258561 287760 1280649 1028703 -236364 -245377 910127 1023262
32726 1023262 2589 -200903 491988 378359 -379212 -36577 1087570 998620 -151228
32717 -151228 -271763 776326 1060578 277390 86973 709199 574845 -459121 -782473
32708 -782473 -149510 -49657 -726864 -799082 -99239 1954 -617414 -552878 316493 517318
32698 517318 -169806 -274661 533046 834864 181854 -138817 376707 604411 79671 -181748
32688 -181748 231326 412823 96792 195540 811879 817843 20133 -310193 288051 661342
32678 661342 194696 -166797 194962 491977 154828 -138138 117080 307154 -37205 -391408
32668 -391408 -332690 -240640 -345835 -275289 7929 -8877 -321501 -315522 21261 31350 -293156
32657 -293156 -234382 252999 437663 255868 420167 904945 827258 99373 -309106 -79741
32647 -79741 -17016 -447673 -647808 -312281 -141567 -454122 -586991 -203297 107073 36146
32637 36146 92140 429222 406504 -152623 -470136 -130943 236331 112120 -149150 -172058
32627 -172058 -148748 -175459 -13127 176863 -93270 -588510 -510499 79216 236249 -217891
32617 -217891 -361293 174837 600490 457783 336550 570320 581312 135941 -74103 234743
32607 234743 329687 -111333 -284240 231878 563953 85090 -373279 64970 785917 750048
32597 750048 199164 86021 480760 717314 639771 631619 727330 601069 216124 -201383
32587 -201383 -574663 -825874 -681452 -134967 301090 283879 150722 305114 578994 654461
32577 654461 608526 568665 342972 -112646 -359510 -122673 182482 68206 -303763 -491212
32567 -491212 -457425 -428514 -434141 -414623 -445042 -485688 -262415 262754 656894 575172 221381
32556 221381 -20385 -69657 -33569 30990 30489 -132162 -282876 -117657 276022 467583 323849
32545 323849 116406 -57252 -388914 -811643 -947872 -739812 -541336 -469429 -285324 -18601
32535 -18601 -19572 -248281 -226234 123807 309559 132366 -20530 44084 20942 -176129 -179490
32524 -179490 71406 133782 -69902 -17645 427802 667874 432749 311670 671788 901036
32514 901036 409289 -352682 -616698 -434121 -347351 -425378 -363493 -168262 -64832 3145
32504 3145 209784 423138 419329 288085 243206 288421 379182 590477 829706 754198 287028
32493 287028 -150215 -214935 -87191 -68945 -127386 -104963 -10370 135728 380422 596199
32483 596199 557990 365330 318933 326664 25032 -442718 -485601 -51207 218145 38555
32473 38555 -122316 -7862 -62189 -515386 -814096 -533506 -130748 -177902 -468225 -484959
32463 -484959 -207662 105485 417135 676522 600737 172462 -153040 -156340 -196640 -453441
32453 -453441 -508949 -159262 88258 -102406 -242163 103538 484552 348227 4282 17386
32443 17386 215298 131201 -72541 25795 242794 141368 -110768 -56266 182311 144142
32433 144142 -113217 -156829 36526 140831 120343 150884 115498 -191486 -572727 -725384
32423 -725384 -770655 -916931 -927601 -558289 -177501 -245687 -489601 -346193 47163 103838
32413 103838 -180770 -270249 -37320 128807 110238 181915 337357 226275 -159875 -395429
32403 -395429 -310823 -192026 -197620 -122175 137547 350942 318003 107729 -126220 -270227
32393 -270227 -221986 -24606 72202 -28892 -40246 250973 538788 433506 96617 -38604
32383 -38604 38458 21867 -93052 -46427 155688 271811 281420 312191 232995 -155859 -617523
32372 -617523 -687105 -333215 59872 285572 409736 372493 23545 -473740 -749255 -715832
32362 -715832 -545131 -262999 171926 509669 453572 195256 186640 425291 487356 245531
32352 245531 25335 31658 124059 194217 281438 272699 -32571 -493006 -707710 -589647 -426222
32341 -426222 -325906 -80554 312756 462247 123905 -413829 -692865 -585643 -289619 -39443
32331 -39443 49551 7111 -36633 1053 78957 170652 337441 534957 545961 299026 45246
32320 45246 -357 41119 5362 -14529 40651 -70811 -476842 -812745 -709391 -389322 -281837
32309 -281837 -297948 -56384 354993 461679 177363 -74014 -5764 250929 491222 604548
32299 604548 451102 35850 -251207 -38366 445694 661306 533137 416782 391419 194047
32289 194047 -159076 -318023 -230733 -217044 -301789 -94122 469938 850783 660113 206277
32279 206277 -20992 8177 53507 65062 102416 74462 -83457 -155477 101928 547264 778468
32268 778468 656706 478633 554838 763309 688890 209345 -261477 -292576 -29528 60285
32258 60285 -62650 1244 312009 392287 47299 -211444 30654 401364 372044 99164
32248 99164 27405 66599 -139749 -441148 -410491 -121659 35331 126239 487719 904787
32238 904787 801362 236584 -99947 47259 220613 143446 98880 209456 107554 -350329
32228 -350329 -705851 -611282 -365232 -364100 -498346 -467017 -294017 -182166 -171135 -216843 -318753
32217 -318753 -359030 -127716 302117 540098 393731 110243 -36089 -62460 -43859 77199
32207 77199 264062 294012 86052 -141915 -183221 -67041 95753 212508 120091 -275053
32197 -275053 -723341 -837438 -609388 -381764 -307484 -235036 -120248 -89994 -75207 121156
32187 121156 347334 239192 -86943 -83537 317014 469442 -12998 -625611 -689040 -230796
32177 -230796 234513 402087 271688 -95459 -517156 -661792 -431827 -155785 -128468 -210689
32167 -210689 -139717 36039 108692 50636 -61594 -235092 -425002 -432097 -185216 51034
32157 51034 -38434 -461477 -955903 -1208665 -1009402 -468025 -108391 -368658 -933295 -1005518
32147 -1005518 -386867 209530 167799 -211008 -266845 80190 417155 548440 610858 644107
32137 644107 507248 184295 -159651 -408806 -556770 -597772 -549679 -510613 -535618 -544940 -474165
32126 -474165 -397049 -393733 -429889 -451036 -446034 -359230 -126238 152448 287573 290251 334560
32115 334560 397984 252992 -99456 -323356 -218214 7735 94106 75623 103113 170262
32105 170262 188053 131198 3509 -144985 -139118 116896 353005 192684 -278511 -590901
32095 -590901 -571586 -497877 -498389 -327147 75523 310388 100861 -270021 -398496 -276250
32085 -276250 -104774 55850 193708 220910 164309 176292 219387 118470 20112 285597
32075 285597 769601 813471 231177 -325532 -348002 -166800 -199270 -172274 248409 621905
32065 621905 328821 -360459 -621661 -275824 96782 126159 23825 5453 -3328 -6260 177928
32054 177928 544515 814455 800989 569154 241376 -71064 -210662 -143527 -95270 -233344
32044 -233344 -357016 -217557 28906 59141 -88881 -132608 -58766 -91070 -227754 -234868 -68421
32033 -68421 72640 90750 58902 -2902 -111387 -159299 -69445 9693 -30744 24667 359133
32022 359133 665536 504622 -302 -313700 -264863 -177938 -247082 -297558 -234682 -249997 -440790
32011 -440790 -615811 -622022 -538753 -434550 -239493 26030 167985 74231 -157840 -395414
32001 -395414 -563864 -571739 -383360 -157299 -72034 -50969 78949 224553 143960 -119050
31991 -119050 -272849 -242204 -234096 -325139 -358465 -305299 -353523 -537108 -628404 -525815 -426014
31980 -426014 -469356 -514503 -421134 -279124 -188418 -66547 141667 293530 289916 290475 460458
31969 460458 643264 531723 116607 -253647 -295205 -113177 -6850 -43994 -12212 165991
31959 165991 202792 -125645 -479063 -303135 307801 594357 172807 -407980 -505040 -298445
31949 -298445 -337040 -557954 -471247 -131916 -137350 -603374 -874327 -487180 175808 513554
31939 513554 497390 464336 489934 380591 90287 -199590 -321190 -218760 91818 486343
31929 486343 747333 752013 576627 359947 179859 90496 114294 157114 103961 22978 75559
31918 75559 209616 187501 -40809 -262754 -368602 -496888 -699496 -765397 -564555 -305720
31908 -305720 -226365 -234499 -98576 164393 332710 312570 215384 164969 197158 300583 418793
31897 418793 455822 382044 279681 214012 155723 107266 174114 385092 556695 492819 248634
31886 248634 47729 -10083 -6042 779 61026 180378 222746 81264 -112339 -84731 229583
31875 229583 534516 480972 91831 -262007 -312752 -144450 62277 298280 558060 614376
31865 614376 275167 -208023 -323474 56662 492214 542072 284945 117323 201908 319045
31855 319045 209039 -108230 -386333 -441970 -338149 -279745 -361708 -475834 -468016 -303963
31845 -303963 -47627 219001 389032 360152 170747 -2382 -89886 -240493 -538725 -757941
31835 -757941 -616021 -187731 172139 264304 171366 -5882 -262884 -511408 -544337 -291523
31825 -291523 47292 212293 124817 -105331 -294109 -288605 -79002 176087 326070 400865
31815 400865 499479 570232 464373 174954 -140289 -350417 -417633 -323796 -107924 64975
31805 64975 58299 -47953 -97393 -112995 -196782 -256805 -114086 159835 318328 339134 407366
31794 407366 472261 220987 -355123 -741456 -518865 45536 311676 24426 -486285 -757252
31784 -757252 -618205 -233773 70909 43288 -272886 -535395 -433689 -24530 337191 384902
31774 384902 180049 -22304 -60622 17333 79840 75467 27323 -84892 -311163 -564977 -607252
31763 -607252 -310768 142655 444432 466528 280487 -17005 -319995 -437588 -237075 126338
31753 126338 318936 215566 29043 9888 154821 280744 284645 238026 248927 296174 255513
31742 255513 108152 28635 137016 248695 113264 -124270 -43790 384350 647563 419569
31732 419569 49264 -12581 89730 -40075 -285053 -167929 335676 702994 617562 339143
31722 339143 235105 340698 478728 484540 252243 -143450 -368104 -184597 152987 220498
31712 220498 61257 58802 238397 242013 17689 -66321 87059 110420 -122828 -207029 80227
31701 80227 344421 235795 18483 36447 96040 -97676 -300935 -117488 277376 409923
31691 409923 305941 402720 755981 924131 667725 265554 63043 117455 348904 650758
31681 650758 775333 494641 4797 -160919 216284 736125 872813 544528 49158 -341448
31671 -341448 -528150 -487349 -254321 36113 240816 331450 347195 272582 70756 -178838
31661 -178838 -300211 -226431 -94412 -51656 -43648 67430 214316 170428 -67755 -195864
31651 -195864 -55183 79294 -72713 -301287 -214063 105055 203464 -14635 -178407 -138007
31641 -138007 -222178 -587907 -818518 -536314 -25730 180947 55941 -26981 63112 142308
31631 142308 171089 313611 536187 564641 327589 106070 117955 215794 140900 -115842
31621 -115842 -357041 -459522 -470440 -472231 -463926 -401633 -308909 -274215 -301800 -248833 -33641
31610 -33641 155526 59714 -249280 -414808 -304582 -201057 -340064 -525715 -438584 -126260
31600 -126260 91593 87708 22816 33743 78057 91190 95099 112209 105351 40004 -65619 -160068
31588 -160068 -196958 -181840 -182469 -225803 -212735 -64353 76590 -10771 -267689 -371721 -169953
31577 -169953 127259 256187 179677 -1437 -161260 -112319 241135 622588 591674 159116
31567 159116 -164171 -80656 132694 165816 116131 104851 -62296 -448874 -647637 -373003
31557 -373003 -8736 -35766 -268758 -248056 -62718 -109751 -294552 -220048 -7304 -124992
31547 -124992 -454535 -366162 183118 457776 86265 -361706 -283743 127545 368073 366796
31537 366796 309391 200777 59086 138578 499020 699448 385668 -109254 -223490 12031
31527 12031 103464 -103589 -247484 -58665 269761 394700 230351 -38857 -194618 -189552
31517 -189552 -175701 -297350 -464280 -477688 -364777 -325083 -318727 -80222 326427 398171 -81870
31506 -81870 -605819 -612053 -262846 -100316 -201989 -213635 -53009 1328 -108180 -103500 85545
31495 85545 161741 -1268 -92750 142208 475017 498399 133952 -354735 -672844 -671910 -396969
31484 -396969 -98501 -47303 -224275 -332887 -194174 38095 128922 40234 -130546 -297237
31474 -297237 -369981 -290791 -196084 -333028 -670325 -807183 -465515 105695 435648 400038
31464 400038 261184 257841 394135 563106 651472 567218 367976 306892 532395 796785
31454 796785 719950 322931 10908 -11202 6647 -181637 -399408 -333004 -50403 58355
31444 58355 -194836 -584944 -806419 -808173 -724614 -638268 -537156 -419836 -307441 -172993
31434 -172993 24578 221606 274483 157709 38063 51810 87807 -55885 -337420 -490601
31424 -490601 -409750 -303288 -361805 -477132 -457346 -340174 -272550 -228415 -113195 -32093 -134528
31413 -134528 -256509 -85752 306096 487919 317926 169771 325314 520229 383244 23542
31403 23542 -168935 -96315 32975 117994 237695 393936 514574 663522 934692 1165276
31393 1165276 1060828 611306 117178 -183825 -251959 -65117 346755 684112 588497 175695
31383 175695 -3124 304131 686014 655775 312315 127377 275418 488403 486922 282486
31373 282486 65030 -9209 94157 274083 359717 279283 153868 159893 325814 515053
31363 515053 573846 461904 284747 215896 323760 468020 446369 236317 -14500 -217948
31353 -217948 -406902 -559903 -561143 -407664 -278891 -290282 -318475 -186935 86766 335827
31343 335827 440594 386019 211187 -7167 -181238 -275536 -288519 -184294 31838 184194
31333 184194 69610 -225732 -359709 -173990 96265 164442 44506 -89505 -204690 -357802
31323 -357802 -468581 -380188 -118188 89030 67478 -124061 -284087 -289162 -222811 -270538 -455574
31312 -455574 -562062 -442115 -296313 -416526 -704390 -757935 -471467 -210482 -266044 -456248
31302 -456248 -460096 -265620 -58501 93842 200579 190260 38740 -109764 -155511 -196681
31292 -196681 -282531 -249746 -39461 84580 -59894 -201938 -24659 268128 233273 -104186
31282 -104186 -300768 -189640 -37227 5732 106525 294064 286020 -4981 -204692 -17536
31272 -17536 284100 255278 -59639 -234852 -119610 -6342 -125061 -302048 -260524 -38139
31262 -38139 91559 12306 -109850 -79818 107603 339560 543258 696555 785880 851148
31252 851148 985174 1176530 1238330 1033389 697974 482587 434492 412362 343878 258126
31242 258126 130301 -53432 -127550 69795 379050 498592 445095 457505 467991 162297
31232 162297 -352669 -503622 -113487 219222 -34735 -561397 -704633 -373116 16451 208527
31222 208527 243864 144682 -76129 -245474 -256700 -289352 -449757 -443242 -26279 468154 543598
31211 543598 261139 37554 -56514 -208596 -255633 145813 777903 978995 590312 164374
31201 164374 89219 94863 -150540 -475957 -527304 -272264 58054 242852 144771 -194777
31191 -194777 -450463 -327112 -18085 30900 -164374 -127564 277664 582218 444617 138604
31181 138604 27296 11420 -149908 -350019 -348999 -198695 -104071 -79280 -46645 -79870 -261610
31170 -261610 -461897 -507877 -429737 -335230 -203453 -3698 135541 71850 -152652 -391276
31160 -391276 -540353 -523339 -310885 -45609 52945 -11208 -23858 64504 52952 -127094 -249863
31149 -249863 -164936 -37098 -31643 -19901 191698 533475 752053 679607 341321 -41762
31139 -41762 -149014 109620 388157 325099 93791 116323 305310 172454 -276804 -447923
31129 -447923 -145137 61688 -210002 -541229 -510457 -427542 -669066 -886756 -603285 -112651
31119 -112651 952 -138764 -17262 249967 125609 -266389 -220122 340361 634892 230302
31109 230302 -330930 -433997 -235253 -184331 -259498 -169538 51009 117205 -33587 -196485
31099 -196485 -204501 -47510 191185 357705 323464 166967 104123 175910 212079 158113 175093
31088 175093 320267 400558 272410 34088 -201747 -450076 -628303 -504054 -84403 237001
31078 237001 197412 70763 227887 510061 448578 -4028 -398569 -449822 -351727 -320624
31068 -320624 -218212 119879 468952 473220 188327 24568 163890 346872 305601 114874
31058 114874 -36357 -160954 -324783 -384729 -188631 70911 50237 -209491 -286546 12391
31048 12391 374844 449414 295828 182325 186275 218542 244077 249029 150864 -41697 -128419
31037 -128419 17976 244760 378058 492144 671142 723539 484062 229576 365599 767701
31027 767701 886177 539586 167632 167225 370817 398707 216921 75254 92462 168552 204206
31016 204206 188480 111537 -54685 -299863 -570590 -780308 -800557 -550353 -146353 152091
31006 152091 212649 133946 35133 -97678 -270979 -381310 -410511 -544578 -865818 -1067038
30996 -1067038 -793031 -228259 23120 -263034 -610223 -537254 -241799 -218321 -438977 -446753
30986 -446753 -205744 -231177 -675286 -889928 -356124 409009 503760 -59644 -427069 -216265
30976 -216265 8410 -238951 -584599 -464874 -39371 112923 -115693 -321894 -270374 -111108
30966 -111108 15441 148157 270723 266585 142199 11404 -142185 -404478 -639707 -573784
30956 -573784 -223635 43577 -15679 -217747 -241385 -43860 139047 99059 -137584 -354796
30946 -354796 -358755 -179816 -34649 -33530 -11885 222652 553675 648430 377620 -18232 -211799
30935 -211799 -125303 48339 89700 -13546 -78495 7841 106627 54560 5190 253466 685550
30924 685550 781043 349614 -110886 -102538 165525 172544 -94263 -234286 -168453 -194185 -352969
30913 -352969 -337609 -103465 -3469 -143956 -137406 240898 619746 590394 310831 175913
30903 175913 196032 118992 -49802 -81777 32067 70233 -20197 -57379 26797 65391 -61733
30892 -61733 -251713 -342684 -282040 -97547 147098 350480 464068 567601 696759 645397
30882 645397 186898 -485960 -823319 -545215 22697 390750 453745 391345 258786 19951
30872 19951 -140153 50736 483961 715725 580117 398727 428058 474355 310913 119676
30862 119676 151611 240520 104049 -85068 56189 424229 530391 279875 85928 145349
30852 145349 177557 36154 -668 201546 332313 229619 235933 547643 726922 397288
30842 397288 -20456 85825 504895 518995 63154 -193057 62005 326172 116866 -321545
30832 -321545 -448377 -164704 185828 302500 162390 -77160 -231729 -224118 -138446 -79830
30822 -79830 -20733 95420 190457 176571 150024 231208 293152 107065 -290918 -622905 -714576
30811 -714576 -601099 -373825 -152048 -91956 -171172 -117098 157650 255995 -160169 -711874
30801 -711874 -713134 -160963 253313 154163 -67651 41697 368048 535814 425041 135245
30791 135245 -222867 -472793 -414247 -132384 2498 -175175 -398655 -395264 -267124 -252230
30781 -252230 -339218 -326093 -111681 209396 427737 356794 37030 -223817 -204023 -72420
30771 -72420 -83546 -122566 52155 250467 67027 -376728 -497292 -128675 253197 317596
30761 317596 283134 339878 298623 106633 98276 363138 451051 137111 -92707 164025 485291
30750 485291 299069 -152582 -228866 53662 126955 -138091 -276751 -44708 257094 349700
30740 349700 335685 363816 352647 194783 -47243 -237290 -266289 -77666 222236 372539
30730 372539 273940 144317 144825 87338 -181369 -368311 -128431 333724 530371 416131
30720 416131 348972 422841 379067 173877 93950 222348 277072 114363 -41902 -29047 -9094
30709 -9094 -124560 -236398 -193709 -71513 30232 154008 292621 288893 91771 -113553
30699 -113553 -173323 -145597 -98725 20725 181958 196378 33770 -33748 169695 390966
30689 390966 284585 -57380 -203149 33552 362792 409152 147842 -124119 -143053 74515
30679 74515 293805 301906 77651 -234654 -462623 -501418 -331591 -10929 345811 605150
30669 605150 651517 444287 115147 -42453 155980 506294 588808 287672 -58545 -135815
30659 -135815 -68400 -162174 -413135 -523812 -318613 81184 434288 540917 311711 -111772
30649 -111772 -365957 -203386 213239 515543 542657 376985 105995 -192725 -332704 -193014
30639 -193014 25316 11932 -197676 -275166 -113362 26158 -60775 -242262 -304237 -236643
30629 -236643 -148064 -94419 -92065 -123320 -57852 237050 631971 786548 567319 225883 48033
30618 48033 8540 -81015 -232875 -271439 -98036 171210 330673 292958 171655 146809 234089
30607 234089 268802 182126 149739 300897 420716 211285 -218019 -433004 -261521 6510
30597 6510 74536 6450 19742 156653 298830 318219 117021 -277534 -580325 -463573 -17574
30586 -17574 280442 211421 120511 340320 619037 501191 80213 -81733 243305 638921
30576 638921 630591 261982 -61269 -65668 216991 589537 814094 708502 312829 -71665
30566 -71665 -161791 -6900 103113 40947 -11553 110981 251934 134880 -203590 -415361
30556 -415361 -312716 -118324 -114308 -222618 -148662 146763 358707 232937 -140561 -479378
30546 -479378 -609945 -558814 -456293 -413396 -428168 -390082 -237380 -84990 -88675 -205643 -239428
30535 -239428 -132339 -51272 -139999 -340604 -517476 -601034 -538144 -279718 59236 193135
30525 193135 -8679 -312115 -418112 -361454 -378771 -454834 -311634 97206 388627 240163
30515 240163 -130744 -235054 45661 361876 417305 291756 168487 36109 -132779 -136704
30505 -136704 203874 640583 677914 203994 -333524 -479490 -268588 -44587 2610 -68643
30495 -68643 -166242 -250481 -267730 -185858 -84081 -75906 -154977 -218849 -219826 -194025 -163448 -104120
30483 -104120 -9598 78232 107809 76530 77088 250220 585104 787668 527672 -126545 -690548
30472 -690548 -769380 -430413 -1547 298427 402097 287719 47920 -75942 63266 332181
30462 332181 522054 607412 651054 631473 562923 594688 739228 689788 223076 -369107 -611935
30451 -611935 -505657 -452055 -570294 -531693 -147979 291353 440449 329186 175427 32442
30441 32442 -145118 -273638 -228273 -77397 -29315 -150112 -259332 -145368 152289 331777
30431 331777 171615 -132600 -138869 265592 670637 689980 477380 423865 532939 477209
30421 477209 180809 -79813 -166444 -258613 -458224 -598393 -589504 -608405 -752278 -805806 -581607
30410 -581607 -252436 -104202 -140419 -166273 -125421 -111942 -121710 -23668 196734 316342 92095
30399 92095 -404218 -742372 -553869 -17770 276345 84165 -124552 162648 690639 749846
30389 749846 200249 -350365 -444743 -308921 -293031 -296109 -98275 129817 84910 -134740
30379 -134740 -167397 58750 263072 245270 85059 -70037 -173234 -223773 -218056 -172641 -102727
30368 -102727 -10295 48468 -21466 -194142 -288468 -180866 53322 272669 405203 391241
30358 391241 175673 -135258 -285294 -166110 44471 147091 152045 137335 80064 -15641
30348 -15641 -14234 141717 275557 214337 43333 -51659 -57613 -70253 -90365 -75802 -83132 -160535
30336 -160535 -183871 9590 365096 634776 638451 421495 193266 131987 173166 30119
30326 30119 -412642 -797670 -679579 -193220 57646 -142147 -329274 -129525 164226 131361
30316 131361 -88400 -121225 -46166 -198874 -482838 -462518 -97615 156486 40457 -180863
30306 -180863 -198827 -74479 -1026 47371 229447 559826 849026 849624 460480 -122663 -522175
30295 -522175 -555166 -382196 -169052 160346 593231 734010 270520 -431345 -695305 -442043
30285 -442043 -219621 -307604 -344004 -14519 396083 454835 223615 105355 257629 453335
30275 453335 416575 105108 -262863 -384511 -201307 -52697 -270670 -634768 -595776 -112053
30265 -112053 197298 -41433 -369079 -212006 207523 240044 -136800 -278371 110189 530392
30255 530392 471942 153453 137942 512011 837154 795395 529255 323086 224817 107050
30245 107050 -53952 -126758 -34082 104542 108002 -18182 -55162 155594 462493 528381 222550
30234 222550 -201170 -377684 -220294 39902 157798 107468 14213 -22224 23356 135643
30224 135643 249736 264914 165186 85430 144433 236555 134271 -175083 -403630 -303650 11579
30213 11579 202993 98011 -174088 -403008 -508700 -505005 -390688 -189629 -39721 -95165
30203 -95165 -301730 -389506 -198005 67344 66183 -204359 -368979 -170164 204486 433189
30193 433189 495585 562370 602723 421956 49288 -234573 -299089 -306041 -374371 -375929 -182513
30182 -182513 122959 408846 642955 749914 564101 104550 -314112 -441063 -378036 -330234
30172 -330234 -281784 -150022 -58325 -155254 -296222 -218867 35985 176021 92694 -45313
30162 -45313 -131191 -260106 -468178 -587509 -484050 -267615 -141797 -152721 -187827 -154776
30152 -154776 -71944 -1220 44879 92114 106127 -19231 -292417 -508919 -463606 -251818 -156632
30141 -156632 -235970 -280746 -228140 -288722 -517452 -603275 -343004 -24925 -16268 -219307 -306327
30130 -306327 -280833 -374333 -530489 -470057 -231771 -189023 -481091 -828629 -988296 -1022857
30120 -1022857 -1025844 -926048 -698005 -478135 -348850 -249828 -174936 -197998 -254709 -190828 -70636
30109 -70636 -101465 -195377 -9515 449656 699767 485867 190486 228802 415512 332017
30099 332017 16987 -164970 -129264 -76751 -38790 103666 232561 123405 -58469 77415
30089 77415 418269 350261 -293557 -824686 -615183 9991 278973 54471 -160262 -114770
30079 -114770 -61349 -98022 84962 576267 912607 732080 329304 151101 109168 -107268
30069 -107268 -326878 -119793 397067 616945 344805 51735 97967 267304 301113 359258
30059 359258 611002 820830 748587 604214 679402 821273 713877 442408 319646 338674
30049 338674 266810 144403 204435 372163 333655 96259 11679 184982 294719 110411
30039 110411 -191346 -361377 -396619 -379069 -287891 -133539 -44381 -68640 -77665 12011 88368
30028 88368 27011 -106730 -125993 90051 491793 856350 933774 709576 443359 322827
30018 322827 224430 -1420 -205852 -189601 -94311 -176611 -329957 -264932 -81172 -160447 -476245
30007 -476245 -531521 -119371 325849 354336 92047 -40371 101006 332578 438067 316548
29997 316548 14237 -250971 -253961 -28851 183381 247203 186124 -5503 -293987 -412127
29987 -412127 -131396 280380 308293 -73691 -378408 -363696 -288523 -304389 -175663 168727
29977 168727 371379 244294 117217 250969 403472 356656 368895 646384 840789 613803
29967 613803 296742 394551 757316 866947 696318 630619 697185 551952 198924 75882
29957 75882 325668 529782 346547 -6765 -115441 80123 281582 223087 -44096 -197660
29947 -197660 -4761 324424 320241 -105638 -476993 -419764 -198076 -256127 -516923 -568630
29937 -568630 -338799 -115985 -32159 26204 87585 101598 176748 390370 479413 177370 -257033
29926 -257033 -347103 -128768 -21227 -51755 146524 553246 677936 409494 272366 569095
29916 569095 886729 808576 562547 533087 595616 420490 83502 -116440 -186309 -313834
29906 -313834 -406569 -217254 175040 416612 363073 179271 10559 -132894 -204059 -132240
29896 -132240 -4778 17733 -36509 619 140922 219822 173191 114773 114949 104122 38614
29885 38614 -13323 -4110 22238 41625 98587 189865 220598 140137 20622 -61980 -130375 -218755
29873 -218755 -277722 -270729 -295042 -464415 -688385 -729962 -533852 -339892 -348179 -404938 -219449
29862 -219449 181956 473253 504191 476785 559780 620980 529403 454135 584971 765008 735332
29851 735332 591412 605509 679012 424556 -161716 -555420 -398847 28967 258430 228832
29841 228832 172646 170556 160993 222142 473850 747127 691516 266241 -135462 -151134 144902
29830 144902 402414 418738 276218 141761 65186 -24809 -204683 -456470 -653528 -655013
29820 -655013 -457841 -244558 -209240 -317394 -330026 -131303 71256 15464 -217680 -290121
29810 -290121 -101823 43811 -124437 -462756 -634992 -542705 -329390 -99465 123932 248336
29800 248336 174059 -12027 -111499 -72281 -544 45792 92707 118758 69297 -43481 -217794
29789 -217794 -529008 -897872 -943512 -417031 295166 512997 127749 -286593 -302427 -136499
29779 -136499 -140990 -233479 -158017 45 -54152 -330505 -516032 -372500 42644 485634
29769 485634 703733 605062 380757 331050 472064 511476 329926 207391 354403 506928
29759 506928 321391 -40685 -113186 208705 588861 776694 834884 849369 780295 654706
29749 654706 590173 565189 453412 324532 391921 601452 627175 392552 225462 306213
29739 306213 333698 28680 -355841 -398290 -135035 98228 271447 613242 1022906 1069308
29729 1069308 683795 365230 466762 691639 606709 307471 174390 221998 159428 -28143
29719 -28143 -52590 121097 166012 -50138 -231843 -169057 -88689 -217421 -333913 -125230
29709 -125230 245503 339795 94832 -122501 -77879 81445 162419 170885 147552 64304 -6591
29698 -6591 109201 384286 524657 370477 151876 153646 294725 266760 -3306 -246947
29688 -246947 -188827 174886 630670 942627 966075 680336 205650 -207893 -282288 75278
29678 75278 602681 838714 595397 214679 175891 482341 669590 449105 74317 -62373
29668 -62373 44605 109564 16306 -82134 -76103 -63511 -144197 -213609 -71365 304389 658139
29657 658139 670309 297827 -122765 -190879 131331 496395 588762 439325 268851 163178
29647 163178 45512 -99550 -137411 45903 356216 524474 355025 -36503 -284077 -163187
29637 -163187 109800 114085 -232901 -549231 -476304 -117509 141767 115177 -49889 -135391
29627 -135391 -76939 55273 164388 200636 196214 215844 238898 157845 -43724 -193774 -114695
29616 -114695 143967 350651 343646 171960 21079 50367 252333 427996 374782 146344
29606 146344 26468 178068 436056 544648 470003 337125 182217 -26916 -185334 -90314
29596 -90314 285091 710686 922659 826922 499384 117721 -113889 -112882 -4174 55854
29586 55854 112426 306540 557521 583570 306648 11970 -36278 47258 -16506 -240181 -390246
29575 -390246 -373211 -346353 -417129 -460148 -331502 -94827 96199 217820 326486 364729
29565 364729 192882 -175753 -506451 -570325 -384921 -191986 -212133 -416168 -530821 -318255
29555 -318255 127455 447131 431765 250377 160495 147745 56211 -57804 -6707 145683
29545 145683 133812 -43798 -79039 114542 207447 -9066 -259527 -238990 -98526 -127938
29535 -127938 -246101 -219631 -149828 -272974 -446763 -343887 -64299 -31796 -301430 -488961
29525 -488961 -421135 -329472 -307961 -119957 271918 491617 324221 68348 38605 119045
29515 119045 111386 139182 341977 485864 273625 -171443 -467593 -436554 -133972 346476
29505 346476 801964 896299 552669 179688 171804 361365 301257 -79240 -451914 -575856
29495 -575856 -455897 -146175 246802 468629 375724 210694 298704 567748 699208 636593
29485 636593 568462 501243 269874 -53367 -171673 -13238 189764 289817 342226 326524
29475 326524 129135 -146442 -225609 -101880 -78929 -279431 -460239 -435066 -335214 -293449
29465 -293449 -199447 25146 191780 119079 -73959 -167802 -155910 -149896 -128776 -9292 129738
29454 129738 111684 -65622 -180017 -43608 257939 429896 292067 22524 -10098 307517
29444 307517 684686 805531 689787 537838 419133 340527 423679 696738 861603 639185
29434 639185 244647 118148 253054 243841 -12257 -163915 -36558 92277 29056 6824
29424 6824 229780 474981 457708 278116 192527 195420 130522 12660 -41894 -45450 -62969
29413 -62969 -52175 26100 87267 69222 29971 -18991 -148413 -258996 -90236 335200 591781
29402 591781 420726 111462 20585 16252 -219447 -581238 -680324 -467267 -287193 -338406
29392 -338406 -433310 -328987 -33760 246773 301598 80311 -216345 -319419 -262318 -354566
29382 -354566 -643592 -718602 -324182 156424 227977 14567 -23570 113947 43830 -224768
29372 -224768 -238440 99599 290223 22920 -319259 -257678 81504 235172 92552 -68791
29362 -68791 -83262 -68560 -123950 -153215 -63593 42257 -1403 -159247 -191723 25963 272908
29351 272908 229459 -64877 -232410 -111450 -19568 -276176 -715890 -950742 -904519 -762391
29341 -762391 -576667 -311041 -143538 -293384 -602448 -700127 -539948 -358667 -177527 147422
29331 147422 407357 179510 -412176 -686246 -364252 42184 79677 -8654 120042 254004
29321 254004 102470 -58640 145570 432514 273624 -159516 -201066 220503 438600 104020
29311 104020 -289008 -199491 187061 360786 273712 284814 515310 676211 527906 209350
29301 209350 16716 21654 39981 -64501 -176613 -104087 127445 311523 378659 464993 600215
29290 600215 573851 280168 -23897 -44372 133753 221748 181605 206978 342319 440302 466803
29279 466803 547119 705808 830266 896000 969509 991261 823168 517508 279840 174550
29269 174550 136845 231283 547483 842358 695303 112644 -400644 -498179 -363973 -301314
29259 -301314 -339555 -431140 -644627 -910104 -928283 -615398 -317355 -299541 -357506 -245342
29249 -245342 -125252 -192731 -207554 98441 430359 327905 -37136 -95113 175529 213688
29239 213688 -157836 -410054 -174787 165022 107373 -207828 -287967 -26998 252943 309020
29229 309020 176321 -12266 -109422 38168 398223 649833 508000 88057 -248723 -322596
29219 -322596 -205898 16849 281804 384721 93052 -503204 -968424 -959269 -564149 -146951
29209 -146951 23028 -75206 -292900 -418887 -275002 153715 648254 886837 721694 341169
29199 341169 115878 235087 499650 522526 143548 -402181 -743226 -738578 -540337 -341352
29189 -341352 -162376 65502 280129 295543 94421 -23450 215292 604998 621878 121142
29179 121142 -407343 -477003 -236553 -156605 -296190 -308902 -93450 45349 -50193 -125164
29169 -125164 38027 293566 460661 614581 793277 754194 357600 -76004 -163142 -18630
29159 -18630 -38914 -258778 -324364 -68693 251446 332902 162187 -73505 -200148 -154652
29149 -154652 -30702 -10926 -121797 -150217 29291 194855 96149 -106362 -45128 292718
29139 292718 554272 540982 393556 258452 125106 34693 102420 257516 280479 162905
29129 162905 100110 76561 -140343 -483689 -513152 -81436 342664 321654 49642 -56537
29119 -56537 -27738 -144860 -317124 -198545 157736 292649 54589 -136870 87644 513658
29109 513658 662091 408683 42724 -160565 -195655 -187090 -178712 -121487 4818 126449 145521
29098 145521 57512 -31667 -12335 136334 361887 588104 724104 692062 507498 302190
29088 302190 217199 274531 359301 314696 82919 -207929 -348307 -304496 -285759 -432537 -547260
29077 -547260 -354743 40367 250331 158153 41570 73757 69010 -104971 -229698 -126994
29067 -126994 -32441 -228896 -549780 -629886 -462587 -301223 -164704 89446 290414 92542
29057 92542 -360270 -438682 111225 756055 887294 572463 275316 140332 -25321 -222637
29047 -222637 -170094 215526 587238 569354 211184 -109424 -151767 -39254 -12197 -72871
29037 -72871 -2234 278888 530615 489947 224166 16395 -13540 45416 165821 401948
29027 401948 617080 520521 114721 -183859 -73232 229353 350177 297214 315897 371996
29017 371996 179522 -275609 -622717 -611460 -417246 -294306 -192745 57699 366290 451331
29007 451331 235195 -50714 -161352 -72243 97588 236565 257950 104317 -162650 -355379
28997 -355379 -340206 -175011 6753 172930 339271 418573 313012 143139 161444 377086
28987 377086 494079 345845 155202 157284 194854 6634 -252734 -204283 99497 194223
28977 194223 -36717 -124501 220109 566738 386856 -137802 -417552 -330110 -246100 -300278
28967 -300278 -241006 -42929 -62686 -381747 -537060 -233343 136275 104663 -110026 8658
28957 8658 370218 378963 -93956 -449176 -237987 195552 249178 -112934 -422346 -377456 -93648
28946 -93648 213100 443307 508639 319370 -8353 -145302 86314 444860 517523 202271
28936 202271 -186633 -306455 -164452 -38972 -102023 -250721 -315651 -292423 -274953 -259422
28926 -259422 -155553 42769 231004 326773 309774 158135 -91610 -227741 -20498 433304
28916 433304 720991 584515 206830 -99767 -300420 -539332 -796887 -902702 -817093 -661907
28906 -661907 -509633 -356862 -263454 -279992 -259831 -7256 365497 498458 270315 -31170
28896 -31170 -130238 -109437 -183760 -344431 -425158 -372176 -250433 -85596 114590 252410 225048
28885 225048 86379 90 60069 236332 431722 508829 349642 -3259 -335141 -481441
28875 -481441 -485584 -460664 -412674 -310385 -205254 -137180 -26796 183323 373186 391096 273302
28864 273302 165944 118892 111981 167715 244001 141716 -227079 -572447 -521109 -132959 181520
28853 181520 243655 266069 388572 429153 256769 88291 169338 380281 412237 188762
28843 188762 -119673 -391437 -629427 -792773 -769763 -545247 -266557 -108585 -117354 -173211
28833 -173211 -102256 112843 252793 124915 -113753 -123321 88976 111350 -236968 -536735
28823 -536735 -354153 53127 56329 -421027 -785434 -636251 -285478 -211652 -372491 -382250
28813 -382250 -137244 96997 133384 70516 38657 6678 -71661 -112450 -29120 102335 127979
28802 127979 24587 -69656 -28112 126765 275144 341135 338319 291484 184694 31625 -59477
28791 -59477 13046 189355 306390 335120 427782 647038 778645 576141 133419 -167335
28781 -167335 -89407 226117 483426 535581 421028 257602 188055 290448 436951 381075
28771 381075 116079 -9531 263788 677567 751864 455290 240535 352948 457973 165749
28761 165749 -350445 -573268 -337540 16831 149496 69904 -53844 -143464 -142044 58582
28751 58582 417314 626282 434241 28280 -139967 76079 336875 286131 12085 -118022
28741 -118022 40959 284183 385120 324302 153809 -133931 -462684 -578472 -314838 126894
28731 126894 367167 287607 97535 -9177 -46533 -67948 -32643 76403 181496 245397
28721 245397 319265 383170 314141 94492 -139310 -341296 -608591 -855640 -730746 -125231
28711 -125231 470946 476060 -47882 -511971 -569255 -400945 -263077 -149860 -7807 52275
28701 52275 -60849 -229693 -268874 -120815 155065 438872 563615 450719 264472 245885
28691 245885 376574 419755 303072 202334 214569 241589 262812 400908 601942 582066
28681 582066 254502 -112725 -340386 -576374 -855397 -831083 -331532 164249 95122 -370503
28671 -370503 -614327 -499245 -437902 -576789 -547962 -186507 72768 -165951 -622090 -705915
28661 -705915 -289592 208865 367311 119049 -321856 -648420 -628405 -297649 14245 -2789
28651 -2789 -292013 -490762 -337199 53050 322373 252711 2599 -70276 149733 366302
28641 366302 259865 -49526 -145275 109659 409762 478546 425112 480399 618849 662004
28631 662004 587425 490657 351633 92871 -182859 -262222 -135793 -28328 -79968 -193929
28621 -193929 -267487 -382776 -628479 -857522 -809862 -464105 -111757 -20040 -124727 -164772
28611 -164772 -60160 16405 -22793 26311 352136 738778 747178 287112 -237975 -431423
28601 -431423 -332412 -233063 -267150 -341121 -319313 -107015 320921 799280 1002242 787837
28591 787837 413915 222323 222336 206407 144959 155659 157432 -64993 -416952 -495055 -170423
28580 -170423 163923 132681 -119337 -214763 -89860 55567 173458 366535 549708 493908
28570 493908 242953 136583 297855 412625 230035 22119 222694 734390 970818 638639
28560 638639 143345 25067 237539 291876 2478 -278988 -226481 12878 128882 125059
28550 125059 185019 251004 114321 -144167 -212844 -88345 -141945 -502086 -775464 -642711
28540 -642711 -360119 -289966 -245636 167025 719212 707267 17551 -551905 -335317 292183
28530 292183 482276 95099 -208488 26389 471156 585060 363538 226035 375772 605153
28520 605153 688233 656081 598915 452181 180469 12209 204362 595971 698029 337473
28510 337473 -54779 -14820 300093 344550 -15890 -309330 -135392 289377 470732 307311
28500 307311 148173 247267 423275 345014 387 -277810 -248095 -77698 -95755 -294148
28490 -294148 -305567 39189 385107 326569 25967 3730 372595 687165 622777 398533
28480 398533 338031 372366 271145 93529 62808 161504 191246 132990 126138 153762 65939
28469 65939 -106753 -172985 -133014 -217066 -508624 -791318 -862279 -771160 -649683 -520619 -402852
28458 -402852 -410408 -578596 -726668 -662948 -441675 -266450 -206570 -171751 -142534 -245565 -529669
28447 -529669 -790999 -762039 -458615 -201782 -231687 -413450 -448787 -286553 -129993 -80076
28437 -80076 -26462 70753 73162 -41745 -56906 121939 244218 113347 -36410 101425 362512
28426 362512 331859 1256 -222362 -142630 18496 81995 159048 315198 374521 254215
28416 254215 182819 360645 631753 698826 492146 166165 -111379 -238496 -203803 -136536
28406 -136536 -184207 -288840 -269629 -143822 -106206 -159743 -94819 87455 115762 -35696 9591
28395 9591 409881 726431 534423 89721 -48602 171602 334204 273470 271880 527215
28385 527215 815161 784622 359270 -202006 -505372 -342923 44532 162575 -110146 -309255
28375 -309255 -53117 344113 328825 -38765 -206807 -7544 164899 84427 11835 109066
28365 109066 87780 -234884 -475535 -207017 340862 549248 250457 -100170 -78646 209748
28355 209748 361042 177235 -173783 -391977 -335713 -95193 164039 365018 490490 473466
28345 473466 262742 -9501 -98695 45719 187913 119832 -50163 -58283 131827 259998
28335 259998 96725 -271502 -543722 -534625 -320988 -67772 173966 407750 525298 379405
28325 379405 21461 -311966 -484579 -556586 -569865 -479019 -373093 -469158 -721364 -752174
28315 -752174 -426054 -169256 -353928 -657307 -522761 -54196 134292 -109967 -287374 -112539
28305 -112539 41096 -189039 -544437 -544615 -147120 302460 513851 394042 5315 -381920
28295 -381920 -437724 -182120 6262 -40132 -38848 184879 304124 21526 -360366 -372542
28285 -372542 -124026 -79279 -239174 -119464 434226 925316 851678 304314 -240301 -456956
28275 -456956 -363369 -184696 -146235 -269803 -340259 -193402 24659 83614 67259 243700
28265 243700 560057 626099 291549 -92608 -157942 8203 82426 -14021 -96853 -54142 36088
28254 36088 83583 103083 149375 237181 322976 321451 187694 19341 -8166 134745 273557
28243 273557 279766 269195 409255 603979 569464 245301 -57873 -42358 167127 186621 -76260
28232 -76260 -256612 -30920 396119 527872 222671 -167275 -324492 -335763 -396355 -425738
28222 -425738 -244066 45693 169117 104637 91258 213302 267743 108563 -129040 -250394
28212 -250394 -241416 -179972 -93587 -24795 -66559 -194815 -220551 -66015 53065 -79639 -299589
28201 -299589 -203610 327050 931147 1138905 818979 235427 -213019 -273821 1122 281905
28191 281905 230099 -152610 -492464 -460113 -176077 -61685 -286161 -543204 -476587 -165466
28181 -165466 12195 -87043 -234604 -240913 -222877 -320184 -378852 -161670 245823 494579 406148
28170 406148 135239 -90340 -184137 -138234 44702 283860 440338 474301 459593 410492
28160 410492 252149 14314 -122332 -64276 70492 165582 270120 412136 427512 186665
28150 186665 -131998 -242987 -167549 -186481 -382367 -506185 -388235 -227656 -285241 -457789
28140 -457789 -402592 -31011 359401 485967 416823 392838 453192 413380 174889 -119837
28130 -119837 -284001 -301973 -268450 -220702 -145496 -75360 -33593 75245 348576 650550 679253
28119 679253 344939 -79495 -295746 -315234 -302885 -237662 17341 369015 521514 408194
28109 408194 316156 431537 506823 226077 -262691 -489117 -287504 22113 117886 49776
28099 49776 9829 -6275 -94031 -178941 -122348 -4358 -45181 -255519 -395342 -320043 -171016
28088 -171016 -148943 -255847 -352003 -348892 -257560 -136567 -66583 -100564 -181663 -183910 -73698
28077 -73698 53908 125989 167548 197043 188608 190785 312479 495161 482908 174636 -161309
28066 -161309 -233104 -152090 -250997 -542340 -654128 -347641 148810 426679 345245 88867
28056 88867 -93010 -93541 28213 147831 222049 329269 500354 564890 327555 -104556 -368020
28045 -368020 -281519 -53498 53225 82244 235768 494524 603624 407677 22530 -332496
28035 -332496 -530075 -549441 -435044 -289724 -209992 -180493 -108621 8330 48977 -44530 -144088
28024 -144088 -98025 49718 118725 37543 -95219 -187069 -240789 -229894 -52039 273592 493624
28013 493624 382819 48438 -221245 -369573 -588166 -893387 -970187 -602008 -43839 260797
28003 260797 207530 45418 -43488 -106305 -169199 -102520 156622 429490 478312 274365 -9261
27992 -9261 -212000 -321970 -426968 -564031 -619460 -432567 -51503 211519 122501 -144044
27982 -144044 -207989 15967 253425 318343 346760 479544 589064 521449 387387 354607
27972 354607 317817 79783 -235944 -294046 -65972 97678 -3996 -135192 -28677 194834
27962 194834 253001 145487 80935 85547 8551 -123894 -104025 59285 80020 -125282 -223368
27951 -223368 25757 326141 264461 -20612 -24836 325450 537771 307969 -32160 -43262
27941 -43262 212614 396986 443515 507936 547139 356885 -6667 -195393 -11809 358318
27931 358318 589902 507550 150784 -240672 -335428 -35301 328948 367125 159275 120791
27921 120791 350871 486548 298069 53344 84541 301864 405838 354661 327043 362744
27911 362744 323177 149605 -58582 -186977 -171395 12134 272463 397646 277705 54055
27901 54055 -99517 -236753 -489665 -755678 -779132 -525876 -245183 -124452 -82019 26528
27891 26528 162778 180169 53089 -79190 -82593 13415 38382 -140825 -464007 -717686 -737633
27880 -737633 -549583 -317863 -201879 -254612 -397061 -496000 -528197 -625805 -854770 -1018442
27870 -1018442 -875889 -524569 -306993 -304419 -229652 54853 241953 53185 -260023 -231940
27860 -231940 149971 447169 386708 148236 17385 42435 122593 223614 376514 554531
27850 554531 637517 504628 195554 -31725 57726 334444 398990 113434 -202992 -271795
27840 -271795 -262576 -428963 -611514 -490122 -133591 137390 287223 478124 546858 148134
27830 148134 -537479 -823578 -429365 131986 308969 188763 124992 118505 -40442 -315927
27820 -315927 -505272 -577913 -608961 -547040 -342963 -151919 -137928 -226091 -280640 -342684 -453576
27809 -453576 -466409 -311990 -211054 -286901 -215371 305595 921181 960672 353084 -284533
27799 -284533 -482929 -372672 -234851 -82191 120753 211243 60344 -198567 -373133 -440122
27789 -440122 -427016 -287693 -47719 134488 199689 282213 437978 501066 376719 253466
27779 253466 314693 434848 402466 286335 310487 463307 504495 333039 109584 -7333
27769 -7333 -57498 -162698 -338526 -470571 -427084 -200238 42828 115682 44952 28448 119328
27758 119328 140247 24235 13002 292406 627191 670268 501616 477871 592094 426081
27748 426081 -155581 -679752 -670795 -267572 59609 173628 303900 542170 670752 503714
27738 503714 117341 -304400 -624759 -713559 -494006 -129667 44709 -81068 -232881 -142422
27728 -142422 62469 76685 -78745 -62428 254973 547371 475329 164900 7226 87037
27718 87037 105423 -101730 -268197 -100725 231245 282368 -69962 -488260 -639077 -527666
27708 -527666 -311516 -63549 129382 95141 -153599 -274957 -18102 346717 351840 11691
27698 11691 -197728 -47265 163314 149406 67930 153687 257080 92715 -241350 -353327
27688 -353327 -105040 217032 264605 -43186 -511786 -811835 -702866 -309208 -81191 -273701
27678 -273701 -582293 -553437 -224767 -19434 -93465 -192939 -152354 -109858 -156174 -179006 -168305
27667 -168305 -268495 -388124 -199780 265809 492799 245026 -9858 156030 418021 274983
27657 274983 -44885 50087 468026 540093 159535 21097 517510 1092920 1061716 531936
27647 531936 87709 -33104 9627 119580 303126 425225 346193 198596 186453 229929
27637 229929 153035 91484 301439 625396 600311 147005 -275613 -336579 -251562 -310403 -347881
27626 -347881 -48982 434154 599588 304929 -21846 8904 233863 251379 57100 60101
27616 60101 481684 1016134 1208589 981173 608555 299519 45233 -141812 -111491 173253
27606 173253 446324 389391 19906 -319979 -355792 -148702 44198 81324 46839 81310
27596 81310 170984 160929 -18924 -213132 -197885 54986 350013 474270 343372 -3953
27586 -3953 -401699 -565582 -310367 181415 488318 433687 269447 279537 402369 419262
27576 419262 338337 342263 445453 460990 302489 106759 22524 37798 59524 43527 679
27565 679 -52298 -125636 -269324 -512222 -752595 -802102 -617446 -389851 -307147 -333065 -328830
27554 -328830 -261079 -151287 31875 249036 307565 120005 -94210 -106070 -24097 -55374
27544 -55374 -85252 117850 392526 346822 12862 -158180 -28993 6374 -287975 -577973
27534 -577973 -517306 -285393 -220744 -276183 -228312 -143993 -225955 -395593 -416312 -275886 -103570
27523 -103570 112306 359173 350390 -114353 -671414 -758570 -403817 -165111 -286574 -431150
27513 -431150 -344213 -253482 -374088 -473380 -279168 2446 -24450 -318268 -446125 -205299
27503 -205299 134955 261921 227475 287550 485308 595189 485316 349573 429411 608630
27493 608630 538461 182887 -62779 55938 262575 195884 -19983 -21557 178006 275535
27483 275535 273231 470558 841890 936986 539142 -16904 -337864 -366877 -145342 335058
27473 335058 808054 761348 149838 -350996 -218822 182567 218989 -39685 -61998 192651
27463 192651 259308 18977 -128267 -12091 27612 -193838 -323477 -60032 319176 386338
27453 386338 200415 136880 283950 380111 269344 98562 44567 67517 6413 -185654
27443 -185654 -364947 -356589 -192192 -128185 -335844 -630155 -665108 -375806 -39433 102713
27433 102713 67863 -47219 -214448 -358584 -340950 -186774 -99072 -106551 43476 436898
27423 436898 702492 480493 -8465 -235709 -109999 -43810 -260288 -451818 -293989 44327
27413 44327 183523 109641 136038 359467 483705 268897 -84479 -175517 87994 398395
27403 398395 437671 203770 -74228 -208676 -164790 3455 214202 371602 393050 240835
27393 240835 -61846 -395395 -547696 -388749 -78215 67671 6185 65839 440734 795962
27383 795962 672782 150373 -265111 -358964 -391513 -509564 -436939 21760 548905 711944
27373 711944 537409 356480 274889 151642 -20749 -82790 -17351 31389 48131 157773
27363 157773 317534 285749 -13220 -324119 -373260 -180585 35915 136679 154653 198086
27353 198086 310224 378982 219509 -161222 -446837 -313570 176855 630049 727407 445107
27343 445107 -38170 -436804 -451423 -61216 303316 196849 -221573 -356097 -9346 362567
27333 362567 374706 238413 260506 238019 -161760 -672469 -659775 -57022 453796 334002
27323 334002 -150473 -385167 -218263 -11766 -32647 -112047 47412 421534 650367 440889
27313 440889 -95040 -537722 -569548 -250779 91216 176947 -22345 -304203 -416233 -282459
27303 -282459 -69845 34875 75927 199052 297204 63789 -493837 -888787 -740343 -293992
27293 -293992 -51879 -66232 14993 287857 419575 200518 -115636 -184198 1832 222934
$$ [...]
##END NTUPLES=NMR SPECTRUM
##END=
