##TITLE=31Pdec_LY-13.Dix.1B
 CD3CN, 24 sc
 1.06.2021
##JCAMPDX= 6.0         $$ Bruker NMR JCAMP-DX V2.0
##DATA TYPE= NMR SPECTRUM
##DATA CLASS= NTUPLES
##ORIGIN= UXNMR, Bruker Analytische Messtechnik GmbH
##OWNER= root
$$ XWIN-NMR		Version 3.5
$$ Tue Jun  1 10:33:40 2021 Russian Standard Time (UT+4h)  she@DPX200
##.OBSERVE FREQUENCY= 81.013821
##.OBSERVE NUCLEUS= ^31P
##.ACQUISITION MODE= SIMULTANEOUS
##.ACQUISITION SCHEME= undefined
##.AVERAGES= 24
##.DIGITISER RES= 16
##SPECTROMETER/DATA SYSTEM= spect
##.PULSE SEQUENCE= zgpg30
##.SOLVENT NAME= CD3CN
##.SHIFT REFERENCE= (INTERNAL, CD3CN, 0, 248.564)
##AUDIT TRAIL= $$ (NUMBER, WHEN, WHO, WHERE, WHAT)
$$ ##TITLE= Audit trail, XWIN-NMR		Version 3.5
$$ ##JCAMPDX= 5.01
$$ ##ORIGIN= Bruker BioSpin GmbH
$$ ##OWNER= she
$$ F:/spectra/data/she/nmr/P31/1/pdata/1/auditp.txt
$$ ##AUDIT TRAIL=  $$ (NUMBER, WHEN, WHO, WHERE, WHAT)
(   1,<2021-06-01 10:32:22.87 +0400>,<she>,<DPX200>,
      <created by zg, POWCHK disabled, PULCHK disabled
       configuration hash MD5:
       00 E9 B6 7A A2 85 ED C7 34 08 36 98 17 FE 4E 26
       data hash MD5: 32K
       1F 42 F2 BC EB 0B E3 EF 92 F6 1B 63 28 DC A4 67>)
(   2,<2021-06-01 10:32:25.09 +0400>,<she>,<DPX200>,
      <Start of raw data processing
       efp BC_mod = 2 LB = 1 FT_mod = 6 PKNL = 1 PHC0 = -5750.558 PHC1 = -150.1273 SI = 64K 
       data hash MD5: 64K
       0F 32 78 B8 19 C6 C5 89 53 F0 53 5D 08 A0 B6 84>)
(   3,<2021-06-01 10:33:00.18 +0400>,<she>,<DPX200>,
      <pk PHC0 = -215.2537 PHC1 = 422.4 
       data hash MD5: 64K
       55 A8 92 19 93 01 D5 D7 B7 11 13 7D CD 08 1B E3>)
(   4,<2021-06-01 10:33:03.26 +0400>,<she>,<DPX200>,
      <abs ABSG = 5 
       data hash MD5: 64K
       65 D5 F4 2D 6D C7 C4 26 12 A4 1A AC 15 71 23 5E>)
(   5,<2021-06-01 10:33:17.28 +0400>,<she>,<DPX200>,
      <abs ABSG = 5 
       data hash MD5: 64K
       07 AB E5 48 D3 12 62 C5 6B 83 2C A5 70 E9 2C 89>)
$$ ##END=
$$ 
$$ hash MD5
$$ D0 CE 9E F6 FE B5 05 1F C9 67 19 A9 89 AA 7D 3C
##$RELAX= 
##$RELAX= 
##$RELAX= 
##$RELAX= 
##$RELAX= 
##$RELAX= 
##$RELAX= 
##$RELAX= 
$$ Bruker specific parameters
$$ --------------------------
##$DU= <F:/spectra>
##$EXPNO= 1
##$NAME= <P31>
##$PROCNO= 1
##$TYPE= <nmr>
##$USER= <she>
##$AMP= (0..31)
100 100 100 100 100 100 100 100 100 100 100 100 100 100 100 100 100 100 
100 100 100 100 100 100 100 100 100 100 100 100 100 100 
##$AQSEQ= 0
##$AQ_mod= 1
##$AUNM= <au_zg>
##$AUTOPOS= <>
##$BF1= 81.014009
##$BF2= 200.13
##$BF3= 200.13
##$BF4= 200.13
##$BF5= 200.13
##$BF6= 200.13
##$BF7= 200.13
##$BF8= 200.13
##$BYTORDA= 1
##$CFDGTYP= 0
##$CFRGTYP= 5
##$CHEMSTR= <none>
##$CNST= (0..31)
1 1 145 1 1 1 1 1 1 1 1 1 1 1 1 1 1 1 1 1 1 1 1 1 1 1 1 1 1 1 1 1 
##$CPDPRG= <waltz16>
##$CPDPRG1= <>
##$CPDPRG2= <waltz16>
##$CPDPRG3= <>
##$CPDPRG4= <mlev>
##$CPDPRG5= <mlev>
##$CPDPRG6= <mlev>
##$CPDPRG7= <mlev>
##$CPDPRG8= <mlev>
##$CPDPRGB= <>
##$CPDPRGT= <>
##$D= (0..31)
0 1 0 0 0 0 0 0 0 0 0 0.03 2e-05 3e-06 0 0 0 0 0 0 0 0 0 0 0 0 0 0 0 0 
0 0 
$$ [...]
##$SUBNAM3= <"">
##$SUBNAM4= <"">
##$SUBNAM5= <"">
##$SUBNAM6= <"">
##$SUBNAM7= <"">
##$SUBNAM8= <"">
##$SUBNAM9= <"">
##$SW= 501.771253377433
##$SWIBOX= (0..15)
0 1 3 0 0 0 0 0 0 0 0 0 0 0 0 0 
##$SW_h= 40650.406504065
##$TD= 32768
##$TD0= 1
##$TE= 0
##$TE2= 300
##$TE3= 300
##$TEG= 300
##$TL= (0..7)
0 120 53 12 22 120 120 120 
##$TP= (0..7)
150 150 150 150 150 150 150 150 
##$TP07= 0
##$TPNAME0= <>
##$TPNAME1= <>
##$TPNAME2= <>
##$TPNAME3= <>
##$TPNAME4= <>
##$TPNAME5= <>
##$TPNAME6= <>
##$TPNAME7= <>
##$TPOAL= (0..7)
0.5 0.5 0.5 0.5 0.5 0.5 0.5 0.5 
##$TPOFFS= (0..7)
0 0 0 0 0 0 0 0 
##$TUNHIN= 0
##$TUNHOUT= 0
##$TUNXOUT= 0
##$USERA1= <user>
##$USERA2= <user>
##$USERA3= <user>
##$USERA4= <user>
##$USERA5= <user>
##$V9= 5
##$VALIST= <valist>
##$VCLIST= <CCCCCCCCCCCCCCC>
##$VD= 0
##$VDLIST= <DDDDDDDDDDDDDDD>
##$VPLIST= <PPPPPPPPPPPPPPP>
##$VTLIST= <TTTTTTTTTTTTTTT>
##$WBST= 1024
##$WBSW= 4
##$XGAIN= (0..3)
0 0 0 0 
##$XL= 0
##$YL= 0
##$YMAX_a= 3112
##$YMIN_a= -8213
##$ZGOPTNS= <>
##$ZL1= 120
##$ZL2= 120
##$ZL3= 120
##$ZL4= 120
##$ABSF1= 248.5645
##$ABSF2= -253.2056
##$ABSG= 5
##$ABSL= 3
##$ALPHA= 0
##$AQORDER= 0
##$ASSFAC= 0
##$ASSFACI= 0
##$ASSFACX= 0
##$ASSWID= 0
##$AUNMP= <proc_1d>
##$AZFE= 0.1
##$AZFW= 0.5
##$BCFW= 0
##$BC_mod= 2
##$BYTORDP= 0
##$COROFFS= 0
##$CY= -3
##$DATMOD= 1
##$DC= 0
##$DFILT= <>
##$DTYPP= 0
##$F1P= 0
##$F2P= 0
##$FCOR= 1
##$FTSIZE= 65536
##$FT_mod= 6
##$GAMMA= 0
##$GB= 0
##$INTBC= 1
##$INTSCL= 5.30512e-09
##$ISEN= 30
##$LB= 1
##$LEV0= 0
##$LPBIN= 0
##$MAXI= 10000
##$MC2= 0
##$MEAN= 0
##$ME_mod= 0
##$MI= 50
##$NCOEF= 0
##$NC_proc= -4
##$NLEV= 6
##$NOISF1= 182.463
##$NOISF2= 159.3651
##$NSP= 0
##$NTH_PI= 0
##$NZP= 0
##$OFFSET= 248.5645
##$PC= 4
##$PHC0= -5965.812
##$PHC1= 272.2727
##$PH_mod= 1
##$PKNL= yes
##$PPARMOD= 0
##$PSCAL= 0
##$PSIGN= 0
##$REVERSE= no
##$SF= 81.014009
##$SI= 65536
##$SIGF1= 159.3651
##$SIGF2= -187.1042
##$SINO= 113.3802
##$SIOLD= 16384
##$SREGLST= <1H.CDCl3>
##$SSB= 0
##$STSI= 65536
##$STSR= 0
##$SW_p= 40650.406504065
##$SYMM= 0
##$S_DEV= 0
##$TDeff= 32768
##$TDoff= 0
##$TI= <>
##$TILT= no
##$TM1= 0
##$TM2= 0
##$TOPLEV= 0
##$USERP1= <user>
##$USERP2= <user>
##$USERP3= <user>
##$USERP4= <user>
##$USERP5= <user>
##$WDW= 1
##$XDIM= 65536
##$YMAX_p= 444611540
##$YMIN_p= -6167121
$$ End of Bruker specific parameters
$$ ---------------------------------
##NTUPLES= NMR SPECTRUM
##VAR_NAME=  FREQUENCY,     SPECTRUM/REAL,   SPECTRUM/IMAG
##SYMBOL=    X,             R,               I
##VAR_TYPE=  INDEPENDENT,   DEPENDENT,       DEPENDENT
##VAR_FORM=  AFFN,          ASDF,            ASDF
##VAR_DIM=   65536,         65536,           65536
##UNITS=     HZ,            ARBITRARY UNITS, ARBITRARY UNITS
##FACTOR=    0.620285442955139, 1,           1
##FIRST=     20137.2065510759, 0,            0
##LAST=      -20513.1999529892, 0,           0
##MIN=       -20513.1999529892, -6167121,    0
##MAX=       20137.2065510759, 444611540,    0
$$ Real data points
##PAGE= N=1
##DATA TABLE= (X++(R..R)), XYDATA
$$ [...]
$$ plain form
35742 60437 -996084 -1150989 -254732 764594 927604 229720 -543993 -733750 -269413
35733 -269413 495683 1029860 864703 12499 -870350 -1068386 -580545 -55169 28280 -171015
35723 -171015 -213733 84049 548572 856032 774757 369141 -35821 -260807 -543257 -1118796
35713 -1118796 -1652680 -1551022 -860893 -338844 -448176 -789217 -805963 -567396 -433228 -375934
35703 -375934 -182937 -31220 -243610 -625920 -661798 -324780 -103058 -187964 -239826 -83795
35693 -83795 -31512 -251460 -368880 -76824 285711 216036 -190245 -417038 -284477 -95426
35683 -95426 -113494 -278504 -431921 -521276 -553146 -551314 -567236 -597707 -555943 -442493 -410903
35672 -410903 -511712 -533116 -273567 203839 755690 1332870 1741363 1582970 833724 160288
$$ packed form
35742F0437j056521j54905Q96257J019326J63010o97884p73713j89757M64337
35733b69413P65096N34177j65157q52204q82849j98036M87841N25376Q3449j99295
35723a71015m2718K97782M64523L07460q1275m05616m04962k24986k82450n75539
35713a118796n33884J01658O90129N22049j09332l41041j6746K38567J34168N7294
35703c75934J92997J51717k12390l82310l5878L37018K21722q4906n1862J56031
35693h3795N2283k19948j17420K92056L62535o9675m06281k26793J32561J89051
35683i5426j8068j65010j53417q9355l1870J832j5922l0471M1764J13450L1590
35672d10903j00809k1404K59549M77406N51851N77180M08493j58393p49246o73436
$$ plain form
35662 160288 141387 448474 424402 218854 508120 1171326 1255844 482524 -209982 -91890
35652 -91890 303521 212443 -113242 -73485 62053 -303460 -795278 -545442 203816 259130
35642 259130 -632837 -1286254 -863104 -42113 215340 103105 350779 883825 1029653 644129
35632 644129 190382 -45346 -86044 151111 683634 1064791 867966 424036 360903 548480
35622 548480 313582 -336917 -609331 -190576 258012 202726 28420 243019 572583 469550
35612 469550 46139 -146122 7326 96587 -168177 -658250 -1057637 -1076697 -601172 94042
35602 94042 483545 389289 173942 107058 -66382 -574343 -1064993 -1096145 -810289 -580885
35592 -580885 -350760 37986 205764 -272209 -961329 -1046766 -621525 -531477 -900184 -892607
$$ packed form
35662A60288j8901L07087k4072k05548K89266O63206Q4518p73320o92506J18092
35652i1890L95411r1078l25685L9757J35538l65513m91818K49836P49258N5314
35642B59130q91967o53417M23150Q20991K57453j12235K47674N33046J45828l85524
35632F44129m53747k35728m0698K37155N32523L81157j96825m43930o3133J87577
35622E48480k34898o50499k72414M18755M48588n5286j74306K14599L29564j03033
35612D69550m23411j92261J53448Q9261k64764m90073l99387j9060M75525O95214
35602I4042L89503r4256k15347o6884j73440n07961m90650l1152K85856K29404
35592e80885K30125L88746J67778m77973o89120q5437M25241R0048l68707P577
$$ plain form
35582 -892607 -238040 130450 -420203 -1055425 -704257 252312 572830 23981 -444926 -298237
35572 -298237 -124338 -521861 -1133775 -1245167 -794785 -307514 -117620 -82551 36390 212958
35562 212958 208204 -118074 -569669 -739358 -458733 -39265 95703 -65308 -183608 -81711
35552 -81711 92338 197504 275391 322238 189752 -140800 -429290 -487598 -416108 -355543 -201594
35541 -201594 190510 640766 767361 481648 134633 86514 279612 362558 162851 -121854
35531 -121854 -232918 -202641 -244116 -348964 -234978 198748 570282 415894 -168672 -552741
35521 -552741 -308536 268641 517698 192406 -268356 -257909 316596 951450 1123038 828263
35511 828263 467632 314537 330678 477494 855323 1341911 1399819 624534 -612765 -1422775
$$ packed form
35582h92607O54567L68490n50653o35222L51168R56569L20518n48849m68907J46689
35572b98237J73899l97523o11914j11392M50382M87271J89894L5069J18941J76568
35562B12958m754l26278m51595j69689K80625M19468J34968j61011j18300J01897
35552h1711J74049J05166P7887M6847j32486l30552k88490n8308P1490O0565J53949
35541b01594L92104M50256J26595k85713l47015m8119J93098Q2946j99707k84705
35531a21854j11064L0277m1475j04848J13986M33726L71534j54388n84566l84069
35521e52741K44205N77177K49057l25292m60762J0447N74505O34854J71588k94775
35511H28263l60631j53095J6141J46816L77829M86588N7908p75285j237299q10010
$$ plain form
35501 -1422775 -1312757 -586284 142763 521236 513639 242414 -55688 -142096 -13464 114210
35491 114210 133678 168469 295009 381907 332736 256802 239160 160753 -72465 -337987 -535172
35480 -535172 -784912 -1139250 -1325371 -1119503 -795520 -790688 -1023202 -999964 -602464 -271337
35470 -271337 -273192 -269220 84575 497567 440986 -28700 -313594 -103664 262507 350896 184970
35459 184970 57392 54701 33554 -56680 -89214 6486 111369 62598 -165295 -441100 -568923
35448 -568923 -428232 -126246 18842 -204963 -590704 -680588 -309894 168857 304903 58432
35438 58432 -237798 -312505 -192701 -82263 -169724 -515598 -978547 -1281354 -1279999 -1114373
35428 -1114373 -960657 -752407 -379484 -58343 -144444 -546179 -701101 -291203 332799 641814
$$ packed form
35501a422775J10018P26473P29047L78473p597k71225k98102q6408J28632J27674
35491A14210J9468L4791J26540Q6898m9171p5934j7642p8407k33218k65522j97185
35480e35172k49740l54338j86121K05868L23983M832k32514K3238L97500L31127
35470b71337j855L972L53795M12992n6581m69686k84894K09930L66171Q8389j65926
35459A84970j27578k691k1147r0234l2534R5700J04883m8771k27893k75805j27823
35448e68923J40691L01986J45088k23805l85741q9884L70694M78751J36046k46471
35438E8432k96230p4707J19804J10438q7461l45874m62949l02807J355J65626
35428a114373J53716K08250L72923L21141q6101m01735j54922M09898O24002L09015
$$ plain form
35418 641814 552075 306547 12500 -344876 -608160 -572282 -349141 -247730 -295406 -213929
35408 -213929 99668 398571 469789 393476 314573 227336 108658 20164 -37160 -124278 -127325
35397 -127325 164887 599141 650869 154776 -319746 -222052 160804 164520 -179820 -188544 361417
35386 361417 841183 706577 230482 -59777 -172821 -386948 -558081 -289715 355957 868779
35376 868779 981258 862821 632278 205485 -264343 -320213 182401 835542 1342871 1975611
35366 1975611 2931681 3625659 3260745 1997195 916680 719381 986439 946010 495553
35357 495553 104478 39053 138917 220940 269072 225950 -15397 -303646 -235069 326034 941616
35346 941616 1054900 642958 183621 31752 96570 169069 264709 431724 431263 -39031 -804832
$$ packed form
35418F41814q9739k45528k94047l57376k63284L5878K23141J01411m7676Q1477
35408b13929L13597K98903P1218p6313p8903q7237j18678q8494n7324q7118l047
35397a27325K92212M34254N1728m96093m74522R7694L82856L716l44340q724N49961
35386C61417M79766j34606m76095k90259j13044k14127j71133K68366O45672N12822
35376H68779J12479j18437k30543m26793m69828n5870N02614O53141N07329O32740
35366A975611R56070O93978l64914j263550j080515j97299K67058m0429m50457
35357D95553l91075o5425R9864Q2023M8132m3122k41347k88249O8577N61103O15582
35346I41616J13284m11942m59337j51869O4818P2499R5640J67015m61m70294p65801
$$ plain form
35335 -804832 -1237542 -989130 -472579 -352317 -685340 -889648 -574031 -65980 59204 -267460
35325 -267460 -602944 -635362 -526781 -580147 -831757 -1108366 -1288523 -1313978 -1078844 -555817
35315 -555817 6534 257266 147104 -49942 -155745 -276957 -473277 -524144 -259281 101819
35305 101819 244532 235519 352650 537478 433167 -19019 -437653 -551122 -488663 -368737
35295 -368737 -19776 603672 1073472 927343 257928 -428148 -735470 -507829 260655 1237230
35285 1237230 1728028 1363410 691646 574292 1038675 1277369 832190 193914 -12
35276 -12 135220 11707 -540573 -1042930 -954164 -273353 421928 481610 -196603 -1059030 -1506296
35265 -1506296 -1504291 -1400491 -1327843 -1170320 -986882 -955552 -899733 -428081 340191 739768
$$ packed form
35335h04832m32710K48412N16551J20262l33023k04308L15617N08051J25184l26664
35325b67460l35484l2418J08581n3366k51610k76609j80157k5455K35134N23027
35315e55817N62351K50732j10162j97046j05803j21212j96320n0867K64863L61100
35305A01819J42713r013J17131J84828j04311m52186m18634j13469O2459J19926
35295c68737L48961O23448M69800j46129o69415o86076l07322K27641P68484R76575
35285A237230M90798l64618o71764j17354M64383K38694m45179o38276j93926
35276a2J35232j23513n52280n02357Q8766O80811O95281N9682o78213q62427m47266
35265a506296K005J03800P2648J57523J83438L1330N5819M71652P68272L99577
$$ plain form
35255 739768 449116 -91082 -364902 -363944 -248297 -26061 84157 -383421 -1299940 -1662632
35245 -1662632 -831332 431143 906939 535038 238907 400764 457777 18808 -520057
35236 -520057 -707271 -677136 -757321 -956649 -1118922 -1195171 -1167162 -1025669 -916276 -974849
35226 -974849 -1017769 -796863 -514451 -569940 -812339 -662309 -54590 405671 406191 365451 609431
35215 609431 767646 424789 -165125 -492614 -489122 -363752 -149340 125566 178017 -128665
35205 -128665 -420394 -305916 32515 170541 83088 7787 -58112 -241335 -400001 -322690
35195 -322690 -120540 20697 235058 636988 857839 510968 -85109 -291705 -119252 -123485
35185 -123485 -399245 -430763 -22532 367270 433360 461542 632614 532747 -158600 -969802
$$ packed form
35255G39768k90652n40198k73820R58J15647K22236J10218m67578r16519l62692
35245a662632Q31300J262475M75796l71901k96131J61857N7013m38969n38865
35236e20057j87214L0135q0185j99328j62273p6249K8009J41493J09393n8573
35226i74849m2920K20906K82412n5489k42399J50030O07719M60261N20m0740K43980
35215F09431J58215l42857n89914l27489L492J25370K14412K74906N2451l06682
35205a28665k91729J14478L38431J38026q7453p5301o5899j83223j58666P7311
35195c22690K02150J41237K14361M01930K20851l46871n96077k06596J72453m233
35185a23485k75760l1518M08231L89802O6090K8182J71072r9867o91347q11202
$$ plain form
35175 -969802 -1170952 -722718 -206127 -1425 -5178 -64098 -226488 -497518 -680334 -611851
35165 -611851 -394661 -276516 -356900 -470413 -347903 119392 770151 1300793 1455165 1125099
35155 1125099 439201 -173708 -232685 268984 747873 699489 332731 207252 365154 271002
35145 271002 -367646 -1167113 -1590188 -1537290 -1258654 -1001954 -918920 -1025330 -1076283 -761849
35135 -761849 -199019 73383 -197303 -578486 -537814 -166224 21794 -157618 -357114 -216322
35125 -216322 184161 430408 232575 -222390 -397301 -21107 477963 445286 -100221 -454642
35115 -454642 -219318 201113 345048 387415 614170 683851 104784 -795097 -1106577 -523171
35105 -523171 334393 806458 818578 552011 116017 -246638 -188283 212857 405925 141311
$$ packed form
35175i69802k01150M48234N16591K04702l753n8920j62390k71030j82816O8483
35165f11851K17190J18145q0384j13513J22510M67295O50759N30642J54372l30066
35155A125099o85898o12909n8977N01669M78889m8384l66758j25479J57902r4152
35145B71002o38648p99467m23075N2898K78636K56700Q3034j06410n0953L14434
35135g61849N62830K72402k70686l81183M0672L71590J88018j79412j99496J40792
35125b16322M00483K46247j97833m54965j74911L76194M99070l2677n45507l54421
35115d54642K35324M20431J43935M2367K26755O9681n79067q99881l11480N83406
35105e23171Q57564M72065J2120k66567m35994l62655N8355M01140J93068k64614
$$ plain form
35095 141311 -157522 -128838 -102240 -497967 -974115 -815416 -18316 655290 738792 589394
35085 589394 676157 847160 653279 86164 -396686 -452486 -141827 291361 628636 680451
35075 680451 393106 44872 69610 514572 876827 694443 138514 -259690 -362887 -547453
35065 -547453 -1051418 -1589306 -1787137 -1679780 -1517734 -1329752 -996425 -589873 -293954 -79345
35055 -79345 197896 422840 305568 -148377 -595134 -825413 -937646 -975061 -785016 -405002
35045 -405002 -205951 -382057 -604116 -487502 -148670 45575 60622 116592 172529 -39830
35035 -39830 -466094 -668995 -460879 -233936 -433812 -947489 -1259317 -1076117 -579543 -140179
35025 -140179 13835 -128893 -418271 -606816 -490814 -110359 219830 186828 -183219 -551096
$$ packed form
35095A41311k98833K8684K6598l95727m76148J58699P97100O73606Q3502j49398
35085E89394Q6763J71003j93881n67115m82850n5800L10659M33188L37275N1815
35075F80451k87345l48234K4738M44962L62255j82384n55929l98204j03197j84566
35065e47453n03965n37888j97831J07357J62046J87982L33327M06552K95919K14609
35055g9345K77241K24944j17272m53945m46757k30279j12233l7415J90045L80014
35045d05002J99051j76106k22059J16614L38832J94245J5047N5970N5937k12359
35035c9830m26264k02901K08116K26943j99876n13677l11828J83200M96574M39364
35025a40179J54014j42728k89378j88545J16002L80455L30189l3002l70047l67877
$$ plain form
35015 -551096 -678108 -683536 -739005 -649208 -83081 745571 1050871 402178 -634075 -1164281
35005 -1164281 -1058944 -896386 -941316 -800784 -231551 302019 256329 -200349 -474113 -381863
34995 -381863 -233486 -198249 -82674 209683 425109 346528 134057 60739 112397 90512
34985 90512 -5102 42518 304612 548557 544965 394188 386100 574099 674562 471290 172094
34974 172094 176649 526869 792132 565883 -73181 -689805 -974561 -999314 -1060274 -1341446
34964 -1341446 -1693115 -1749767 -1377998 -962942 -994842 -1328647 -1221035 -346104 561104 503253
34954 503253 -511049 -1478634 -1641080 -1213209 -792781 -571015 -422648 -370048 -508587 -644315
34944 -644315 -429507 134439 619115 646363 266951 -152564 -272806 -18758 367999 502052
$$ packed form
35015e51096j27012n428n5469Q9797N66127Q28652L05300o48693j036253n30206
35005a164281J05337J62558m4930J40532N69233N33570m5690m56678k73764R2250
34995c81863J48377L5237J15575K92357K15426p8581k12471p3318N1658k1885
34985I0512r5614M7620K62094K43945l592j50777q088J87999J00463k03272k99196
34974A72094M555L50220K65263k26249o39064o16624k84756k4753o0960k81172
34964a341446l51669n6652L71769M15056l1900l33805J07612Q74931R07208n7851
34954E03253j014302r67585j62446M27871M20428K21766J48367N2600j38539j35728
34944f44315K14808N63946M84676K7248l79412m19515j20242K54048L86757J34053
$$ plain form
34934 502052 222306 -197206 -350890 -237068 -294785 -785467 -1316333 -1248006 -558695 16788
34924 16788 -94340 -494340 -324553 467668 897135 239208 -888432 -1266512 -661216 -9673
34914 -9673 -4974 -215667 43519 556671 539839 -132019 -667495 -359338 617800 1526051
34904 1526051 1845486 1600275 1167753 938288 1019843 1146896 959454 429949 -71055 -161388
34894 -161388 188235 671865 914324 726867 243908 -167038 -250335 -118323 -34020 3311
34884 3311 192727 432306 264524 -433919 -1030046 -856311 -226643 -164404 -972697 -1628628
34874 -1628628 -1044457 428126 1374624 1092418 305291 -36217 38000 -30599 -231398 -73822
34864 -73822 445875 721703 437911 -28877 -262857 -323238 -384599 -353018 -144281 44762
$$ packed form
34934E02052k79746m19512j53684J13822n7717m90682n30866O8327O89311N75483
34924A6788j11128m00000J69787P92221M29467o57927j127640l78080O05296O51543
34914i673M699k10693K59186N13152j6832o71858n35476L08157R77138R08251
34904A526051L19435k45211m32522k29465Q1555J27053j87442n29505n01004r0333
34894a61388L49623M83630K42459j87457m82959m10946q3297J32012Q4303L7331
34884C311J89416K39579j67782o98443n96127J73735O29668O2239q08293o55931
34874a628628N84171J472583R46498k82206p87127l41508P4217o8599k00799J57576
34864g3822N19697K75828k83792m66788k33980o0381o1361L1581K08737J89043
$$ plain form
34854 44762 58358 56355 176306 230900 51890 -143124 -46629 308449 686709 964042 1049332
34843 1049332 806444 356343 124038 240487 254212 -160108 -592426 -502440 -73365 141712
34833 141712 126196 272503 566304 628629 452103 364923 335937 76110 -199670 54829
34823 54829 706558 963360 595151 276439 410573 475983 -1681 -624476 -848839 -843311
34813 -843311 -962764 -968647 -520410 26005 110098 -64720 140246 684939 862607 409049
34803 409049 -121333 -216516 -65748 -154887 -613301 -1157272 -1412046 -1170418 -547681 39826
34793 39826 207036 -54671 -441680 -652552 -535057 -108932 359410 484380 199833 -92477
34783 -92477 -51342 116471 -7724 -395800 -598150 -355329 121373 453641 444453 156833
$$ packed form
34854D4762J3596k003J19951N4594j79010j95014R6495L55078L78260K77333Q5290
34843A049332k42888m50101k32305J16449J3725m14320m32318Q9986M29075K15077
34833A41712j5516J46307K93801O2325j76526q7180k8986k59827k75780K54499
34823E4829O51729K56802l68209l18712J34134O5410m77664o22795k24363N528
34813h43311j19453n883M48237N46415Q4093j74818K04966N44693J77668m53558
34803D09049n30382r5183J50768q9139m58414n43971k54774K41628O22737N87507
34793C9826J67210k61707l87009k10872J17495M26125M68342J24970k84547k92310
34783i2477M1135J67813j24195l88076k02350K42821M76702L32268r188k87620
$$ plain form
34773 156833 -168175 -308873 -279214 -245209 -203652 -5057 247745 226129 -30202 -21251 411727
34762 411727 704157 438092 92152 294793 734773 598106 -119051 -554369 -226134 407958
34752 407958 749470 764017 690593 583343 400899 204673 88352 112584 283861 375057
34742 375057 -14324 -830791 -1291898 -826460 -32282 66003 -454953 -566475 29726 439727
34732 439727 93165 -340287 -142792 252348 73094 -441957 -449822 102652 415304 74407
34722 74407 -434990 -543340 -306947 -121605 -159663 -305945 -406650 -422576 -444957 -600623
34712 -600623 -862698 -990849 -750191 -153635 543825 999886 950912 428538 -148033 -322323
34702 -322323 -110207 64548 -22189 -153005 -106975 13357 40874 -12222 -148922 -479417
$$ packed form
34773A56833l25008j40698K9659L4005M1557J98595K52802k1616k56331Q951M32978
34762D11727K92430k66065l45940K02641M39980j36667p17157m35318L28235O34092
34752D07958L41512J4547p3424j07250j82444j96226j16321K4232J71277R1196
34742C75057l89381q16467m61107M65438P94178R8285n20956j11522N96201M10001
34732D39727l46562m33452J97495L95140j79254n15051p865N52474L12652l40897
34722G4407n09397j08350K36393J85342l8058j46282j00705j5926k2381j55666
34712f00623k62075j28151K40658N96556O97460M56061m8974n22374n76571j74290
34702c22323K12116J74755q6737j30816M6030J20332K7517n3096j36700l30495
$$ plain form
34692 -479417 -898527 -1013947 -669502 -242309 -141906 -293881 -396397 -395341 -386444 -314420
34682 -314420 -118852 38412 30151 58878 374497 864992 1216294 1304163 1169482 829539
34672 829539 401473 172738 228251 238531 -59276 -429217 -539947 -507037 -592508 -640427
34662 -640427 -353826 55414 89896 -231155 -374291 -115927 180210 200082 95896 107932
34652 107932 193552 237203 304945 478105 649172 647892 444521 160143 -32456 -53996 -63131
34641 -63131 -309546 -687983 -690068 -95828 547511 561297 44882 -346444 -369316 -354092 -481128
34630 -481128 -550405 -516879 -591537 -659185 -255206 610615 1218074 1083376 610636 396453
34620 396453 375895 142244 -291725 -596467 -707584 -777016 -743397 -460129 -113212 -15691
$$ packed form
34692d79417m19110j15420L44445M27193J00403j51975j02516J056Q897P2024
34682c14420J95568J57264q261K8727L15619M90495L51302Q7869j34681l39943
34672H29539m28066k28735N5513J0280k97807l69941j10730L2910q5471m7919
34662f40427K86601M09240L4482l21051j43136K58364K96137J9872j04186J2036
34652A07932Q5620M3651O7742J73160J71067j280k03371k84378j92599k1540r135
34641f3131k46415l78437k085N94240O43339J3786n16415l91326k2872J5224j27036
34630d81128o9277L3526p4658o7648M03979Q65821O07459j34698m72740k14183
34620C96453k0558k33651m33969l04742j11117o9432L3619K83268L46917R7521
$$ plain form
34610 -15691 -66859 97566 436390 470961 12290 -495364 -534793 -138422 219556 175461
34600 175461 -198960 -508104 -419519 -33588 161998 -165812 -769079 -1107817 -975440 -600509
34590 -600509 -207142 206653 645165 987974 1156780 1141847 831071 147625 -572926 -761365
34580 -761365 -373442 -57589 -243459 -456172 -27664 783343 1007983 263060 -756065
34571 -756065 -1185382 -889514 -286147 230980 416595 146430 -369984 -644538 -503600 -343923
34561 -343923 -484980 -622031 -371318 -34154 -212521 -829816 -1179439 -926562 -445182 -108255
34551 -108255 124806 256590 20019 -589808 -1059276 -989090 -598766 -306798 -204721 -240908
34541 -240908 -482641 -812651 -783881 -245196 222315 -13383 -771134 -1334312 -1353164 -1009225
$$ packed form
34610a5691n1168J64425L38824L4571m58671n07654l9429L96371L57978m4095
34600A75461l74421l09144Q8585L85931J95586l27810o03267l38738J32377L74931
34590f00509L93367M13795M38512L42809J68806j4933l10776o83446p20551j88439
34580g61365L87923L15853j85870k12713M28508Q11007K24640p44923j019125
34571g56065m29317K95868O03367N17127J85615k70165n16414k74554J40938J59677
34561c43923j41057j37051K50713L37164j78367o17295l49623K52877M81380L36927
34551a08255K33061J31784k36571o09827m69468P0186L90324K91968J02077l6187
34541b40908k41733l30010K8770N38685M67511k35698p57751n63178j8852L43939
$$ plain form
34531 -1009225 -523928 -26324 252075 157760 -102115 -249860 -320039 -360812 -84944 619390
34521 619390 1161552 959457 429821 426326 848608 793574 99731 -351743 -128101 72141
34511 72141 -251980 -417508 310295 1400527 1803243 1459040 1100586 924463 482950 -230732
34501 -230732 -583792 -319998 46901 113093 188913 671235 1310759 1517656 1124869 516668
34491 516668 138111 93028 143206 -9798 -376672 -611791 -422947 1526 208900 114138
34481 114138 110760 454854 838448 798353 360954 14266 95434 436052 644705 552954
34471 552954 268003 -92166 -507753 -882751 -979885 -703206 -324273 -206234 -361488 -518821
34461 -518821 -571764 -636712 -669462 -455915 -129709 -232341 -921478 -1510048 -1279131 -511672
$$ packed form
34531a009225M85297M97604K78399r4315k59875j47745p0179m0773K75868P04334
34521F19390N42162k02095n29636l495M22282n5034o93843m51474K23642K00242
34511G2141l24121j65528P27803J090232M02716l44203l58454j76123m41513p13682
34501b30732l53060K63794L66899O6192P5820M82322O39524K06897l92787o08201
34491E16668l78557m5083N0178j53004l66874k35119J88844M24473K07374r4762
34481A14138l378L44094L83594m0095m37399l46688Q1168L40618K08653r1751
34471E52954k84951l60169m15587l74998r7134K76679L78933J18039j55254j57333
34461e18821n2943o4948l2750K13547L26206j02632o89137n88570K30917P67459
$$ plain form
34451 -511672 -169817 -616909 -1195074 -1152673 -545262 -38000 -111556 -622232 -964268 -624583
34441 -624583 227928 761282 397942 -347809 -409407 399604 1052132 682213 -227741 -533909
34431 -533909 31028 628044 538243 12133 -270423 -118592 128470 229957 310561 481159
34421 481159 498117 26473 -821938 -1441546 -1342383 -693251 -107660 34944 -135923 -324615
34411 -324615 -401485 -344467 -157680 -12535 -198954 -690041 -966675 -577697 253401 878533
34401 878533 986510 802607 595294 354811 18526 -299102 -428138 -307880 6993 319521
34391 319521 323052 -46923 -340123 -66550 547038 772063 461456 323805 810039 1338115
34381 1338115 1171828 570140 331092 516104 482932 88312 -43638 396589 883426 949564
$$ packed form
34451e11672L41855m47092n78165M2401O07411N07262p3556n10676l42036L39685
34441f24583Q52511N33354l63340p45751o1598Q09011O52528l69919r09954l06168
34431e33909N64937N97016q9801n26110k82556J51831K47062J01487Q0604J70598
34421D81159J6958m71644q48411o19608R9163O49132N85591J42604j70867j88692
34411c24615p6870N7018J86787J45145j86419m91087k76634L88978Q31098O25132
34401H78533J07977j83903k07313k40483l36285l17628j29036J20258L14873L12528
34391C19521L531l69975k93200K73573O13588K25025l10607j37651M86234N28076
34381A338115j66287o01688k39048J85012l3172l94620j31950M40227M86837O6138
$$ plain form
34371 949564 877855 1035588 1124657 684963 -79052 -580965 -675741 -631572 -510256 -176206
34361 -176206 202114 256845 14325 -145246 -139089 -264388 -544969 -530328 21955 672537
34351 672537 790065 257789 -508668 -1014253 -991052 -504523 43734 210086 -21188 -228509
34341 -228509 -128664 79818 126430 155189 484787 1015649 1226123 805267 60893 -405007
34331 -405007 -321707 26858 156583 -114498 -547087 -808199 -787953 -553415 -177440 205321
34321 205321 328109 75037 -223844 -122723 282258 386923 -98454 -707507 -826135 -449237
34311 -449237 -26188 226556 468222 754829 807796 399539 -234538 -549189 -246580 386289
34301 386289 753919 592293 247134 205387 476344 702460 804986 1078796 1529771 1611741
$$ packed form
34371I49564p1709J57733Q9069m39694p64015n01913r4776M4169J21316L34050
34361a76206L78320N4731k42520j59571O157j25299k80581J4641N52283O50582
34351F72537J17528n32276p66457n05585K3201M86529N48257J66352k31274k07321
34341b28509R9845K08482M6612K8759L29598N30862K10474m20856p44374m65900
34331d05007Q3300L48565J29725k71081m32589k61112K0246K34538L75975L82761
34321B05321J22788k53072k98881J01121M04981J04665m85377o09053j18628L76898
34311d49237M23049K52744K41666K86607N2967m08257o34077l14651L02609O32869
34301C86289L67630j61626l45159m1747K70957K26116J02526K73810M50975Q1970
$$ plain form
34291 1611741 983878 158964 -86157 283965 664607 758693 814705 933734 811712 374551
34281 374551 57987 93925 41417 -481931 -1025222 -885164 -202261 226816 152543 141040
34271 141040 518070 797120 533907 116272 141423 464330 529225 353785 440206 813437
34261 813437 923730 599806 351351 446563 367794 -355091 -1285405 -1594869 -1101592 -298811
34251 -298811 359126 682046 512036 -129701 -764011 -873916 -575165 -390549 -435647 -389473
34241 -389473 -243616 -403864 -874095 -975950 -246773 829514 1378732 1132812 553318
34232 553318 204628 289109 605589 728653 403020 -77864 -125101 357454 760494 588248
34222 588248 147139 47189 288578 315489 -136071 -707225 -953464 -834211 -578125 -360720
$$ packed form
34291A611741o27863q24914k45121L70122L80642R4086N6012J19029j22022m37161
34281C74551l16564L5938n2508n23348n43291J40058O82903M29077p4273j1503
34271A41040L77030K79050k63213m17635K5151L22907O4895j75440Q6421L73231
34261H13437J10293l23924k48455R5212p8769p22885r30314l09464M93277Q02781
34251b98811O57937L22920j70010o41737o34310j09905K98751J84616m5098M6174
34241c89473J45857j60248m70231j01855P29177J076287N49218k45920n79494
34232E53318l48690Q4481L16480J23064l25633m80884m7237M82555M03040j72246
34222E88248m41109r9950K41389K6911m51560n71154k46239J19253K56086K17405
$$ plain form
34212 -360720 -251064 -269627 -349587 -353980 -240620 -137136 -168586 -269401 -269452 -157182 -126212
34201 -126212 -260335 -276157 179697 939633 1313267 883375 71166 -385497 -328612 -181708
34191 -181708 -198070 -195346 -53766 11017 -161735 -381009 -375208 -94828 345370 746211 819128
34180 819128 458830 53137 103000 486517 588674 241923 -44713 36882 139147 -10514
34170 -10514 -77955 227274 550258 465096 144498 -77764 -292295 -560725 -425753 362864
34160 362864 1102322 1008313 481643 507659 1001132 875411 -173879 -1069909 -896473 -114073
34150 -114073 270156 25545 -369069 -563491 -522661 -245900 162369 373598 234467 114713
34140 114713 456504 1079559 1298247 741999 -181854 -706079 -489065 57238 240141 -118431
$$ packed form
34212c60720J09656j8563p9960m393J13360J03484l1450j00815n1J12270L0970
34201a26212j34123j5822M55854P59936L73634m29892q12209m56663N6885J46904
34191a81708j6362K724J41580O4783j72752k19274N801K80380M40198M00841P2917
34180H19128l60298m05693M9863L83517J02157l46751k86636Q1595J02265j49661
34170a0514o7441L05229L22984q5162l20598k22262k14531k68430J34972P88617
34160C62864P39458r4009n26670K6016M93473j25721j049290q96030J73436P82400
34150a14073L84229k44611l94614j94422M0830K76761M08269K11229j39131j19754
34140A14713L41791O23055K18688n56248r23853n24225K17014N46303J82903l58572
$$ plain form
34130 -118431 -496602 -373956 104963 413480 373709 230447 143479 59052 26160 162455
34120 162455 299207 138831 -195855 -270296 -69671 -81484 -497716 -884922 -880244 -676665
34110 -676665 -512247 -214391 323793 681102 452626 -63129 -257703 -80258 16190 -124214
34100 -124214 -145807 196546 631949 730844 412353 -20951 -215911 -91084 86515 -33110
34090 -33110 -473090 -863135 -859885 -519113 -151350 56421 142691 220047 372848 621001
34080 621001 869160 974692 940715 914419 919363 768463 376357 -10165 -78582 149113
34070 149113 338137 202041 -255587 -774487 -1029694 -898455 -627036 -623399 -988615 -1356943
34060 -1356943 -1304699 -842120 -403328 -378638 -706313 -934087 -721364 -270720 -107429 -377207
$$ packed form
34130a18431l78171J22646M78919L08517l9771j43262q6968q4427l2892J36295
34120A62455J36752j60376l34686p4441K00625j1813m16232l87206M678K03579
34110f76665J64418K97856N38184L57309k28476n15755j94574J77445R6448j40404
34100a24214k1593L42353M35403R8895l18491m33304j94960J24827J77599j19625
34090c3110m39980l90045L250L40772L67763K07771Q6270P7356J52801K48153
34080F21001K48159J05532l3977k6296M944j50900l92106l86522o8417K27695
34070A49113J89024j36096m57628n18900k55207J31239K71419L637l65216l68328
34060a356943N2244M62579M38792K4690l27675k27774K12723M50644J63291k69778
$$ plain form
34050 -377207 -623056 -442324 -56083 111179 121654 312872 628652 750021 739278 875589
34040 875589 931424 411509 -428108 -677918 -136565 297530 -10738 -540853 -641126 -612129
34030 -612129 -999816 -1487627 -1401880 -861286 -508960 -405514 -79884 498494 838976 737768
34020 737768 431601 38642 -444458 -701019 -399898 123865 233714 -30342 -108997 20207
34010 20207 -162247 -638729 -742897 -330441 -109973 -459160 -808396 -671410 -461266 -690444
34000 -690444 -1065161 -1042366 -733741 -591329 -630816 -586068 -456530 -323196 8295 597309
33990 597309 961998 704320 227446 182394 459814 409732 -118167 -634599 -807667 -754808
33980 -754808 -594886 -323388 -109521 -132377 -142379 227748 739336 769336 278527 -108062
$$ packed form
34050c77207k45849J80732L86241J67262J0475J91218L15780J21369j0743J36311
34040H75589N5835n19915q39617k49810N41353M34095l08268n30115j00273K8997
34030f12129l87687m87811Q5747N40594L52326J03446L25630N78378L40482j01208
34020G37768l06167l92959m83100k56561L01121N23763J09849k64056p8655J29204
34010B0207j82454m76482j04168M12456K20468l49187l49236J36986K10144k29178
34000f90444l74717K2795L08625J42412l9487M4748J29538J33334L31491N89014
33990E97309L64689k57678m76874m5052K77420n0082n27899n16432j73068N2859
33980g54808J59922K71498K13867k2856j0002L70127N11588L0000m90809l86589
$$ plain form
33970 -108062 -71356 50743 42222 190401 577167 713192 355057 69457 395050 922618
33960 922618 857946 164967 -502865 -770918 -765823 -503340 205465 1126449 1512880 942198
33950 942198 -137716 -948962 -1178171 -1003955 -611437 -31991 603718 972752 867019
33941 867019 491455 293067 443492 613793 406736 -79666 -375665 -319342 -271309 -515309
33931 -515309 -793738 -717295 -357270 -72723 52806 203831 383638 387417 193861 16638
33921 16638 -28230 24359 231896 669092 1115757 1213608 977368 774726 755978 706037 528323
33910 528323 430359 488107 455830 196822 -95779 -294627 -527231 -742172 -553097 132880
33900 132880 726744 615955 -61683 -661944 -791863 -499296 -12006 333486 187547 -382443
$$ packed form
33970a08062L6706J22099q521J48179L86766J36025l58135k85600L25593N27568
33960I22618o4672o92979o67832k68053N095K62483P08805R20984L86431n70682
33950I42198j079914q11246k29209J74216L92518N79446O35709L69034j05733
33941H67019l75564j98388J50425J70301k07057m86402k95999N6323M8033k44000
33931e15309k78429P6443L60025K84547J25529J51025J79807L779j93556j77223
33921A6638m4868N2589K07537M37196M46665R7851k36240k02642j8748m9941j77714
33910E28323r7964N7748l2277k59008k92601j98848k32604k14941J89075O85977
33900A32880N93864j10789o77638o00261j29919K92567M87290L45492j45939n69990
$$ plain form
33890 -382443 -807514 -732261 -496117 -478812 -371992 270791 1074406 1207332 587477 -42726
33880 -42726 -238394 -281411 -395035 -330250 -27690 14088 -519858 -1162860 -1272016 -865177
33870 -865177 -434702 -220674 -81924 105936 297301 425957 446667 302529 16135 -282987
33860 -282987 -515923 -698081 -781023 -663129 -406714 -193029 -13403 301520 695067 873429
33850 873429 754973 549459 318051 -65580 -381531 -89155 791589 1407828 1173083 643293
33840 643293 686582 1172760 1224328 572600 -98835 -174110 196093 537678 638699 512193
33830 512193 226328 -36331 -107142 -145228 -452492 -879120 -881632 -369890 22127 -115579
33820 -115579 -233805 361909 1256319 1262182 71791 -1159837 -1244934 -433998 79707 -221124
$$ packed form
33890c82443m25071P5253K36144J7305J06820O42783Q03615J32926o19855o30203
33880d2726j95668m3017j13624O4785L02560M1778n33946o43002j09156M06839
33870h65177M30475K14028J38750J87860J91365J28656K0710j44138k86394k99122
33860b82987k32936j82158q2942J17894K56415K13685J79626L14923L93547J78362
33850H73429j18456k05514k31408l83631l15951K92376Q80744O16239k34745n29790
33840F43293M3289M86178N1568o51728o71435p5275L70203L41585J01021j26506
33830E12193k85865k62659p0811l8086l07264m26628k512N11742L92017j37706
33820a15579j18226N95714Q94410N863j190391j231628q5097Q10936N13705l00831
$$ plain form
33810 -221124 -733537 -823238 -632000 -581310 -680337 -739989 -830825 -1028913 -1024533 -542629 52651
33799 52651 175076 -61839 16920 558266 890845 523010 -153240 -467755 -318797 -72016
33789 -72016 22354 -26034 -111414 -68093 212926 524886 518657 292515 389352 973280 1469665
33778 1469665 1347248 809133 337505 24162 -197067 -144555 197562 292641 -220233 -732129
33768 -732129 -367314 712980 1499990 1547533 1384830 1469136 1526750 1180654 587482 129468
33758 129468 -70422 -77158 34804 116642 40690 -62956 -21583 -29893 -343449 -612865 -212518
33747 -212518 672302 1067165 604439 123906 406788 1013812 1035419 454788 9114 36843
33737 36843 219525 297991 344792 369802 261305 143531 293155 672821 963314 1029448
$$ packed form
33810b21124n12413q9701J91238N0690r9027n9652r0836j98088M380M81904N95280
33799E2651J22425k36915P8759N41346L32579l67835o76250l14515J48958K46781
33789g2016R4370m8388q5380M3321K81019L11960o229k26142R6837N83928M96385
33778A469665j22417n38115m71628l13343k21229N2512L42117R5079n12874n11896
33768g32129L64815J080294P87010M7543j62703Q4306N7614l46096n93172m58014
33758A29468j99890o736J11962Q1838p5952j03646M1373q310l13556k69416M00347
33747b12518Q84820L94863m62726m80533K82882O07024K1607n80631m45674K7729
33737C6843J82682P8466M6801K5010j08497j17774J49624L79666K90493O6134
$$ plain form
33727 1029448 957507 747029 451226 479323 1115405 1785684 1573010 585051 -15437 336994
33717 336994 784443 453583 -109524 174223 1133809 1581345 1159465 780202 1035054 1286798
33707 1286798 871468 258124 210854 484042 329823 -91545 113730 1048783 1720866 1504446
33697 1504446 1005081 1006815 1309936 1266571 942052 960136 1413501 1667234 1276591 537274
33687 537274 12578 -53274 264896 765768 1139902 1105543 729675 412751 414777 596400
33677 596400 746303 905623 1150680 1281357 1065706 718220 761190 1295066 1698337 1321775
33667 1321775 368363 -220551 185229 1208331 1955752 1998785 1619740 1229764 917855
33658 917855 629688 439770 422826 454087 366967 205293 136375 199139 306714 421794
$$ packed form
33727A029448p1941k10478k95803K8097O36082O70279k12674r87959o00488L52431
33717C36994M47449l30860n63107K83747R59586M47536m21880l79263K54852K51744
33707A286798m15330o13344m7270K73188j54219m21368K05275R35053O72083k16420
33697A504446m99365J734L03121m3365l24519J8084M53365K53733l90643p39317
33687E37274n24696o5852L18170N00872L74134l4359l75868l16924K026J81623
33677E96400J49903J59320K45057J30677k15651l47486M2970N33876M03271l76562
33667A321775r53412n88914M05780J023102P47421M3033l79045l89976l11909
33658I17855k88167j89918j6944L1261q7120j61674o8918O2764J07575J15080
$$ plain form
33648 421794 552218 618479 501069 222829 -42367 -150942 -92369 78069 321895 614237
33638 614237 888852 1000494 802528 354891 3124 72243 468932 783778 832083 860128
33628 860128 1106760 1405291 1428462 1164551 915819 894819 1013488 1057396 949804 838058
33618 838058 935189 1225554 1380657 1123360 627376 318674 305251 314997 218184 224990 449903
33607 449903 677554 748141 791302 857877 730473 390209 253975 565306 923158 851985
33597 851985 502186 302447 238401 53410 -77806 261548 953315 1392092 1344495 1194700
33587 1194700 1226641 1172001 681037 -117224 -738796 -831436 -443181 42534 232822 115464
33577 115464 46626 245698 519791 655726 749241 852572 695305 211873 -40339 398370
$$ packed form
33648D21794J30424O6261j17410k78240k65196j08575N8573J70438K43826K92342
33638F14237K74615J11642j97966m47637l51767O9119L96689L14846M8305K8045
33628H60128K46632K98531K3171k63911k48732k1000J18669M3908j07592j11746
33618H38058R7131K90365J55103k57297m95984l08702j3423R746r6813O806K24913
33607D49903K27651P0587M3161O6575j27404l40264j36234L11331L57852p1173
33597H51985l49799j99739o4046j84991j31216L39354O91767M38777m7597j49795
33587A194700L1941n4640m90964p98261o21572r2640L88255M85715J90288j17358
33577A15464o8838J99072K74093J35935R3515J03331j57267m83432k52212M38709
$$ plain form
33567 398370 1052340 1097284 567538 192458 154939 -93614 -718083 -1106094 -863244 -421116
33557 -421116 -276919 -278095 -79093 225033 334157 185740 -172507 -735503 -1263870 -1291753
33547 -1291753 -750773 -199508 -112314 -309372 -387595 -321452 -306840 -380286 -525999 -799773
33537 -799773 -1016963 -710934 195271 1033832 1177445 912978 1044060 1802323 2674701 3309986
33527 3309986 4139865 5858533 8391715 10564536 10995714 9461547 7205991 5645202
33519 5645202 4962527 4365157 3439526 2529219 1854225 1159655 453843 217914 477308
33510 477308 492095 -76367 -465205 24078 846510 1035716 642888 414856 460040 281983
33500 281983 -77380 -19071 461143 610391 121440 -370858 -311359 -2444 23207 -204531
$$ packed form
33567C98370O53970M4944n29746l75080l7519k48553o24469l88011K42850M42128
33557d21116J44197j176J99002L04126J09124j48417l58247n62996n28367k7883
33547a291753N40980N51265Q7194j97058p8223O6143J4612p3446j45713k73774
33537g99773k17190L06029R06205Q38561J43613k64467J31082P58263Q72378O35285
33527C309986Q29879J718668K533182K172821M31178j534167k255556j560789
33519E645202o82675n97370r25631r10307o74994o94570p05812k35929K59394
33510D77308J4787n68462l88838M89283Q22432J89206l92828k28032M5184j78057
33500B81983l59363N8309M80214J49248m88951m92298N9499L08915K5651k27738
$$ plain form
33490 -204531 -344907 -303940 -133481 229522 733970 1055793 1033421 968793 1138471 1289784
33480 1289784 1034535 527827 303740 544300 944288 1251629 1480832 1535777 1112693 236438
33470 236438 -479185 -488516 -31254 197452 -13449 -208425 -21068 350249 567994 621602
33460 621602 600368 382266 -71815 -391877 -189249 398524 917119 1149501 1091241 666986
33450 666986 3426 -280358 244328 972622 884807 5881 -590219 -365090 -127 -157975
33440 -157975 -447811 -209202 391879 756360 809886 836231 740986 232857 -468398 -787652
33430 -787652 -592091 -305981 -277145 -449961 -605356 -582866 -353794 -129166 -214233 -529801
33420 -529801 -570592 -109503 422437 592754 578816 684145 686136 254949 -317467 -459627
$$ packed form
33490b04531j40376M0967J70459L63003N04448L21823k2372o4628J69678J51313
33480A289784k55249n06708k24087K40560L99988L07341K29203N4945m23084q76255
33470B36438p15623r331M57262K28706k10901j94976J87357L71317K17745N3608
33460F21602k1234k18102m54081l20062K02628N87773N18595K32382n8260m24255
33450F66986o63560k83784N24686P28294q7815q78926n96100K25129L64963j57848
33440a57975k89836K38609O01081L64481N3526K6345r5245n08129p01255l19254
33430g87652J95561K86110K8836j72816j55395K2490K29072K24628q5067l15568
33420e29801m0791M61089N31940J70317j3938J05329J991m31187n72416j42160
$$ plain form
33410 -459627 -179241 36240 21469 49238 257892 507913 729339 940481 1026912 914555
33400 914555 783082 717469 446067 -120224 -481562 -268050 43415 -165690 -634671 -728945
33390 -728945 -578109 -721130 -913129 -441476 469051 782280 275494 -148373 13479 215645
33380 215645 89542 126485 612140 988630 922420 971081 1446858 1617887 944608 224911
33370 224911 460815 1288480 1642539 1439680 1458384 1929717 2405332 2796000 3390471 3922555
33360 3922555 3749213 3036146 2704099 2993097 3079447 2447577 1711688 1589807 1842100 1812521
33350 1812521 1427906 1052802 791880 536109 415864 660715 1150406 1511023 1542686 1268924
33340 1268924 757771 192114 -95460 10048 181058 93476 -114437 -168119 -189727 -436345
$$ packed form
33410d59627K80386K15481j4771K7769K08654K50021K21426K11142Q6431j12357
33400I14555j31473o5613k71402n66291l61338K13512L11465k09105m68981r4274
33390g28945J50836j43021j91999M71653R10527L13229n06786m23867J61852K02166
33380B15645j26103L6943M85655L76490o6210M8661M75777J71029o73279p19697
33370B24911K35904Q27665L54059k02859J8704M71333M75615L90668N94471N32084
33360C922555j73342p13067l32047K88998Q6350o31870p35889j21881K52293k9579
33350A812521l84615l75104k60922k55771j20245K44851M89691L60617L1663k73762
33340A268924n11153n65657k87574J05508J71010q7582k07913n3682k1608k46618
$$ plain form
33330 -436345 -682410 -442257 194700 527197 200917 -274421 -207593 448087 1199132 1610594
33320 1610594 1525660 989893 302972 -46569 166214 609433 783064 566231 176701 -197791
33310 -197791 -445438 -424963 -174973 -65704 -359549 -760981 -811247 -577180 -450957 -395549
33300 -395549 -32276 505566 532102 -138877 -757903 -653220 -147901 15997 -237409 -338905
33290 -338905 63371 735683 1213596 1175586 624724 -11689 -181130 119213 259894 -117566
33280 -117566 -511292 -338985 96824 93912 -266529 -229247 384665 859240 698966 324998
33270 324998 293223 413167 160177 -395471 -616436 -154227 630158 1128628 1112193 825203
33260 825203 599536 490492 318081 15226 -200449 -73244 392551 980426 1462519 1623268
$$ packed form
33330d36345k46065K40153O36957L32497l26280m75338O6828O55680P51045M11462
33320A610594q4934n35767o86921l49541K12783M43219J73631k16833l89530l74492
33310a97791k47647K0475K49990J09269k93845m01432n0266K34067J26223N5408
33300c95549L63273N37842K6536o70979o19026J04683N05319J63898k53406j01496
33290c38905M02276O72312M77913l8010n50862o36413j69441L00343J40681l77460
33280a17566l93726J72307M35809k912l60441L7282O13912M74575j60274l73968
33270C24998l1775J19944k52990n55648k20965M62209P84385M98470j6435k86990
33260H25203k25667j09044j72411l02855k15675J27205M65795N87875M82093J60749
$$ plain form
33250 1623268 1291833 608231 105537 205929 689348 946755 720827 321036 136924
33241 136924 220494 358739 326047 64360 -215416 -200096 72686 120574 -327469 -799560
33231 -799560 -638541 63870 607069 669941 557195 434840 18240 -707496 -1075405 -531260
33221 -531260 522056 1153345 989625 479047 182578 170410 135672 -140329 -514130 -599457
33211 -599457 -170130 543499 1044971 1061619 721297 267680 -177351 -520509 -615290 -422636
33201 -422636 -99885 192150 440054 639269 659766 405031 26864 -160528 14389 410103
33191 410103 702251 682694 450871 302865 442785 849079 1353692 1680781 1472300 621209
33181 621209 -335658 -561188 102437 863308 997162 743942 761204 1081968 1236456 1137947
$$ packed form
33250A623268l31435o83602n02694J00392M83419K57407k25928l99791j84112
33241A36924Q3570J38245l2692k61687k79776J5320K72782M7888m48043m72091
33231g99560J61019P02411N43199O2872j12746j22355m16600p25736l67909N44145
33221e31260J053316O31289j63720n10578k96469j2168l4738k76001l73801q5327
33211e99457M29327P13629N01472J6648l40322m53617m45031l43158r4781J92654
33201d22636L22751K92035K47904J99215K0497k54735l78167j87392J74917L95714
33191D10103K92148j9557k31823j48006J39920M06294N04613L27089k08481q51091
33181F21209r56867k25530O63625P60871J33854k53220J7262L20764J54488r8509
$$ plain form
33171 1137947 1109536 1128724 814374 232455 -20746 260924 545373 407087 134434 161584
33161 161584 402516 525945 488076 436715 422855 506109 807586 1183283 1215788 832421
33151 832421 546615 730218 1019355 868672 382950 127110 332108 750481 1133723 1389645
33141 1389645 1364712 935866 343965 81073 379592 1017193 1583532 1738484 1336772 604201
33131 604201 123037 313500 914808 1250036 1024722 609331 492769 701896 860137 659449
33121 659449 185339 -147222 20843 579403 971886 775097 205129 -138649 3914 319481
33111 319481 418323 289654 146323 66339 5036 5754 142567 310319 306011 121582 -36102
33100 -36102 -13944 197800 616634 1212093 1654545 1498110 811999 269734 304739 525364
$$ packed form
33171A137947k8411J9188l14350n81919k53201K81670K84449j38286k72653K7150
33161A61584K40932J23429l7869n1361j3860Q3254L01477L75697L2505l83367
33151H32421k85806J83603K89137j50683m85722k55840K04998M18373L83242K55922
33141A389645k4933m28846n91901k62892K98519O37601N66339J54952m01712p32571
33131F04201m81164J90463O01308L35228k25314m15391j16562K09127J58241k00688
33121F59449m74110l32561J68065N58560L92483j96789n69968l43778J42563L15567
33111C19481R8842j28669j43331p9984o1303P18J36813J67752m308j84429j57684
33100c6102K2158K11744M18834N95459M42452j56435o86111n42265L5005K20625
$$ plain form
33090 525364 396578 161769 439743 1076760 1191695 474319 -302285 -366432 79298 369139
33080 369139 337007 286881 373916 500752 614907 742750 894696 1146387 1551026 1831088
33070 1831088 1572941 917156 542400 700483 849548 585681 277150 306476 384807 231223
33060 231223 228611 644307 876141 386347 -224268 -118608 331267 179431 -429398 -544747
33050 -544747 -118046 -24562 -416517 -485322 -37740 104504 -347114 -544512 -6071 493235
33040 493235 224657 -366171 -587618 -610973 -837070 -983521 -674048 -256689 -169735 -81224
33030 -81224 454975 988939 779917 95802 -58278 567954 1108836 843467 152420 -65625
33020 -65625 456050 1100247 1170592 723780 432520 649885 961074 909606 752644 952000
$$ packed form
33090E25364j28786k34809K77974O37017J14935p17376p76604o4147M45730K89841
33080C69139l2132n0126Q7035J26836J14155J27843J51946K51691M04639K80062
33070A831088k58147o55785l74756J58083J49065k63867l08531K9326P8331j53584
33060B31223k612M15696K31834m89794o10615J05660M49875j51836o08829j15349
33050e44747M26701R3484l91955o8805M47582J42244m51618j97398N38441M99306
33040D93235k68578n90828k21447k3355k26097j46451L09473M17359Q6954Q8511
33030h1224N36199N33964k09022o84115j54080O26232N40882k65369o91047k18045
33020f5625N21675O44197P0345m46812k91260K17365L11189n1468j56962J99356
$$ plain form
33010 952000 1262211 1110223 683158 683955 1023338 832278 -10160 -473942 40796 750088
33000 750088 743645 287022 130408 306902 433781 551241 811461 867706 416720 -84190
32990 -84190 -42814 320292 435153 403682 700801 1152210 1123135 606035 272813 446530
32980 446530 770138 947620 1117195 1347495 1370812 1059836 741561 790669 1162640 1492835
32970 1492835 1507884 1262907 1055434 1093964 1214825 1044463 496946 -60661 -217728 67875
32960 67875 497550 678776 375411 -220381 -527949 -227504 237221 249515 -34481 41446
32950 41446 499336 669358 354957 180985 503083 826699 735312 594810 794088 1003072
32940 1003072 810564 491775 483215 597925 419824 67019 -65302 16564 62927 120658
$$ packed form
33010I52000L10211j51988m27065P97L39383j91060q42438m63782N14738P09292
33000G50088o443m56623j56614J76494J26879J17460K60220N6245m50986n00910
32990h4190M1376L63106J14861l1471K97119M51409k9075n17100l33222J73717
32980D46530L23608J77482J69575K30300K3317l10976l18275M9108L71971L30195
32970A492835J5049k44977k07473L8530J20861j70362n47517n57607j57067K85603
32960F7875M29675J81226l03365n95792l07568L00445M64725J2294k83996P5927
32950D1446M57890J70022l14401j73972L22098L23616r1387j40502J99278K08984
32940A003072j92508l18789q560J14710j78101l52805j32321Q1866M6363N7731
$$ plain form
32930 120658 364985 614871 498091 -39604 -700443 -1123859 -1040534 -466174 100757 86941
32920 86941 -392039 -639994 -374418 -37389 34271 65049 221948 245435 18777 -160797
32910 -160797 -179650 -285060 -400193 -62750 623139 847224 340816 -109064 103437 524270
32900 524270 562975 423340 462376 443183 131765 -102201 35255 188246 90792 135635
32890 135635 553036 790518 414464 -101620 -186640 -51536 -87579 -126131 22406 35893
32880 35893 -244400 -360258 -89678 59289 -172425 -222502 226903 580908 450424 415203
32870 415203 868497 1161057 815064 565018 1188138 2226108 2828009 2942516 2774267
32861 2774267 2079521 962820 331058 575683 865357 667937 722013 1460953 1876609
$$ packed form
32930A20658K44327K49886j16780n37695o60839m23416Q3325N74360N66931j3816
32920H6941m78980k47955K65576L37029P1660L0778J56899K3487k26658j79574
32910a60797j8853j05410j15133L37443O85889K24085n06408m49880K12501M20833
32900E24270L8705j39635L9036j9193l11418k33966J37456J52991r7454M4843
32890A35635M17401K37482l76054n16084q5020J35104l6043l8552J48537J3487
32880C5893k80293j15858K70580J48967k31714n0077M49405L54005j30484l5221
32870D15203M53294K92560l45993k50046O23120J037970O01901J14507j68249
32861B774267o94746j116701o31762K44625K89674j97420N4076P38940M15656
$$ plain form
32852 1876609 1227551 491239 672804 1018136 507568 -162321 143991 873774 770586
32843 770586 35418 -277390 -156364 -205618 -173433 394635 852433 444840 -219313 -229694
32833 -229694 30492 -120194 -171397 437851 860047 269425 -429608 -114282 573365 585784
32823 585784 457493 975805 1292224 476589 -455455 -227885 466225 593845 919715 2140270
32813 2140270 2812329 1877445 1270592 2932871 5168860 5336767 4238568 4188634 4649277
32804 4649277 3819459 2740755 3429315 4547573 3571177 1766988 2126685 3757930 3536865
32795 3536865 2038034 2260020 3619308 3154850 1698481 2505549 4624197 4454806 3155138
32786 3155138 5030506 9139349 10809159 11189806 15799566 23284234 26728070 27814164
$$ packed form
32852A876609o49058p36312J81565L45332n10568o69889L06312P29783j03188
32843G70586p35168l12808J21026m9254L2185N68068M57798m07593o64153j0381
32833b29694K60186j50686n1203O09248M22196n90622o99033L15326O87647J2419
32823E85784j28291N18312L16419q15635r32044K27570O94110J27620L25870J220555
32813B140270O72059r34884o06853J662279K235989J67907j098199m9934M60643
32804D649277q29818j078704O88560J118258r76396j804189L59697J631245k21065
32795C536865j498831K21986J359288m64458j456369Q07068K118648j69391j299668
32786C155138J875368M108843J669810L80647M609760P484668L443836J086094
$$ plain form
32778 27814164 36893790 55060662 71141401 85887913 125142637 211956073 329288027
32771 329288027 423302004 444611540 382632399 267851832 151318115 75581429 49740529
32764 49740529 49034725 44646881 31933936 23843443 24632656 24556943 18260016 12598777
32756 12598777 12897689 14231238 11540021 8066067 7902721 8573866 6898932 5243889
32748 5243889 6255101 7311594 5579982 3385806 3528775 4036621 2461532 951439
32740 951439 2127660 3886447 3182261 1489438 1747160 2993382 2702918 1700065 2151718
32731 2151718 3048209 2157258 491310 553912 1804661 1920704 1136259 1420677 2477299
32722 2477299 2271743 760000 -209127 -71704 232325 494721 1091770 1407919 810817
$$ packed form
32778B7814164R079626J8166872J6080739J4746512L9254724Q6813436J17331954
32771C29288027R4013977K1309536o1979141j14780567j16533717p5736686k5840900
32764D9740529p05804m387844j2712945q090493P89213p5713o296927n661239
32756A2598777K98912J333549k691217l473954j63346O71145j674934j655043
32748E243889J011212J056493j731612k194176J42969N07846j575089j510093
32740I51439J176221J758787p04186j692823K57722J246222k90464j002853M51653
32731B151718Q96491q90951j665948O2602J250749J16043p84445K84418J056622
32722B477299k05556j511743r69127J37423L04029K62396N97049L16149n97102
$$ plain form
32713 810817 290142 890265 1641344 1304362 852755 1751479 3065044 2933699 1802882
32704 1802882 1471520 1893873 1670286 925868 950295 1542326 1370360 588332 578547 1352576
32694 1352576 1564996 940944 518482 635739 684680 654899 1021733 1394785 1130051 875451
32684 875451 1587017 2473489 1999658 572322 53177 794132 1350197 1112910 1029094 1488123
32674 1488123 1581926 903248 250659 72815 -134796 -430878 -28513 1144434 1928079
32665 1928079 1621969 983084 908810 1172302 1112484 755105 627816 984991 1620223 2100858
32655 2100858 2056546 1550207 1087910 957621 853693 524284 299760 451610 587759 342043
32645 342043 106226 364118 862559 1165904 1409565 1753284 1811216 1475453 1518934 2401259
$$ packed form
32713H10817n20675O00123P51079l36982m51607Q98724J313565j31345j130817
32704A802882l31362M22353k23587p44418K4427N92031j71966p82028r785P74029
32694A352576K12420o24052m22462J17257M8941k9781L66834L73052k64734k54600
32684H75451P11566Q86472m73831j427336n19145P40955N56065k37287q3816M59029
32674A488123R3803o78678o52589j77844k07611k96082M02365J172947P83645
32665A928079l06110o38885p4274K63492n9818l57379j27289L57175O35232M80635
32655B100858m4312n06339m62297j30289j03928l29409k24524J51850J36149k45716
32645C42043k35817K57892M98441L03345K43661L43719N7932l35763M3481Q82325
$$ plain form
32635 2401259 3274221 3268333 2965936 3367217 4164563 4426865 4326642 4683949 5308997 5345695
32625 5345695 4906312 4843990 5143720 5007215 4359247 3849653 3509987 2824412 2029220 1914697
32615 1914697 2348000 2367433 1786745 1396736 1524626 1675959 1662942 1804179 1920409 1431551
32605 1431551 609384 465392 1170316 1781848 1761578 1570889 1521663 1269068 804509 754036
32595 754036 1200745 1302682 663731 117652 470947 1241152 1379627 744282 179016 352204
32585 352204 999226 1320520 952976 431781 487066 943696 899903 180640 -224860 289180
32575 289180 875167 601217 48976 346554 1246106 1554536 1102332 839777 1107564 1208244
32565 1208244 760821 227165 -50661 -228521 -267506 88806 555180 510374 -3096 -426474
$$ packed form
32635B401259Q72962n888l02397M01281P97346K62302j00223L57307O25048L6698
32625E345695m39383o2322K99730j36505o47968n09594l39666o85575p95192j14523
32615A914697M33303J9433n80688l90009J27890J51333j3017J41237J16230m88858
32605A431551q22167j43992P04924O11532k0270j90689m9226k52595m64559n0473
32595G54036M46709J01937o38951n46079L53295P70205J38475o35345n65266J73188
32585C52204O47022L21294l67544n21195N5285M56630m3793p19263m05500N14040
32575B89180N85987k73950n52241K97578Q99552L08430m52204k62555K67787J00680
32565A208244m47423n33656k77826j77860l8985L56312M66374m4806n13470m23378
$$ plain form
32555 -426474 -722213 -1208409 -1523233 -1001740 -35430 260578 -208300 -435369 -68284 172629
32545 172629 32526 172976 682361 631180 -269254 -950696 -688939 -259111 -514831 -933768
32535 -933768 -585097 329698 911931 900783 678333 443178 160524 -59974 -172067 -418298
32525 -418298 -858455 -1080488 -811064 -378635 -176643 -118939 9032 130297 159669 240424
32515 240424 372198 264713 -141828 -468760 -461490 -292911 -119307 130745 345601 211607
32505 211607 -167999 -238308 172539 564187 543902 315602 175405 110294 96203 192799
32495 192799 182111 -240739 -792779 -846118 -458205 -315416 -490629 -248555 580869 1076881
32485 1076881 620437 -134405 -351237 -234001 -390253 -668726 -479758 172989 716452
$$ packed form
32555d26474k95739m86196l14824N21493R66310K96008m68878k27069L67085K40913
32545A72629j40103J40450N09385n1181r00434o81442K61757M29828k55720m18937
32535i33768L48671R14795N82233j1148k22450k35155k82654k20498j12093k46231
32525d18298m40157k22033K69424M32429K01992N7704J27971J21265K9372Q0755
32515B40424J31774j07485m06541l26932P270J68579J73604K50052K14856j33994
32505B11607l79606p0309M10847L91648k0285k28300j40197o5111j4091R6596
32495A92799j0688m22850n52040n3339L87913J42789j75213K42074Q29424M96012
32485A076881m56444p54842k16832J17236j56252k78473J88968O52747N43463
$$ plain form
32476 716452 767623 356255 -265323 -637303 -362007 270633 453385 26583 -171866 400385
32466 400385 1043530 829386 -13171 -478014 -142821 561202 1143732 1466820 1556082 1523173
32456 1523173 1520266 1443802 988308 269934 -97932 65227 88664 -489882 -1032888 -713845
32446 -713845 137570 481487 130914 -33212 549991 1295971 1310782 563418 -105264 37869
32436 37869 839196 1477668 1425204 1024731 901912 1002215 725422 -5487 -476658 -211824
32426 -211824 345780 533680 314766 29986 -172306 -202509 181354 907019 1317626 953802
32416 953802 299853 173031 609213 941406 838107 681921 908464 1417455 1727746 1468733
32406 1468733 701642 -100868 -447983 -270603 150781 639216 1176491 1538122 1386973
$$ packed form
32476G16452N1171m11368o21578l71980K75296O32640J82752m26802j98449N72251
32466D00385O43145k14144q42557m64843L35193P04023N82530L23088Q9262l2909
32456A523173k907p6464m55494p18374l67866J63159K3437n78546n43006L19043
32446g13845Q51415L43917l50573j64126N83203P45980J4811p47364o68682J43133
32436C7869Q01327O38472n2464m00473j22819J00303k76793p30909m71171K64834
32426b11824N57604J87900k18914k84780k02292l0203L83863P25665M10607l63824
32416I53802o53949j26822M36182L32193j03299j56186K26543N08991L10291k59013
32406A468733p67091q02510l47115J77380M21384M88435N37275L61631j51149
$$ plain form
32397 1386973 864687 558789 659798 684126 297968 -164896 -353513 -452342 -621073 -494701
32387 -494701 143601 713788 580801 55914 -86898 202111 330817 153567 152578 523491
32377 523491 840026 803339 703442 857558 1035807 768519 7918 -733578 -834935 -141479
32367 -141479 795895 1127619 541430 -362741 -719138 -341908 188920 320801 141669 142085
32357 142085 535174 938401 764520 -65284 -900031 -1007176 -387502 273976 437102 206265
32347 206265 -4438 37962 338267 802420 1228441 1367811 1136006 646245 46202 -490098
32337 -490098 -695271 -439579 25168 368989 622043 925379 1028649 620384 66192 108326
32327 108326 763183 1229234 1046826 630275 414613 219064 -169692 -458415 -356608 -85141
$$ packed form
32397A386973n22286l05898J01009K4328l86158m62864j88617r8829j68731J26372
32387d94701O38302N70187j32987n24887j42812K89009J28706j77250r89L70913
32377E23491L16535l6687r9897J54116J78249k67288p60601p41496j01357O93456
32367a41479R37374L31724n86189r04171l56397L77230N30828J31881j79132M16
32357A42085L93089M03227j73881q29804q34747j07145O19674O61478J63126k30837
32347B06265k10703M2400L00305M64153M26021J39370k31805m89761o00043n36300
32337d90098k05173K55692M64747L43821K53054L03336J03270m08265n54192M2134
32327A08326O54857M66051j82408m16551k15662j95549l88756k88723J01807K71467
$$ plain form
32317 -85141 55707 151808 336578 457334 409929 326151 168326 -280149 -762919 -619818
32307 -619818 108109 432556 -183776 -951752 -942136 -418029 -186017 -256869 -77497 358967
32297 358967 571544 469332 328332 132767 -264047 -537507 -246842 345769 546222 219197
32287 219197 -143769 -209520 -14749 446992 1166478 1744762 1727606 1260501 857458 646269
32277 646269 405765 169990 157738 242194 132986 -36929 60530 281447 246034 96611
32267 96611 274884 631926 561912 40846 -262722 -26086 321709 391372 321262 264312
32257 264312 63873 -281268 -435233 -320357 -352227 -743638 -1062758 -871329 -405690 -198909
32247 -198909 -290060 -225645 257960 883476 1188621 1058297 819565 819636 1002844 1069474 1013163
$$ packed form
32317h5141J40848R6101J84770J20756m7405q3778j57825m48475m82770J43101
32307f19818P27927L24447o16332p67976R616N24107K32012p0852J79372M36464
32297C58967K12577j02212j41000j95565l96814k73460K90665N92611K00453l27025
32287B19197l62966o5751J94771M61741P19486N78284j7156m67105m03043k11189
32277F46269k40504k35775j2252Q4456j09208j69915R7459K20917l5413j49423
32267I6611J78273L57042p0014n21066l03568K36636L47795O9663p0110n6950
32257B64312k00439l45141j53965J14876l1870l91411l19120J91429M65639K06781
32247a98909r1151O4415M83605O25516L05145j30324k38732P1J83208O6630n6311
$$ plain form
32236 1013163 1158497 1546064 1703370 1330570 816676 652528 692753 518571 204062 85508
32226 85508 13528 -427054 -1052830 -1211282 -834895 -626772 -987713 -1408974 -1261220 -688924
32216 -688924 -341473 -531140 -987125 -1271156 -1210444 -993108 -907578 -942294 -762236 -236398
32206 -236398 230515 208073 -109127 -173120 120642 366031 321948 189781 191945 288320 372583
32195 372583 416985 396116 344195 423942 644614 663242 251665 -205821 -157285 305732 611449
32184 611449 580124 527802 525092 232193 -381802 -781554 -609109 -208342 -104962 -322268
32174 -322268 -504746 -473019 -402151 -562246 -993734 -1376801 -1289004 -720586 -157687 54579
32164 54579 151142 402133 471296 -102541 -997907 -1376306 -1018132 -530184 -373657 -340594
$$ packed form
32236A013163J45334L87567J57306l72800n13894j64148M0225j74182l14509j18554
32226H5508p1980m40582o25776j58452L76387K08123l60941m21261J47754N72296
32216f88924L47451j89667m55985k84031O0712K17336Q5530l4716J80058N25838
32206b36398M66913k2442l17200o3993K93762K45389m4083j32167K164R6375Q4263
32195C72583M4402k0869n1921P9747K20672J8628m11577m57486M8536M63017L05717
32184F11449l1325n2322k710k92899o13995l99752J72445M00767J03380k17306
32174c22268j82478L1727P0868j60095m31488l83067Q7797N68418N62899K12266
32164E4579R6563K50991O9163n73837q95366l78399L58174M87948J56527L3063
$$ plain form
32154 -340594 -141636 96963 163058 99867 -7926 -190786 -372389 -364975 -202601 -111071
32144 -111071 -85495 92411 373772 446104 299313 315715 671750 1076935 1213123 1034021
32134 1034021 586423 -25689 -484823 -556075 -530041 -807845 -1067701 -563101 633259 1454840
32124 1454840 1199964 373446 -190038 -392020 -595259 -827937 -807116 -430892 165274 778720
32114 778720 1095574 814441 76104 -565287 -804050 -831778 -775436 -425097 198236 555863
32104 555863 281635 -283778 -638229 -764261 -823180 -648669 -61909 617546 872379 610332
32094 610332 130398 -295251 -478167 -239668 334546 778574 721472 301167 -126293 -424174
32084 -424174 -586853 -541978 -338485 -239235 -343368 -403708 -261080 -114791 -108284 -44134 186782
$$ packed form
32154c40594J98958K38599O6095o3191j07793j82860j81603P414J62374R1530
32144a11071K5576J77906K81361P2332j46791J6402L56035M05185J36188j79102
32134A034021m47598o12112m59134p1252K6034k77804k59856N04600J196360Q21581
32124A454840k54876q26518n63484k01982k03239k32678K0821L76224N96166O13446
32114G78720L16854k81133p38337o41391k38763k7728N6342L50339O23333L57627
32104E55863k74228n65413l54451j26032n8919J74511N86760O79455K54833k62047
32094F10332m79934m25649j82916K38499N74214M44028n7102m20305m27460k97881
32084d24174j62679M4875K03493R9250j04133o0340J42628J46289O507O4150K30916
$$ plain form
32073 186782 305076 111339 -154209 -263522 -363398 -515175 -390864 94835 389714 149004
32063 149004 -35675 494532 1278291 1291826 460367 -292099 -424088 -297319 -236623 16957
32053 16957 574729 870467 403834 -410379 -661076 -58404 738740 907298 359997 -223209
32043 -223209 -221501 209856 428911 212046 -43802 -99699 -297437 -859466 -1301002 -1110998
32033 -1110998 -619360 -505131 -722627 -681613 -344931 -313907 -781972 -1189977 -1092402 -674625
32023 -674625 -218565 252054 538905 203521 -651685 -1167471 -806881 -136998 19091 -240725
32013 -240725 -213834 245129 611224 612974 549419 607595 494165 4435 -489501 -459288 93774
32002 93774 641123 707197 273391 -309718 -658406 -631933 -379388 -144442 -39769 -36137
$$ packed form
32073A86782J18294j93737k65548j09313r9876j51777J24311M85699K94879k40710
32063A49004j84679N30207P83759J3535q31459p52466j31989J26769O0696K53580
32053A6957N57772K95738m66633q14213k50697O02672P97144J68558n47301n83206
32043b23209J708M31357K19055k16865k55848n5897j97738n62029m41536J90004
32033a110998M91638J14229k17496M1014L36682L1024m68065m08005R7575M17777
32023f74625M56060M70619K86851l35384q55206n15786L60590O69883J56089k59816
32013b40725K6891M58963L66095J750o3555N8176j13430m89730m93936L0213N53062
32002I3774N47349O6074m33806n83109l48688K6473K52545K34946J04673L632
$$ plain form
31992 -36137 -95021 -184188 -200078 -53138 141876 141243 -81437 -228232 -41195 360392 660818
31981 660818 754671 776257 784346 650112 292822 -162684 -539604 -780840 -889253 -812201
31971 -812201 -481404 82425 739538 1257613 1406640 1153635 736512 389908 52805 -410830
31961 -410830 -755233 -516256 255714 842294 705043 153331 -154575 -75655 42655 -466
31951 -466 -108789 -219451 -309772 -160421 407449 1069556 1229009 759459 129651 -243091
31941 -243091 -376386 -435222 -470336 -508948 -537289 -360388 137870 605038 556522 121898
31931 121898 -73637 157681 343640 209767 104920 271874 326900 -78695 -587371 -638850
31921 -638850 -272079 46396 73696 -155888 -586395 -995524 -932714 -309812 233032 80872
$$ packed form
31992c6137n8884q9167j5890J46940J95014o33k22680j46795J87037M01587L00426
31981F60818R3853K1586Q089j34234l57290m55506l76920k41236j08413P7052
31971h12201L30797N63829O57113N18075J49027k53005m17123l46604l37103m63635
31961d10830l44403K38977P71970N86580j37251n51712l07906P8920J18310m3121
31951d66j08323j10662r0321J49351N67870O62107J59453m69550o29808l72742
31941b43091j33295n8836l5114l8612k8341J76901M98258M67168m8516m34624
31931A21898j95535K31318J85959j33873j04847J66954N5026m05595n08676n1479
31921f38850L66771L18475K7300k29584m30507m09129O2810O22902N42844j52160
$$ plain form
31911 80872 -476710 -652977 -233965 317018 635327 728529 601065 257221 61261 449185
31901 449185 1184446 1476305 989060 219672 -283420 -542864 -750859 -769523 -453690 -136803
31891 -136803 -316785 -950826 -1425413 -1267281 -677575 -284651 -447056 -886993 -1068650 -883619
31881 -883619 -744751 -908316 -1002088 -550326 228287 602459 291158 -195528 -279866 3397
31871 3397 225139 152382 -87642 -219098 -23683 488101 993556 1131673 940084 783451
31861 783451 775137 603733 106298 -350972 -378459 -160352 -155003 -396223 -528606 -433804 -353587
31850 -353587 -375482 -247965 162127 601223 794256 776806 693990 562448 421430 418814
31840 418814 511247 381731 -49772 -336459 -103702 337510 443849 274725 300688 524390
$$ packed form
31911H0872n57582j76267M19012N50983L18309R3202j27464l43844j95960L87924
31901D49185P35261K91859m87245p69388n03092k59444k07995j8664L15833L16887
31891a36803j79982o34041m74587J58132N89706L92924j62405m39937j81657J85031
31881h83619J38868j63565r3772M51762P78613L74172l11301m86686q4338K83263
31871C397K21742p2757k40024j31456J95415N11784N05455J38117j91589j56633
31861G83451q314j71404m97435m57270k7487K18107N349k41220j32383R4802Q0217
31850c53587k1895J27517M10092M39096J93033j7450q2816j31542j41018k616
31840D18814R2433j29516m31503k86687K32757M41212J06339j69124K5963K23702
$$ plain form
31830 524390 476793 104790 -50744 265110 633890 709028 690965 735174 572720 169743
31820 169743 83111 566924 953422 625380 19047 -159054 -155949 -611863 -1228753 -1193514
31810 -1193514 -695877 -715530 -1276691 -1270128 -322753 451956 149909 -594892 -716119 -229697
31800 -229697 173844 310678 424494 478024 325387 177543 219912 185624 -74502 -97582
31790 -97582 423986 889831 613274 -37053 -204519 84105 88875 -275154 -260336 439290
31780 439290 1122033 1041108 285700 -541336 -1024551 -1104104 -918583 -647541 -318554 177772
31770 177772 708208 826069 420682 57664 163675 278636 -190270 -839058 -779558 -71275
31760 -71275 350877 158794 29220 413053 895197 1080729 1185366 1315028 1026651 180761
$$ packed form
31830E24390m7597l72003j55534L15854L68780P5138j8063M4209j62454m02977
31820A69743q6632M83813L86498l28042o06333j78101L105m55914o16890L5239
31810a193514M97637j9653n61161O563R47375P74709l02047p44801j21227M86422
31800b29697M03541J36834J13816N3530j52637j47844M2369l4288k60126k3080
31790i7582N21568M65845k76557o50327j67466K88624M770l64029J4818O99626
31780D39290O82743q0925p55408q27036m83215p9553J85521K71042L28987M96326
31770A77772N30436J17861m05387l63018J06011J14961m68906o48788N9500P08283
31760g1275M22152j92083j29574L83833M82144J85532J04637J29662k88377q45890
$$ plain form
31750 180761 -496693 -357035 225143 475782 314479 193573 248302 265624 219221 216202
31740 216202 112744 -244775 -551858 -365581 206494 629404 666592 511773 282838 -93873
31730 -93873 -478765 -497518 -58833 469610 720200 660825 398120 -24984 -499974 -808373
31720 -808373 -888211 -939147 -1095944 -1174236 -931101 -463493 -144942 -178711 -354199 -297393
31710 -297393 80628 442338 387333 -49137 -398779 -359701 -220265 -427852 -848872 -882071
31700 -882071 -389446 -27767 -317348 -788229 -610797 149432 609107 405306 181687 447542
31690 447542 695342 253034 -527513 -711677 -135752 460236 541993 268014 -105759 -516309
31680 -516309 -690967 -262530 475401 703865 297744 128612 703156 1298149 1095094 447119
$$ packed form
31750A80761o77454J39658N82178K50639j61303j20906N4729J7322m6403l019
31740B16202j03458l57519l07083J86277N72075M22910L7188j54819k28935l76711
31730i3873l84892j8753M38685N28443K50590n9375k62705m23104m74990l08399
31720h08373p9838n0936j56797p8292K43135M67608L18551l3769j75488N6806
31710b97393L78021L61710n5005m36470l49642L9078J39436k07587m21020l3199
31700h82071M92625L61679k89581m70881J77432P60229M59675k03801k23619K65855
31690D47542K47800m42308p80547j84164N75925N95988Q1757k73979l73773m10550
31680e16309j74658M28437P37931K28464m06121j69132N74544N94993k03055o47975
$$ plain form
31670 447119 183360 243784 4257 -422492 -317526 318935 657355 398501 259270 747082
31660 747082 1277273 1046689 218812 -340100 -200331 247150 416378 171945 -151957 -194404
31650 -194404 16132 110453 -115700 -383484 -291711 146786 567705 711619 548453 131499
31640 131499 -314730 -343075 225690 881401 981900 631990 446643 498488 198143 -634456
31630 -634456 -1267960 -992296 -62404 687472 830743 587661 341019 275840 379992 538466
31620 538466 649489 719967 762899 650219 289434 -101783 -212172 -122423 -206934 -499471
31610 -499471 -555601 -90027 597052 1002796 939992 523436 -65343 -602940 -831729 -633934
31600 -633934 -112960 513693 973083 1003582 642382 351999 518117 908026 1018053 844782
$$ packed form
31670D47119k63759O0424k39527m26749J04966O36461L38420k58854j39231M87812
31660G47082N30191k30584q27877n58912J39769M47481J69228k44433l23902m2447
31650a94404K10536R4321k26153k67784R1773M38497M20919J43914j63166m16954
31640A31499m46229k8345N68765O55711J00499l49910j85347N1845l00345q32599
31630f34456o33504K75664R29892P49876J43271k43082k46642o5179J04152J58474
31620E38466J11023P0478M2932j12680l60785l91217j10389Q9749q4511k92537
31610d99471n6130M65574O87079M05744o2804m16556n88779n37597k28789J97795
31600f33934N20974O26653M59390L0499l61200k90383J66118L89909J10027j73271
$$ plain form
31590 844782 799884 918679 772437 243955 -230556 -363391 -368117 -397003 -225292 202295
31580 202295 472493 320484 50450 -47628 -226205 -772830 -1374743 -1488898 -1084996 -592545
31570 -592545 -308734 -199680 -93882 191639 686983 1036777 774227 52531 -323351 81481
31560 81481 703560 766143 284989 -164400 -308420 -283097 -181130 -33120 -16790 -170932
31550 -170932 -108548 460966 1113277 1175550 683228 294260 316018 420838 367251 395448
31540 395448 693654 955148 799221 369881 197620 520883 939650 833522 137157 -415890
31530 -415890 -60762 977300 1583492 1056333 -44836 -655282 -469193 -19517 232736
31521 232736 309903 283081 11967 -507498 -932649 -954084 -686097 -494682 -530380 -557241
$$ packed form
31590H44782m4898J18795j46242n28482m74511j32835m726k8886J71711M27587
31580B02295K70198j52009k70034r8078j78577n46625o01913j14155M03902M92451
31570e92545K83811J09054J05798K85521M95344L49794k62550p21696l75882M04832
31560H1481O22079O2583m81154m49389j44020K5323J01967J48010J6330j54142
31550a70932O2384N69514O52311O2273m92322l88968K1758J04820n3587K8197
31540C95448K98206K61494j55927m29340j72261L23263M18767j06128o96365n53047
31530d15890L55128J038062O06192n27159j101169o10446J86089M49676K52253
31521B32736P7167k6822k71114n19465m25151k1435K67987J91415l5698k6861
$$ plain form
31511 -557241 -249130 376504 898510 974846 801362 835253 1097504 1144768 820639 546656
31501 546656 597189 569576 28023 -706023 -969554 -721196 -487988 -470369 -330338 80004
31491 80004 355683 119130 -430588 -784126 -697993 -333526 7472 151388 154342 203288
31481 203288 372889 514145 446433 181973 -102920 -204022 33322 553711 945958 771098
31471 771098 185638 -114449 204337 649387 640200 290843 31101 -140314 -441456 -653405
31461 -653405 -367637 243888 566474 426828 236191 231761 163803 -166369 -574655 -818379
31451 -818379 -823833 -549498 -74282 180056 -147813 -691848 -680594 -25333 536764 549999
31441 549999 403378 485003 484900 71032 -314248 -25817 741604 1165069 913058 452606
$$ packed form
31511e57241L08111O25634N22006P6336j73484L3891K62251M7264l24129k73983
31501E46656N0533k7613n41553p34046k63531K48358K33208J7619J40031M10342
31491H0004K75679k36553n49718l53538Q6133L64467L40998J43916K954M8946
31481B03288J69601J41256o7712k64460k84893j01102K37344N20389L92247j74860
31471G71098n85460l00087L18786M45050r187l49357k59742j71415l01142k11949
31461f53405K85768O11525L22586j39646j90637m430o7958l30172m08286k43724
31451h18379n454K74335M75216K54338l27869n44035J1254O55261N62097J3235
31441E49999j46621Q1625j03m13868l85280K88431P67421M23465k52011m60452
$$ plain form
31431 452606 267556 318118 365871 375188 399713 383880 285589 202280 199592 150144 -88016
31420 -88016 -409076 -545419 -416837 -249023 -273501 -415275 -410676 -186607 48366 95413
31410 95413 -52073 -361769 -832239 -1254700 -1188419 -480063 376957 759141 678334 641872
31400 641872 803859 727188 114702 -630729 -835377 -313031 521641 1131057 1253138 947423
31390 947423 453162 13594 -233643 -231134 30840 407913 562470 249455 -365521 -858146
31380 -858146 -999075 -873235 -606889 -245337 95143 238683 181563 85326 658 -162236
31370 -162236 -366321 -438280 -380156 -383666 -454657 -365700 -114165 -47392 -291729 -414451 -14607
31359 -14607 605871 790556 427402 61430 87520 230081 9270 -529162 -819457 -479050
$$ packed form
31431D52606j85050N0562M7753R317K4525j5833r8291q3309k688m9448k38160
31420h8016l21060j36343J28582J67814k4478j41774M599K24069K34973M7047
31410I5413j47486l09696m70470m22461O6281P08356Q57020L82184q0807l6462
31400F41872J61987p6671o12486p45431k04648N22346Q34672O09416J22081l05715
31390I47423m94261m39568k47237K509K61974L77073J54557l13015o14976m92625
31380h58146j40929J25840K66346L61552L40480J43540n7120r6237q4668j62894
31370a62236k04085p1959N8124l510p0991Q8957K51535O6773k44337j22722L99844
31359a4607O20478J84685l63154l65972K6090J42561k20811n38432k90295L40407
$$ plain form
31349 -479050 182832 469400 78552 -541652 -708652 -290517 202101 294090 77367 -37738
31339 -37738 123059 407376 659936 862224 967862 860277 561862 300014 242764 296785
31329 296785 296305 276100 373998 527911 506115 274807 111015 237572 532871 749584 840058
31318 840058 864369 744171 381344 -83341 -412323 -585920 -685745 -592760 -202166 152819
31308 152819 9978 -467591 -610974 -240225 65569 -76025 -270838 -117938 59471 -182109
31298 -182109 -571040 -542330 -129744 218797 408991 599202 594799 95441 -598294 -864439
31288 -864439 -678005 -562079 -697123 -783955 -714489 -617362 -311180 417141 1010873 637318
31278 637318 -380674 -739615 -111251 234378 -610651 -1705851 -1663186 -659617 53220
$$ packed form
31349d79050O61882K86568l90848o20204j67000M18135M92618R1989k16723j15105
31339c7738J60797K84317K52560K02288J05638j07585k98415k61848n7250N4021
31329B96785m80k0205R7898J53913k1796k31308j63792J26557K95299K16713R0474
31318H40058K4311j20198l62827m64685l28982j73597r9825R2985L90594L54985
31308A52819j42841m77569j43383L70749L05794j41594j94813J52900J77409k41580
31298a82109l88931K8710M12586L48541J90194J90211m403m99358o93735k66145
31288h64439J86434J15926j35044q6832O9466R7127L06182P28321N93732l73555
31278F37318j017992l58941O28364L45629q45029j095200M2665J003569P12837
$$ plain form
31269 53220 27133 -189854 -357436 -771826 -1249859 -1087489 -279337 205274 -242393 -1027762
31259 -1027762 -1270472 -925037 -508498 -226875 71995 390136 560527 610791 727881 902145
31249 902145 924883 728294 467336 253535 47563 -114356 509 533504 1202629 1477072
31239 1477072 1168791 693806 565708 732872 705120 335986 88204 317999 661914 539362
31229 539362 40271 -206612 -10347 91331 -315398 -865585 -953501 -582644 -249756 -170004
31219 -170004 -85534 180932 428800 453213 347200 226704 -46337 -578284 -1077887 -1109347
31209 -1109347 -647763 -106392 156739 107303 -140915 -454274 -611125 -441777 -144402 -158134
31199 -158134 -568255 -913877 -773338 -289101 99004 207882 160961 89084 36305 15160
$$ packed form
31269E3220k6087k16987j67582m14390m78033J62370Q08152M84611m47667p85369
31259a027762k42710L45435M16539K81623K98870L18141J70391N0264J17090J74264
31249I02145K2738j96589k60958k13801k05972j61919J14865N32995O69125K74443
31239A477072l08281m74985j28098J67164k7752l69134k47782K29795L43915j22552
31229E39362m99091k46883J96265J01678m06729n50187q7916L70857L32888P9752
31219a70004Q4470K66466K47868K4413j06013j20496k73041n31947m99603l1460
31209a109347M61584N41371K63131m9436k48218l13359j56851J69348K97375j3732
31199a58134m10121l45622J40539M84237L88105J08878m6921p1877n2779k1145
$$ plain form
31189 15160 -42808 -221405 -355905 -112481 461262 812956 627442 332612 443183 742463
31179 742463 657371 179842 -204447 -331465 -447291 -575018 -473759 -228328 -210748 -392237
31169 -392237 -343135 -6109 199473 174191 332796 785906 1036677 810380 522333 540858
31159 540858 604168 391550 89060 -67614 -245122 -512662 -458435 110759 601387 424066
31149 424066 -75146 -164117 168355 411181 557457 1095268 2039978 2739175 2736912 2247652
31139 2247652 1674943 1150361 651078 183516 -222595 -430824 -193133 451040 931162
31130 931162 723789 60057 -368935 -295349 -27242 133964 119807 -151502 -688188 -1118030
31120 -1118030 -1000583 -460064 -35373 59925 29982 -56369 -294229 -447841 -114101 539884
$$ packed form
31189A5160n7968j78597j34500K43424N73743L51694j85514k94830J10571K99280
31179G42463q5092m77529l84289j27018j15826j27727J01259K45431J7580j81489
31169c92237M9102L37026K05582k5282J58605M53110K50771k26297k88047J8525
31159E40858O3310k12618l02490j56674j77508k67540N4227N69194M90628j77321
31149D24066m99212q8971L32472K42826J46276N37811R44710O99197k263m89260
31139B247652n72709n24582m99283m67562m06111k08229K37691O44173M80122
31130I31162k07373o63732m28992P3586K68107J61206j4157k71309n36686m29842
31120a118030J17447N40519M24691R5298k9943q6351k37860j53612L33740O53985
$$ plain form
31110 539884 874786 734024 610954 713836 643632 286550 208810 684044 1067932 755950
31100 755950 133902 -117901 -112948 -351401 -669325 -512386 -6672 198758 84293 285729
31090 285729 860580 1006322 369634 -248084 -88425 366847 179093 -526475 -736205 -111195
31080 -111195 529084 467574 53929 -24007 158598 26927 -441811 -652462 -373358 -115783
31070 -115783 -291993 -543696 -350486 61321 665 -610554 -1033925 -721402 -49124 232544
31060 232544 -53288 -464545 -644346 -677526 -770676 -914967 -970288 -879951 -693525 -498318
31050 -498318 -396402 -442328 -548266 -549680 -408653 -252580 -191499 -241621 -460486 -939417
31040 -939417 -1538144 -1858555 -1715006 -1448111 -1469372 -1634191 -1452726 -857593 -298349 -28823
$$ packed form
31110E39884L34902j40762j23070J02882p0204l57082p7740M75234L83888l11982
31100G55950o22048k51803M953k38453l17924J56939N05714K05430j14465K01436
31090B85729N74851J45742o36688o17718J59659M55272j87754p05568k09730O25010
31080a11195O40279o1510m13645p7936J82605j31671m68738k10651K79104K57575
31070a15783j76210k51703J93210M11807o0656o11219m23371L12523O72278K81668
31060B32544k85832m11257j79801l3180r3150j44291n5321R0337J86426J95207
31050d98318J01916m5926j05938j414J41027J56073O1081n0122k18865m78931
31040i39417n98727l20411J43549K66895k1261j64819J81465N95133N59244K69526
$$ plain form
31030 -28823 178947 425864 341828 -267289 -891476 -948573 -605296 -406044 -366842 -105437
31020 -105437 302732 366746 86745 55383 493989 901002 914242 831519 915947 854165 406212
31009 406212 16831 173300 595694 699249 515167 494306 661981 665181 511047 563938
30999 563938 840793 951737 774005 585225 459696 140934 -328377 -440948 23184 552558
30989 552558 554922 102295 -312499 -484983 -589277 -709726 -654971 -275744 255660 597239
30979 597239 621409 561670 701604 960431 986284 715828 538366 673941 705303 161299
30969 161299 -638125 -884062 -401825 116259 141068 4294 251903 755829 925838 568818
30959 568818 95375 -66589 71003 203545 120068 -93944 -139769 176836 648751 804710
$$ packed form
31030b8823K07770K46917q4036o09117o24187n7097L43277J99252L9202K61405
31020a05437M08169O4014k80001l1362M38606M07013J3240q2723Q4428o1782m47953
31009D06212l89381J56469M22394J03555j84082k0861J67675L200j54134N2891
30999E63938K76855J10944j77732j88780j25529l18762m69311j12571M64132N29374
30989E52558K364m52627m14794j72484j04294j20449N4755L79227N31404L41579
30979E97239K4170n9739J39934K58827K5853k70456j77462J35575L1362n44004
30969A61299p99424k45937M82237N18084K4809j36774K47609N03926J70009l57020
30959E68818m73443j61964J37592J32542q3477k14012m5825L16605M71915J55959
$$ plain form
30949 804710 461423 10979 -27075 337672 577777 317183 -229246 -581512 -585142 -481313
30939 -481313 -452251 -351356 6384 476188 718593 624538 395694 247402 255967 453212
30929 453212 776668 931509 668919 271111 334462 889582 1178868 614947 -433723 -1181988
30919 -1181988 -1372466 -1230995 -847815 -215435 324530 325835 -102295 -423623 -445105 -445799
30909 -445799 -559191 -570673 -372208 -110856 162053 492984 662983 393795 -19852 78039
30899 78039 682776 957767 391857 -435139 -630851 -87510 581516 828873 540317 -47488
30889 -47488 -451723 -260008 355697 725623 526656 195079 243279 580711 854980 1044289
30879 1044289 1263075 1331041 1040650 608750 389184 338778 208087 48407 62721 147689
$$ packed form
30949H04710l43287m50444l8054L64747K40105k60594n46429l52266l630J03829
30939d81313K9062J00895L57740M69804K42405r4055k28844j48292Q565J97245
30929D53212L23456J54841k62590l97808O3351N55120K89286n63921j048670p48265
30919a181988j90478J41471L83180O32380N39965J305m28130l21328k1482o94
30909d45799j13392j1482J98465K61352K72909L30931J69999k69188m13647R7891
30899G8039O04737K74991n65910q26996j95712N43341O69026K47357k88556n87805
30889d7488m04235J91715O15705L69926j98967l31577M8200L37432K74269J89309
30879A044289K18786O7966k90391m31900k19566n0406j30691j59680J4314Q4968
$$ plain form
30869 147689 81876 9011 202189 459229 310401 -183165 -411207 -82497 409260 629302
30859 629302 609352 489956 144116 -456814 -847194 -536294 227328 620728 277523 -187543
30849 -187543 72006 1041394 1820398 1689506 872997 85471 -360889 -645107 -845183 -768647
30839 -768647 -398774 -39623 128427 243565 366053 309584 67847 -52741 -23580 -332832
30829 -332832 -1181469 -1859251 -1526820 -384898 541025 659243 272176 -149993 -513227
30820 -513227 -812710 -884062 -707737 -568004 -644501 -726968 -567370 -281874 -150239 -154698
30810 -154698 24209 536468 1039466 978075 240812 -563215 -687573 -107340 475757 540872
30800 540872 282868 68924 -158680 -528107 -709348 -343684 251956 469912 362468 502278
$$ packed form
30869A47689o5813p2865J93178K57040j48828m93566k28042L28710M91757K20042
30859F29302j9950j19396l45840o00930l90380L10900P63622L93400l43205m65066
30849a87543K59549R69388P79004j30892q16509p87526m46360k84218k00076P6536
30839g68647L69873L59151J68050J15138J22488n6469k41737j20588K9161l09252
30829c32832q48637o77782L32431J141922R25923J18218l87067m22169l63234
30820e13227k99483p1352J76325J39733p6497q2467J59598K85496J31635m459
30810a54698J78907N12259N02998o1391p37263q04027j24358N80233N83097O5115
30800E40872k58004k13944k27604l69427j81241L65664N95640K17956j07444J39810
$$ plain form
30790 502278 929882 1025064 581469 232559 446422 756096 487155 -244383 -799538 -918075
30780 -918075 -803654 -558454 -98475 456210 790789 806400 673778 497574 251662 29398
30770 29398 18110 168582 174305 -117765 -475222 -556717 -294323 55621 146987 -184464 -777258
30759 -777258 -1254778 -1362986 -1195640 -1016045 -910962 -760283 -541593 -491113 -841116 -1442770
30749 -1442770 -1774493 -1416921 -516629 316342 622945 495943 271457 14076 -387015
30740 -387015 -706907 -454826 364490 987179 767707 52579 -274485 20543 307039 89635
30730 89635 -314067 -357095 -115247 -121134 -508600 -768349 -436427 272242 705244 531130
30720 531130 93817 2434 448178 995226 1079104 658519 233824 177691 251474 5737
$$ packed form
30790E02278M27604R5182m43595l48910K13863L09674k68941p31538n55155j18537
30780i18075J14421K45200M59979N54685L34579J5611j32622j76204k45912k22264
30770B9398j1288J50472N723k92070l57457q1495K62394L49944R1366l31451n92794
30759g77258m77520j08208J67346J79595J05083J50679K18690N0480l50003o01654
30749a442770l31723L57572R00292Q32971L06603j27002k24486k57381m01091
30740c87015l19892K52081Q19316O22689k19472p15128l27064K95028K86496k17404
30730H9635m03702m3028K41848n887l87466k59749L31922P08669M33002j74114
30720E31130m37313r1383M45744N47048Q3878m20585m24695n6133P3783k45737
$$ plain form
30710 5737 -473960 -596085 -100274 518665 664183 399133 190140 141189 2393 -151558
30700 -151558 102803 716572 947957 380058 -326686 -283955 331826 537208 6528 -469401
30690 -469401 -178136 515946 776208 433776 8253 -147513 -168221 -193686 -78455 262641
30680 262641 567189 523757 196203 -46840 42187 373839 688070 802513 688224 422514
30670 422514 151740 44879 158837 312819 203401 -245280 -697427 -716594 -277676 172457
30660 172457 236909 30227 -12801 265557 501916 233316 -501777 -1083604 -896186 7987
30650 7987 902706 1115310 703973 291340 263499 358235 156369 -237912 -303555 136514
30640 136514 578314 442562 -164439 -564305 -354392 130758 320434 148585 56385 358821
$$ packed form
30710E737m79697j22125M95811O18939J45518k65050k08993m8951j38796j53951
30700a51558K54361O13769K31385n67899p06744M2731O15781K05382n30680m75929
30690d69401K91265O94082K60262l42432m25523j55766k0708k5465J15231L41096
30680B62641L04548m3432l27554k43043Q9027L31652L14231J14443j14289k65710
30670D22514k70774j06861J13958J53982j09418m48681m52147j9167M38918M50133
30660A72457O4452k06682m3028K78358K36359k68600p35093n81827J87418R04173
30650G987Q94719K12604m11337m12633k7841R4736k01866l94281o5643M40069
30640A36514M41800j35752o07001l99866K09913M85150J89676j71849r2200L02436
$$ plain form
30630 358821 899018 1354167 1592996 1593597 1267848 625509 -31830 -363957 -392416 -406419
30620 -406419 -509577 -529389 -374277 -176037 -9862 216396 457796 430626 46961 -315844
30610 -315844 -287514 -50104 -56396 -335083 -486595 -338946 -168961 -180046 -179575 13299 187249
30599 187249 58992 -269051 -472240 -445314 -294624 -71772 146417 73132 -460418 -1049460
30589 -1049460 -1063536 -521220 -159031 -446348 -942950 -913791 -259988 478090 804667 647863
30579 647863 257683 28003 244761 723518 884738 481577 10957 25423 301658 221910
30569 221910 -197649 -311991 127505 619495 732924 663514 712561 760883 604928 364136
30559 364136 199944 30017 -137235 -7493 458417 726042 402603 -86713 -95595 258505
$$ packed form
30630C58821N40197M55149K38829O01l25749o42339o57339l32127k8459j4003
30620d06419j03158j9812J55112J98240J66175K26258K41400k7170l83665l62805
30610c15844K8330K37410o292k78687j51512J47649J69985j1085M71J92874J73950
30599A87249j28257l28043k03189K6926J50690K22852K18189p3285n33550n89042
30589a049460j4076N42316L62189k87317m96602K9159O53803P38078L26577j56804
30579F47863l90180k29680K16758M78757J61220m03161m70620J4466K76235p9748
30569B21910m19559j14342M39496M91990J13429o9410M9047M8322j55955k40792
30559C64136j64192j69927j67252J29742M65910K67625l23439m89316q882L54100
$$ plain form
30549 258505 327478 -36151 -337483 -266929 -36092 145731 333246 475005 336663 -23551
30539 -23551 -184736 19093 236400 174110 26935 56073 103428 -122338 -516116 -687123
30529 -687123 -489699 -166534 -3405 -39741 -130869 -189134 -306166 -579465 -820507 -655073
30519 -655073 -96907 232499 -164570 -883261 -1070894 -597508 -184083 -289176 -507758 -337228
30509 -337228 50174 206466 108755 5123 -65182 -130194 14172 470194 872650 866126
30499 866126 717963 903129 1249839 1115748 383341 -304633 -377845 79724 648302 998314
30489 998314 910968 364703 -233105 -340565 8320 208035 -16893 -197075 85248 454914
30479 454914 284991 -326632 -669063 -389181 139645 405605 287347 -48064 -380761 -454304
$$ packed form
30549B58505O8973l63629l01332P0554K30837J81823J87515J41759j38342l60214
30539b3551j61185K03829K17307o2290j47175K9138M7355k25766l93778j71007
30529f87123J97424L23165J63129l6336r1128n8265j17032k73299k41042J65434
30519f55073N58166L29406l97069p18691j87633M73386M13425j05093k18582J70530
30509c37228L87402J56292r7711j03632p0305o5012J44366M56022M02456o524
30499H66126j48163J85166L46710j34091p32407o87974p3212M57569N68578L50012
30489I98314q7346n46265n97808j07460L48885J99715k24928j80182K82323L69666
30479D54914j69923o11623l42431K79882N28826K65960j18258l35411l32697p3543
$$ plain form
30469 -454304 -96044 494864 827552 675376 354448 256292 290429 61667 -484272 -891278
30459 -891278 -735299 -137536 386069 494972 339063 336337 708596 1244700 1502686 1241312
30449 1241312 637865 73135 -236913 -327365 -280678 -120017 58481 44867 -228949 -493953
30439 -493953 -397512 61966 514123 641619 474086 221302 -26791 -323042 -669196 -910616
30429 -910616 -830975 -354421 293152 660979 461090 -85633 -445963 -381108 -177596 -166591
30419 -166591 -250299 -158293 13249 -86154 -438013 -583521 -327472 -110332 -356373 -743818
30409 -743818 -579742 202669 903048 979471 677941 534963 629221 670252 587264 605747
30399 605747 795171 919842 808901 600320 516492 585401 657831 550743 146004 -483681
$$ packed form
30469d54304L58260N90908L32688j52176l20928r8156L4137k28762n45939m07006
30459h91278J55979N97763N23605J08903j55909k726L72259N36104K57986k61374
30449A241312o03447n64730l10048r0452M6687J60661J78498j3614k73816k65004
30439d93953R6441M59478M52157J27496j67533k52784k48093k96251l46154k41420
30429i10616P9641M76554O47573L67827j99889n46723l60330O4855K03512J1005
30419a66591q3708R2006J71542r9403l51859j45508K56049K17140k46041l87445
30409g43818J64076P82411P00379P6423l01530j42978R4258M1031q2988J8483
30399F05747J89424J24671j10941k08581q3828O8909P2430j07088m04739o29685
$$ plain form
30389 -483681 -1026282 -1184581 -985670 -656921 -258784 259618 686283 674635 346194 279357
30379 279357 652862 881466 497086 -41279 28194 626579 952648 625677 67016 -283839
30369 -283839 -506905 -768538 -882189 -621509 -138351 224294 333320 285178 210498 208015
30359 208015 298246 325714 73590 -437128 -914136 -1086543 -867029 -290703 412429 732589
30349 732589 288344 -588697 -1072680 -803188 -276174 -121753 -363858 -606710 -596056 -327053
30339 -327053 98723 438087 378835 -87503 -572471 -760225 -713393 -542803 -130000 542084
30329 542084 1108645 1216991 972451 716432 605715 649641 848560 1020275 839646 362136
30319 362136 121111 349017 546586 278682 -84596 -23457 188594 -37736 -518269 -553438
$$ packed form
30389d83681n42601j58299J98911L28749L98137N18402M26665j1648l28441o6837
30379B79357L73505K28604l84380n38365O9473N98385L26069l26971n58661l50855
30369b83839k23066k61633j13651K60680M83158L62645J09026m8142p4680k483
30359B08015R0231K7468k52124n10718m77008j72407K19514N76326P03132L20160
30349G32589m44245q77041m83983K69492N27014J54421k42105k42852J0654K69003
30339c27053M25776L39364n9252m66338m84968j87754M6832J70590M12803O72084
30329E42084N66561J08346k44540k56019j10717M3926J98919J71715j80629m77510
30319C62136k41025K27906J97569k67904l63278O1139K12051k26330m80533l5169
$$ plain form
30309 -553438 -107885 160983 19451 -89786 8184 -82985 -468011 -636576 -351109 -111293
30299 -111293 -309438 -575467 -438079 -78882 82295 102265 303423 674531 911604 801809
30289 801809 292063 -473016 -955776 -584692 337807 650275 -231703 -1397091 -1574550
30280 -1574550 -766622 -53882 -90873 -572857 -1032140 -1361203 -1504406 -1321370 -924244 -655877
30270 -655877 -613993 -594514 -521930 -506453 -488609 -304380 -101672 -177131 -381325 -261737 123400
30259 123400 171773 -279474 -577977 -218648 380915 533915 270226 143432 362363 645618
30249 645618 753456 684008 469868 213704 199449 521923 723621 313877 -395474 -554767
30239 -554767 23802 521587 244421 -427243 -662852 -359505 -101873 -130571 -30542 439304
$$ packed form
30309e53438M45553K68868j41532j09237R7970r1169l85026j68565K85467K39816
30299a11293j98145k66029J37388L59197J61177J9970K01158L71108K37073j09795
30289H01809n09746p65079m82760L71084R22499L12468q81978j165388j77459
30280a574550Q07928P12740l6991m81984m59283l29063j43203J83036L97126K68367
30270f55877M1884J9479P2584J5477J7844J84229K02708p5459k04194J19588L85137
30259A23400M8373m51247k98503L59329N99563J53000k63689j26794K18931K83255
30249F45618J07838o9448k14140k56164j4255L22474K01698m09744p09351j59293
30239e54767N78569M97785k77166o71664k35609L03347K57632k8698J00029M69846
$$ plain form
30229 439304 813446 597116 94890 57533 620320 1079935 820195 74913 -449548 -443547
30219 -443547 -186260 -5416 102420 256017 375652 287792 35642 -121899 -49914 62286
30209 62286 -62883 -413950 -670167 -577203 -236620 48023 127241 99824 112148 205887 348501
30198 348501 469133 457715 276651 88033 103331 279945 364448 285526 252544 347545 315367
30187 315367 8579 -218814 48430 567682 598887 -141598 -1039534 -1273724 -727731 -21830
30177 -21830 238483 56075 -102795 88059 467982 682943 698734 771466 890959 635112
30167 635112 -158694 -915950 -970219 -475947 -133041 -117115 40150 443986 486426 -140851
30157 -140851 -771484 -689807 -229530 -233748 -725408 -912004 -446778 91592 131354 -138479
$$ packed form
30229D39304L74142k16330n02226l7357N62787M59615k59740p45282n24461O001
30219d43547K57287J80844J07836J53597J19635q7860k52150j57541P1985J12200
30209F2286j25169l51067k56217R2964L40583K84643P9218k7417J2324R3739J42614
30198C48501J20632j1418j81064j88618J5298J76614Q4503p8922l2982R5001l2178
30187C15367l06788k27393K67244N19252L1205p40485q97936k34190N45993P05901
30177b1830K60313j82408j58870J90854L79923K14961J5791P2732J19493k55847
30167F35112p93806p57256n4269M94272L42906J5926J57265M03836M2440o27277
30157a40851o30633Q1677M60277m218m91660j86596M65226N38370L9762k69833
$$ plain form
30147 -138479 -236843 -103031 11142 -11912 -168225 -504023 -927147 -1074229 -728165 -220155
30137 -220155 -69486 -314739 -535510 -489351 -380158 -450942 -623194 -685540 -641980 -701023
30127 -701023 -980109 -1312137 -1347896 -887212 -165218 279374 165531 -164844 -130997 379238
30117 379238 922606 1117151 1045779 949603 839921 649665 522795 623825 781149 655841
30107 655841 238047 -131695 -255191 -292623 -420120 -565667 -616934 -626672 -629638 -486985 -142920
30096 -142920 147343 112260 -130527 -224316 -47583 219796 436435 615195 713507 601200
30086 601200 283034 -90248 -454433 -812188 -980502 -721256 -217392 -10815 -243094 -352280
30076 -352280 115778 720693 646327 -153531 -859941 -855797 -414415 -187555 -390953 -706975
$$ packed form
30147a38479r8364J33812J14173k3054j56313l35798m23124j47082L46064N08010
30137b20155J50669k45253k20771M6159J09193p0784j72252o2346M3560n9043
30127g01023k79086l32028l5759M60684P21994M44592j13843l30375L3847N10235
30117C79238N43368J94545p1372r6176j09682j90256j26870J01030J57324j25308
30107F55841m17794l69742j23496l7432j27497j45547n1267r738k966J42653L44065
30096a42920K90263l5083k42787r3789J76733K67379K16639J78760R8312j12307
30086F01200l18166l73282l64185l57755j68314K59246N03864K06577k32279j09186
30076c52280M68058O04915p4366p99858p06410M144M41382K26860k03398l16022
$$ plain form
30066 -706975 -726671 -283866 451519 1033685 1059428 588455 113241 -69 131855 219858
30056 219858 229339 293194 408974 492371 578883 674088 525045 -91694 -876536 -1190265 -834600
30045 -834600 -320099 -191589 -380305 -460626 -300128 -118879 -26430 126802 397463 552032
30035 552032 368036 -33205 -285734 -126787 409572 1028678 1342393 1141674 618823 220075
30025 220075 166493 217684 34646 -331927 -509338 -323554 -47842 -64468 -390410 -622659
30015 -622659 -355849 338298 886054 794267 256727 -62188 68064 124540 -300734 -725291
30005 -725291 -448115 262054 434869 -161228 -720151 -751506 -777412 -1150722 -1128748 -71478
29995 -71478 1130434 1061996 -78679 -666600 -42040 593050 120450 -821945 -929488 -167112
$$ packed form
30066g06975j9696M42805P35385N82166K5743m70973m75214j13310J31924Q8003
30056B19858R481O3855J15780Q3397Q6512R5205j49043o16739p84842l13729L55665
30045h34600N14501J28510j88716q0321J60498J81249R2449J53232K70661J54569
30035E52032j83996m01241k52529J58947N36359O19106L13715k00719n22851l98748
30025B20075n3582N1191j83038l66573j77411J85784K75712j6626l25942k32249
30015f22659K66810O94147N47756r1787n37540l18915J30252N6476m25274m24557
30005g25291K77176P10169J72815n96097n58923l1355k5906l73310K1974J057270
29995g1478J201912o8438j140675n87921O24560O35090m72600r42395j07543P62376
$$ plain form
29985 -167112 370326 104795 -461655 -708507 -635228 -560876 -644006 -830869 -932130 -704693
29975 -704693 -124187 457207 671880 566897 425412 309395 99041 -141399 -198168 -45857
29965 -45857 163143 368550 550829 516136 103780 -431664 -596089 -218243 424073 956417
29955 956417 1097984 654919 -258257 -1059812 -1194561 -786066 -437493 -457434 -691818 -990964
29945 -990964 -1279448 -1223659 -519283 387624 572727 -126104 -800744 -729037 -272037 -73087
29935 -73087 -39775 208692 426795 133489 -370720 -283668 422540 839368 416017 -300138
29925 -300138 -547760 -394246 -423778 -763047 -967961 -772315 -471840 -460279 -691438 -803721
29915 -803721 -647256 -463823 -507100 -657126 -582029 -227344 77231 65623 -110900 -125876
$$ packed form
29985a67112N37438k65531n66450k46852P3279P4352q3130j86863j01261K27437
29975g04693N80506N81394K14673j04983j41485j16017k10354k40440n6769J52311
29965d5857K09000K05407J82279l4693m12356n35444j64425L77846O42316N32344
29955I56417J41567m43065r13176q01555j34749M08495L48573j9941k34384k99146
29945i90964k88484N5789P04376R06907J85103o98831o74640P1707M57000J98950
29935g3087L3312K48467K18103k93306n04209Q7052P06208M16828m23351p16155
29925c00138k47622J53514k9532l39269k04914J95646L00475J1561k31159j12283
29915h03721J56465J83433m3277j50026P5097L54685L04575j1608j76523j4976
$$ plain form
29905 -125876 80774 297602 368358 291643 47797 -407540 -930817 -1200626 -1055671 -673005
29895 -673005 -306470 6930 345048 646774 780712 810212 924226 1054457 849009 224150
29885 224150 -297189 -139774 531159 959787 752166 263132 -65771 -267973 -473373 -438619
29875 -438619 61379 682240 890030 701848 517343 395598 133731 -40408 377770 1210327
29865 1210327 1537402 897960 -65616 -515870 -425440 -275601 -252103 -229249 -191880 -200665
29855 -200665 -183963 -120020 -159952 -285546 -204313 106761 190140 -167027 -457435 -194679
29845 -194679 304370 440649 238414 116332 126983 94394 153216 402058 356598 -375074
29835 -375074 -1122418 -857793 210876 791602 326483 -384020 -586707 -541047 -653783 -632490
$$ packed form
29905a25876K06650K16828P0756p6715k43846m55337n23277k69809J44955L82666
29895f73005L66535L13400L38118L01726J33938K9500J14014J30231k05448o24859
29885B24150n21339J57415O70933M28628k07621m89034l28903k02202k05400L4754
29875d38619M99998O20861K07790j88182j84505j21745k61867j74139M18178Q32557
29865A210327L27075o39442r63576m50254R0430J49839K3498K2854L7369q785
29855b00665J6702O3943l9932j25594Q1233L11074Q3379l57167k90408K62756
29845a94679M99049J36279k02235j22082J0651l2589N8822K48842m5460p31672
29835c75074p47344K64625J068669N80726m65119p10503k02687M5660j12736K1293
$$ plain form
29825 -632490 -136519 492624 818180 1010606 1323717 1432760 987774 369071 179563 332478
29815 332478 331906 164402 182963 280031 -85180 -1016025 -1914443 -2166510 -1697040 -865247
29805 -865247 -188874 -109301 -627838 -1194570 -1279950 -966012 -658513 -424627 -86122 205206
29795 205206 106004 -201341 -62163 685038 1315368 1095810 209372 -497113 -464611 122925
$$ packed form
29825f32490M95971O29143L25556J92426L13111J09043m44986o18703j89508J52915
29815C32478n72j67504J8561R7068l65211r30845q98418k52067M69470Q31793
29805h65247O76373P9573n18537n66732q5380L13938L07499K33886L38505K91328
29795B05206r9202l07345J39178P47201O30330k19558q86438p06485L2502N87536
$$ [...]
##END NTUPLES=NMR SPECTRUM
##END=
