##TITLE=31Pdec_LY-13Dix.5.B
 CD3CN, 24 sc
 4.06.2021
##JCAMPDX= 6.0         $$ Bruker NMR JCAMP-DX V2.0
##DATA TYPE= NMR SPECTRUM
##DATA CLASS= NTUPLES
##ORIGIN= UXNMR, Bruker Analytische Messtechnik GmbH
##OWNER= root
$$ XWIN-NMR		Version 3.5
$$ Fri Jun  4 11:49:37 2021 Russian Standard Time (UT+4h)  she@DPX200
##.OBSERVE FREQUENCY= 81.013821
##.OBSERVE NUCLEUS= ^31P
##.ACQUISITION MODE= SIMULTANEOUS
##.ACQUISITION SCHEME= undefined
##.AVERAGES= 24
##.DIGITISER RES= 16
##SPECTROMETER/DATA SYSTEM= spect
##.PULSE SEQUENCE= zgpg30
##.SOLVENT NAME= CDCl3
##.SHIFT REFERENCE= (INTERNAL, CDCl3, 0, 248.564)
##AUDIT TRAIL= $$ (NUMBER, WHEN, WHO, WHERE, WHAT)
$$ ##TITLE= Audit trail, XWIN-NMR		Version 3.5
$$ ##JCAMPDX= 5.01
$$ ##ORIGIN= Bruker BioSpin GmbH
$$ ##OWNER= she
$$ F:/spectra/data/she/nmr/P31/1/pdata/1/auditp.txt
$$ ##AUDIT TRAIL=  $$ (NUMBER, WHEN, WHO, WHERE, WHAT)
(   1,<2021-06-04 11:47:46.59 +0400>,<she>,<DPX200>,
      <created by zg, POWCHK disabled, PULCHK disabled
       configuration hash MD5:
       00 E9 B6 7A A2 85 ED C7 34 08 36 98 17 FE 4E 26
       data hash MD5: 32K
       8A 74 2F 7A 05 07 9D F4 9F DA A6 91 F9 BC AF BD>)
(   2,<2021-06-04 11:48:31.98 +0400>,<she>,<DPX200>,
      <Start of raw data processing
       efp BC_mod = 2 LB = 1 FT_mod = 6 PKNL = 1 PHC0 = -6390.309 PHC1 = 1111.475 SI = 64K 
       data hash MD5: 64K
       42 1C 08 B8 7C 7C AF 95 1A 1A 4C B1 33 22 6D 14>)
(   3,<2021-06-04 11:48:46.54 +0400>,<she>,<DPX200>,
      <pk PHC0 = -4.821611 PHC1 = 0 
       data hash MD5: 64K
       14 0F EF 6C 24 B7 C9 E1 B5 DC E0 6A CC 1F D0 B5>)
$$ ##END=
$$ 
$$ hash MD5
$$ 93 9C DF E7 C0 39 F0 2D 64 34 4C 96 04 B4 4A F8
##$RELAX= 
##$RELAX= 
##$RELAX= 
##$RELAX= 
##$RELAX= 
##$RELAX= 
##$RELAX= 
##$RELAX= 
$$ Bruker specific parameters
$$ --------------------------
##$DU= <F:/spectra>
##$EXPNO= 1
##$NAME= <P31>
##$PROCNO= 1
##$TYPE= <nmr>
##$USER= <she>
##$AMP= (0..31)
100 100 100 100 100 100 100 100 100 100 100 100 100 100 100 100 100 100 
100 100 100 100 100 100 100 100 100 100 100 100 100 100 
##$AQSEQ= 0
##$AQ_mod= 1
##$AUNM= <au_zg>
##$AUTOPOS= <>
##$BF1= 81.014009
##$BF2= 200.13
##$BF3= 200.13
##$BF4= 200.13
##$BF5= 200.13
##$BF6= 200.13
##$BF7= 200.13
##$BF8= 200.13
##$BYTORDA= 1
##$CFDGTYP= 0
##$CFRGTYP= 5
##$CHEMSTR= <none>
##$CNST= (0..31)
1 1 145 1 1 1 1 1 1 1 1 1 1 1 1 1 1 1 1 1 1 1 1 1 1 1 1 1 1 1 1 1 
##$CPDPRG= <waltz16>
##$CPDPRG1= <>
##$CPDPRG2= <waltz16>
##$CPDPRG3= <>
##$CPDPRG4= <mlev>
##$CPDPRG5= <mlev>
##$CPDPRG6= <mlev>
##$CPDPRG7= <mlev>
##$CPDPRG8= <mlev>
##$CPDPRGB= <>
##$CPDPRGT= <>
##$D= (0..31)
0 1 0 0 0 0 0 0 0 0 0 0.03 2e-05 3e-06 0 0 0 0 0 0 0 0 0 0 0 0 0 0 0 0 
0 0 
##$DATE= 1622792866
##$DBL= (0..7)
120 120 120 11 120 120 24 19 
##$DBP= (0..7)
150 150 150 150 150 150 150 150 
##$DBP07= 0
##$DBPNAM0= <>
##$DBPNAM1= <>
##$DBPNAM2= <>
##$DBPNAM3= <>
##$DBPNAM4= <>
##$DBPNAM5= <>
##$DBPNAM6= <>
##$DBPNAM7= <>
##$DBPOAL= (0..7)
0.5 0.5 0.5 0.5 0.5 0.5 0.5 0.5 
##$DBPOFFS= (0..7)
$$ [...]
##$SUBNAM2= <"">
##$SUBNAM3= <"">
##$SUBNAM4= <"">
##$SUBNAM5= <"">
##$SUBNAM6= <"">
##$SUBNAM7= <"">
##$SUBNAM8= <"">
##$SUBNAM9= <"">
##$SW= 501.771253377433
##$SWIBOX= (0..15)
0 1 3 0 0 0 0 0 0 0 0 0 0 0 0 0 
##$SW_h= 40650.406504065
##$TD= 32768
##$TD0= 1
##$TE= 0
##$TE2= 300
##$TE3= 300
##$TEG= 300
##$TL= (0..7)
0 120 53 12 22 120 120 120 
##$TP= (0..7)
150 150 150 150 150 150 150 150 
##$TP07= 0
##$TPNAME0= <>
##$TPNAME1= <>
##$TPNAME2= <>
##$TPNAME3= <>
##$TPNAME4= <>
##$TPNAME5= <>
##$TPNAME6= <>
##$TPNAME7= <>
##$TPOAL= (0..7)
0.5 0.5 0.5 0.5 0.5 0.5 0.5 0.5 
##$TPOFFS= (0..7)
0 0 0 0 0 0 0 0 
##$TUNHIN= 0
##$TUNHOUT= 0
##$TUNXOUT= 0
##$USERA1= <user>
##$USERA2= <user>
##$USERA3= <user>
##$USERA4= <user>
##$USERA5= <user>
##$V9= 5
##$VALIST= <valist>
##$VCLIST= <CCCCCCCCCCCCCCC>
##$VD= 0
##$VDLIST= <DDDDDDDDDDDDDDD>
##$VPLIST= <PPPPPPPPPPPPPPP>
##$VTLIST= <TTTTTTTTTTTTTTT>
##$WBST= 1024
##$WBSW= 4
##$XGAIN= (0..3)
0 0 0 0 
##$XL= 0
##$YL= 0
##$YMAX_a= 2621
##$YMIN_a= -4780
##$ZGOPTNS= <>
##$ZL1= 120
##$ZL2= 120
##$ZL3= 120
##$ZL4= 120
##$ABSF1= 0
##$ABSF2= 0
##$ABSG= 0
##$ABSL= 0
##$ALPHA= 0
##$AQORDER= 0
##$ASSFAC= 0
##$ASSFACI= 0
##$ASSFACX= 0
##$ASSWID= 0
##$AUNMP= <proc_1d>
##$AZFE= 0.1
##$AZFW= 0.5
##$BCFW= 0
##$BC_mod= 2
##$BYTORDP= 0
##$COROFFS= 0
##$CY= -3
##$DATMOD= 1
##$DC= 0
##$DFILT= <>
##$DTYPP= 0
##$F1P= 0
##$F2P= 0
##$FCOR= 1
##$FTSIZE= 65536
##$FT_mod= 6
##$GAMMA= 0
##$GB= 0
##$INTBC= 1
##$INTSCL= 5.30512e-09
##$ISEN= 30
##$LB= 1
##$LEV0= 0
##$LPBIN= 0
##$MAXI= 10000
##$MC2= 0
##$MEAN= 0
##$ME_mod= 0
##$MI= 50
##$NCOEF= 0
##$NC_proc= -6
##$NLEV= 6
##$NOISF1= 182.463
##$NOISF2= 159.3651
##$NSP= 0
##$NTH_PI= 0
##$NZP= 0
##$OFFSET= 248.5645
##$PC= 4
##$PHC0= -6395.131
##$PHC1= 1111.475
##$PH_mod= 1
##$PKNL= yes
##$PPARMOD= 0
##$PSCAL= 0
##$PSIGN= 0
##$REVERSE= no
##$SF= 81.014009
##$SI= 65536
##$SIGF1= 159.3651
##$SIGF2= -187.1042
##$SINO= 113.3802
##$SIOLD= 16384
##$SREGLST= <1H.CDCl3>
##$SSB= 0
##$STSI= 65536
##$STSR= 0
##$SW_p= 40650.406504065
##$SYMM= 0
##$S_DEV= 0
##$TDeff= 32768
##$TDoff= 0
##$TI= <>
##$TILT= no
##$TM1= 0
##$TM2= 0
##$TOPLEV= 0
##$USERP1= <user>
##$USERP2= <user>
##$USERP3= <user>
##$USERP4= <user>
##$USERP5= <user>
##$WDW= 1
##$XDIM= 65536
##$YMAX_p= 421988129
##$YMIN_p= -102345378
$$ End of Bruker specific parameters
$$ ---------------------------------
##NTUPLES= NMR SPECTRUM
##VAR_NAME=  FREQUENCY,     SPECTRUM/REAL,   SPECTRUM/IMAG
##SYMBOL=    X,             R,               I
##VAR_TYPE=  INDEPENDENT,   DEPENDENT,       DEPENDENT
##VAR_FORM=  AFFN,          ASDF,            ASDF
##VAR_DIM=   65536,         65536,           65536
##UNITS=     HZ,            ARBITRARY UNITS, ARBITRARY UNITS
##FACTOR=    0.620285442955139, 1,           1
##FIRST=     20137.2065510759, 0,            0
##LAST=      -20513.1999529892, 0,           0
##MIN=       -20513.1999529892, -102345378,  0
##MAX=       20137.2065510759, 421988129,    0
$$ Real data points
##PAGE= N=1
##DATA TABLE= (X++(R..R)), XYDATA
$$ [...]
35693B4443J78732o65764j041290N4418J624669J951441P25357p49291j160581
35684I42134m60034L86313N13816p3728o53608n38695K89833J153732J221305
35675B781068K56414j007176j425772o66033L03419L42942l81773o35249J72352
35666b59808J206889J401683P65105L2300m46437q15824j016525p03530J06076
35657B69929Q49103J052834Q11201M62103Q9009l78246p34612n84445J6250L56320
35647B209446j06101q91649j001313k70941M09917M22739K28810L91569N29146
35638A921623L2813p11872p96494j97839K55825J75821q6692l32987o86990q70501
35628a297293l87315M27706O26574J57080M3433O85788J119179N59793l45700
$$ plain form
35693 24443 203175 -462589 -1503879 -1449461 175208 2126649 2852006 2102715 942134
35684 942134 482100 868413 1382229 1308501 654893 116198 406031 1559763 2781068
35675 2781068 3037482 2030306 604534 -61499 241920 584862 203089 -432160 -259808
35666 -259808 947081 2348764 3113869 3146169 2699732 1883908 867383 163853 269929
35657 269929 1119032 2171866 2983067 3445170 3534179 3155933 2421321 1836876 1853126 2209446
35647 2209446 2103345 1211696 210383 -60558 349359 772098 1000908 1392477 1921623
35638 1921623 1954436 1242564 446070 248231 504056 679877 593185 260198 -426792 -1297293
35628 -1297293 -1684608 -1256902 -630328 -473248 -429815 255973 1375152 1934945 1589245
35619A589245n59918q4957M07884O21006N34740l1316r42952j416425r41572m1660
35609h65925N49781Q54076J073787P97194k31482j139280q82423J40613N57008
35600H53349l9667o73793n17536J26805N12526L30623k44256p53130o34285J84492
35590h54872Q76260N68306l68432o28140K65827J242355J091235N666p85401n83751
35580H29053J15997M52780K02044k50235o04512q39122p43672N4385J192516J399987
35570A809221J08408j246935p99450J011830J787143N27022r79586q75049K39442
35561A582046O88348K61840j63386m73089j034713j304168n48649M84030M58717
35552d9024k40909q918J202646J599089L93647r60840j075767m70909k09392j60446
$$ plain form
35619 1589245 1029327 944370 1352254 1973260 2508000 2476684 1533732 117307 -824265 -865925
35609 -865925 -316144 537932 1611719 2408913 2177431 1038151 155728 296341 853349
35600 853349 813682 139889 -377647 -250842 261684 592307 348051 -405079 -1039364 -854872
35590 -854872 21388 589694 221262 -406878 -141051 1101304 2192539 2198205 1412804 829053
35580 829053 945050 1397830 1599874 1349639 745127 -93995 -837667 -783282 409234 1809221
35570 1809221 1917629 670694 -128756 883074 2670217 3197239 2217653 1342604 1582046
35561 1582046 2270394 2532234 2368848 1895759 861046 -443122 -991771 -507741 -49024
35552 -49024 -289933 -298851 903795 2502884 2896531 1935691 859924 389015 179623 19177
35542A9177K52576O90577M67643k39186p23229p48354m81758J083M97718N64011
35532C00258K30673K15095Q13322J240152P51703k02729p02013o79012p07026
35523A260423q56581o12180J92515R96615J097285L35385o84367r89072k25275
35514E14748P00725N39518o42664j440446r43100K25369J006547J153660R19797
35505B034154M00733j92533l79667j42048r7666m48426n97975l19171k54983n95830
35495e93412m52902N25794J148376N09661l24744M1052R97049R61003J4497l71959
35485B454415J72242N94115M41590M12132Q05427J040271Q36918M36520l26425
35476F867205j635389k486248j653674R6879O88812j69661o39403Q2411N09836
$$ plain form
35542 19177 271753 962330 1429973 1190787 467558 -280796 -762554 -761471 -263753 300258
35532 300258 530931 746026 1559348 2799500 3551203 3348474 2646461 1967449 1260423
35523 1260423 403842 -208338 -15823 980792 2078077 2413462 1729095 740023 514748
35514 514748 1215473 1754991 1112327 -328119 -1271219 -1045850 -39303 1114357 2034154
35505 2034154 2434887 2242354 1862687 1720639 1622973 1174547 576572 257401 2418 -593412
35495 -593412 -1046314 -520520 627856 1137517 812773 853825 1850874 2811877 2826374 2454415
35485 2454415 2626657 3220772 3662362 4074494 4879921 5920192 6757110 7193630 6867205
35476 6867205 5231816 2745568 1091894 1188773 1877585 1707924 1068521 1150932 1660768
35467A660768l67441j288880r64800j41576O3978J23165P23167J031060J95706
35458A035147p41543l92359O04143P09592M4871j88248k2622l51351q75445n91682
35448g69497J35289J72768j04818N24909J461884Q68320r80695j649743l60466
35439g02049Q45070O22093K80814R02206J152267j10662j350083q25129K81216
35430A095743j69003j530689j439073K07318J234107Q78520O07243J014771P19822
35421B618759p86504j695905o69168R06847J077457K25834L0694N87002N22234
35412B817250m69390j075098m76170M75609O46416J11627l06742k54486j801J69629
35402A636844J94059M5623k47944m91385n07002l97240m08645n52727n59250k44282
$$ plain form
35467 1660768 1293327 4447 -960353 -1101929 -1037951 -914786 -191619 839441 1035147
35458 1035147 293604 -98755 505388 1214980 1259851 1071603 1048981 697630 -177815 -769497
35448 -769497 -634208 -461440 -566258 -41349 1420535 2288855 1308160 -341583 -702049
35439 -702049 143021 765114 1045928 1948134 3100401 2989739 1639656 814527 1095743
35430 1095743 926740 -603949 -2043022 -1835704 -601597 276923 884166 1898937 2618759
35421 2618759 1832255 136350 -532818 374029 1451486 1677320 1708014 2295016 2817250
35412 2817250 2347860 1272762 796592 1272201 1918617 2030244 1723502 1469016 1467215 1636844
35402 1636844 1830903 1876526 1628582 1137197 630195 232955 -175690 -728417 -1287667 -1531949
35392a531949K31313N43099N22807K18948k09377m92027k88118M61646J238583
35383F94925J355115P62062J09769j34370k08114m24588n13215j31357L33529
35374A843756K17969k95676l33408K92021O91060K47911l95689l33807J85945
35365B120082J80671m65022p44621o3613P63924O02649l72066q62762k38201N86224
35355A507265M38289m54619q13087j75689M46373J27603n30968l07305P09171
35346I47033J113241J91478j007815j083242r7319O77112M91100r8689j89839
35337I43060K67960N07975j0398q61943j094296l70696N81850Q80334N78017L78619
35327A800482M23827J19384o63480j049267l93662N76676O64464j14377o21151
$$ plain form
35392 -1531949 -1300636 -757537 -234730 -15782 -225159 -717186 -1005304 -543658 694925
35383 694925 2050040 2812102 2921871 2787501 2579387 2154799 1641584 1510227 1843756
35374 1843756 2061725 1766049 1432641 1724662 2415722 2663633 2267944 1934137 2120082
35365 2120082 2300753 1835731 1091110 1027497 1791421 2394070 2022004 1159242 921041 1507265
35355 1507265 1945554 1490935 677848 502159 948532 1076135 545167 237862 947033
35346 947033 2060274 2251752 1243937 160695 63376 740488 1231588 1132899 943060
35337 943060 1211020 1718995 1708597 846654 -247642 -618338 -36488 843846 1421863 1800482
35327 1800482 2224309 2343693 1680213 630946 237284 813960 1478424 1364047 742896
35318G42896k55524L45715L91428n9821m67188n50451l12162J63727N50226L60557
35308I09403l83258r37086p32294j52192Q9418N4102M18084J280903J792773J187502
35298C527355k14495j295846j275137m24361K78986K09090k31281k21123K21517
35289E74705K10449m63828o10050O19578J954796J459800m67161j367911l52883
35280A557495N48545k56011j183360n9132K005392J986090l26407j821288o73876
35271A777448J183739J260032j07619j110934j354686j469119j216026j08268
35263a145433R39465P07546q3188K55111J396112J246594o03558j934699j180761
35254d02811L39812O87087J41143J93242Q45016P51229l81140j230588q38475
$$ plain form
35318 742896 487372 833087 1224515 1164694 697506 147055 -165107 -1380 548846 909403
35308 909403 526145 -410941 -1143235 -1295427 -1206009 -1151907 -733823 547080 2339853 3527355
35298 3527355 3312860 2017014 741877 317516 596502 805592 574311 353188 574705
35289 574705 785154 321326 -288724 330854 2285650 3745450 3278289 1910378 1557495
35280 1557495 2106040 1850029 666669 607537 2612929 4599019 4272612 2451324 1777448
35271 1777448 2961187 4221219 4113600 3002666 1647980 178861 -1037165 -1145433
35263 -1145433 -205968 501578 418390 673501 2069613 3316207 2712649 777950 -402811
35254 -402811 -62999 624088 765231 958473 1803489 2554718 2173578 942990 104515
35245A04515J24868M88661J23275j67937J48065P07274P44795J410r34561j228968
35235A11397o93995R3313N22507M87617J71548k60288n37839k75391N34161J235002
35225A388032J080584M8485j084855j432932p55166L03320P58819L14156k70287
35216C50156j87514K38252M6136p47258r46803P8715J322294J453117N66277j72323
35206B001049k32822j98829o00919j049232q15537J09259Q87999P87314R3785
35197I82067k17594J38102K10041p43095j709048r85085J190429K449929J335562
35188B651308p20479j432309o33091R2013L984j46798J39556K98154p8875m47203
35178b73740k61330J76352L70857M62736Q13284J196933R87478L5377r95054j223968
$$ plain form
35245 104515 229383 718044 841319 673382 821447 1528721 2273516 2274926 1340365 111397
35235 111397 -582598 -489285 33222 520839 692387 432099 -105740 -381131 153030 1388032
35225 1388032 2468616 2517101 1432246 -686 -755852 -452532 306287 620443 350156
35216 350156 162642 400894 447030 -300228 -1247031 -1168316 153978 1607095 2173372 2001049
35206 2001049 1768227 1569398 968479 -80753 -896290 -787031 100968 888282 982067
35197 982067 764473 902575 1112616 369521 -1339527 -2324612 -1134183 1315746 2651308
35188 2651308 1930829 498520 -134571 -42558 -38574 -185372 -45816 252338 173463 -273740
35178 -273740 -535070 -358718 12139 474875 1288159 2485092 3472570 3507947 2512893 1288925
35168A288925m63763M70948N40671l15877j065033q96501k11196J59504K21976
35159b70346N39483J003452Q65597K5938o27912m40989J70265M36968K16309j11246
35149A807519k64676k05811K7745L00273L58557N8764m48310q12139p37338k81681
35139a97097M0990k16093o54713l11706R19433J815728J421777M20271l2217j39038
35129C067335p86877j544580j106726K89091Q13967r6319p21751J56811J196923
35120A267874O47959q22893j227429k83841N36625N57265O00485J088339J150988
35111C515372J48721j166191j646871j102236j85969M18965L72545j84545o10273
35102d40482l85192J38681J73208l28442o50654m78670k00422N9193O63938J408255
$$ plain form
35168 1288925 825162 1296110 1836781 1520904 455871 -440630 -651826 -492322 -270346
35159 -270346 269137 1272589 2138186 2164124 1536212 1095223 1265488 1702456 1918765 1807519
35149 1807519 1542843 1337032 1364777 1665050 2023607 2082371 1634061 821922 84584 -197097
35139 -197097 -156107 -372200 -1026913 -1338619 -419186 1396542 2818319 3238590 3206373 3067335
35129 3067335 2280458 735878 -370848 -81757 732210 635891 -85860 70951 1267874
35120 1267874 1915833 1092940 -134489 -418330 118295 675560 1276045 2364384 3515372
35111 3515372 3664093 2497902 851031 -251205 -437174 -18209 354336 169791 -440482
35102 -440482 -825674 -686993 -513785 -842227 -1492881 -1971551 -2171973 -2112780 -1448842 -40587
35092d0587J351260L14276m96483j87056M42271K35401m22316l35398M23847O44035
35082A929250J9856m07677n0224L49129J19732k29329k0224L88916K48174l57235
35072A990368p52906p61749p89551j016717j122621p74240j2399P86454J154061
35063a299300R24517M63951K09386N0713k80559l73638L19396J086211N08656
35054A609333j115053j532539K28284J996884J457075l92014r15276N5677M07732
35045A800103m36551p69624J08062O87320J35999k66805K36153L23620p64887
35036A053390j392547l15412P92283j8576j553821j401752O4870N79262N466K90698
35026a896139J648167J991481N85635o81932n27984j27074n78229r09041j18879
$$ plain form
35092 -40587 1310673 1624949 1128466 941410 1383681 1619082 1196766 861368 1285215 1929250
35082 1929250 1949106 1541429 1491205 1840334 1960066 1730737 1710513 2099429 2347603 1990368
35072 1990368 1237462 475713 -313838 -1330555 -2453176 -3227416 -3239815 -2453361 -1299300
35063 -1299300 -374783 89168 298554 349267 68708 -304930 14466 1100677 1609333
35054 1609333 494280 -1038259 -809975 1186909 2643984 2251970 1336694 1392371 1800103
35045 1800103 1363552 593928 701990 1389310 1525309 1258504 1494657 1818277 1053390
35036 1053390 -339157 -654569 137714 119138 -1434683 -2836435 -2771565 -2192303 -2186837 -1896139
35026 -1896139 -247972 1743509 2329144 1647212 1119228 992154 413925 -495116 -613995
35017f13995P90402N57992j30219M1345P17040O78349M9467q0115L37674L48038
35007B695978k63873p60969q45640r11149r19179l01445Q24914J432187R27524
34998A878348p0330o16930m70240L2471N30640P15210K98539o32163j394527j230442
34988i59424j42625R54865J112344L82884k38348m3721N25879N83870M5072m00296
34978A820500l68834j36388M5368K26167K81328o7134o05234p65210n44337m45093
34968e58867l88551K35216J164378J205262J65745n02757P6416O89940O7998p87966
34958A366814j41481J402702J535480j62060j439294p26241O28646N15086r38327
34949B041325j832156j172820J71258Q77283N51407k30174n98609j39115O31013
$$ plain form
35017 -613995 176407 734399 604180 645525 1362565 2040914 2090381 2010266 2347940 2695978
35007 2695978 2432105 1671136 825496 -85653 -1004832 -1306277 -481363 950824 1878348
34998 1878348 1808018 1191088 720848 753319 1283959 1999169 2297708 1665545 271018 -959424
34988 -959424 -1102049 -147184 965160 1348044 1109696 1065975 1591854 2175724 2220796 1820500
34978 1820500 1451666 1315278 1360646 1586813 1868141 1801007 1195773 430563 -113774 -558867
34968 -558867 -947418 -712202 452176 1657438 1823183 1320426 1396842 2086782 2154780 1366814
34958 1366814 1225333 2628035 4163515 4001455 2562161 1835920 2464566 2979652 2041325
34949 2041325 209169 -963651 -792393 84890 636297 406123 -192486 -331601 299412
34940B99412P04392j47820q98216n64700L79282O54971O5321k11757N64146J480111
34930B325142J197168j65481j190884j034167l22845l7518j99038j44293K95384
34921G23468N17436O6216o27092p10496j2816O17848L06932o23277q91960M2641
34911e91100J052104P44050n58931j187970m18597O81898R31226M42448j26398
34902I68730o07966q71349m02933P00623J282220P20176R17K4884j8776j015228
34892G81298j814480q76173Q28510J082689J29275K40164J546657J500041o81085
34883B736896k213727j047196Q33675O43124q94236j084012M28207J580113J242122
34874B224966K02987o91008j259976j201542m23385J83797p1527k85999N74093
$$ plain form
34940 299412 1003804 855984 -42232 -606932 -227650 427321 492642 280885 845031 2325142
34930 2325142 3522310 3356829 2165945 1131778 808933 771415 572377 428084 723468
34921 723468 1240904 1307120 680028 -30468 -43284 574564 881496 258219 -633741 -591100
34911 -591100 461004 1205054 646123 -541847 -960444 -278546 652680 1095128 968730
34902 968730 360764 -510585 -913518 -212895 1069325 1789501 1790418 1815302 1796526 781298
34892 781298 -1033182 -1909355 -1080845 1844 131119 371283 1917940 3417981 2736896
34883 2736896 523169 -524027 309648 952772 58536 -1025476 -597269 982844 2224966
34874 2224966 2427953 1736945 476969 -724573 -1147958 -964161 -1035688 -1321687 -747594
34865g47594J550611J028663m33049q51287j8173M26917k510p3474N16314M63728
34855A860146n31202q82069J72774J111786N93527m61802n74592P1667M43374
34846A803609L46518J9050p20210j625326j511812K6634J437630J178313n6815
34837H97591n48578j46993j3526l93338m20512Q9306L31699M1866j67394j57382
34827d87261n08124j072560p21331P87834J935480J436120J75172r9004N42048
34818A988374L67052j088874j865962l22419K079060K332166n1237k283823k057975
34809i03638m06594K97961j95051l17074L68080O49906O0125k90749K17164O26502
34799A06632K40563n5118N44278J121976M56824q95743j406740q10003j28151
$$ plain form
34865 -747594 803017 1831680 1398631 547344 529171 956088 953578 880104 1396418 1860146
34855 1860146 1328944 446875 619649 1731435 2324962 1863160 1288568 1360235 1803609
34846 1803609 2150127 2169177 1448967 -176359 -1688171 -1661537 -223907 954406 897591
34837 897591 349013 202020 188494 -204844 -625356 -536050 -204351 -162485 -329879 -487261
34827 -487261 -995385 -2067945 -2789276 -2001442 -65962 1370158 1545330 1446326 1988374
34818 1988374 2355426 1266552 -599410 -921829 1157231 3489397 3438160 1154337 -903638
34809 -903638 -1310232 -1012271 -1207322 -1524396 -1156316 -506410 -446285 -737034 -519870 106632
34799 106632 347195 292077 836355 1958331 2415155 1519412 112672 -697331 -825482
34790h25482Q8851J79791K97936K39650K29651O44439J004501M72837o10301r70315
34780G51558l53815Q6680k46138m25263K63128Q89486L50924o61184o07442M48287
34770D96221Q80818L9656p41754k17570R19192J194394N15660Q310J15989J37562
34760C348478l24514o70621m58193k20601m76349p33567l12497M23892N85823
34751A161851J44284j35809K2529J08885j91752n33672n32708k04267K56731N59397
34741F55469L16981l52191m91242M81464J484126R80931n78594j119607o2942
34732A314395P04255j54981j224742o59419P45166Q45087l58929q46888j780M75976
34722H38140m05102j181020m15795Q00672N62376p09252q24937P54952K005890
$$ plain form
34790 -825482 -736631 -556840 -258904 -19254 210397 854836 1859337 2332174 1721873 751558
34780 751558 397743 484423 238285 -186978 76150 965636 1316560 655376 47934 496221
34770 496221 1377039 1416695 674941 457371 1376563 2570957 3086617 3094927 3210916 3348478
34760 3348478 3023964 2353343 1895150 1674549 1198200 464633 152136 576028 1161851
34751 1161851 1306135 1170326 1192855 1301740 1109988 576316 43608 -160659 96072 655469
34741 655469 972450 620259 129017 610481 2094607 3075538 2496944 1377337 1314395
34732 1314395 2018650 1863669 638927 -20492 724674 1569761 1210832 363944 362164 838140
34722 838140 433038 -747982 -1163777 -363105 199271 -509981 -1334918 -579966 1425924
34713A425924J290752l71471r65426k94488J73221k79421p94243n70650l6819
34704d22621Q3215j13808j74553j05314k0288L37717R16322Q69129k07034j126373
34694C6392n32871Q70318J084449j71624r68062j99053O76663O7494j095638q44420
34684a076352O05239J113338p0942j169494n61830R14628J331134L64521n55699
34675H94543m20294J81703K33813k16066l03590K91896Q73540O51209l09133j236667
34665F40954j446190p97014L18064J166623J127474K86864n69575p88213m44299
34656e05312N3908N11931P83709O01196P2558j76066O2061R9352m71766q61013
34646A70558l26504M13676L23180q3486L38336J085974O53703p17402j163997
$$ plain form
34713 1425924 2716676 2345205 1379779 1085291 1258512 979091 184848 -385802 -422621
34704 -422621 -339406 -453214 -627767 -733081 -753369 -415652 500670 1369799 1162765 36392
34694 36392 -496479 373839 1458288 1286664 318602 119549 796212 863706 -231932 -1076352
34684 -1076352 -471113 642225 571283 -598211 -1160041 -245413 1085721 1450242 894543
34675 894543 474249 655952 889765 673699 370109 662005 1535545 2186754 1877621 640954
34665 640954 -805236 -1602250 -1284186 -117563 1009911 1296775 727200 -61013 -505312
34656 -505312 -451404 60527 844236 1445432 1517990 1341924 1403985 1503337 1031571 170558
34646 170558 -155946 257730 580910 497424 835760 1921734 2575437 1858035 694038
34637F94038l07941R7530p28052j209314k28410R20699Q49015K96036L26579K28694
34627I38874p47830j279186j4502J588143J128811q55807j575447j92172J246913
34618B37797J132579J80334l70273m03186k45310J2668O1438m01067p94562l36324
34608i25906M39161L44959l68245l30852M95191N99494n07400j375880q60254
34599b489732L50720J061635R82641L28986n49750p61347L51171J663325J233075
34590B170724p28536j748230o34591Q43829P96078j98750n95448k53741J31433
34581b17232N16612R72720Q82111J5669o80893n20354j27689o2004J95217P97924
34571A772081P34117k31669o13597K18327M58372j111454k456453j249320J131386
$$ plain form
34637 694038 386097 483627 -244425 -1453739 -1682149 -761450 87565 383601 710180 938874
34627 938874 191044 -1088142 -1102644 485499 1614310 758503 -816944 -1009116 237797
34618 237797 1370376 1550710 1180437 777251 531941 544609 606047 204980 -589582 -925906
34608 -925906 -486745 -141786 -510031 -840883 -345692 253802 -253598 -1629478 -2489732
34599 -2489732 -2139012 -1077377 -94736 234250 -315500 -1076847 -725676 937649 2170724
34590 2170724 1442188 -306042 -940633 -96804 699274 500524 -94924 -348665 -217232
34581 -217232 299380 1272100 2154211 2169880 1488987 968633 840944 778940 974157 1772081
34571 1772081 2506198 2274529 1660932 1879259 2337631 1226177 -1230276 -2479596 -1348210
34562a348210J600699J84130m98510J32108J02888r98624j046662O93699J931876
34553G53394R97856n86085p55130J08585M95874K56432R6947J5305k45155l13197
34543H24826r884L7749l53165k80484N78856R98486J26079r08179o92103L03810
34533F25991P15424M08586J02306j97525p77196r99852j82194Q75800Q56435k1922
34523A405853m74830k52034j39944k02296K27624Q98374P37112k70083r23954
34514A005822p63351n76720o51905j89999R34987J432961N37142o18902o11704
34505D98331L03551Q81024P08913K84234j01418m95809p05963n09679j94175j52047
34495E16962k17138n8517J04839r5878l57077p4652N93855Q10116K53888l86055
$$ plain form
34562 -1348210 252489 436619 -61891 70217 173105 -825519 -1872181 -1178482 753394
34553 753394 1751250 1165165 410035 518620 1014494 1270926 1367873 1383178 1138023 824826
34543 824826 814942 852691 499526 219042 797898 1796384 1922463 1014284 322181 625991
34533 625991 1341415 1750001 1852307 1654782 877586 -122266 -304460 571340 1427775 1405853
34523 1405853 931023 678989 539045 336749 564373 1462747 2199859 1929776 1005822
34514 1005822 242471 -334249 -986154 -1176153 -241166 1191795 1728937 1110035 498331
34505 498331 801882 1682906 2391819 2676053 2574635 2078826 1372863 863184 669009 516962
34495 516962 299824 241307 346146 250268 -106809 -181461 412394 1222510 1476398 1090343
34485A090343l02146M42583R89787O01136n14991j279477q65132K43845P53610
34476A159558K29203l74605j70270M13269M53568n2948m36895n14450n45167l87660
34466b26397K40823Q38182N74951k93931n83860O2416O54102M23988j41143l47558
34456A201573l57049m99986m31536J29342N32131R3140o27148n38345K49882N45177
34446B97181o7994n82066j03380Q63138J204220O56560j28054o02430p88047q30948
34436h1820o41524j38797M27558O24746K86842k72195n41492l16397J11820K98095
34426b43164J39329l9741R1160M20304M71819N925n53783n42188N4833M85352
34416B89846K46224j88519j31227K05402J31943j96988M8921P68007P27645m47597
$$ plain form
34485 1090343 788197 1230780 2220567 2821703 2306712 1027235 162103 405948 1159558
34476 1159558 1388761 1014156 843886 1257155 1710723 1657775 1220880 706430 161263 -226397
34466 -226397 14426 852608 1427559 1133628 549768 612184 1266286 1690274 1549131 1201573
34456 1201573 844524 344538 -86998 42344 574475 667615 40467 -497878 -247996 297181
34446 297181 229187 -352879 -456259 406879 1611099 2267659 2139605 1537175 749128 -81820
34436 -81820 -723344 -862141 -434583 190163 477005 204810 -336682 -653079 -541259 -243164
34426 -243164 -103835 -143576 -52416 367888 839707 845632 291849 -250339 -195506 289846
34416 289846 536070 347551 216324 421726 553669 356681 405602 1173609 1901254 1453657
34406A453657j296707n66043P69829R47394J77276J90259J216101J419860j15055
34397D196571j681673j390076O3171N94383j49376o06506N386N48726l2304r37004
34387F11298o83559O59986J459103O31885r88206j678018q20557N16156R63396
34378F71484M50591Q6370N40407J092798O79564m74208r79849j46441R58089Q21584
34368C700389n14582j502470j137868j76886J43166o6477K70030J202305J376620
34359C294227J12968j237346j043735J92718N46790m47847j184677n72126L28003
34350a1025J73498m35383l3086J170956J483021L02998j039419j296078p92954
34341d77472l61278L5817P36370J290596R90729Q5966m66836l13620N979J7548
$$ plain form
34406 1453657 156950 -409093 360736 1308130 1485406 1675665 2891766 4311626 4196571
34397 4196571 2514898 1124822 1187993 1782376 1633000 1026494 1031880 1580606 1548302 611298
34387 611298 -72261 587725 2046828 2678713 1690507 12489 -808068 -291912 671484
34378 671484 1122075 1208445 1748852 2841650 3521214 3047006 2067157 1920716 2878805 3700389
34368 3700389 3185807 1683337 545469 368583 511749 445272 715302 1917607 3294227
34359 3294227 3407195 2169849 1126114 1318832 1865622 1417775 233098 -339028 -11025
34350 -11025 162473 -272910 -305996 864960 2347981 2650979 1611560 315482 -477472
34341 -477472 -838750 -802933 -66563 1224033 2214762 2300728 1833892 1520272 1526251 1543799
34331A543799j38949j78240r1171M7745K29175L18485J13353k55796l42492Q672
34321A254581L69959K74097j52231l36914K2180N53739N77313j10324q63590q21508
34311G67302j881N81993K13100m79798l53063N74747J073704M26947o11200r53545
34301A238306n63680j32129N5133J75471J45943l10574r11643q92399o3690P29629
34291e29633N41500n08504j244745o21597J093970K386759K007339M58315m92725
34282C090679J7852Q99843P04827m21272j220172j197547q82540n17071J73388
34273F47987Q56461O31375m17262r81510m41792J74371q8010n81618k71293N07956
34263C6665P43769M51877L42901L13317k76095j059029q87768K98991J149602
$$ plain form
34331 1543799 1404850 1226610 1135439 1183184 1412359 1730844 1844197 1588401 1245909 1254581
34321 1254581 1624540 1898637 1746406 1409492 1431672 1985411 2562724 2452400 1588810 767302
34311 767302 765421 1347414 1560514 1080716 727653 1302400 2376104 2803051 2191851 1238306
34301 1238306 674626 542497 597630 773101 919044 608470 -303173 -1195572 -1259262 -529633
34291 -529633 11867 -496637 -1741382 -2362979 -1269009 1117750 3125089 3583404 3090679
34282 3090679 3108531 4008374 4713201 4291929 3071757 1874210 991670 474599 647987
34273 647987 1504448 2135823 1718561 737051 295259 469630 381620 -199998 -471291 36665
34263 36665 780434 1232311 1575212 1888529 1612434 553405 -334363 -35372 1114230
34254A114230P50179k85138r15020q91312n06526j2489K77852P1328l19715j78258
34244h94869M69514O57885j11535r77160q15112K89854J225230J148510K04775
34235A197092p27627p51172K13806J155883J013616M7897m99987j83666J48919
34226A614761j18781m50587l11273j36371l38300l72098J86218N69646O0858n27793
34216A76280j01234O29788R5997j333336j479964L53108K059278J598667k33418
34207A765166j105039k68830R17727J139863N57144M4383p7644j57034m44645
34198B371091o25628k49326M64793O33824j52572j055668r75680j05952L33422
34189F38304j11204n83327l82413P0002K16223L08888O30947O48687r6378q99531
$$ plain form
34254 1114230 1864409 1579271 664251 -227061 -733587 -746076 -468224 -396896 -716611 -894869
34244 -894869 -425355 232530 120995 -856165 -1671277 -1381423 -156193 992317 1197092
34235 1197092 469465 -281707 -67901 1087982 2101598 2149495 1649508 1465842 1614761
34226 1614761 1495980 1045393 734120 597749 259449 -112649 73569 643215 704073 176280
34216 176280 75046 704834 800831 -532505 -2012469 -1659361 399917 1998584 1765166
34207 1765166 660127 391297 1309024 2448887 3006031 3050414 2972770 2815736 2371091
34198 2371091 1745463 1496137 1960930 2594754 2442182 1386514 410834 304882 638304
34189 638304 527100 -56227 -438640 -368638 -152415 156473 787420 1436107 1339729 440198
34179D40198p46488J59945P29089N31823N4900l09343n02109k59156N36127J078550
34169A713536M51210p53407r49762O2734O62807r6393r83083n40312O76057J094179
34159A337566M93084n0170o0237o0037k65114k53597O850K1538j89725n8104L23782
34148A245836J58042n18199n11241O11573J444382O36015r91799j489408m95665
34139H9536M10655N5475q36392q72105J45860J161071J222687M01340m90104p58618
34129E29405m17696k3711M8246L1790L06775O83460N50280k07023q29587n33074
34119A38865M18134Q49445N1986j188917j332837M8586J574548J633847L37459
34110B531116p50949o83552q2275J08038q9207j08709J69459M57113N55078L20998
$$ plain form
34179 440198 -306290 -146345 582744 1114567 1169467 860124 358015 98859 634986 1713536
34169 1713536 2164746 1411339 461577 524311 1187118 1090725 107642 -432670 243387 1337566
34159 1337566 1830650 1780480 1720243 1660206 1395092 1141495 1148345 1169883 980158 922054 1245836
34148 1245836 1403878 885679 374438 986011 2430393 3066408 2074609 585201 89536
34139 89536 500191 555666 -280726 -1152831 -1006971 154100 1376787 1778127 1288023 529405
34129 529405 111709 87998 136244 168034 474809 1158269 1708549 1501526 671939 138865
34119 138865 556999 1406444 1458430 269513 -1063324 -1014738 559810 2193657 2531116
34110 2531116 1780167 1096615 1014340 1122378 1033171 924462 1093921 1551034 2106112 2427110
34100B427110l00256p91359l73174O53656Q41755l05088j241833n93788O05003
34091I22026N42225l76468k75800Q98436J255722K24751n55347k19840r3645j004255
34081A317805j493937l52303J020753P69143m17832n99466K52857O18306J97229
34072A312555O6325M26259L31985l63491o96496l44547l5569r1475q5211o335
34062E14000k64348n11623j4381P83992P00481j35466l88660K21896O15355M72899
34052A994145O31509J015735M27241r52587j229731J5770O35253n72710j664550
34043C00075p83970O65625N12807m40752p2685J073606P08127j004339j492218
34034e33724m6834J073262L94305o73552m71282M91545R44120Q15139N91583K22543
$$ plain form
34100 2427110 2126854 1335495 962321 1615977 2457732 2152644 910811 317023 922026
34091 922026 1464251 1087783 811983 1710419 2966141 3190892 2635545 2415705 2322060 1317805
34081 1317805 -176132 -528435 492318 1261461 843629 244163 497020 1115326 1312555
34072 1312555 1378880 1805139 2137124 1773633 1077137 732590 697021 605546 520335 514000
34062 514000 249652 -261971 -276352 507640 1208121 1072655 683995 905891 1521246 1994145
34052 1994145 2625654 3641389 4068630 3116043 1886312 1902082 2537335 1964625 300075
34043 300075 -483895 181730 694537 253785 181100 1254706 1962833 958494 -533724
34034 -533724 -580558 492704 887009 213457 -257825 233720 1177840 1992979 2584562 2807105
34024B807105k80092m49233m00127q96100j655153j212248N80232J661765P09076
34015H65225o74440m16579Q03937Q73428k40081o52098J62295O48679l1482o30809
34005G08075j3188R79219R58183J08886l52210j48070j17862o13096q62747k72362
33995C74828M65827K99922m82278m50537Q16699J752802Q55275r75651j519765
33986A137122m21078M00142j47845o61288K54284J458844R96481p21607j484132
33977H10923n94507M00386L43893q2329k8749R6517k55829n34794l7800P39541
33967H57252P47958q1530q08689p45096q6834N63853P88168N13741l1995m61823
33957A255005m54744P1394Q52935J276566Q27728j69108o62609j75459M75476
$$ plain form
34024 2807105 2527013 2077780 1677653 781553 -873600 -2085848 -1505616 156149 865225
34015 865225 190785 -225794 578143 1451571 1211490 559392 721687 1370366 1338884 708075
34005 708075 694887 1674106 2632289 2741175 2388965 2240895 2123033 1509937 647190 374828
33995 374828 840655 1140577 658299 207762 1024461 2777263 3632538 2656887 1137122
33986 1137122 716044 1116186 968341 307053 561337 2020181 3016662 2295055 810923
33977 810923 216416 616802 960695 878366 849617 946134 690305 155511 117711 857252
33967 857252 1605210 1523680 714991 -30105 -116939 446914 1235082 1748823 1716828 1255005
33957 1255005 800261 871655 1724590 3001156 3828884 3659776 2997167 2821708 3297184
33948C297184L81466r8288j03622J39648k05788q38616o15560L52492N86042l56733
33938B538225j028510m13483M75103L99249j07017P9822O16656M00971m06398
33929B554618o59452j20998L82309M67288N11206N97424M27569K37097N45139
33920D942200R42899L85518j083076k064265j646037n08752K51924N05694P21806
33911B447911R26325P05646m8158q45421r80475j65478J017732J469613P64252
33902E291947k51996n64033l26054l33425n53380l15169K11015J19449m77645
33893B800709l11537Q64637J464892M38809q87591p47214L22351M29290n44114
33884C830232p73744M58004J513173R42451l45755o59854q9956J090o18047q08430
$$ plain form
33948 3297184 3678650 3580362 3476740 3616388 3410600 2571984 1956424 2308916 2894958 2538225
33938 2538225 1509715 1096232 1571335 1970584 1863567 1943389 2560045 2961016 2554618
33929 2554618 1895166 1774168 2156477 2623765 3134971 3732395 4159964 4397061 4942200
33920 4942200 5885099 6270617 5187541 3123276 1477239 968487 1220411 1726105 2447911
33911 2447911 3374236 4079882 4031724 3186303 2205828 2040350 3058082 4527695 5291947
33902 5291947 5039951 4475918 4149864 3816439 3263059 2947890 3158905 3278354 2800709
33893 2800709 2489172 3353809 4818701 5257510 4369919 3622705 3945056 4374346 3830232
33884 3830232 3056488 3514492 5027665 5970116 5624361 4964507 4874551 4875641 4257594 3449164
33874C449164j39704L63175l7494o08468m22898J94551L88311J72863J24007K16237
33864C699744J3957l24486k70777P5669K27847L19779P55776J059230M14222o80650
33854E290311q21287M9829M62387p6359k43727N91821R68541j76424j401337j018963
33844C624792L6296j18010r00928k35463J578504J886762r9491j805927j007554
33835B958981J129734K020255J039082m29868j137903q81584r0654M54497J37037
33826E199577n53593l83124P20325J189741J05082j172266q87729M69123R21441
33817E608577o4079r89202p04617O6877J14232m20459m66143K01453N83582r179
33807C921042q34041p57587K1781K88389j73745j55028Q49394J461552N55911
$$ plain form
33874 3449164 3309460 3672635 3635141 3026673 2603775 2798326 3186637 3359500 3483507 3699744
33864 3699744 3713701 3389215 3118438 3194107 3421954 3741733 4497509 5556739 5970961 5290311
33854 5290311 4469024 4518853 4981240 4904881 4661154 5252975 6221516 6045092 4643755 3624792
33844 3624792 3661088 3543078 2642150 2406687 3985191 5871953 5772462 3966535 2958981
33835 2958981 4088715 6108970 7148052 6718184 5580281 4698697 4608043 5062540 5199577
33826 5199577 4645984 4262860 4983185 6172926 6278008 5105742 4218013 4687136 5608577
33817 5608577 5544498 4555296 3850679 3917556 4031788 3611329 3145186 3346639 3930221 3921042
33807 3921042 3087001 2329414 2351195 2639584 2465839 2310811 3160205 4621757 5177668
33798E177668o45268l68599O89902L73501j248671j737468j61545J407532J222841
33789D709893L61259M48965Q84233K16897j133784j568530q70095k31829k00001
33780B617008j76108K52852P45958Q57080M30661l45949p53359r0034J066916
33771D605025J176054k5396q84448l52488L59714n4601p35716l05910N99854N34180
33761D916268j32614n9436M18775q9225j291973j559879p50739k54893l16995
33752H79289J76867J110932R52645l38579p62423M74416J496674P30465p14297
33743D005989j031301l87056p6550k94523k63967K19477O04281M60745j94771
33734C042324r51828j061227j82657Q20459Q48648K80652L33154P78372J93852
$$ plain form
33798 5177668 4532400 4163801 4853703 5227204 3978533 2241065 2079520 3487052 4709893
33789 4709893 5071152 5520117 6404350 6621247 5487463 3918933 3048838 2817009 2617008
33780 2617008 2440900 2693752 3439710 4296790 4727451 4381502 3628143 3538109 4605025
33771 4605025 5781079 5755683 4871235 4518747 4878461 4823860 4088144 3782234 4382088 4916268
33761 4916268 4783654 4724218 5142993 5053768 3761795 2201916 1451177 1196284 879289
33752 879289 1056156 2167088 3119733 2781154 2018731 2493147 3989821 4720286 4005989
33743 4005989 2974688 2587632 2511082 2216559 1952592 2172069 2776350 3237095 3042324
33734 3042324 2090496 1029269 846612 1667071 2515719 2796371 3129525 3907897 4101749
33725D101749j263304j568205p8738J192616P63163m6861L62931J080233M38543
33716D982127j012334j487987p84104k5637M40678Q66607P07148m42865j238913
33707B004720j91714J582645J578289k81541j430321n13231Q38220P76513k19738
33698D143842o31496k14742J73051J10494q9260j09262P4187L18863L46639n4812
33688D067504o66219r72594p16577o6706N97129P85477J96031o59911o90313L07985
33678B181806J073420N77368m31569o28979j41329m4488l99112l14895L15080
33669B187302O64363M35790P0418l37163q91713r11116K56842J580094J337816
33660D392633k00610j013973m00460K65465J92272L03707R63407Q73373n33315
$$ plain form
33725 4101749 2838445 1270240 1191502 2384118 3147281 3100420 3463351 4543584 4982127
33716 4982127 3969793 2481806 1697702 1672065 2112743 2979350 3686498 3243633 2004720
33707 2004720 1813006 3395651 4973940 4692399 3262078 2748847 3587067 4363580 4143842
33698 4143842 3512346 3297604 3470655 3581149 3491889 3382627 3456814 3775677 4122316 4067504
33688 4067504 3401285 2428691 1712114 1645408 2242537 3028014 3224045 2564134 1873821 2181806
33678 2181806 3255226 3832594 3401025 2772046 2630717 2586229 2187117 1872222 2187302
33669 2187302 2851665 3287455 3357873 3020710 2128997 1217881 1474723 3054817 4392633
33660 4392633 4192023 3178050 2777590 3043055 3235327 3539034 4502441 5375814 4842499
33651D842499j645142j091887J26312M33809k763k96963n96313j095362q02521
33642a28331P61955J946047J141523n06312p33717M17687J082652P35765M77666
33633E194935O32589M74300J24080M09078J022556J172051J741233L956787N915460
33624B0643069L884061j967889o456693n797339k310120n13445j046830j355959
33616E078855n52723j48451o58115p50600N397K58838n96936j213332n32982M85359
33606A375310M74313k92166n78845m7984O12543Q88163Q60128O97095M22421R7135
33596D508113j92622m34329n36045k90931K67879P21951P40875M85016K74263
33587E544170P4260l44092q47969r34413l66171M42163Q41457O29028J55216j69500
$$ plain form
33651 4842499 3197357 2105470 2231782 2665591 2662828 2365865 1769552 674190 -128331
33642 -128331 633624 2579671 3721194 3214882 2481165 2898852 3981504 4717269 5194935
33633 5194935 5827524 6301824 6425904 6834982 7857538 9029589 10770822 14727609 20643069
33624 20643069 24527130 22559241 16102548 10305209 7995089 7481644 6434814 5078855
33616 5078855 4526132 4377681 3719566 2968966 2974363 3233201 2636265 1422933 889951 1375310
33606 1375310 1849623 1557457 978612 930628 1543171 2431334 3291462 3988557 4410978 4508113
33596 4508113 4315491 3881162 3345117 3054186 3322065 4044016 4784891 5269907 5544170
33587 5544170 5618430 5274338 4426369 3491956 3125785 3567948 4409405 5038433 5193649 5024149
33577E024149k56423k07776m8867K41434N68692P59723O94125L46596j13879k28122
33567F779652L66728J261220J465472O59944k49705l67830l8662n6776k06027
33558I614016K77413J116017J234062N82919L05503Q25954J200742Q71374O74997
33549A6702997J352511K266469K486172K132230J807307J646272J690837K175672
33541C2260467K690587K237633R57702M43431J295290J870899Q20590o96755j073361
33532D0806483j027803k132894l764606m007724k844298j941441j791948j575877
33524B1719892j432901k178263k975577k150714l86490j46340j591540k180525
33516H677542j001774k32832j090693j613718l12680R80057K82168j056235p50820
$$ plain form
33577 5024149 4767726 4559950 4511083 4752517 5321209 6080932 6775057 7121653 7007774 6779652
33567 6779652 7146380 8407600 9873072 10533016 10283311 9915481 9876819 9820043 9614016
33558 9614016 9891429 11007446 12241508 12824427 13129930 13955884 15156626 16028000 16702997
33549 16702997 18055508 20321977 22808149 24940379 26747686 28393958 30084795 32260467
33541 32260467 34951054 37188687 38146389 38589820 39885110 41756009 42576599 41879844 40806483
33532 40806483 39778680 37645786 33881180 29873456 27029158 25087717 23295769 21719892
33524 21719892 20286991 18108728 15133151 12982437 12595947 12449607 10858067 8677542
33516 8677542 7675768 7442936 6352243 4738525 4425845 5405902 5688070 4631835 3881015
33507C881015N36516N93363n12726q79345j35479L17854q2043n67961q19509j145692
33497A185993j190118l67544O72742P72080J46734q7119J61981J91650J50533
33488A636932O12557R54401J54564j060358r62368L15662P75761l19662j321570
33479G85919p66210O36329J313859Q04776k37626r75308q53973q751N86855K06752
33469A492622m70705k93762N04768O69274p571m57986k29231n8975l07590l12198
33459E28646K46368O59756L94895j41244m67229o16199n47958n6233M49885K07213
33449F57900n36287n78531M11640J252625R18304j65178r75997j130843q04024
33440i50391k45894J85894J91949j0198M784J19024k6172j58929K16880P20476
$$ plain form
33507 3881015 4417531 5010894 4498168 3618823 3483344 3801198 3719155 3151194 2331685 1185993
33497 1185993 -4125 -371669 301073 1073153 1219887 1132768 1294749 1486399 1636932
33488 1636932 2249489 3203890 3358454 2298096 1335728 1651390 2427151 2107489 785919
33479 785919 19709 656038 1969897 2774673 2537047 1561739 707766 699015 1285870 1492622
33469 1492622 1021917 728155 1232923 1902197 1894626 1436640 1207409 1148434 840844 528646
33459 528646 775014 1434770 1829665 1688421 1221192 604993 57035 802 450687 657900
33449 657900 121613 -456918 -45278 1207347 2125651 1960473 984476 -146367 -950391
33440 -950391 -1196285 -1010391 -818442 -828640 -823856 -704832 -731004 -889933 -673053 47423
33430D7423N24628k37960o71377n53966l25211Q3040R05593J328405M31578p87921
33420G44232m18732J214597J673187J36864j331803j082841j30319O0322j38390
33411G27117Q5725K28992k26378m20190K73045P43518m63q99096o13560R9005
33401b285j79457q85660n36432M28109L08943p59294q51096N24846J542401R46291
33391E36366j42516k00809M52867N15068k04325p30682n46058k23715l47846n09372
33381a401022J00930J282747J717243O80960p16403q58026J57786P50344K27319
33372A941878m19597l34058Q579O053m43L27840M76344O7924l23754k20896r4830
33361A435040l25976l91331m667Q8428m93987p74582n0306O48810J69383p63209
$$ plain form
33430 47423 572051 334091 -337286 -891252 -1216463 -1133423 -227830 1100575 1532153 744232
33420 744232 325500 1540097 3213284 3350148 2018345 935504 805185 865507 727117
33411 727117 812842 1041834 815456 395266 668311 1411829 1411366 512270 -101290 -2285
33401 -2285 -181742 -1067402 -1603834 -1175725 -866782 -1626076 -2477172 -1952326 -409925 536366
33391 536366 393850 193041 645908 1160976 956651 225969 -320089 -543804 -891650 -1401022
33381 -1401022 -1300092 -17345 1699898 2380858 1664455 806429 964215 1714559 1941878
33372 1941878 1522281 1188223 1196802 1202855 1202412 1530252 2006596 2074520 1750766 1529870 1435040
33361 1435040 1109064 717733 713066 801494 307507 -467075 -517381 131429 300812 -462397
33351d62397p54273l0571K13764J1362K98504Q98397P37495j19930m53509Q0565
33341D19407N21387L20259o58q7432k81934o48107o71604k18264K05915L32402
33331a08629L71788L35369K2617l22339k40304J16242K61599L04914O32680Q94389
33321B268326M33512m05724o07936j18825N7029m80153r11110n20607L25870Q26235
33311H66617O35932j6973n03897k01775O25585P34932m27358j494139q72808P65981
33301A12097J298428L01392m28424J97439R54982M38773p45230j064695k93010
33292G71752N01661N63418O0798n15558p90104n79359o5860L05934L79700L99755
33282A032137M42392K87800L6722J41258M96674L02922o19305j164498m41446
$$ plain form
33351 -462397 -1216670 -1247241 -1033477 -1022115 -723611 174786 912281 792351 338842 419407
33341 419407 940794 1261053 1260395 1172963 891029 242922 -428682 -646946 -441031 -108629
33331 -108629 263159 598528 621145 298806 58502 174744 436343 741257 1373937 2268326
33321 2268326 2701838 2296114 1688178 1569353 1626382 1146229 235119 -285488 40382 866617
33311 866617 1502549 1485576 981679 779904 1405489 2140421 1713063 218924 -653884 112097
33301 112097 1410525 1711917 1283493 1480932 2435914 2874687 2129457 1064762 771752
33292 771752 1273413 1836831 1897629 1382071 591967 12608 -53252 252682 632382 1032137
33282 1032137 1474529 1762329 1799051 1940309 2436983 2739905 2120600 956102 514656
33273E14656O53432M71705r64314j753711o28514J318815K080526J217925R414
33264B919934n11641n74630o61749n93828j49989K68552L01253K76080M76745
33255A750727M69820p937k90064L8299Q4334q33994j522816o20738Q03363P04391
33245E75385l85710j12423J410291J383158q41094k186019p52057J006996L87049
33236D85576j195151r14689P37662J318005P62619Q02655J247397M82937r90290
33227B736721j103733o3900j44527j492063j594788M05950K078732J473042k06860
33218B088574r59961o89166k43197K28656O39743L45129o30276j110467m76670
33209h07635M07272O99143O72928O68713L55758k67382m77463r1998J16246k12707
$$ plain form
33273 514656 1168088 1639793 675479 -1078232 -1706746 -387931 1692595 2910520 2919934
33264 2919934 2408293 1833663 1171914 578086 428097 696649 997902 1273982 1750727
33255 1750727 2220547 2212610 1922546 1960845 2045179 1211185 -311631 -932369 -129006 575385
33245 575385 189675 77252 1487543 2870701 2029607 -156412 -908469 98527 485576
33236 485576 -709575 -1624264 -886602 431403 1194022 1996677 3244074 3727011 2736721
33227 2736721 1632988 1569088 1424561 -67502 -1662290 -1256340 822392 2295434 2088574
33218 2088574 1128613 439447 196250 424906 1064649 1409778 779502 -330965 -807635
33209 -807635 -400363 298780 971708 1640421 1996179 1728797 1251334 1159336 1275582 1062875
33199A062875n06420m73022m40309k14960P61460J787394J312677m59743j365890
33190A464062n00826L68457k51355j176240o31280Q66935J485499Q26970K5342
33181B477564j84087n4132J8159j86900p70569j278731q32951N59771J572363
33172A320487J200977Q7323n54446n32658l84272k48194P0281M63632P01758P85784
33162B910672O23064l4092q74425j004502j78282O67434O40648k5125n92555q06052
33152A326785p57251m31092J15298O20434R46971J069971P61009l4759o84244
33143B933122o49537n23061j091289j667768r33888O76858J295116M97883j15856
33134D21580K98551N64406j59876p75962k24489O57606O47681Q1022r4007L2912
$$ plain form
33199 1062875 556455 83433 -356876 -571836 189624 1977018 3289695 2829952 1464062
33190 1464062 963236 1331693 1080338 -95902 -727182 139753 1625252 2452222 2477564
33181 2477564 2293477 2239345 2257504 2070604 1300035 21304 -811647 -251876 1320487
33172 1320487 2521464 2608787 2054341 1521683 1137411 889217 959498 1423130 2124888 2910672
33162 2910672 3533736 3499644 2625219 1620717 1442435 2109869 2750517 2725392 2132837 1326785
33152 1326785 569534 138442 253740 874174 1821145 2891116 3652125 3617366 2933122
33143 2933122 2283585 1760524 669235 -998533 -1932421 -1255563 39553 537436 421580
33134 421580 720131 1284537 1124661 348699 124210 781816 1429497 1510519 1416512 1449424
33124A449424k3559N1974O08874J013763O26888n0194k75305k34915l21632k18596
33114B626722K50179L51812l37704q72879k82070Q23908J137393M76507l02479
33105C871389n85297l20124K59924M90808l19227j626312j785098k55359J386342
33096A117046J527673N01246m62045j019997j286749q46604L48393J095269M78629
33087A452861n15093m24746L87043M71632k46441m85352J42512N68779J16466
33078A467661m83441l35245L51468P21364M22978j15990l45800k65794l02063
33069A115138m93488k42049O35445J135163L37976r17138r88721O3910N53153
33060A199389r1319m69848L08941J117159P69517j00654l43714j36593k25054
$$ plain form
33124 1449424 1425865 1477839 2086713 3100476 3727364 3677170 3401865 3166950 2845318 2626722
33114 2626722 2876901 3228713 2891009 2018130 1736060 2559968 3697361 4173868 3871389
33105 3871389 3286092 2965968 3225892 3716700 3397473 1771161 -13937 -269296 1117046
33096 1117046 2644719 3145965 2683920 1663923 377174 -469430 -121037 974232 1452861
33087 1452861 937768 513022 900065 1371697 1125256 639904 782416 1351195 1467661
33078 1467661 984220 648975 1000443 1721807 2144785 2028795 1682995 1417201 1115138
33069 1115138 621650 379601 1015046 2150209 2488185 1571047 582326 646236 1199389
33060 1199389 1108070 638222 947163 2064322 2833839 2733185 2389471 2252878 2027824
33051B027824m27005k03960J47016R4358n3595K33220O44135N57211R1008j75862
33041B934350m9958K68202M66052J08486q76039j543825q59782N50111R36653
33032A934250K5033n21300K14055R71145M75927n60830p72302j89174K11391N2258
33022A840453l15268m68588j00564O64670R35424Q3574r30020o76740M48557Q64484
33012B345982N32966P51287J268388M33726j390982j700617m3626Q39929n39866
33003B497187j969412j302818K86553R16706J056282J598701J461897k25810j727520
32994B591766j204635J98261L57213m04230m10040L50849P49095P44550Q44975
32985C817804N80225m43959j231895r71669n32772p08888n90064N86365J694946
$$ plain form
33051 2027824 1600819 1396859 1543875 1638233 1584638 1817858 2461993 3019204 3110212 2934350
33041 2934350 2884392 3152594 3618646 3727132 2851093 1307268 447486 997597 1934250
33032 1934250 1959283 1437983 1652038 2623183 3099110 2538280 1765978 1576804 1788195 1840453
33022 1840453 1525185 1056597 956033 1620703 2556127 2639701 1709681 1032941 1481498 2345982
33012 2345982 2878948 3630235 4898623 5332349 3941367 2240750 2197124 3037053 2497187
33003 2497187 527775 -775043 -488490 428216 1484498 3083199 4545096 4319286 2591766
32994 2591766 1387131 1585392 1942605 1538375 1128335 1479184 2228279 2972829 3817804
32985 3817804 4398029 3954070 2722175 1750506 1217734 508846 -81218 505147 2200093
32976B200093J580585Q81814L78995m43547j534241j303594N84386J829462R17714
32967E091667m92941o05727k34586l79081J1452J364870J597811k93682j739404
32958D320379o95435P80021K82748p04532N1882J171916M08813r67734o67887
32949C980171K37603l78968j378660n89911Q57383O94253j48597L63848J108987
32940D746109K5249j511765r92440N47451N66949k88980M3000O94375k22336j470847
32930B136765r33484K29443M6484k29936R31626J400233o76920k309161m90993
32921A04057J860395P81860j452931n22484J912257J535959m59906r8422J521960
32912E182745R44737j00981J781721L619934N89937m152993l768013M80183J692411
$$ plain form
32976 2200093 3780678 4662492 5041487 4597940 3063699 1760105 2344491 4173953 5091667
32967 5091667 4598726 3992999 3758413 3379332 3390784 4755654 6353465 6059783 4320379
32958 4320379 3624944 4404965 4687713 3983181 4035063 5206979 5615792 4648058 3980171
32949 3980171 4217774 3838806 2460146 1870235 2727618 3421871 3273274 3637122 4746109
32940 4746109 4771358 3259593 2267153 2814604 3381553 3092573 3135573 3829948 3607612 2136765
32930 2136765 1203281 1432724 1479208 1249272 2180898 3581131 2904211 595050 104057
32921 104057 1964452 2746312 1293381 770897 2683154 4219113 3759207 3660785 5182745
32912 5182745 6127482 6026501 7808222 11428156 12018093 7865100 4097087 4577270 6269681
32903F269681n15521p78478R58026J17719k213040r59494K193082J296659j913053
32894D455581p47244L164727K451421j494304p98196L268876K426648j737500
32886A0990009N841N896762N455328L55649K182656Q850097P267038J131506P663288
32877D9798174K2768244K4310055J9597174M6325130J01944771J16613038M0631543
32870D21988129p2100827j21083498q3933964l0253654j6701875k6023577k1215460
32863E0675274o004745k894591r072838p721414p04460p28534n499379m201118
32855A3848195Q88150K09202m068310l199300R61927M48235l057808k087241J914329
32846E857379J740571j762454j954790Q61612R31382j482457j242485J269495
$$ plain form
32903 6269681 5754160 4975682 5933708 6051427 3838387 2878893 5071975 6368634 4455581
32894 4455581 3708337 6873064 9324485 7830181 7031985 10300861 12727509 10990009
32886 10990009 10995850 16892612 22347940 22703589 24886245 33736342 41003380 42134886 49798174
32877 49798174 72566418 96876473 116473647 162798777 264743548 381356586 421988129
32870 421988129 349887302 228803804 144869840 114616186 97914311 71890734 50675274
32863 50675274 44670529 41775938 32703100 24981686 24277226 23548692 18049313 13848195
32855 13848195 14736345 14945547 10877237 7677937 8639864 9088099 6030291 3943050 5857379
32846 5857379 7597950 5835496 3880706 4742318 5673700 4191243 2948758 4218253
32838D218253J206035j114119j147344Q67217P08213j397973j463855L63379M19361
32829B659167j087942p53072R93572P02526j118277p94583J372804J455447r11922
32820B517720j997016o01184N95760M15160N17154J182046P00442p90595j254784
32811A284703n48477k88095l59194M86669J266870J43984j557496r82213J202144
32802F48895J685232K1049j033507m70988j06925o36403o04511L78893R63683
32793H45418Q60585J075633J302615K75115j307515j384952n9360N65310K202
32784B175051k40284J75380K6610o26583l45980P10152P69953k45420m22362N78082
32774B554599O65196r38863j788155L76470M079209N527366K810234k131346n331411
$$ plain form
32838 4218253 5424288 4310169 3162825 4030042 4738255 3340282 1876427 2239806 2659167
32829 2659167 1571225 818153 1811725 2514251 1395974 601391 1974195 3429642 2517720
32820 2517720 520704 -80480 515280 930440 1447594 2629640 3330082 2539487 1284703
32811 1284703 736226 448131 88937 575606 1842476 1986460 428964 -553249 648895
32802 648895 2334127 2355176 1321669 850681 743756 107353 -497158 -118265 845418
32793 845418 1706003 2781636 4084251 4359366 3051851 1666899 1607539 2172849 2175051
32784 2175051 1934767 2110147 2136757 1510174 1164194 1874346 2644299 2398879 1976517 2554599
32774 2554599 3219795 2280932 492777 869247 4948456 10475822 13286056 11154710 5823299
32765E823299m478644j132119J089544P21521k95732m4938O24993J85684o89589
32756A804019n17301J76414j07409r55650o82490O85180J360517N40046o83038
32747A620288j032167k77022R16187J332697J74459j437937j241715Q53947K030174
32738B938911N88068j356866j216899J09012J94976p67860p60059L75221J022794
32729A127298P77262N76182M77319j43871p37875l04349N81731O48919J34712
32720C137328J8798j5283o41943r85935o9758Q93448K43834j083433r91233J98908
32710G04731M61320l60700o20981j0712K12830k02228l50230k15848l76664k26780
32700i85262R47423J843888Q50876q72572r55583K82876O24188o9803j00318L75598
$$ plain form
32765 5823299 1344655 212536 1302080 2023601 1727869 1682931 2307924 2493608 1804019
32756 1804019 1286718 1463132 1355723 400073 -282417 402763 1763280 2303326 1620288
32747 1620288 588121 311099 1227286 2559983 2734442 1296505 54790 908737 2938911
32738 2938911 3526979 2170113 953214 1062226 1257202 489342 -270717 104504 1127298
32729 1127298 1904560 2480742 2958061 2814190 2076315 1771966 2353697 3002616 3137328
32720 3137328 3156126 3140843 2498900 1512965 1443207 2336655 2580489 1497056 505823 704731
32710 704731 1166051 805351 184370 173658 386488 184260 -165970 -381818 -758482 -985262
32700 -985262 -37839 1806049 2656925 1784353 828770 1111646 1735834 1666031 1565713 1941311
32690A941311l70958j805453j413818Q82072K276604J570054N59932L42694j62547
32681C819891j132114q96943O67161J185310k95181j522901p82124M42172K52750
32672A738021p64231j164628r32257n40119K61448J311814J559491Q40443K74070
32663B584052J04383o64325j773568j455496L59040J335359M71490k84024L78237
32654A055148Q57279j46921j003929r2256J130788O21997p54499r20567p6129
32645F70911J72628j86603k3458N37956N37259J28807M8717L4351l46675l71572
32635A202321M34544Q16755j97843j116771k22415J209881P34420j071276j335904
32626D53712M37166J572765N09806r87416q74681K85226P77497L06527k48528
$$ plain form
32690 1941311 1570353 -235100 -1648918 -766846 1509758 3079812 3639744 3982438 3819891
32681 3819891 2687777 1790834 2457995 3643305 3348124 1825223 1043099 1485271 1738021
32672 1738021 973790 -190838 -1123095 -1663214 -1401766 -89952 1469539 2309982 2584052
32663 2584052 2688435 2024110 250542 -1204954 -845914 489445 960935 676911 1055148
32654 1055148 1912427 1765506 761577 669321 1800109 2422106 1667607 747040 670911
32645 670911 843539 656936 633478 1171434 1708693 1837500 1886217 1920568 1573893 1202321
32635 1202321 1636865 2453620 2255777 1139006 916591 2126472 2860892 1789616 453712
32626 453712 890878 2463643 2973449 1986033 1111352 1396578 2174075 2480602 2232074
32617B232074m42649m33919l29003k28870l21898l96887N0691Q23068R48174O9997
32607A970778r14318j136131q43739n76525j10399Q42662J530777R45142m94662
32598A213585j190125m54371O46153R09265N31549L75344M79404K64726k27188
32589B548342l95534k17009k12291k87401J62864Q10224M64074q67771j458384
32580E47114l61368R40608P09978m21481o67180j905J03172o15864q46623n8148
32570f71697O64557M93597k8220j91865p4553J47844O11284J063211Q56525K1532
32560B892215o27958o80408m65425j76662K49070M07928j69797q98702p29944
32551a99683J71744P38492Q30975J088859J108178j50346j981970k263101o90523
$$ plain form
32617 2232074 1789425 1355506 1026503 797633 475735 78848 129539 952607 1900781 1970778
32607 1970778 1056460 -79671 -923410 -1499935 -1610334 -767672 763105 1708247 1213585
32598 1213585 23460 -430911 215242 1124507 1656056 2031400 2510804 2775530 2548342
32589 2548342 2152808 1935799 1723508 1436107 1598971 2409195 2873269 2005498 547114
32580 547114 185746 1126354 1836332 1414851 747671 745766 848938 233074 -613549 -671697
32570 -671697 -7140 486457 458237 266372 191819 339663 950947 2014158 2870683 2892215
32560 2892215 2264257 1583849 1118424 941762 1190832 1598760 1428963 530261 -199683
32551 -199683 -27939 710553 1541528 2630387 3738565 3588219 1606249 -656852 -1347375
32542a347375N88863L34487j55894K36083N68889P8211j22037O45807Q86096l91637
32532A321493j400663m49994Q61499K14337j288694q79917J046319J511555J1939
32523I47874p21703N44632J588234O50861p81877p97474r1541j92480o87333m22423
32513C6770M1862m96498j341094p86868Q88994J579044N50451n40718l16930M22489
32503C7502L44978k84466l13201L38488P01999L83128M1962K57104P57796R35449
32493C200739N34948k75733j057882j285419q40764l35028m37896r03721q54884
32484b255640o5001P24496R03492O83860M57080K10246p2243j49761o7268k37742
32474A31519n85554m29894K87837N97155M843n44481j02336P72518R63986M55730
$$ plain form
32542 -1347375 -758512 -424025 -579919 -343836 225053 303264 181227 827034 1713130 1321493
32532 1321493 -79170 -529164 332335 546672 -742022 -1621939 -575620 935935 947874
32523 947874 226171 770803 2359037 3009898 2228021 1430547 1339006 1146526 459193 36770
32513 36770 78632 -417866 -1758960 -2545828 -1656834 -77790 472661 -68057 -384987 37502
32503 37502 382480 98014 -215187 123301 825300 1208428 1250390 1507494 2265290 3200739
32493 3200739 3735687 3459954 2402072 1116653 275889 -59139 -497035 -1400756 -2255640
32484 -2255640 -2320641 -1596145 -692653 -8793 448287 658533 586290 436529 369261 131519
32474 131519 -454035 -883929 -596092 1063 5906 -538575 -640911 131607 1095593 1551323
32464A551323p3193n30657j047544j059434j47753P94529O83302j089p3597K96730
32454C92617Q7835m73026k34103O47011P83828o9754o60262m12438n0043J76809
32444A88474Q44755J549795R13586q85834j703154n53480Q11004O63401j87545
32435A641002j15670O60408Q03996J22159m97985o40236m96782q5403N42233Q72750
32425B806472O03781J51225j52000n32387q76559m68724O21811J098345L17305
32416C569269n79715m64206M5501j33236o66287o19008k20594l08296o91059n37670
32406f05301O2808K77868k2392j55404K22470P55658R79125O35239k23370r61562
32396I65139p77301J69257P89685O02133K48447J22050k04155o55432l44771O08894
$$ plain form
32464 1551323 1478130 947473 -100071 -1159505 -1307258 -512729 170573 169484 95887 392617
32454 392617 480452 7426 -226677 420334 1204162 1134408 474146 61708 11665 188474
32444 188474 1033229 2583024 3496610 2610776 907622 354142 1165146 1828547 1641002
32435 1641002 1525332 2185740 2989736 3111895 2613910 1973674 1476892 1391489 1933722 2806472
32425 2806472 3410253 3561478 3409478 2877091 2000532 1531808 2153619 3251964 3569269
32416 3569269 2989554 2525348 2570849 2437613 1771326 1152318 931724 623428 -67631 -605301
32406 -605301 -542493 -264625 -287017 -442421 -219951 535707 1514832 2150071 1926701 965139
32396 965139 187838 357095 1146780 1748913 1997360 2119410 1915255 1259823 915052 1523946
32386A523946O77388n68061j360534n50598L69344j44123r14448j46317J273656
32377A60253J239582N7939k15056O22857Q34335k9716n84307l28563k97830p27336
32367G32158n18485M85642R42591L23227k55723j10516L9210j89610l1987P33225
32357B149732J032028K82874o07321q23196p68800q70279o67235R8746P48914
32348E75463P60442M79964K24887j40266l50353J55195Q79358N80563n62312q20987
32338A781954L37662J188144M23012q61981j102259n57504k38507l0070M85178
32329A425629O11292k64264j068765m86364P46139Q31386l15593j109469q31609
32320d61618l61590l93151n24873l23390L6718M03842Q02638Q79021L00818k80463
$$ plain form
32386 1523946 2201334 1633273 272739 -277859 91485 -52638 -967086 -1113403 160253
32377 160253 1399835 1457774 1242718 1865575 2699910 2670194 2085887 1757324 1459494 732158
32367 732158 213673 699315 1641906 1965133 1709410 1598894 1638104 1448494 1416507 2149732
32357 2149732 3181760 3464634 2857313 2034117 1265317 395038 -272197 -173451 575463
32348 575463 1335905 1815869 2040756 1900490 1550137 1705332 2584690 3165253 2602941 1781954
32338 1781954 2119616 3307760 3730772 2868791 1766532 1209028 970521 940451 1425629
32329 1425629 2036921 1772657 703892 217528 963667 1795053 1479460 369991 -461618
32320 -461618 -823208 -1216359 -1741232 -2064622 -2027904 -1624062 -821424 57597 358415 77952
32310G7952J05868J038648R97472l34579j409815j022717N3855M35018Q6198p9222
32300e1322J80059L16310J25295k209J31668K64428J86969o2534m63650r18588
32290b93574r71173k43251Q22845J276887Q41715K07484p669M9801J00706L46552
32280B130323Q73441J026310K14867r43462j198604l82203L25167N7437o12168
32271A491108o54958n0608L66463J69699k00603j84602J70555L58932R7156k68470
32261A294672j43031M39787N96954k96839j455592j369105K23311J793280J813832
32252B897269M45991r88587j592499j403518q68598m48683l83629l38972L14891
32243b366335J441579J948842J241956K05089m5997K66444K50834j8943J72833
$$ plain form
32310 77952 183820 1222468 2219940 1885361 475546 -547171 -493316 -58298 27900 -51322
32300 -51322 128737 445047 570342 568133 699801 964229 1151198 1088664 625014 -293574
32290 -293574 -1264747 -1507998 -685153 591734 1433449 1640933 1633264 1683065 1783771 2130323
32280 2130323 3003764 4030074 4244941 3301479 2102875 1720672 2045839 2103276 1491108
32271 1491108 836150 785542 1152005 1321704 1121101 936499 1107054 1465986 1563142 1294672
32261 1294672 1151641 1591428 2188382 1891543 435951 -933154 -709843 1083437 2897269
32252 2897269 3343260 2354673 762174 -641344 -1509942 -1958625 -2342254 -2681226 -2366335
32243 -2366335 -924756 1024086 2266042 2471131 2425134 2691578 2942412 2923469 3096302
32234C096302N63909J03895j150596j754665r26520L25676P52611N20613N16521
32225B047746P73170N66073k61025r38708p52364J56247J027362J199190N68193
32216D385884m08115j085322j117340o55552j28423J37546J46551J50800K83982
32207A710011L11570l9467n26408n69652j09054K01272p1272n05983n32278k66816
32197c98077j16921q284L26404O42399N10399J36109J16404M71482N89214J16648
32187B385777o31224j099590r11741p8808P59423O69515m18590j311972j015939
32178a653149j05972K60836J82792O12250J410831J313586M982j180753j112718
32169b67315k37619M58531P73691Q67370M80628n03669j350391j218462k87072
$$ plain form
32234 3096302 3660211 3764106 2613510 858845 -67675 258001 1010612 1531225 2047746
32225 2047746 2820916 3386989 3125964 2187256 1434892 1591139 2618501 3817691 4385884
32216 4385884 3977769 2892447 1775107 1119555 991132 1128678 1275229 1426029 1710011
32207 1710011 2021581 1982114 1455706 886054 777000 978272 907000 401017 -131261 -398077
32197 -398077 -514998 -523282 -196878 445521 955920 1092029 1208433 1679915 2269129 2385777
32187 2385777 1754553 654963 -256778 -335586 423837 1093352 674762 -637210 -1653149
32178 -1653149 -1759121 -1498285 -1315493 -703243 707588 2021174 2026156 845403 -267315
32169 -267315 -504934 -46403 727288 1594658 2075286 1571617 221226 -997236 -1284308
32160a284308N42232P89432O67251M73506K90358J66324J30293M7583k45354o85821
32150H91496j004291r20910l17908N60883J093501Q16390O0493l11764M7990N25652
32140A441532L40847m67176j076666p94958J96664R90225Q67745P6910m84882
32131A090241l90743j30570k69893o24440o46806k44921K23467M51628K99152
32122b42885k05605o17877l54746L59306M97694k60988q34344l21177N68839O88236
32112g23547K24128N8699J34691p4154j39272N82057J305796Q10013k73543k27589
32102A677279Q07384R11900l89580j332520q86580j79964j00771J67131R86545
32093A660824R45808o16811j785051p98323R99965J152447k16038r90632m71477
$$ plain form
32160 -1284308 -742076 47356 714607 1188113 1478471 1644795 1775088 1822671 1577317 891496
32150 891496 -112795 -1033705 -1351613 -790730 302771 1119161 1179654 867890 915880 1441532
32140 1441532 1782379 1315203 238537 -556421 -359757 630468 1498213 1575123 1090241
32131 1090241 699498 568928 299035 -325405 -972211 -1217132 -993665 -542037 -242885
32122 -242885 -448490 -1066367 -1421113 -1061807 -564113 -825101 -1659445 -1980622 -1411783 -723547
32112 -723547 -499419 -440720 -306029 -380183 -519455 62602 1368398 2178411 1904868 1677279
32102 1677279 2484663 3396563 3006983 1674463 787883 607919 507148 674279 1660824
32093 1660824 2606632 1989821 204770 -593553 406412 1558859 1342821 352189 -119288
32084a19288J64044L14466N60876R03974N26538m17720o09485L67116J245255
32075B935776R01506k05936r11583p47860j23242J91579l64916j424345j685858
32066a434879m58708J070499J194704P8995n29458N9330O51566L02192k52221
32057F82020l6295N41775N03283j28160n66481n16857k91422m7365K76213M67989
32047H84700J97422l86156p14723m67493J34563O38793P44494M89420K15517K01560
32037A938097K63779P798m49413m63365J78499P36343L96448o21943j298072r92411
32027c04240l0363P42450O72617k06032j031879p65912N46446J509045J038673
32018B170805m9319j08764Q44683J055568k42454j495478j122357J72297P15774
$$ plain form
32084 -119288 44756 359222 920098 1824072 2350610 1932890 1323405 1690521 2935776
32075 2935776 3837282 3631346 2719763 1971903 1848661 2040240 1675324 250979 -1434879
32066 -1434879 -1893587 -823088 371616 450611 -78847 -19517 632049 934241 682020
32057 682020 645725 1187500 1690783 1562623 996142 479285 187863 140498 416711 884700
32047 884700 1082122 695966 -18757 -486250 -351687 287106 1031600 1521020 1736537 1938097
32037 1938097 2201876 2209674 1760261 1296896 1475395 2211738 2608186 1986243 688171 -304240
32027 -304240 -334603 407847 1080464 874432 -157447 -923359 -376913 1132132 2170805
32018 2170805 2121486 2012722 2857405 3912973 3670519 2175041 1052684 1224981 1940755
32009A940755M24593L19038K71540n97852j566702q26799J254299J901005J3983
32000C133860j848361j183318Q12982J401734M21398k43266j21928l02405p04724
31991A365972q9945J170321J067767p39057j995487j094934P65535J620372J159378
31982C229922J58264q75661j443002q87152M39459J075523M42256k78396q6060
31973A775153L57025J31367m05481n84635o70222r66688q46143R4519R43450P83694
31963F12039J60675M9335K71606J52796j19127k9263J52511j6658j66665J54739
31953A221988N30804M89194L88382M54684q183j222068j858165q36949P58036
31944h2277J144442L97585n3884K48538N99317O35050M68201r6117r93933j228766
$$ plain form
32009 1940755 2365348 2684386 2955926 2358074 791372 -35427 1218872 3119877 3133860
32000 3133860 1285499 102181 915163 2316897 2738295 2495029 2373101 2070696 1365972
31991 1365972 1276027 2446348 3514115 2775058 779571 -315363 450172 2070544 3229922
31982 3229922 3388186 2512525 1069523 182371 621830 1697353 2139609 1861213 1775153
31973 1775153 2132178 2263545 1858064 1273429 603207 -363481 -1209624 -1115105 -171655 612039
31963 612039 772714 822049 1093655 1246451 1127324 1098061 1250572 1233914 1067249 1221988
31953 1221988 1752792 2241986 2630368 3085052 3076869 1854801 -3364 -840313 -82277
31944 -82277 1062165 1459750 1405866 1654404 2253721 2888771 3356972 3260855 2266922 1038156
31934A038156k55649P49766N69527n8180J02019L99536m35560j580878j227236
31925f98499K09715O73915o8868l30224K56226L03528l42687k10957O75667L66932
31915H34748j364326j956632r0406J954924J761103K05428n31149k99674j88677
31906C25339j52325L11708M80445l82997j202622n81637P72150J157556O13298
31897A340915M15118M87757l36613j672414j590187K88756J771377J085677o36367
31888A154019j041818K24274J264525O38011p89459j122850L5900J165004R82056
31879B509662R9993j69898J17630o9926p14330p27378r370K17318m12280o60015
31869A81406Q0191N73131n0294n81500J63957J035885L71764r85954q52431O77178
$$ plain form
31934 1038156 782507 1532273 2101800 2043620 2145639 2545175 2109615 528737 -698499
31925 -698499 -488784 185131 116263 -213961 42265 345793 3106 -207851 467816 834748
31915 834748 -529578 -2486210 -2576616 -621692 1139411 1344839 813690 514016 325339
31906 325339 173014 484722 965167 582170 -620452 -1202089 -429939 727617 1340915
31897 1340915 1756033 2243790 1907177 234763 -1355424 -1066668 704709 1790386 1154019
31888 1154019 112201 336475 1601000 2239011 1449552 326702 362602 1527606 2509662
31879 2509662 2609655 2439757 2557387 2487461 1773131 1045753 1036383 1253701 841421 181406
31869 181406 261597 834728 784434 202934 366891 1402776 1774540 788586 -63845 613333
31859F13333J241052q9440j463994j220623j60559J97234O849L14900R28641O77143
31849A044536m89662j101560k30195J022055Q76137o43547j522707l64175J595468
31840A86350J967126L85387r86368l85203J258953J715503L43455j372962j805199
31831A307042q32099L93575P10003l0908q87400q59775o1502N11239L86617J09251
31821G46043J76516L58705M34787O50291Q99695M49708p68206j539100r62575
31812D45864J61602N25364J03968k85612m30396n36965l02852N17202J164273
31803A362448Q12142k3844l31506l41325r26370j681741j322397R1586J030641
31794a330366P75067K54654K94903N00401L73737K32469L88687M68965J49692
$$ plain form
31859 613333 1854385 1764945 300951 -919672 -1080231 -882997 -876148 -561248 367393 1044536
31849 1044536 554874 -546686 -776881 245174 1121311 477764 -1044943 -1409118 186350
31840 186350 2153476 2538863 1552495 1167292 2426245 4141748 4485203 3112241 1307042
31831 1307042 474943 868518 1578521 1547613 660213 -199562 -261064 250175 636792 746043
31821 746043 922559 1281264 1716051 2366342 3266037 3715745 2947539 1408439 445864
31812 445864 607466 1132830 1236798 951186 520790 -16175 -319027 198175 1362448
31803 1362448 2174590 2150746 1819240 1477915 551545 -1130196 -2452593 -2361007 -1330366
31794 -1330366 -555299 -300645 -5742 494659 868396 1100865 1489552 1958517 2108209
31785B108209k60735m17949l79641j80048K46744N29479J04519p99043j262640
31776c11105r25660k88231K77721Q32210J124800O89141j11784k72460L27011
31767A341643O78360K43410l17522l72973j65910l3685J30240K38021p2113m98613
31757A170858k25848N87989P38417j07953p50140l47756L42695L89328O0329p8647
31747A779272k12677m95107l78655L11914P33394L69839q0056k0068P5210j03416
31737A979650Q3643P30851O84575l90656r28345j8603P13118k20779j339803n41987
31727G51664J165226J219075k14061p19143J11493K77500p40189j089569j31869
31718F30127L51407m19794o78492N45392J377614K77166j207827j022195J32302
$$ plain form
31785 2108209 1847474 1429525 1049884 869836 1116580 1646059 1750578 951535 -311105
31776 -311105 -1236765 -1524996 -1247275 -415065 709735 1398876 1287092 1014632 1341643
31767 1341643 2020003 2263413 1945891 1572918 1407008 1373323 1503563 1741584 1669471 1170858
31757 1170858 945010 1532999 2271416 2163463 1413323 1065567 1408262 1797590 1857919 1779272
31747 1779272 1566595 1071488 692833 1004747 1738141 2107980 2027924 2007856 2083066 1979650
31737 1979650 2063293 2794144 3478719 3088063 2159718 2141115 2854233 2633454 1293651 751664
31727 751664 1916890 3135965 2921904 2202761 2314254 2591754 1851565 761996 630127
31718 630127 981534 561740 -116752 428640 1806254 2083420 875593 -146602 -14300
31709a4300M37210J12850M21456Q82909J72851j057252r43252L90705R51296J96541
31699A551014j97117O86537J462733P50093p25701j410698j054886m81034r2835
31690D88106L20266P43138P91258L12724l69293p78774o39257n1113N36915O83698
31680B037668L73258l1056k28179k35605k51651l77709m39244j39481M03026M69373
31670A580400l52539j206273q19980N41660J119870J68145q15082l05087R41685
31661H52799J154156K39781m29531l85658m07880o50881k96308O44508R11098
31652A632084o335r22510p86894j79517q0636k62535J2781N17146M33638k42847
31642A14375o90298m37112K03737P23465Q57156N97824K37206K09213N35328O90028
$$ plain form
31709 -14300 422910 535760 957216 1840125 2012976 955724 12472 403177 1354473 1551014
31699 1551014 1353897 2040434 3503167 4253260 3527559 2116861 1061975 580941 488106
31690 488106 808372 1551510 2342768 2655492 2286199 1507425 868168 817055 1353970 2037668
31680 2037668 2410926 2379870 2151691 1916086 1664435 1286726 847482 708001 1111027 1580400
31670 1580400 1227861 21588 -798392 -256732 863138 1031283 216201 -88886 852799
31661 852799 2006955 2246736 1817205 1431547 1023667 372786 76478 720986 1632084
31652 1632084 1625749 703239 -83655 -263172 -343808 -606343 -593562 -76416 357222 114375
31642 114375 -575923 -1013035 -809298 -85833 771323 1369147 1606353 1815566 2350894 3040922
31632C040922L38886j47489k94858k64755n26776j067643j386324j123422l69881
31623a801340M87371R86051Q48836K22036m87072j001896j143559o27334M80188
31614b036719J246299P43525m67470p94164J17742P47164j9538j137044r57443
31605b557648L87335J386358J309160P15480K07374j16050j77280J9725K5432
31596A199886l88889n10614K85068J154179P76737m83819r54610k26120L10552
31587A162370j40331n48773L920P01880M21541m49714q68430q10790p60744l80045
31577a669116P62670J706671J070178o30553j338794l80715N83196J49938p54974
31568e01499m82862P25237J143136J53738r24016p36765M08865J188451R49038
$$ plain form
31632 3040922 3379808 3232319 2937461 2672706 2145930 1078287 -308037 -1431459 -1801340
31623 -1801340 -1313969 -327918 520918 742954 255882 -746014 -1889573 -2516907 -2036719
31614 -2036719 -790420 -46895 -514365 -1308529 -1190787 -443623 -463161 -1600205 -2557648
31605 -2557648 -2170313 -783955 525205 1240685 1448059 1332009 1154729 1174454 1199886
31596 1199886 810997 300383 585451 1739630 2516367 2032548 1077938 851818 1162370
31587 1162370 1022039 473266 477186 1179066 1600607 1150893 282463 -528327 -1289071 -1669116
31577 -1669116 -906446 800225 1870403 1239850 -98944 -479659 103537 253475 -501499
31568 -501499 -984361 -259124 884012 1037750 113734 -623031 -214166 974285 1923323
31559A923323K23447j68920p0831K0310k73308o30650m36145K29754M48175k94824
31549I70331j110529p06111P15362J487582O97357n63722q12723k24241l5452
31540D17854m16249k81850P19890J367302O14154p90289j296911o11669J51849
31531a25919J44090k65334l04482J07172M22685K74603j40680l98483l06909K8923
31521e64334M30406P32941O97601J51508o31570r98939o55110o1276K40701L63527
31511b94545O30305P71624L41465k97944l61319L8873K2073m89142n27624K05193
31501C8959O45715R2635n66240l38153K19515P2899m07612j17787P45003Q92470
31491A277404N6034o03918l55985J55698J80645l4660Q6500M99539P33933N07186
$$ plain form
31559 1923323 2146770 1977850 1907019 1927329 1654021 1023371 587226 816980 1265155 970331
31549 970331 -140198 -846309 -130947 1356635 2053992 1490270 677547 453306 417854
31540 417854 1605 -280245 439645 1806947 2421101 1630812 333901 -277768 -125919
31531 -125919 18171 -247163 -551645 -444473 -21788 252815 112135 -286348 -593257 -564334
31521 -564334 -133928 599013 1296614 1448122 816552 -182387 -837497 -898773 -658072 -294545
31511 -294545 335760 1107384 1448849 1150905 789586 828459 850532 361390 -166234 38959
31501 38959 684674 777309 211069 -127084 92431 165330 -242282 -360069 384934 1277404
31491 1277404 1333438 729520 373535 529233 709878 675218 761718 1261257 1995190 2502376
31481B502376j06695o71705n61212K96227R88642O81896r5358j94541L03194K38529
31471C381353n73752r01683j40561O23429L57666l67967n51604l84047n29977
31462I12857o61601n7642Q80867J079578N07278J68097M22835N17932l7272o85426
31452C047503p70809m32638j29926O1447K32323K34527n4300m03084n37503n10240
31442G37300m63426l02320N7377L49327K55684o7720j50975J13300L19801J87957
31432A036305K5175K82709Q12720R19883K27336p60731j172067p61711j72045
31423D37574j24378n17599n73545Q3689P85970N85844m53983j232844j008844
31414b018116k81389J02003J86218N75192J213157J380590Q42082J53323k26762
$$ plain form
31481 2502376 2395681 1723976 1162764 1458991 2447633 3129529 3034171 2839630 3142824 3381353
31471 3381353 2807601 1905918 1765357 2388786 2746452 2378485 1826881 1442834 912857
31462 912857 251256 193614 1074481 2154059 2661337 2829434 3252269 3770201 3732929 3047503
31452 3047503 2276694 1844056 1714130 1775577 2007900 2242427 2188127 1785043 1247540 737300
31442 737300 273874 -28446 28931 378258 633942 566222 415247 528547 848348 1036305
31432 1036305 1061480 1344189 2156909 3076792 3304128 2543397 1371330 609619 437574
31423 437574 313196 -204403 -777948 -694259 91711 677555 223572 -1009272 -2018116
31414 -2018116 -2299505 -2197502 -2011284 -1436092 -222935 1157655 1999737 2153060 1926298
31405A926298l18973r9174M52881P00111r0990j260716j157288M13123J545806
31396B111078R17337l24948n75100k71694o99239j410646r43440M66197J043885
31387C13430K72110m39036p9417O85065Q93655M68550k81681j011970j053487
31378b32781j13258P49708L37964o08889l54184Q69624J029374k80029j014366
31369C83163q0998Q82923M02682m48405k29863L12849j25824q63139m79845N76623
31359C30166P90209J22832k37653m84K19245L99897Q15387Q26655j93708j255404
31349A817142r62166J15524K71972m54590m13414O57002J033029j00152j227431
31340G36916q73123K60684O06368k6102o18009n73631k08507O07k7254k5074K84606
$$ plain form
31405 1926298 1607325 1508151 1961032 2661143 2570153 1309437 152149 565272 2111078
31396 2111078 3028415 2703467 2128367 1856673 1157434 -253212 -1196652 -730455 313430
31387 313430 585540 146504 67087 752152 1645807 2114357 1832676 820706 -232781
31378 -232781 -346039 403669 741633 132744 -221440 648184 1677558 1397529 383163
31369 383163 302165 1185088 1587770 1139365 909502 1222351 1096527 233388 -246457 330166
31359 330166 1120375 1243207 1005554 1005070 1224315 1624212 2439599 3266254 3072546 1817142
31349 1817142 854976 970500 1242472 787882 374468 1031470 2064499 1964347 736916
31340 736916 -136207 124477 730845 704743 86734 -486897 -695404 -694797 -722051 -747125 -462519
31329d62519P54363P97084J43686o07994p08543k65872O4272J16168K38353N12895
31319E81893O74307O33482M64192J31462k14064j25563L50465M14266k13575n58523
31309B138342R1387Q07283M13082n59573p86251l00523q2409j27348K29254N40959
31299B364203j65904j286344j225760o6742M78468q8285m22971J36784O17176
31290C40625M85914N00864P99255L29629q98750j155813K35016J451143Q85588
31281B973471m49362p16052P5572O77736N71247n4924j042114j722853r88216
31272f75495Q16072J515419Q9834j448038q64271R91778J655619O78544l31627
31263B427835m90982l33590k08710M9953J38610l05705o03330N5176R67033Q18858
$$ plain form
31329 -462519 291844 1088928 1232614 624620 -83923 -349795 -285523 -169355 68998 581893
31319 581893 1256200 1889682 2353874 2485336 2271272 2145709 2496174 2910440 2696865 2138342
31309 2138342 2229729 3037012 3450094 2890521 2104270 1803747 1721338 1593990 1823244 2364203
31299 2364203 2198299 911955 -313805 -380547 97921 9636 -413335 -276551 340625
31290 340625 826539 1327403 2126658 2456287 1557537 401724 636740 2087883 2973471
31281 2973471 2524109 1808057 1883629 2561365 3132612 3077688 2035574 312721 -675495
31272 -675495 140577 1655996 1745830 297792 -566479 425299 2080918 2759462 2427835
31263 2427835 1936853 1603263 1394553 1444506 1583116 1277411 674081 729257 1696290 2515148
31253B515148j38652m96478M1752M94011M53702L86153K53060m15157j157859
31244A935680j005323k12923J01133o0879K50131Q77248O72322k84186o87367
31235A585836m15307o48398j214443m01755J711877K439811N13101j546216j129187
31226H95319N01751M83246j031811j444378l4685J245888J152050N73147K65466
31217B605993l21969j211666j146172J95133J109000L57851q03009o12953M55263
31208F27471O81547j00956n86749l63934k54512m23918q7854O75690P19299m3338
31198H42746j86225O84577Q54786o48571j930720r56555R81187J036215p13994
31189c6554j400757L4133J280036N22100p85501n47978O69558R49337K01595p8488
$$ plain form
31253 2515148 2376496 1880018 1921770 2415781 2869483 3255636 3508696 3093539 1935680
31244 1935680 930357 717434 818567 757688 1007819 1885067 2557389 2273203 1585836
31235 1585836 1170529 522131 -692312 -1094067 617810 3057621 3570722 2024506 895319
31226 895319 1397070 1880316 848505 -595873 -630558 615330 1767380 2340527 2605993
31217 2605993 2284024 1072358 -73814 121319 1230319 1588170 785161 172208 627471
31208 627471 1309018 1208062 621313 257379 2867 -421051 -508905 166785 886084 842746
31198 842746 656521 1341098 2195884 1547313 -383407 -1339962 -358775 677440 -36554
31189 -36554 -1437311 -1403178 -123142 398958 -386543 -934521 -264963 684374 885969 807481
31179H07481N33703R43529M76807l37531q66611r81154o16396J76598P90759O26266
31169A553451J1470k67859j60652k18715m96113m88595o3796L43419L90028Q8836
31159F91474l47965m43800K52271J243131J202026j85990j354328q88444M18022
31150E86397Q35882K31912k19489k08155m02053p54837n17557J55518L07040j36335
31140a21677l68951l03237m93948o04686J66560J149411P72052o93066j109729
31131a607271K78372J679235J534232M55918m20912j007273j215521l65454J169856
31122E01182J610428L77520p17876k54231O29239L79086m19521m42692k8904k20317
31112A413914o69880m41651J57457L32984L47075O42346O14774n1001k40430N10927
$$ plain form
31179 807481 1341184 2284713 2761520 2423989 1557378 576224 -40172 136426 927185 1553451
31169 1553451 1564921 1297062 1136410 917695 421582 -67013 -130809 212610 602638 691474
31159 691474 343509 -100291 151980 1395111 2597137 2411147 1056819 168375 586397
31150 586397 1422279 1654191 1434702 1226547 824494 69657 -447900 -292382 14658 -121677
31140 -121677 -490628 -793865 -1287813 -1892499 -1725939 -576528 195524 -497542 -1607271
31131 -1607271 -1328899 350336 1884568 2340486 1919574 912301 -303220 -668674 501182
31122 501182 2111610 2489130 1771254 1517023 2146262 2525348 2105827 1663135 1634231 1413914
31112 1413914 744034 302383 459840 792824 1139899 1782245 2397019 2346018 2105588 2616515
31102B616515M71740j387710k703626r75866J916632K080106l95582j780307p43200
31093i01298K40125n8858L23595K015273K191706n50599k921771j710901J078803
31084b93925J425691n29351j344246k7947J013838M69865j06950M49948R76546
31075B033469L45285n85204o17977o8100J90910J77196K59276K69115Q6169J56404
31065B246543N80200N79246k47604r65232n94306K94323L67949m95721j135004
31056F30394q53171j82872J87584K88886L56773K58135n9736j53024K61417O36581
31046A370967K76661n23842p67342j76009M28825L79042N8467J07013L63846K78610
31036A796238n5492r2724J27108j3363n93115q44004k68279N49639O82262L0402
$$ plain form
31102 2616515 3088255 1700545 -1003081 -1978947 -62315 2017791 1622209 -158098 -901298
31093 -901298 -661173 -720031 -396436 1618837 3810543 3259944 338173 -1372728 -293925
31084 -293925 1131766 602415 -741831 -769778 244060 713925 606975 1056923 2033469
31075 2033469 2378754 1793550 1175573 1107473 1298383 1475579 1734855 2003970 2090139 2246543
31065 2246543 2826743 3405989 3158385 2193153 1598847 1893170 2261119 1765398 630394
31056 630394 -222777 -405649 -218065 70821 427594 685729 625993 472969 734386 1370967
31046 1370967 1647628 1123786 356444 180435 609260 988302 1046769 1153782 1517628 1796238
31036 1796238 1740746 1648022 1775130 1761767 1168652 324648 56369 606008 1288270 1318672
31026A318672o46992o61030n1363N52943N52525k7038n08098l16656K66378M53497
31016I32838O7988j80138K26919P20494L22164r44134j817365j166591O12208
31007a225617J852178J379977j69280j119116p47384L2343J31297k94729m34211
30998e94542j87846n8875m7056L06148Q41914P91308L1789n70367l69884K50511
30988C93100N62816L27194k64812q28685q34583j25881N40633L07799l92769l17062
30978f32250O01962J027642L47238l89581l21209j12706m61041o51611P2856Q83867
30968C65167O51546q3455r3368L36547L0926p56317o45449L73477P59544j5176
30958I23442o14408j14146N76150L95532k01303k48013J81313M26066L80009K48896
$$ plain form
31026 1318672 671680 10650 -40713 512230 1064755 1037717 529619 212963 479341 932838
31016 932838 1000826 820688 1047607 1768101 2090265 1146131 -671234 -1837825 -1225617
31007 -1225617 626561 2006538 1837258 718142 -29242 3101 134398 -160331 -594542
30998 -594542 -782388 -841263 -888319 -582171 259743 1051051 1082840 512473 142589 393100
30988 393100 955916 1283110 1018298 189613 -644970 -770851 -230218 77581 -315188 -632250
30978 -632250 -30288 997354 1344592 955011 633802 521096 60055 -591556 -518700 365167
30968 365167 1016713 933258 839890 1176437 1207363 451046 -194403 179074 938618 923442
30958 923442 309034 194888 771038 1166570 965267 717254 898567 1324633 1704642 1953538
30948A953538j10981p28733r98018m66277L37209O20912M35627L36962L68055
30939A748294J58283k35907l25191O9922N80134O88257Q3212j055174j832138
30930a20308j248607M56986J647538J168366j12621n03753J85482O01075j6692
30921B057466q44422q74326k47832L21933O17943P41354N06057j90138p67474
30912A320561n62933J13835L03703k00245n49451j68717L47793J71824m71156
30903C05214o37860k8531P02838R63558Q60438O60545K35745n62153j348604j466740
30893c15550p04697M60682J248334J152675L63354l36255l52872J4470j812n35278
30883I93051r26664p36574k75380Q9074M45872P93341O96814L4196n51397n37830
$$ plain form
30948 1953538 1842557 1113824 115806 -350471 -13262 607650 1043277 1380239 1748294
30939 1748294 1906577 1670670 1345479 1415401 1995535 2683792 2767004 1711830 -120308
30930 -120308 -1368915 -911929 735609 1903975 1791354 1287601 1473083 2074158 2057466
30921 2057466 1213044 338718 90886 412819 1030762 1772116 2278173 2088035 1320561
30912 1320561 757628 871463 1175166 974921 425470 256753 604546 776370 305214
30903 305214 -332646 -361177 341661 1305219 2165657 2826202 3061947 2499794 1151190 -315550
30893 -315550 -1020247 -559565 688769 1841444 2204798 1868543 1515671 1530141 1528329 993051
30883 993051 66387 -670187 -945567 -856493 -410621 382720 1079534 1113730 562333 24503
30873B4503k52996j10604J61812P38937Q91729K3502j087600j274078p26662m49608
30863b061065l80871L77931J579139J784575N93119o49466q66279n40063l77372
30854e40352j11857M86964O94694L0818o23483k77542N68104P44295K25703q8328
30844A109016J9562m6699l69794k68747M44396R29524M43098o15607j197516q22548
30834c75315J8233N49358N43432L74968L52402L00171j3126l63133m07942k74188
30824G04860k60122k10399J15821L14205r7056n48914l5873J096683J331531K90409
30814B701145n53210j49770N15482J23707q30186r18279l8130N94130L46914j46606
30804A645197j36759L14766N88721J86544p13868j163271m01698Q86203J116991
$$ plain form
30873 24503 -228493 -339097 -177285 561652 1453381 1476883 389283 -884795 -1611457 -2061065
30863 -2061065 -2441936 -2064005 -484866 1299709 1892828 1243362 377083 -162980 -540352
30854 -540352 -652209 -165245 529449 560267 -63216 -340758 227346 971641 1197344 1109016
30844 1109016 1128578 1081879 712085 443338 887734 1817258 2260356 1644749 447233 -375315
30834 -375315 -357082 192276 735708 1110676 1463078 1763249 1750123 1386990 979048 704860
30824 704860 444738 234339 350160 664365 567309 18395 -17478 1079205 2410736 2701145
30814 2701145 2147935 1998165 2513647 2637354 1807168 888889 850759 1444889 1791803 1645197
30804 1645197 1508438 1823204 2411925 2598469 1884601 721330 319632 1205835 2322826
30795B322826k8426j052049q18827m2707K52198L60532P28265N49727p18139j585478
30785c2078m37550J489844J438897p32840k166771j131973P17059J079010R9567
30776C23165n08939p1483O66736R47413O44361l0499o17432n59311J00164N10192
30766A404367N6380o99545o77255K80719J129456Q69464k27362r21054n39205
30757F75965J87828K27274k21573j75165L33774K16329o56282r27735J3007Q36314
30747E09736M57516j11059L55512R95581M25013o00958m23375M91725L35064p50820
30737A683935r11471K649J10557j066499j623672m78258R67762J319655J035414
30728A040072P78490J77308o44929m91264O99502J162366J40238p10526j83214
$$ plain form
30795 2322826 2294400 1242351 423524 380817 633015 993547 1721812 2271539 1553400 -32078
30785 -32078 -469628 1020216 2459113 1726273 -440498 -1572471 -855412 223598 323165
30776 323165 -185774 -257257 409479 1356892 2001253 1970754 1353322 794011 894175 1404367
30766 1404367 1460747 761202 83947 364666 1494122 2363586 2136224 1215170 675965
30757 675965 863793 1091067 869494 694329 1028103 1244432 588150 -339585 -326578 509736
30747 509736 967252 856193 1211705 2207286 2632299 2031341 1607966 2099691 2434755 1683935
30737 1683935 772464 775113 885670 -180829 -1804501 -2282759 -1314997 4658 1040072
30728 1040072 1818562 1995870 1350941 859677 1559179 2721545 2861783 2151257 1968043
30719A968043M31843r3094n38579L95345J315225L16611j556102j773997k67061
30710A98234P48129K86471n21180p16154m51891J27517R23318J034564j88784
30701A440224j518317j229859J55659N78685k77409o29642L45046J305577J100648
30692A270612L62666O2589J39555K72620N54569P37997J67483q97651j190914
30683A479526l34577M02104l2599r83047j268753q73553n55564m89093j93012
30674b848568N29312J208124J170379K36367q51280r14061K43333J255507Q54800
30665H83913k53946l27826P88694J388625M50788r46640j310726o41171P8422
30656A10133L72628M52878M96732M34843J56325m05165j081299j318439p18353
$$ plain form
30719 1968043 2399886 2306792 1768213 2163558 3478783 3795394 2239292 465295 198234
30710 198234 946363 1232834 711654 -4500 -456391 -328874 594444 1629008 1440224
30701 1440224 -78093 -1307952 -1152293 -573608 -851017 -1480659 -1135613 169964 1270612
30692 1270612 1633278 1695867 1835422 2108042 2662611 3400608 3568091 2670440 1479526
30683 1479526 1144949 1547053 1514454 531407 -737346 -1610899 -2166463 -2655556 -2848568
30674 -2848568 -2319256 -1111132 59247 295614 -555666 -1469727 -1226394 29113 883913
30665 883913 629967 302141 1090835 2479460 2930248 1983608 672882 31711 110133
30656 110133 482761 935639 1432371 1867214 2023539 1618374 537075 -781364 -1499717
30647a499717K90745R14902J003867Q87197M76587m23735j101489n74915O66982
30638F40424J009535J31584m32384K25786Q76389J80740j054082j068158J80591
30629F90425J011321M33281o74659r05836p34J056705J173795K24867q49004j030638
30619A129523l04608M64896O32945L13231j41064o18435j080546j379432j360058
30610b343548q53289K35585J414180J655722P31486n6154M00398J081362K10179
30601B475921j712540k216746m71013J430615J510656L61901m51846o93630q40155
30592f06837o85548n6021K90988o0390j30203P79518J509363Q11452l74780l29383
30582A148159O10260P23426j25745m30261K02988M74597j68045n93355j00729
$$ plain form
30647 -1499717 -1208972 -294070 709797 1596994 2073581 1649846 548357 -26558 640424
30638 640424 1649959 1781543 1349159 1574945 2451334 2632074 1577992 509834 690425
30629 690425 1701746 2135027 1460368 554532 553798 1610503 2784298 3009165 2160161 1129523
30619 1129523 824915 1289811 1922756 2235987 2094923 1476488 395942 -983490 -2343548
30610 -2343548 -3196837 -2961252 -1547072 108650 840136 783982 1184380 2265742 2475921
30601 2475921 763381 -1453365 -1924378 -493763 1016893 1378794 926948 233318 -606837
30592 -606837 -1292385 -1348406 -1057418 -1117808 -1248011 -468493 1040870 1852322 1477542 1148159
30582 1148159 1758419 2481845 2356100 1925839 2128827 2603424 2435379 1842024 1741295
30573A741295L42907j43256q34713o57030J10473L90519j25388p86584r22490
30564h84267m18593L18406O83527M81095K27142M08234O56492L84154l8776K00771
30554B018185P85770M99888p81273j636047j087682J24116Q19705Q34088N62946
30545B139696J04274l97097m74125j63440k26474q10614q75909J37604J088543
30536E22458P60191j74477k34602M64962N08913l94372r51159m04494L62349L12034
30526G71803l16917o34006l01163L66043Q28853N60615m51177j258070q49866
30517a283885L16947P30053O6025k55723N82450J289275M93013q97370r95192
30508D5593J32321O85415J9080o04999l48282k6630l73142o90262j92771N93559
$$ plain form
30573 1741295 2084202 1940946 1106233 449203 559676 950195 824807 38223 -884267
30564 -884267 -1302860 -984454 -300927 180168 407310 815544 1472036 1856190 1817414 2018185
30554 2018185 2803955 3303843 2522570 886523 -201159 -77043 742662 1576750 2139696
30545 2139696 2243970 1846873 1372748 1209308 982834 172220 -703689 -566085 522458
30536 522458 1282649 1108172 873570 1338532 1847445 1453073 501914 97420 459769 771803
30526 771803 454886 -179120 -480283 -114240 714613 1275228 824051 -434019 -1283885
30517 -1283885 -966938 -236885 -170860 -426583 155867 1445142 1938155 1040785 45593
30508 45593 177914 863329 882409 277410 -70872 -97502 -470644 -1160906 -1353677 -760118
30498g60118Q23868O59339N64579L05450k32568k77792M35452N60334q57798k161139
30488i40393j060542J571862K389074L14611j886879j675861p0955N63913J29916
30479f65254J76978R42676J212184O01974k471j89272n01129j050225j128502
30470f03041n10517O5474Q0852r9817p9826l3627r2024P3339O30679J161341J196090
30459A788923P13934n2925q09008j124623p69181j96283q4663l43539k57954L14581
30449h20738O85178M44900K2831j50257k45271m21962l60851R9182M70454K79460
30439B926k40689n22908l05942L52582J148933J387744M96142r37653j438863
30430e7728n20873M98935L07733m99739l43488R47049J803415J012992p59985
$$ plain form
30498 -760118 63750 723089 1287668 1593118 1360550 1082758 1518210 2078544 1220746 -940393
30488 -940393 -2000935 -429073 1960001 2274612 387733 -1288128 -1359083 -795170 -665254
30479 -665254 -488276 454400 1666584 2268558 2266087 2076815 1575686 525461 -603041
30470 -603041 -1113558 -1048084 -967232 -1067049 -1146875 -1180502 -1272526 -1199187 -568508 592833 1788923
30459 1788923 2502857 2449932 1640924 516301 -252880 -449163 -533826 -877365 -1135319 -820738
30449 -820738 -135560 309340 332171 181914 -63357 -485319 -846170 -746988 -276534 2926
30439 2926 -237763 -760671 -1066613 -714031 434902 1822646 2318788 1381135 -57728
30430 -57728 -578601 -79666 228067 -271672 -615160 331889 2135304 3148296 2388311
30421B388311j840412j406106j83510N16679K44035k46570j57532K39293K22191
30412b23621j1822L08904Q61837L80058j057303j512980l6969J506048J072628
30403A286780l37627k03971J493975K180073N91706j510658k082627j280357l82341
30394b45047J20888L59733L13033J92783N60245J229610J081019k36835j458983
30385A916446j399020m83418K44003N76690O68663K35721o18339q29928O8033
30376C78851P83952J11742r56817o65290O28793R36685k38317j174012n22693
30367g17106R94091J871630J509924K83689r57106j234634l37923N47296J77421
30358B137282q83641j063634l07799p4993o63504n74592P68732J710165J007034
$$ plain form
30421 2388311 547899 -858207 -1041717 -525038 -281003 -527573 -685105 -445812 -223621
30412 -223621 -235443 73461 935298 1315356 258053 -1254927 -1291896 214152 1286780
30403 1286780 949153 745182 2239157 4419230 5010936 3500278 1417651 137294 -245047
30394 -245047 -124159 235574 548607 741390 1301635 2531245 3612264 3375429 1916446
30385 1916446 517426 34008 278011 854701 1523364 1759085 1140746 310818 378851
30376 378851 1162803 1274545 317728 -347562 281231 1217916 979599 -194413 -717106
30367 -717106 276985 2148615 3658539 3942228 2985122 1750488 1412565 1959861 2137282
30358 2137282 1253641 190007 -117792 -192785 -856289 -1430881 -662149 1048016 2055050
30349B055050j2565L63303J296063P29519j143903j979931p81454P08059O43383
30340A877524m53603q02953K8402P58865L69770n09579n57962L60884R49933K42454
30330B263735j021810j388998o47490R7394J51786l0616K0987O0577m4733J76961
30320c62207Q10187J022709L20673n00800n33626j25709j03207l02114k815O40952
30310H64043P91935L21289q7704j41986k28927m83296n13882k17088l4914j40142
30300A29328m6882N98635J293934J163115M2650j173717j397535n51576L21671
30291C79623L83108N9383K02991N84079K72530o03758q52972k22680J00572l86447
30281h3571m70563O26330J569451Q99166n08324p69524N2570K84116m88490q73121
$$ plain form
30349 2055050 2042485 2405788 3701851 4431370 3287467 1307536 526082 1234141 1877524
30340 1877524 1423921 620968 649370 1408235 1778005 1268426 710464 1071348 2021281 2263735
30330 2263735 1241925 -147073 -794563 -697169 -545383 -575999 -555012 -494435 -539168 -362207
30320 -362207 447980 1470689 1791362 1290562 756936 631227 528020 225906 223091 864043
30310 864043 1655978 1977267 1889563 1747577 1518650 1035354 521472 304384 269470 129328
30300 129328 82446 681081 1975015 3138130 3180780 2007063 609528 57952 379623
30291 379623 762731 822114 1025105 1609184 1881714 1277956 424984 202304 302876 -83571
30281 -83571 -554134 72196 1641647 2540813 2032489 1262965 1315535 1599651 1111161 238040
30271B38040n9524J003223J209927P07290K07752q0732l56909p12234j011621
30262A145212r50162l34391M10159N03664j1576j39400M40478O53515j78854j024482
30252E14163q31268k87360l60950l61825O07977J458849P20661n85631l39241
30243E35375J041571J245863O4569l77385M69472O79048m68303j093357j96301
30234A900552M40530n50737j639494j033655L70371P11732R3610j98793J3437
30225A07553J56822L48962P84831P50776j86015j004319o81942J67444M55763
30216H99875L77097O17427Q03703J94638q48656j361034j090902l67985N19682
30207b56155J019897M60823o85597r15851J07372Q84701M63854j83379j98942
$$ plain form
30271 238040 178516 1181739 2391666 3098956 3306708 3225976 2869067 2156833 1145212
30262 1145212 195050 -139341 270818 774482 762906 623506 1063984 1717499 1538645 514163
30252 514163 -317105 -604465 -965415 -1327240 -719263 739586 1460247 874616 535375
30243 535375 1576946 2822809 2887378 2509993 2979465 3658513 3190210 2096853 1900552
30234 1900552 2341082 1790345 150851 -882804 -512433 199299 292909 94116 107553
30225 107553 264375 613337 1398168 2148944 1962929 958610 276668 444112 899875
30216 899875 1276972 1894399 2698102 2892740 2044084 683050 -407852 -775837 -256155
30207 -256155 763742 1224565 538968 -376883 -269511 615190 1079044 895665 696723
30198F96723l23555r63514q16108P33042J751149N21395j432094j488239J77331
30189a143870J282704R96840L81644Q3020q3542J14437Q17324R64233k41528j509708
30179A661554j198106j0651K74558j44034J89034J024007Q96198K4812q2690M29453
30169C064135O5142r80459j000772j5052J40902q02759j072877k31974J4072p89515
30159a609157o72404J214094K600968J418408j004029j904063p52678O83668Q88896
30150H63703r3664j166436j187472r2539P89526L96674l66050K5311J073602R43290
30140A185945l94942j031756k89785M33691L97462N10626R39658M21594j012252
30131A160241j303467K77566J569433R03740l50734m22673J743l43097o70290
$$ plain form
30198 696723 373168 -590346 -1406454 -673412 1077737 1599132 167038 -1321201 -1143870
30189 -1143870 138834 1135674 1517318 1600338 1516796 1631233 2448557 3412790 3171262 1661554
30179 1661554 463448 452797 727355 583321 772355 1796362 2692560 2717372 2634682 3064135
30169 3064135 3129277 2148818 1148046 1132994 1273896 471137 -601740 -833714 -819642 -1609157
30159 -1609157 -2281561 -1067467 1533501 2951909 1947880 43817 -708861 -25193 863703
30150 863703 770039 -396397 -1583869 -1676408 -886882 -490208 -856258 -830947 242655 1185945
30140 1185945 791003 -240753 -530538 -96847 300615 811241 1750899 2172493 1160241
30131 1160241 -143226 134340 1703773 2607513 2256779 1834106 1835849 1492752 822462
30122H22462J97986J240830Q45665k96804m14351K41302M1334r20524q83118N76765
30112A451547J783144J417493O6011r46377j028582m74603l8663l16181r42426
30103I71363q37974J67380P66073O1797r11935p01408L62672P92548J92129m48310
30093D14335l70453J93333O76290O89520R8313p29627j057824o34999N4606O43234
30083b3272J151777J198155J93283j215325j381580p0772R38422N49223j15126
30074A224785k2984j00452j099360j539925n4053J777408J540579j70273p76329
30065G79396J57035O90139J05278k05150L08335K98226q11327j508891o68682
30056h55641N75007O71211r0539m06909J4920M19302L25371l9131k50462m9488
$$ plain form
30122 822462 1020448 2261278 3106943 2810139 2395788 2637090 2678424 1757900 874782 1451547
30112 1451547 3234691 4652184 4718195 3771818 2743236 2268633 2229970 1913789 971363
30103 971363 133389 300769 1066842 1128639 216704 -484704 -122032 670516 862645 414335
30093 414335 43882 237215 913505 1603025 1701338 971711 -86113 -721112 -666506 -23272
30083 -23272 1128505 2326660 2519943 1304618 -76962 -147734 790688 1339911 1224785
30074 1224785 1201801 1101349 1989 -1537936 -1591989 185419 1725998 1555725 779396
30065 779396 936431 1626570 1731848 1526698 1835033 2133259 1321932 -186959 -855641
30056 -855641 -280634 390577 300038 -106871 -91951 327351 652722 613591 363129 313641
30046C13641N03480R04057N68036m55005j392303j454366m96045Q17102J349832
$$ plain form
30046 313641 817121 1721178 2289214 1834209 441906 -1012460 -1508505 -691403 658429
$$ [...]
##END NTUPLES=NMR SPECTRUM
##END=
