##TITLE=31Pdec_LY-13Dix.4.B
 CD3CN, 24 sc
 4.06.2021
##JCAMPDX= 6.0         $$ Bruker NMR JCAMP-DX V2.0
##DATA TYPE= NMR SPECTRUM
##DATA CLASS= NTUPLES
##ORIGIN= UXNMR, Bruker Analytische Messtechnik GmbH
##OWNER= root
$$ XWIN-NMR		Version 3.5
$$ Fri Jun  4 09:58:24 2021 Russian Standard Time (UT+4h)  she@DPX200
##.OBSERVE FREQUENCY= 81.013821
##.OBSERVE NUCLEUS= ^31P
##.ACQUISITION MODE= SIMULTANEOUS
##.ACQUISITION SCHEME= undefined
##.AVERAGES= 24
##.DIGITISER RES= 16
##SPECTROMETER/DATA SYSTEM= spect
##.PULSE SEQUENCE= zgpg30
##.SOLVENT NAME= CD3CN
##.SHIFT REFERENCE= (INTERNAL, CD3CN, 0, 248.564)
##AUDIT TRAIL= $$ (NUMBER, WHEN, WHO, WHERE, WHAT)
$$ ##TITLE= Audit trail, XWIN-NMR		Version 3.5
$$ ##JCAMPDX= 5.01
$$ ##ORIGIN= Bruker BioSpin GmbH
$$ ##OWNER= she
$$ F:/spectra/data/she/nmr/P31/1/pdata/1/auditp.txt
$$ ##AUDIT TRAIL=  $$ (NUMBER, WHEN, WHO, WHERE, WHAT)
(   1,<2021-06-04 09:56:57.42 +0400>,<she>,<DPX200>,
      <created by zg, POWCHK disabled, PULCHK disabled
       configuration hash MD5:
       00 E9 B6 7A A2 85 ED C7 34 08 36 98 17 FE 4E 26
       data hash MD5: 32K
       DC E9 AC B7 A9 C8 F8 CC F6 8D 15 D6 D1 24 EB F7>)
(   2,<2021-06-04 09:57:00.07 +0400>,<she>,<DPX200>,
      <Start of raw data processing
       efp BC_mod = 2 LB = 1 FT_mod = 6 PKNL = 1 PHC0 = -5449.951 PHC1 = -806.9276 SI = 64K 
       data hash MD5: 64K
       80 05 8E 89 2F 42 4B 9D 2C 1D A6 88 8F 08 47 9B>)
(   3,<2021-06-04 09:57:49.95 +0400>,<she>,<DPX200>,
      <pk PHC0 = -517.0185 PHC1 = 1058.798 
       data hash MD5: 64K
       57 F3 8D F9 83 E7 2A B5 6A B5 CC 99 DC D4 A3 72>)
$$ ##END=
$$ 
$$ hash MD5
$$ 59 38 B3 A2 28 E2 9F 40 AA 17 A5 C0 57 6D 94 11
##$RELAX= 
##$RELAX= 
##$RELAX= 
##$RELAX= 
##$RELAX= 
##$RELAX= 
##$RELAX= 
##$RELAX= 
$$ Bruker specific parameters
$$ --------------------------
##$DU= <F:/spectra>
##$EXPNO= 1
##$NAME= <P31>
##$PROCNO= 1
##$TYPE= <nmr>
##$USER= <she>
##$AMP= (0..31)
100 100 100 100 100 100 100 100 100 100 100 100 100 100 100 100 100 100 
100 100 100 100 100 100 100 100 100 100 100 100 100 100 
##$AQSEQ= 0
##$AQ_mod= 1
##$AUNM= <au_zg>
##$AUTOPOS= <>
##$BF1= 81.014009
##$BF2= 200.13
##$BF3= 200.13
##$BF4= 200.13
##$BF5= 200.13
##$BF6= 200.13
##$BF7= 200.13
##$BF8= 200.13
##$BYTORDA= 1
##$CFDGTYP= 0
##$CFRGTYP= 5
##$CHEMSTR= <none>
##$CNST= (0..31)
1 1 145 1 1 1 1 1 1 1 1 1 1 1 1 1 1 1 1 1 1 1 1 1 1 1 1 1 1 1 1 1 
##$CPDPRG= <waltz16>
##$CPDPRG1= <>
##$CPDPRG2= <waltz16>
##$CPDPRG3= <>
##$CPDPRG4= <mlev>
##$CPDPRG5= <mlev>
##$CPDPRG6= <mlev>
##$CPDPRG7= <mlev>
##$CPDPRG8= <mlev>
##$CPDPRGB= <>
##$CPDPRGT= <>
##$D= (0..31)
0 1 0 0 0 0 0 0 0 0 0 0.03 2e-05 3e-06 0 0 0 0 0 0 0 0 0 0 0 0 0 0 0 0 
0 0 
##$DATE= 1622786216
##$DBL= (0..7)
120 120 120 11 120 120 24 19 
##$DBP= (0..7)
150 150 150 150 150 150 150 150 
##$DBP07= 0
##$DBPNAM0= <>
##$DBPNAM1= <>
##$DBPNAM2= <>
##$DBPNAM3= <>
##$DBPNAM4= <>
##$DBPNAM5= <>
##$DBPNAM6= <>
##$DBPNAM7= <>
##$DBPOAL= (0..7)
0.5 0.5 0.5 0.5 0.5 0.5 0.5 0.5 
##$DBPOFFS= (0..7)
$$ [...]
##$SUBNAM2= <"">
##$SUBNAM3= <"">
##$SUBNAM4= <"">
##$SUBNAM5= <"">
##$SUBNAM6= <"">
##$SUBNAM7= <"">
##$SUBNAM8= <"">
##$SUBNAM9= <"">
##$SW= 501.771253377433
##$SWIBOX= (0..15)
0 1 3 0 0 0 0 0 0 0 0 0 0 0 0 0 
##$SW_h= 40650.406504065
##$TD= 32768
##$TD0= 1
##$TE= 0
##$TE2= 300
##$TE3= 300
##$TEG= 300
##$TL= (0..7)
0 120 53 12 22 120 120 120 
##$TP= (0..7)
150 150 150 150 150 150 150 150 
##$TP07= 0
##$TPNAME0= <>
##$TPNAME1= <>
##$TPNAME2= <>
##$TPNAME3= <>
##$TPNAME4= <>
##$TPNAME5= <>
##$TPNAME6= <>
##$TPNAME7= <>
##$TPOAL= (0..7)
0.5 0.5 0.5 0.5 0.5 0.5 0.5 0.5 
##$TPOFFS= (0..7)
0 0 0 0 0 0 0 0 
##$TUNHIN= 0
##$TUNHOUT= 0
##$TUNXOUT= 0
##$USERA1= <user>
##$USERA2= <user>
##$USERA3= <user>
##$USERA4= <user>
##$USERA5= <user>
##$V9= 5
##$VALIST= <valist>
##$VCLIST= <CCCCCCCCCCCCCCC>
##$VD= 0
##$VDLIST= <DDDDDDDDDDDDDDD>
##$VPLIST= <PPPPPPPPPPPPPPP>
##$VTLIST= <TTTTTTTTTTTTTTT>
##$WBST= 1024
##$WBSW= 4
##$XGAIN= (0..3)
0 0 0 0 
##$XL= 0
##$YL= 0
##$YMAX_a= 3452
##$YMIN_a= -10132
##$ZGOPTNS= <>
##$ZL1= 120
##$ZL2= 120
##$ZL3= 120
##$ZL4= 120
##$ABSF1= 0
##$ABSF2= 0
##$ABSG= 0
##$ABSL= 0
##$ALPHA= 0
##$AQORDER= 0
##$ASSFAC= 0
##$ASSFACI= 0
##$ASSFACX= 0
##$ASSWID= 0
##$AUNMP= <proc_1d>
##$AZFE= 0.1
##$AZFW= 0.5
##$BCFW= 0
##$BC_mod= 2
##$BYTORDP= 0
##$COROFFS= 0
##$CY= -3
##$DATMOD= 1
##$DC= 0
##$DFILT= <>
##$DTYPP= 0
##$F1P= 0
##$F2P= 0
##$FCOR= 1
##$FTSIZE= 65536
##$FT_mod= 6
##$GAMMA= 0
##$GB= 0
##$INTBC= 1
##$INTSCL= 5.30512e-09
##$ISEN= 30
##$LB= 1
##$LEV0= 0
##$LPBIN= 0
##$MAXI= 10000
##$MC2= 0
##$MEAN= 0
##$ME_mod= 0
##$MI= 50
##$NCOEF= 0
##$NC_proc= -5
##$NLEV= 6
##$NOISF1= 182.463
##$NOISF2= 159.3651
##$NSP= 0
##$NTH_PI= 0
##$NZP= 0
##$OFFSET= 248.5645
##$PC= 4
##$PHC0= -5966.97
##$PHC1= 251.8704
##$PH_mod= 1
##$PKNL= yes
##$PPARMOD= 0
##$PSCAL= 0
##$PSIGN= 0
##$REVERSE= no
##$SF= 81.014009
##$SI= 65536
##$SIGF1= 159.3651
##$SIGF2= -187.1042
##$SINO= 113.3802
##$SIOLD= 16384
##$SREGLST= <1H.CDCl3>
##$SSB= 0
##$STSI= 65536
##$STSR= 0
##$SW_p= 40650.406504065
##$SYMM= 0
##$S_DEV= 0
##$TDeff= 32768
##$TDoff= 0
##$TI= <>
##$TILT= no
##$TM1= 0
##$TM2= 0
##$TOPLEV= 0
##$USERP1= <user>
##$USERP2= <user>
##$USERP3= <user>
##$USERP4= <user>
##$USERP5= <user>
##$WDW= 1
##$XDIM= 65536
##$YMAX_p= 333949294
##$YMIN_p= -35301688
$$ End of Bruker specific parameters
$$ ---------------------------------
##NTUPLES= NMR SPECTRUM
##VAR_NAME=  FREQUENCY,     SPECTRUM/REAL,   SPECTRUM/IMAG
##SYMBOL=    X,             R,               I
##VAR_TYPE=  INDEPENDENT,   DEPENDENT,       DEPENDENT
##VAR_FORM=  AFFN,          ASDF,            ASDF
##VAR_DIM=   65536,         65536,           65536
##UNITS=     HZ,            ARBITRARY UNITS, ARBITRARY UNITS
##FACTOR=    0.620285442955139, 1,           1
##FIRST=     20137.2065510759, 0,            0
##LAST=      -20513.1999529892, 0,           0
##MIN=       -20513.1999529892, -35301688,   0
##MAX=       20137.2065510759, 333949294,    0
$$ Real data points
##PAGE= N=1
##DATA TABLE= (X++(R..R)), XYDATA
$$ [...]
35534H11300n53675j323860j423392o98352L38557Q58507P03867O84214J208455
$$ 811300 257625 -1066235 -2489627 -3187979 -2849422 -1990915 -1287048 -602834 605621
35525F05621J205604l61130k291853k160304K68989K326970J830065k56729j469813
$$ 605621 1811225 1450095 -841758 -3002062 -2733073 -406103 1423962 1167233 -302580
35516c02580r49712K06716P90009N39639p6484k70142L93306J191431R04641k44414
$$ -302580 -1252292 -1045576 -255567 284072 207588 -62554 330752 1522183 2426824 2182410
35506B182410n44106N26405J120170q7981j391218n38677J398379J319250j090428
$$ 2182410 1638304 2164709 3284879 3196898 1805680 1267003 2665382 3984632 2894204
35497B894204k632116j191345J383656K075999N03467j343441j822693q56478
$$ 2894204 262088 -929257 454399 2530398 3033865 1690424 -132269 -988747
35489i88747O54044J551794J135605j23114j013288j002644n59417n4103N53960
$$ -988747 -334703 1217091 2352696 2229582 1216294 213650 -345767 -399870 154090
35480A54090Q22985M9117j195235j246618K08762J321448O41712q28768j246695
$$ 154090 977075 1026192 -169043 -1415661 -1206899 114549 756261 -72507 -1319202
35471a319202m19159N13130Q85750P64567K16941m65402n07957K77796Q38031
$$ -1319202 -1738361 -1225231 -339481 425086 642027 176625 -331332 -53536 784495
35462G84495L30921m75935l47275N67718J147154R42974L19188m52799j129316
$$ 784495 1115416 639481 292206 859924 2007078 2950052 3269240 2816441 1687125
35453A687125j095173j55797P48277O56873m7358l28230P6L64698M16554O2719
$$ 1687125 591952 436155 1184432 1841305 1793947 1465717 1465793 1830491 2247045 2309764
35443B309764p51044j469218j085646K40813R22751L37230k2674P93335J147690
$$ 2309764 1558720 89502 -996144 -755331 167420 504650 481976 1275311 2423001
35434B423001m51964k190880j335051J253279K124396L70566j399674j307097
$$ 2423001 1971037 -219843 -1554894 -301615 1822781 2193347 793673 -513424
35426e13424l41937K46732P29374J145845N19351r47602j336224n7228Q09662
$$ -513424 -855361 -608629 120745 1266590 1785941 838339 -497885 -555113 254549
35417B54549k30510j574283j063438P20310J669248J289663O60711K79403j55358
$$ 254549 24039 -1550244 -2613682 -1893372 -224124 1065539 1726250 2005653 1850295
35408A850295m94543l53565q1354j45009j23307M15942P48093R5422p96240p23570
$$ 1850295 1355752 1002187 920833 775824 652517 1068459 1816552 1911974 1115734 392164
35398C92164p0905q1640n13283K2851J390596J671359J86913j072355k20889J665189
$$ 392164 321259 239619 -273664 -250813 1139783 2811142 2998055 1925700 1704811 3370000
35388C370000K001631L25151j153471o45028R63353J519870L31729j352780k090376
$$ 3370000 5371631 5696782 4543311 3898283 4861636 6381506 6713235 5360455 3270079
35379C270079j599456n28513L23214M70472O4988j43222K86927O69999K2679j333305
$$ 3270079 1670623 1142110 1465324 1935796 2000784 1857562 2144489 2814488 2837167 1503862
35369A503862j986659j382529m21781J47215O03245J027276P23772k74208o48952
$$ 1503862 -482797 -1865326 -2287107 -2139892 -1536647 -509371 214401 -59807 -708759
35360g08759J12482N96068j91286r51421l32905N50121O6039q79925m21166P29287
$$ -708759 -596277 -209 -191495 -1142916 -1475821 -925700 -859661 -1739586 -2160752 -1431465
35350a431465L85378j084125j155592M88783J379311M90213k58400L56056Q84910
$$ -1431465 -1046087 -2130212 -3285804 -2797021 -1417710 -927497 -1185897 -829841 55069
35341E5069K37674k28220O12243J398667O52836o99910j109241q61895q66078
$$ 55069 292743 64523 676766 2075433 2728269 2028359 919118 57223 -808855
35332h08855o82245K39775Q57056J47724p88576l28318R18590J018898k10474
$$ -808855 -1491100 -1251325 -394269 -246545 -1035121 -1363439 -444849 574049 363575
35323C63575r96205k97464R11198J176324L01821o72671p46388j30841j6012q00435
$$ 363575 -632630 -930094 -18896 1157428 1459249 786578 40190 -90651 -106663 -907098
35313i07098j168480l5790J314589R17715n59666o96898N98374Q95650m29206
$$ -907098 -2075578 -2111368 -796779 120936 -438730 -1135628 -537254 358396 -70810
35304g0810j032469R9937O82599o63352j579881P3560K335450K220484L25324
$$ -70810 -1103279 -1003342 -320743 -984095 -2563976 -2490416 -154966 2065518 2390842
35295B390842p66835p05347q13404r84983l52332L09276p0141l75336P89945K040079
$$ 2390842 1624007 918660 105256 -879727 -1232059 -922783 -992924 -1368260 -578315 1461764
35285A461764J266798m87190o81071K56391j38082j658083j639977K25813J201586
$$ 1461764 2728562 2241372 1560301 1816692 1678610 20527 -1619450 -1393637 -192051
35276a92051Q1677j086176o63708L08629M62413P2436k15540l85819j80971P12266
$$ -192051 -110374 -1196550 -1860258 -1551629 -1089216 -1016780 -1232320 -1618139 -1799110 -1086844
35266a086844J376415O92218m23646k06601P79307M78611q17326p64681O95026
$$ -1086844 289571 981789 558143 351542 1130849 1609460 792134 27453 722479
35257G22479Q93000q78867j861102m23204J185416O07514r52218j048836K30224
$$ 722479 1615479 736612 -1124490 -1547694 -362278 245236 -706982 -1755818 -1525594
35248a525594J022356O13755k71787q78304p14712L83164J491758J203304k63602
$$ -1525594 -503238 110517 -161270 -1039574 -1754286 -1371122 120636 1323940 1060338
35239A060338j055373l99060L94379K40819l10053o30048r45041j019146p1980
$$ 1060338 4965 -394095 284 241103 -68950 -698998 -1644039 -2663185 -2735165
35230b735165J228101J009155o70711j378099n2428J353007J243162P24626R70631
$$ -2735165 -1507064 -497909 -1168620 -2546719 -2599147 -1246140 -2978 721648 1692279
35221A692279R02345m51898j631545j055184K76201N94107J69224J89936M27056
$$ 1692279 2594624 2142726 511181 -544003 -267802 326305 495529 685465 1112521
35212A112521R4420l72301k92843j38168l18862j46007M70775K02771j129432
$$ 1112521 1206941 834640 541797 403629 84767 -61240 409535 612306 -517126
35203e17126j375876M78644J981542Q88705j034224q82901O55731Q48186l03006
$$ -517126 -1893002 -1414358 567184 1455889 421665 -461236 194495 1042681 739675
35194G39675m99218N11465P13375l29364q25732j10359M00878j6529l54077q1363
$$ 739675 240457 751922 1465297 1135933 310201 199842 600720 584191 230114 148751
35184A48751k3992m94594o04556L1648O22205N96755K34082j95210n77600m46867
$$ 148751 124759 -369835 -974391 -942743 -320538 276217 510299 315089 -262511 -709378
35174g09378L34535Q38125M11760K727N07150P99675m88549k147306j840736K09522
$$ -709378 -374843 463282 875042 877769 1384919 2184594 1696045 -451261 -2291997 -2082475
35164b082475J587798J362002P70306M62230k01357j044775r73120k35966k63655
$$ -2082475 -494677 867325 1637631 2099861 1898504 853729 -119391 -355357 -619012
35155f19012r67467p22842O40014J398474R06475M28253N20675K22768n29389
$$ -619012 -1586479 -2309321 -1669307 -270833 635642 1063895 1584570 1807338 1277949
35146A277949l95938O43276P73478m50147j095994k44667L55284m87314j194538
$$ 1277949 882011 1525287 2298765 1848618 752624 507957 863241 375927 -818611
35137h18611k91267R16379O50043l88440n56376l6259R5886N7495M81685O95013
$$ -818611 -1109878 -193499 456544 68104 -488272 -524531 -428645 -371150 110535 805548
35127H05548k971n34774L33277J590636J377697k9111p76265l81331l1847l06514
$$ 805548 802577 267803 601080 2191716 3569413 3540302 2764037 2382706 2350859 2044345
35117B044345n61005m27065k04117J07910O12763N85531o53425k087475j895432
$$ 2044345 1483340 1056275 852158 960068 1572831 2158362 1504937 -582538 -2477970
35108b477970o8365J406366J185105l54q07242q30458k63727P61922J833057K101418
$$ -2477970 -2546335 -1139969 45136 44782 -762460 -1592918 -1856645 -1094723 738334 2839752
35098B839752J164642l31798j348681j371720n78368M04516P72230J29048r18143
$$ 2839752 4004394 3672596 2323915 952195 373827 778343 1550573 1679621 761478
35089G61478j190450l00637P27203O27970m31942q95170J86020J659397J578559
$$ 761478 -428972 -729609 -2406 625564 193622 -701548 -515528 1143869 2722428
35080B722428p8824j169540m06443O79167R8969j358091j296782L53384J073632
$$ 2722428 2643604 1474064 1067621 1746788 1845757 487666 -809116 -455732 617900
35071F17900k07227j336103l86938J290543J283141j95527r26907j23184P82442
$$ 617900 410673 -925430 -1312368 -21825 1261316 1065789 138882 15698 798140
35062G98140M92470o39414j437830j127018J46559J216387Q02020p06484j218143
$$ 798140 1290610 651196 -786634 -1913652 -1767093 -550706 251314 -455170 -1673313
35053a673313K42158J749733J085732q42881j319350l3905N50223p07372j731800
$$ -1673313 -1431155 318578 1404310 561429 -757921 -791826 -241603 -948975 -2680775
35044b680775n71492J458721J749524K25632p89730o5008J081481J074864K82338
$$ -2680775 -3252267 -1793546 -44022 181610 -608120 -673128 408353 1483217 1765555
35035A765555M4428M68388M15508n40517j349944j048587j39331K79975O2705
$$ 1765555 1809983 2278371 2693879 2153362 803418 -245169 -384500 -104525 -41820
35026d1820j89004k99935m18103j91489O39946J138224K38904j140004r08682
$$ -41820 -230824 -530759 -948862 -1140351 -500405 637819 876723 -263281 -1171963
35017a171963R69178K040172Q69125r68438j444263p42346o4143L97676P30625
$$ -1171963 -202785 1837387 2706512 1738074 293811 -448535 -512678 -115002 615623
35008F15623K98590p72332q27206O38879J360476k72040k029840j088087J168482
$$ 615623 914213 141881 -685325 -46446 1314030 1041990 -987850 -2075937 -907455
34999i07455J237917o68820j062637Q13162J790762K61226j339619r21432J63479
$$ -907455 330462 -338358 -1400995 -587833 1202929 1464155 124536 -796896 -633417
34990f33417K43843J48663P71188Q83821k56004q85552J95794J139399K66190
$$ -633417 -389574 -240911 530277 1414098 1158094 272542 468336 1607735 1873925
34981A873925p70357o760J063167J66026j405590r63240P10824Q22387k81262
$$ 1873925 1103568 1096808 2159975 2326001 920411 -42829 667995 1490382 1209120
34972A209120J04173J659203J189173j565208k954120j315314N47519L75902k33294
$$ 1209120 1313293 2972496 4161669 2596461 -357659 -1672973 -1125454 -749552 -982846
34963i82846L32633N35362q08105j409560O10425K639929J348443j626133k063638
$$ -982846 -650213 -114851 -922956 -2332516 -1722091 917838 2266281 640148 -1423490
34954a423490J43552J201425j65145j080210J34380J239764K50337j217163r18623
$$ -1423490 -1279938 -78513 -243658 -1323868 -1189488 50276 300613 -916550 -1835173
34945a835173L88403O88915J37073K79785J103475J180837J36046r56651j280287
$$ -1835173 -1446770 -757855 -620782 -340997 762478 1943315 2079361 1122710 -157577
34936a57577q62277J29481J249643J373834n4631j658609j527083J32313J222103
$$ -157577 -1019854 -890373 359270 1733104 1678473 19864 -1507219 -1374906 -152803
34927a52803O36598n84930j134191r12310k49746Q01124J706973J403531o6540
$$ -152803 483795 -101135 -1235326 -2147636 -2397382 -1596258 110715 1514246 1447706
34918A447706j071531n69577L55228L09238j79433J96967J025412P46988o10650
$$ 1447706 376175 -193402 161826 471064 291631 488598 1514010 2260998 1650348
34909A650348j286085n33303L59817L04553p9398K5884K15412J377l6955N11379
$$ 1650348 364263 -169040 190777 495330 415932 441816 657228 658605 621650 1133029
34899A133029P55101K2454o21201l9024P89564K30175j085237j112718J24990
$$ 1133029 1888130 1910584 1289383 1250359 2039923 2270098 1184861 72143 197133
34890A97133M75829o47554j158711J58025J453348P49496r30423j322723l19582
$$ 197133 672962 25408 -1133303 -975278 478070 1227566 297143 -1025580 -1345162
34881a345162M89836N94041P01074P89847J82824p41028q97537m16642l37825
$$ -1345162 -855326 -261285 439789 1229636 1412460 671432 -226105 -642747 -980572
34872i80572n32224N8267J086665R12319n45915j273210k72171Q63398O11336
$$ -980572 -1512796 -1454529 -367864 544455 -1460 -1274670 -1546841 -683443 -72107
34863g2107j46649R2018R43922J100416N68334K26780R0884k69906l48801M85438
$$ -72107 -218756 -126738 817184 1917600 2485934 2712714 2803598 2533692 2184891 2670329
34853B670329J332718P47625q56482j554474o84014L67156L76796k13142m51262
$$ 2670329 4003047 4750672 3894190 2339716 1655702 2022858 2399654 2186512 1735250
34844A735250k57955q7577j61589n06836r97294j089151l06263Q25459J198751
$$ 1735250 1477295 1389718 1228129 721293 -276001 -1365152 -1671415 -845956 352795
34835C52795O59744J70628K28350K25965j89247k83693M70103J209273P68906
$$ 352795 1012539 1183167 1411517 1637482 1448235 1164542 1634645 2843918 3612824
34826C612824o08004j572227j384530n63923K5622R8873m7809o4502l473k65777
$$ 3612824 3004820 1432593 48063 -515860 -490238 -391365 -439174 -503676 -507149 -772926
34816g72926r22296j255230n37192P70962J392657R75349N41773P98180R95056
$$ -772926 -1695222 -2950452 -3487644 -2716682 -1324025 -348676 193097 991277 1986333
34807A986333K49314q57916j078731l60827K26486J61478o2752q8342k02491m91303
$$ 1986333 2235647 1377731 299000 -61827 164659 326137 263385 175043 -27448 -518751
34797e18751m46807J87506R02808J148944R78483O26400O1798o06589q58371m72879
$$ -518751 -965558 -778052 124756 1273700 2252183 2878583 2940381 2333792 1475421 1002542
34787A002542p2732l08708q08308o54706K19063Q61852O01644j75902p58674r68480
$$ 1002542 929810 621102 -187206 -841912 -622849 239003 840647 664745 -93929 -1062409
34777a062409r10392m54490M08689J052055P89013r3883n47932j28346M20226
$$ -1062409 -1972801 -2427291 -2018602 -966547 -177534 -271417 -819349 -947695 -527469
34768e27469K01556o50791j184603p76936K42726J016757J009590M63845N3732
$$ -527469 -325913 -976704 -2161307 -2938243 -2695517 -1678760 -669170 -205325 -151593
34759a51593O8442J22411j42208m02747j89216K25616K16954o0375J19848O69459
$$ -151593 -83151 39260 -102948 -505695 -694911 -469295 -252341 -312716 -192868 476591
34749D76591O29211j83710o87124l21946q0276p40069j233865k23071J511376
$$ 476591 1105802 922092 234968 -86978 -167254 -907323 -2141188 -2364259 -852883
34740h52883J944234P18174m90544m94444R9915L38831K12395M2360j81322l18799
$$ -852883 1091351 1809525 1318981 824537 924452 1263283 1475678 1518038 1336716 1017917
34730A017917J6601N77615M86255m00044j094326r60909o04806o75535p56021
$$ 1017917 1034518 1612133 2098388 1698344 604018 -356891 -961697 -1637232 -2393253
34721b393253k27470N66852Q79457O77137M11204J75677j50607l29338m1806N27123
$$ -2393253 -2620723 -2053871 -1174414 -497277 -86073 89604 -61003 -390341 -432147 94976
34711I4976R20694R50676O20355q7481r40369j402980j253684q35304l94743K43444
$$ 94976 1015670 1966346 2586701 2499220 1558851 155871 -1097813 -1933117 -2327860 -2084416
34701b084416R71774J066120J61959r59895j182529l08899Q96821J516336J047823
$$ -2084416 -1112642 -46522 115437 -844458 -2026987 -2335886 -1439065 77271 1125094
34692A125094k50797j290639j101468j39325J89768l88914n49714M49257J419443
$$ 1125094 874297 -416342 -1517810 -1657135 -1467367 -1856281 -2405995 -1956738 -537295
34683e37295J087756R5803j86352J16352q3050p25761p13935J37385Q06361O88108
$$ -537295 550461 646264 459912 576264 493214 -232547 -946482 -809097 -2736 685372
34673F85372J76612l44235q10927q15889K6330R58834O77110p00961j533008q95926
$$ 685372 861984 517749 -293178 -1109067 -1082737 -123903 553207 -147754 -1680762 -2576688
34663b576688K53164O38357K91464O599Q7090L10776M57969K93546l83641j164052
$$ -2576688 -2323524 -1685167 -1393703 -1387104 -1300014 -989238 -531269 -237723 -621364 -1785416
34653a785416j081113J84451J575153J695076L97123j023781j149346J50884J524199
$$ -1785416 -2866529 -2682078 -1106925 588151 985274 -38507 -1187853 -1036969 487230
34644D87230J462012K804j219263r75453L7114L42861k25264o40414m75005k49064
$$ 487230 1949242 1952046 732783 -242670 -205556 137305 -87959 -728373 -1203378 -1452442
34634a452442j17591L20284P56637K73281q45696r70624M07722J544914R14104
$$ -1452442 -1570033 -1249749 -493112 -219831 -1065527 -2036151 -1628429 -83515 830589
34625H30589m65306o28696L55429P35754m2800o14889k568R23436R22923K00043
$$ 830589 365283 -263413 92016 827770 784970 170081 167513 1090949 2013872 2213915
34615B213915j51683R9958Q9281o99460j525466j337417k75190L91560m3691o82054
$$ 2213915 2062232 2162190 2251471 1552011 26545 -1310872 -1586062 -1194502 -1238193 -1920247
34605a920247k26859J123954J824396J018903m24389j188803j027157n37434j01424
$$ -1920247 -2147106 -1023152 801244 1820147 1395758 206955 -820202 -1357636 -1459060
34596a459060L01053O36360P89110P69607N62077P4299m46129m09475K75735Q41081
$$ -1459060 -1158007 -521647 267463 1037070 1599147 1673446 1227317 817842 1093577 1934658
34586A934658O39418P098m09671o53405j056591j326024r17584l2683O41807R54872
$$ 1934658 2574076 2581174 2171503 1518098 461507 -864517 -1782101 -1814784 -1172977 -218105
34576b18105J140889Q99547k23296j541002j579259j07201J271241J137106m604
$$ -218105 922784 1822331 1599035 58033 -1521226 -1628427 -357186 779920 775316
34567G75316o35243j28208R23802J649938J486365L86908q60605j069649j20967
$$ 775316 140073 11865 935667 2585605 4071970 4458878 3598273 2528624 2407657
34558B407657N80979o3154j184035j180347r7606N69533J97142l32748l64343
$$ 2407657 2988636 2925482 1741447 561100 463494 1033027 1230169 897421 533078
34549E33078l07030m09895j96872L07574K34146n19976p86289j18858K68254k73142
$$ 533078 226048 -183847 -380719 -73145 161001 -358975 -1145264 -1264122 -995868 -1269010
34539a269010l75727Q76836J731881L86956j532888j093709J132548J775044R4938
$$ -1269010 -1644737 -767901 963980 1350936 -181952 -1275661 -143113 1631931 1726869
34530A726869r86175j3730O60822o35922j678258k53325J712175J260832o17903
$$ 1726869 740694 726964 1387786 751864 -926394 -1179719 532456 1793288 1175385
34521A175385q26823N63040Q33739l84222p07732M34042Q00931m18638j081290
$$ 1175385 348562 911602 1745341 1361119 653387 1087429 1888360 1469722 388432
34512C88432l7137P96378J2753p14052J91577J137583J04409j628161j418479
$$ 388432 351295 1147673 1160426 446374 637951 1775534 1879943 251782 -1166697
34503a166697M35575J279509K89916o98704m23269K32598K37279m2440N6730L04974
$$ -1166697 -731122 548387 838303 139599 -283670 -51072 186207 143767 200497 505471
34493E05471J74495k96372o81560o31104q1377N05489L78752m35663q19300r9130
$$ 505471 679966 383594 -297966 -929070 -1010447 -504958 -126206 -561869 -1381169 -1480299
34483a480299P62755N90767q6629L8814P54103O82331k59501o47053j902M15494
$$ -1480299 -717544 -126777 -213406 -174592 579511 1261842 1002341 355288 353386 768880
34473G68880j26781n09077K94349J361103J178376r6990j010055q73415l21664
$$ 768880 642099 133022 427371 1788474 2966850 2869860 1859805 986390 664726
34464F64726j01777k74017n15091m90543K8469Q77646J377223R24873k84708j352823
$$ 664726 562949 288932 -226159 -716702 -688233 189413 1566636 2491509 2206801 853978
34454H53978j440524m38709Q56803J285182M87002n10586m97085J82235L7261
$$ 853978 -586546 -1025255 -168452 1116730 1603732 1093146 596061 778296 815557
34445H15557j219670j929035p90844J133644J791594P80756n49714j120546r48662
$$ 815557 -404113 -2333148 -3123992 -1990348 -198754 582002 32288 -1088258 -2036920
34436b036920k29330R67973J926102J534849j15091j362628r06552N20461J096894
$$ -2036920 -2266250 -1298277 627825 2162674 2047583 684955 -221597 298864 1395758
34427A395758J61232j136048j348332l99957M79222L53496k35823r4705P57203
$$ 1395758 1556990 420942 -927390 -1327347 -848125 -494629 -730452 -825157 -67954
34418f7954R36973j51695j051530k53110J299842J336646l57894j544086q16920
$$ -67954 869019 717324 -334206 -587316 712526 2049172 1691278 147192 -669728
34409f69728N50107Q44810L20067J61513M16945L68332k9978m29643r09517j255477
$$ -669728 -119621 725189 1045256 1206769 1623714 1992046 1962068 1532425 622908 -632569
34399f32569m97203J320922K085387L35213j946241j715720N61919J554756J80929
$$ -632569 -1129772 191150 2276537 2611750 665509 -1050211 -488292 1066464 1247393
34390A247393j028453l14409P10808K91865m74854J4373Q02260J69547j116551
$$ 1247393 218940 -95469 615339 907204 432350 446723 1248983 1418530 301979
34381C01979j021690L03498R07503L23484m0438L60169M55809k06092n98192j24372
$$ 301979 -719711 -416213 491290 814774 774336 1134505 1590314 1384222 786030 661658
34371F61658L78046K26158P930L53308P75549N37799j80282o90817p86304p64737
$$ 661658 1039704 1265862 1273792 1627100 2402649 2940448 2760166 2069349 1283045 518308
34361E18308q21577p65446k30483P70138J442349R14019l51864p44030K00999
$$ 518308 -303269 -1068715 -1299198 -529060 913289 1827308 1475444 731414 932413
34352I32413P88278l54285j881855j572020K34223J155236L86360m67184k45539
$$ 932413 1720691 1366406 -515449 -2087469 -1853246 -698010 -311650 -778834 -1024373
34343a024373L37261N47981P50118R61787L47509r17657j200521L3542R90832
$$ -1024373 -687112 -139131 610987 1572774 1920283 1002626 -197895 -164353 826479
34334H26479K05775j174703j275437k79327L46511L19633M52859Q02758O43573
$$ 826479 1032254 -142449 -1417886 -1697213 -1350702 -1031069 -578210 224548 868121
34325H68121k3166m12408k97967k09276l40930k94008N8075K72655L7752l54207
$$ 868121 844955 432547 134580 -74696 -415626 -709634 -651559 -378904 -341152 -695359
34315f95359l51910K08461P53112M11086q09120j593990q65545N60056J003967
$$ -695359 -1047269 -838808 -85696 325390 -483730 -2077720 -2943265 -2383209 -1379242
34306a379242L77000P3325M71466M65650j72932j29859R26780J323972J48898
$$ -1379242 -1002242 -928917 -457451 8199 -164733 -294592 632188 1956160 2105058
34297B105058j013094o84598R1687j64401o60487M7466J185604R92707k28090
$$ 2105058 1091964 407366 499053 334652 -325835 -278369 907235 1899942 1671852
34288A671852p77470n12006o41432j103866o56708N92276J088801L28800n70408
$$ 1671852 894382 382376 -259056 -1362922 -2019630 -1427354 -338553 -9753 -580161
34279e80161q17251o25217p7605Q39019J285125N45521l57158k7092P72666K51884
$$ -580161 -1397412 -2022629 -2100234 -1261215 23910 569431 212273 185181 957847 1209731
34269A209731j161539j363201j65186N53080L34631O27012J404814P59513j217293
$$ 1209731 48192 -1315009 -1480195 -927115 -592484 34528 1439342 2198855 981562
34260I81562j692705K30319J547985J75354j527382p51340J124548J140277l12532
$$ 981562 -711143 -480824 1067161 1242515 -284867 -1036207 88341 1228618 916086
34251I16086p59816j70856m27228j279057o70447J195960J757379L20142q86571
$$ 916086 156270 -14586 -441814 -1720871 -2391318 -1195358 562021 882163 -4408
34242d408m66116L44164M38809N67088J168471J098477p6930q28432k61317J75951
$$ -4408 -470524 -126360 312449 879537 2048008 3146485 3069555 2241123 1979806 2155757
34232B155757o43846j178137K49767K194076J964883k20199j631766j161382m35851
$$ 2155757 1511911 333774 583541 2777617 4742500 4522301 2890535 1729153 1293302
34223A293302o94201j063616o18382K2923J88225M23541J060807J092386r0471
$$ 1293302 599101 -464515 -1082897 -1059974 -871749 -448208 612599 1704985 1614514
34214A614514j164774p34450L30542K68034o30779n59452O50777J193111L35079
$$ 1614514 449740 -284710 45832 313866 -316913 -876365 -225588 967523 1302602
34205A302602m15964M7673O45377J48297o89848n47669K09100L18310k54500n84183
$$ 1302602 886638 934311 1579688 1727985 1038137 490468 699568 1017878 763378 179195
34195A79195m91221m41210l15113J94577M79122j12794p69602k86256P67910Q43710
$$ 179195 -312026 -753236 -1068349 -873772 -394650 -507444 -1277046 -1563302 -795392 48318
34185D8318R7237J18314R56059Q24285o91405j561178n21458Q52033P73901L9178
$$ 48318 145555 263869 1219928 2044213 1352808 -208370 -729828 122205 896106 935284
34175I35284L31298J226679R88318n41760j835720j987458j403117n29982M93124
$$ 935284 1266582 2493261 3481579 2939819 1104099 -883359 -2286476 -2816458 -2323334
34166b323334J108376P56850j1224j15346M34994O74200K93831j02345k56084
$$ -2323334 -1214958 -458108 -469332 -584678 -149684 524516 818347 716002 459918
34157D59918n05320p76403n58221L9393L58157L63815N62596P53168K28461o60159
$$ 459918 -45402 -821805 -1380026 -1340633 -982476 -618661 -56065 697103 925564 265405
34147B65405o61801K99863P85637J61064l62193J01177N18410j53537q98737k41125
$$ 265405 -396396 -96533 689104 850168 487975 589152 1107562 954025 55288 -185837
34137a85837J101248J191336j277n84625J15108N09509n25272j713258j314478
$$ -185837 915411 2106747 2105470 1520845 1635953 2145462 1620190 -93068 -1407546
34128a407546K93968J296222R30210N0269l86028k75026K9872J66792j21948o33084
$$ -1407546 -1113578 182644 1112854 1163123 777095 502069 531941 698733 576785 -56299
34118e6299o26862K01595R45106N55035m98690p01281L21684J221357Q64377k09673
$$ -56299 -683161 -481566 463540 1018575 519885 -181396 140288 1361645 2226022 2016349
34108B016349q47756q64275p69864o45348k26856L09252N41480N45577O45408
$$ 2016349 1168593 304318 -465546 -1110894 -1337750 -1028498 -487018 58559 703967
34099G03967O17169o225q68946r15942J37247J139136Q17234n35704j211994o7350
$$ 703967 1321136 1314911 445965 -469977 -332730 806406 1623640 1087936 -124058 -191408
34089a91408J911281K465284P00557j609164k022082m43730Q97434N34076n11299
$$ -191408 1719873 4185157 4885714 3276550 1254468 810738 1708172 2242248 1730949
34080A730949o68869j49511j49576p02326q14899k66906J87652K49906L88977
$$ 1730949 1062080 912569 762993 60667 -754232 -1021138 -833486 -583580 -194603
34071a94603P25358P65725L25711k58442p90465j150804q29953L32161J239383
$$ -194603 530755 1296480 1622191 1363749 573284 -577520 -1407473 -1075312 164071
34062A64071P66769l26541l42834N95355O80756m65011j026780j06448O29555
$$ 164071 930840 604299 261465 856820 1537576 1072565 45785 -60663 568892
34053E68892k38998j402946r64274M97551J091046P24893P78968J297458Q85526
$$ 568892 329894 -1073052 -2037326 -1539775 -448729 276164 1055132 2352590 3238116
34044C238116o06716j486161q03549K46831K88945k73852k25885M95003Q55066
$$ 3238116 2631400 1145239 341690 588521 877466 603614 377729 872732 1727798
34035A727798L38118l55485k73468N16840Q48355j87239j839894k233460p00362
$$ 1727798 2065916 1710431 1436963 1953803 2802158 2614919 775025 -1458435 -2158797
34026b158797J075599J102738k34307p58897L64314J521623J091324l36425j083046
$$ -2158797 -1083198 19540 -214767 -973664 -609350 912273 2003597 1667172 584126
34017E84126p53668k88083j64433J03944O71332Q27401K53267j91738K41537Q29762
$$ 584126 -169542 -457625 -622058 -518114 153218 980619 1233886 1042148 1283685 2113447
34007B113447L97622o83034q80800K3355L93214o36132j504938n89425R86888
$$ 2113447 2511069 1828035 947235 970590 1363804 727672 -777266 -1366691 -379803
33998c79803R07442n94817r79313M67383J320339j11914j930842j489203O28266
$$ -379803 527639 -67178 -1046491 -579108 741231 629317 -1301525 -2790728 -2162462
33989b162462J702328Q90843k28870o02147p49401q54961j67780J116802J457219
$$ -2162462 -460134 430709 201839 -400308 -1149709 -2004670 -2172450 -1055648 401571
33980D01571L62069o03911l12921R5347o81978j642611j024779O26982J115851
$$ 401571 763640 159729 -153192 -57845 -739823 -2382434 -3407213 -2780231 -1664380
33971a664380J5961p21830J15737J267994J189124L15957l8719J94553K32364
$$ -1664380 -1648419 -2370249 -2254512 -986518 202606 518563 479844 674397 906761
33962I06761Q8445L27713O62805K92120n80502r99836r18396j077728j234377
$$ 906761 995206 1322919 1985724 2277844 1697342 697506 -220890 -1298618 -2532995
33953b532995l15617J263204J444696l00156j546617k55508K022609K325551N61154
$$ -2532995 -2848612 -1585408 -140712 -440868 -1987485 -2242993 -220384 2105167 2666321
33944B666321p51798m83350q9228o47012j112338l80978P93331J069933L99069
$$ 2666321 1914523 1431173 1341945 694933 -417405 -798383 -5052 1064881 1463950
33935A463950l88992q40224q21601j16026J024306J596492R06689n45139j706038
$$ 1463950 1074958 234734 -586867 -702893 321413 1917905 2824594 2279455 573417
33926E73417j966432j251283J31959J382005J668385J043549K70981k94000p91511
$$ 573417 -1393015 -2644298 -2512339 -1130334 538051 1581600 1852581 1558581 767070
33917G67070r30152k34682P02684O83282j18290k25714O70023J091778L21167
$$ 767070 -163082 -397764 304920 988202 869912 644198 1314221 2405999 2727166
33908B727166l35921R7210N11892k22538j090667o01210O53321R67748J45663
$$ 2727166 2391245 2488455 3000347 2777809 1687142 1085932 1739253 2707001 2852664
33899B852664n77296n21890M7131Q20998J342587P99366p03014j566275q35940
$$ 2852664 2275368 1753478 1800609 2621607 3964194 4763560 4060546 2494271 1658331
33890A658331J19670l09152j306664r92761M56586J195088O13171k33835o53291
$$ 1658331 1778001 1468849 162185 -830576 -373990 821098 1434269 1200434 547143
33881E47143p60560l40413P05719J210853J41187j282388j072391L42054Q48572
$$ 547143 -213417 -553830 151889 1362742 1503929 221541 -850850 -508796 339776
33872C39776K14915J54434Q74248O00951r28213j514810j08391J330827R71313
$$ 339776 554691 709125 1583373 2184324 1256111 -258699 -367090 963737 1935050
33863A935050k10297m26773K33006P11740R00867J076701Q04640j45857r44817
$$ 1935050 1724753 1297980 1530986 2242726 3143593 4220294 5024934 4879077 3934260
33854C934260r54401p19101p36207n12118J90160N23086R255n00317l20597k9867
$$ 3934260 2979859 2260758 1524551 1012433 1202593 1725679 1734934 1234617 914020 884153
33844H84153j25496p1330L19423J89914n46596m79042Q57234J659440O40112o82021
$$ 884153 758657 687327 1006750 1196664 650068 171026 1028260 2687700 3327812 2645791
33834B645791m37026N48622M27776m39839m93040j2310l71329j037189k42556
$$ 2645791 2208765 2757387 3185163 2745324 2252284 2239974 1868645 831456 588900
33825E88900J634242K211081P80675p46141r67582o52779o70209m96462L01956
$$ 588900 2223142 4434223 5214898 4468757 3501175 2848396 2178187 1681725 1983681
33816A983681R49243P85211K45380k25152q33730j375534r73179L61279J255407
$$ 1983681 2932924 3718135 3963515 3738363 2904633 1529099 555920 917199 2172606
33807B172606Q60941J61k74197m2484K40194N72229P15513K3497j141152j191537
$$ 2172606 3033547 3033708 2759511 2717027 2957221 3529450 4244963 4268460 3127308 1935771
33797A935771L71878J768335J396146K28589J07269P29658M11193p47697q03057
$$ 1935771 2307649 4075984 5472130 5700719 5807988 6537646 6948839 6201142 5398085
33788E398085P73798J981772J262621j69467k51708Q54760J156263j74741j657774
$$ 5398085 6171883 8153655 9416276 9246809 8995101 9849861 11006124 10831383 9173609
33779I173609j563605p2633J179716J152787L28602k79562l88205l83002m07795
$$ 9173609 7610004 7537371 8717087 9869874 10198476 9918914 9530709 9147707 8739912
33770H739912j81699K29707J73688n79752j124497n15515O60020Q25763k95628
$$ 8739912 8558213 8787920 8961608 8381856 7257359 6741844 7401864 8227627 7931999
33761G931999j022382l5652J528644J490989k69105j544400q53362N97143P93058
$$ 7931999 6909617 6873965 8402609 9893598 9624493 8080093 7226731 7823874 8616932
33752H616932l09465j131738r93349p24470p21151l7583J736642K980347J922874
$$ 8616932 8307467 7175729 6182380 5457910 4736759 4699176 6435818 9416165 11339039
33743A1339039n09502j446353P2740J603877O32781j839980k657787q93208J070684
$$ 11339039 10829537 9383184 9455924 11059801 11692582 9852602 7194815 6301607 7372291
33734G372291J113800J03117l4305O39550P02801O0900r8875L07849J27114o04823
$$ 7372291 8486091 8589208 8554903 9194453 9897254 9958154 9859279 10167128 10294242 9689419
33724I689419l57801J044395J513113l0107j484733n78785J554601K099380P36157
$$ 9689419 9331618 10376013 11889126 11859019 10374286 9795501 11350102 13449482 14185639
33715A4185639m32850m87503m96302q28531m47842O13123O94884o05340j354744
$$ 14185639 13752789 13265286 12768984 11940453 11492611 12105734 12800618 12195278 10840534
33706A0840534l81837O96942J77636q97476o09245N99822Q08528j82391q13093
$$ 10840534 10458697 11155639 11333275 10435799 9826554 10426376 11234904 11052513 10239420
33697A0239420n10495l12410p28399q83410j50849Q62855J371275J243627N10848
$$ 10239420 9728925 9416515 8688116 7804706 7653857 8516712 9887987 11131614 11642462
33688A1642462p84821j928982j871251o72334L59067L99605M8274Q7862K90881
$$ 11642462 10857641 8928659 7057408 6385074 6744141 7143746 7192020 7279882 7570763
33679G570763J36394r3055K12081Q77968J105768N56416k94241p87832o87279
$$ 7570763 7707157 7614102 7826183 8704151 9809919 10366335 10072094 9284262 8596983
33670H596983k62947m8041l50904q11902o98185J21632P97896M61100o25777j278184
$$ 8596983 8334036 8285995 7935091 7123189 6425004 6546636 7344532 7805632 7179855 5901671
33660E901671p31844N11397J206667N78965r38870k025669j618144L3957J473477
$$ 5901671 5169827 5681224 6887891 7466856 6527986 4502317 2884173 2918130 4391607
33651D391607J420903R8265j030167q94333Q2016P18379N95512L08036K66510
$$ 4391607 5812510 5910775 4880608 3986275 4068291 4786670 5382182 5690218 5956728
33642E956728P990q47197j558846j058796L88115J273567Q18188k5681n9535M36095
$$ 5956728 5964718 5117521 3558675 2499879 2887994 4161561 4979749 4954068 4894533 5330628
33632E330628L06431n90595j121807n10481O49560J282924J066645M04854k92071
$$ 5330628 5637059 5046464 3924657 3414176 4063736 5346660 6413305 6818159 6526088
33623F526088q11588r56274o67510k05713J57855M90427Q97958J074908O36496
$$ 6526088 5714500 4758226 4090716 3885003 4042858 4533285 5431243 6506151 7142647
33614G142647j84927p08194o95859n48368n34097m29463j06928J70043L09764
$$ 7142647 6957720 6249526 5553667 5005299 4471202 4041739 3934811 4104854 4414618
33605D414618N09706M49161o47393k402517k838167q45596J737977K219107O97860
$$ 4414618 4924324 5373485 4726092 2323575 -514592 -1360188 377789 2596896 3294756
33596C294756l61075m330J57155p99875j371722l85998P73924M99652l36473j06236
$$ 3294756 2933681 2929351 3086506 2286631 914909 528911 1302835 1802487 1466014 1359778
33586A359778O47634L83604m59340k50407P25308O42618n56997q94129L10856
$$ 1359778 2007412 2391016 1931676 1681269 2406577 3049195 2492198 1598069 1908925
33577A908925J284616O74974n25096q14714k33962L07499L72008l9619o73783
$$ 1908925 3193541 3868515 3343419 2528705 2294743 2602242 2974250 2934631 2260848
33568B260848p69437J45344J054822N51250q04814j054297N5808O87946P7397
$$ 2260848 1491411 1636755 2691577 3242827 2438013 1383716 1439524 2127470 2204867
33559B204867l07833L72521P63139p8272q12269k23855N72217K11436m95562k66196
$$ 2204867 1897034 2269555 3032694 2954422 2142153 1918298 2490515 2701951 2206389 1940193
33549A940193K07251k39126p37591J69050J678710J819820O35005j45519o9890
$$ 1940193 2147444 1908318 1170727 1339777 3018487 4838307 5473312 5327793 5257903
33540E257903k05550p31753o68973J130J56030l46049l75030L74994Q81700P26540
$$ 5257903 5052353 4320600 3651627 3652757 3808787 3462738 3087708 3462702 4344402 5070942
33530E070942P23798J169638J227673P32361R57393K567047M024140L224260J33961
$$ 5070942 5794740 6964378 8192051 8924412 9881805 12448852 16472992 19697252 19831213
33521A9831213l073285m248839l129425j182094m689R177n36857j184879j871298
$$ 19831213 16757928 12509089 9379664 8197570 8192881 8202058 7665201 6480322 4609024
33512D609024k146396j316834K13193R61220M39964m1386M35672Q20639J5613
$$ 4609024 2462628 1145794 1358987 2320207 2760171 2718785 3154457 3975096 3990709
33503C990709j013893p84031J98501M38234M7551K14143P48678M13082o74606
$$ 3990709 2976816 2192785 2391286 2829520 2877071 3091214 3839892 4252974 3578368
33494C578368j158991p71310m42706l03813K63749P55186O9355j089563q14826
$$ 3578368 2419377 1648067 1205361 901548 1165297 1920483 1989838 900275 85449
33485H5449P37515J216198k32623j618372j291238j43312M19551N52259Q10330
$$ 85449 822964 2039162 1806539 188167 -1103071 -1246383 -826832 -274573 535757
33476E35757Q25327L88700K08223M96977M11928j92181k42864L94869K83395r17506
$$ 535757 1361084 1749784 1958007 2454984 2866912 2674731 2431867 2826736 3110131 2192625
33466B192625j351016o9712R55251r0662j754218j606837l0343Q12264N34177
$$ 2192625 841609 771897 1727148 1636486 -117732 -1724569 -1754912 -942648 -408471
33457d08471M28836P23891N80585K54321O59492J154732L79196r05448n99390
$$ -408471 20365 744256 1324841 1579162 2238654 3393386 3772582 2867134 2267744
33448B267744R77254J102398q47450j943583k73674J755583J019289j416630j890731
$$ 2267744 3244998 4347396 3499946 1556363 1282689 3038272 4057561 2640931 750200
33439G50200L19152K097529J238580o38193r31682K77250J011908N57029j492
$$ 750200 1069352 3166881 4405461 3767268 2835586 3112836 4124744 4681773 4680281
33430D680281J08116L94664L42611J98855J72011K177k01681K41321J316890J813287
$$ 4680281 4788397 5183061 5525672 5724527 5896538 5898715 5697034 5938355 7255245 9068532
33420I068532R06167n28651j040636l64437P80385J883386K613958K352739J047420
$$ 9068532 9974699 9446048 8405412 8040975 8821360 10704746 13318704 15671443 16718863
33411A6718863J4282N25609J950905K632541K248417J852818J895586J866842
$$ 16718863 16733145 17258754 19209659 21842200 24090617 25943435 27839021 29705863
33403B9705863J772480K155068K530679J652265k97102j554431j361285r96875
$$ 29705863 31478343 33633411 36164090 37816355 37519253 35964822 34603537 33606662
33395C3606662j571094k452813k715824k574099k434080j977700j208069j059029
$$ 33606662 32035568 29582755 26866931 24292832 21858752 19881052 18672983 17613954
33387A7613954j887647k561281k075290r62501j83365J86824K71116k78025j252776
$$ 17613954 15726307 13165026 11089736 10127235 9943870 10130694 10401810 10123785 8871009
33378H871009j537152q41540m01218q54367j008085m1460P69896K12902o38368
$$ 8871009 7333857 6492317 6091099 5236732 4228647 4187187 4957083 5169985 4531617
33369D531617l67740J59900n11348j446346p74594P98446R37503k95323m92412
$$ 4531617 4163877 4323777 3812429 2366083 1591489 2389935 3327438 3032115 2539703
33360B539703Q83339J463838l1111j584933j050774P00508J421935O57025l39568
$$ 2539703 3423042 4886880 4855769 3270836 2220062 2920570 4342505 4999530 4659962
33351D659962p23244o64160n47151o48394j060965j278247n90264N90128Q25884
$$ 4659962 3936718 3272558 2725407 2077013 1016048 -262199 -852463 -262335 563549
33342E63549k37432j011540j89798J226637J388296K89976m38802k3432O37325
$$ 563549 326117 -685423 -875221 351416 1739712 2029688 1590886 1567454 2204779
33333B204779O39416K55593R7426P6652k41416p99406j059288o47197K23140Q32510
$$ 2204779 2844195 3099788 3197214 3273866 3032450 2233044 1173756 526559 749699 1582209
33323A582209N17982n43162j250356p96255J38173J84729o27571o77148P57792
$$ 1582209 2100191 1557029 306673 -489582 -351409 -166680 -794251 -1471399 -713607
33314g13607J970767J101049q67815j260474L14479J336834L00382j006526n49281
$$ -713607 1257160 2358209 1490394 229920 544399 1881233 2181615 1175089 625808
33305F25808O70345N40265m97484m20583O29795O05138o65621j077621l3473N00506
$$ 625808 1296153 1836418 1338934 918351 1548146 2153284 1487663 410042 376569 877075
33295H77075l32281o43236O24620J440981J77346j277521o13286Q52542M08899
$$ 877075 544794 -98442 526178 1967159 2144505 866984 253698 1106240 1515139
33286A515139j305475j305873P24678J930248Q45140o89941p66635R7559N80419
$$ 1515139 209664 -1096209 -371531 1558717 2403857 1713916 947281 1044840 1625259
33277A625259N18277K99396m7069l80916l88065l86655q89773j290857n61905
$$ 1625259 2143536 2442932 2395863 2014947 1626882 1240227 350454 -940403 -1502308
33268a502308P22905R26483N2869j70337P09930J028157r4315j178718q20368
$$ -1502308 -779403 147080 199949 29612 739542 1767699 1673384 494666 -325702
33259c25702K24759N89154K30773l32485j055285j486763o16089J144596J672267
$$ -325702 -100943 488211 718984 386499 -668786 -2155549 -2771638 -1627042 45225
33250D5225K81228q11649K9373R72725k60129k300647k118402O4343J214545M07731
$$ 45225 326453 -485196 -455823 516902 256773 -2043874 -4162276 -4097933 -2883388 -2475657
33240b475657j32578P99043J495122O19025m97462l36929L62939L33138q513J45955
$$ -2475657 -2608235 -1809192 -314070 304955 -192507 -529436 -166497 166641 158128 304083
33230C04083J66089n77235q73214M90218K095937J580627n84004j571090m67307
$$ 304083 470172 -107063 -980277 -490059 1605878 3186505 2602501 1031411 564104
33221E64104N47259q3445q98942j12641J347531J404545R9284p89772o54180n07094
$$ 564104 1111363 1027918 128976 16335 1363866 2768411 2867695 2077923 1423743 916649
33211I16649p86438p17491n4295L65239K65321M52237J026340P47360p81514j840127
$$ 916649 130211 -587280 -641575 -276336 -11015 441222 1467562 2214922 1433408 -406719
33201d06719r55107O80864R02746j46085m05606P66603J711323J148054j23471
$$ -406719 -1361826 -680962 221784 75699 -329907 436696 2148019 3296073 3172602
33192C172602q23033q90651p20890r3830R71679J370067K85736j212372j325052
$$ 3172602 2349569 1458918 738028 644198 1615877 2985944 3271680 2059308 734256
33183G34256j6198R23535L60372p68173q92118J67460J166436J022098l1511p94349
$$ 734256 718058 1641593 2001965 1233792 341674 509134 1675570 2697668 2666157 1871808
33173A871808m51256M28466M43993q48952k059770j513112M74747J757373J026580
$$ 1871808 1420552 1849018 2293011 1444059 -615711 -2128823 -1654076 103297 1129877
33164A129877n63144j015223O6J119436J286156P15612M679o13686r21548o07256
$$ 1129877 566733 -448490 -448424 671012 1957168 2672780 2677459 2063773 1142225 534969
33154E34969R3029M65422M20295O37190J142892Q61825n38772j475101n03683
$$ 534969 627998 1093420 1513715 2150905 3293797 4155622 3616850 2141749 1638066
33145A638066J249420J420362k21152j576093j371115n56476j39961L85290J468285
$$ 1638066 2887486 4307848 4086696 2510603 1139488 583012 443051 828341 2296626
33136B296626K081987J295447J7448l68584k18589q49201k066991k166865m53025
$$ 2296626 4378613 5674060 5691508 5322924 5104335 4255134 2188143 21278 -431747
33127d31747J590046K061966Q01496n92611n59536P43429J549549N31598j389329
$$ -431747 1158299 3220265 4021761 3429150 2869614 3613043 5162592 5694190 4304861
33118D304861k060466r47899K48894K47799n0304N46699J305599Q21090n28356
$$ 4304861 2244395 1296496 1545390 1793189 1742885 2289584 3595183 4416273 3887917
33109C887917j166396p62699l37542k93127p3267L75965M66983K60187L32539
$$ 3887917 2721521 1958822 1621280 1328153 1254886 1630851 2097834 2358021 2690560
33100B690560L95301l29005j307783j039535N00080J483291Q53875k72580n52320
$$ 2690560 3085861 2756856 1449073 409538 909618 2392909 3246784 2974204 2421884
33091B421884k75460l41893o07512l62122L53094R03550J032225R17071O22303
$$ 2421884 2146424 1804531 1197019 834897 1187991 2091541 3123766 4040837 4663140
33082D663140O3850o56736j130666p81895N80069J992642J789446l10761k248887
$$ 4663140 4726990 4070254 2939588 2157693 2737762 4730404 6519850 6209089 3960202
33073C960202k023375m12519L15494j67197k37719M96326N59368m63528r71859
$$ 3960202 1936827 1524308 1839802 1672605 1434886 1931212 2490580 2027052 1055193
33064A055193k42010K32307l85966m91440J057517K421417J462433p38016j559631
$$ 1055193 813183 1045490 659524 168084 1225601 3647018 5109451 4371435 2811804
33055B811804q20601m28101q11591m82467R12016J656316O67762q06587j004115
$$ 2811804 1991203 1563102 751511 269044 1181060 2837376 3505138 2698551 1694436
33046A694436J21679J158113R15237n00257j740378j403994K81132J384657O26405
$$ 1694436 1816115 2974228 3889465 3389208 1648830 244836 525968 1910625 2537030
33037B537030q41603j063685r04P84627O40726L55622L80954K38734j79283k82197
$$ 2537030 1695427 631742 630838 1415465 2056191 2411813 2792767 3031501 2852218 2570021
33027B570021m829L2764j91835n3320K95415j7795p69614n59835Q14189J553859
$$ 2570021 2565192 2597956 2406121 2352801 2648216 2630421 1860807 1300972 2115161 3669020
33017C669020M23883j315807j770205j025283n01206n60641l27943M73386R52064
$$ 3669020 4092903 2777096 1006891 -18392 -519598 -1080239 -1408182 -934796 17268
33008A7268M24348o30934j190854o84875O25900J801818J888641Q70697k20611
$$ 17268 441616 -189318 -1380172 -2065047 -1439147 362671 2251312 3122009 2901398
32999B901398n12538k49403j12292j09846J22280L48803K2266o34140q30949n16981
$$ 2901398 2388860 2139457 2027165 1917319 2039599 2388402 2410668 1776528 945579 428598
32989D28598m61015q29565p55821J68158R77095P43306J00991K57351R92617R76809
$$ 428598 -32417 -861982 -1617803 -1449645 -472550 270756 371747 629098 1621715 2598524
32979B598524k2329o74591j93722M28264P2511p36649q00811j55565K58455K53049
$$ 2598524 2576195 1901604 1707882 2136146 2208657 1472008 671197 515632 774087 1027136
32969A027136L29520L41980k26376q14791l42098O79788N15501q26318j099507
$$ 1027136 1356656 1698636 1472260 657469 315371 995159 1510660 684342 -415165
32960d15165O63873K234850J443382m81632r89616j36996J73254j70494L25680
$$ -415165 248708 2483558 3926940 3445308 2455692 2318696 2491950 2321456 2647136
32951B647136J315668O82375j477562k189115j79697J783902J018374j057417
$$ 2647136 3962804 4645179 3167617 978502 798805 2582707 3601081 2543664
32943B543664j390751P2890R18237K73472m54821m00694k58281m31730l27446
$$ 2543664 1152913 1225803 2144040 2417512 1962691 1561997 1303716 871986 544540
32934E44540J92759M27532K20913J63998J91025m09601j287511j054520M05313
$$ 544540 737299 1164831 1385744 1549742 1740767 1331166 43655 -1010865 -605552
32925f05552J295604M47842r17644j032903l9936N87045K91552r8986J77362Q38238
$$ -605552 690052 1137894 220250 -812653 -852589 -265544 26008 -72978 104384 942622
32915I42622J030295L79233m22876k34817R25876J366072j79089k343805k590832
$$ 942622 1972917 2352150 1929274 1694457 2620333 3986405 3807316 1463511 -1127321
32906a127321p57616P88242P80886N48732J072676J070992l66370j524491o84402
$$ -1127321 -1884937 -1096695 -315809 232923 1305599 2376591 2010221 485730 -198672
32897a98672Q38986Q33383j37838o9016O50916K6959j495158j325052P38006J760360
$$ -198672 640314 1473697 1335859 1266843 1917759 1944718 449560 -875492 -137486 1622874
32887A622874L64115j046784k35321J457234J560352J48145j019528j380194j494999
$$ 1622874 1986989 940205 704884 2162118 3722470 3870615 2851087 1470893 -24106
32878b4106j271671k88176Q08279R71382M27223K92495Q27041J193289P54700
$$ -24106 -1295777 -1583953 -775674 195708 622931 915426 1742467 2935756 3690456
32869C690456j91342p96687m07272O56906J044313j8855j147662k96934J995324
$$ 3690456 3499114 2702427 2295155 2952061 3996374 3977519 2829857 2532923 4528247
32860D528247K780977Q06602j570980j759435l49972L77289k34094j122203j454869
$$ 4528247 7309224 8115826 6544846 4785411 4435439 4812728 4578634 3456431 2001562
32851B001562j019223K30973J525136J341397m28877j682999r71284L37145M53581
$$ 2001562 982339 1213312 2738448 4079845 3650968 1967969 996685 1333830 1787411
32842A787411L1145M49296Q74939k27936j816596j479743O40255J968257J329638
$$ 1787411 1818556 2267852 3142791 2914855 1098259 -381484 258771 2227028 3556666
32833C556666Q1892n15381o43827n85635k43175q1169o01888r97321k19713R56656
$$ 3556666 3638558 3123177 2479350 1893715 1650540 1569371 967483 -29838 -249551 707105
32823G07105R94644K55744L34633J166986J260857M88732Q2137J01078m04977
$$ 707105 1701749 1957493 2292126 3459112 4719969 5208701 5290838 5391916 4986939
32814D986939r38246j64131J109885P18048r13712r28326J259293K749837J670250
$$ 4986939 4048693 3884562 4994447 5712495 4798783 3870457 5129750 7879587 9549837
32805I549837k34755q41084o09095p59772r71947n42622J06731M18309N51854
$$ 9549837 9315082 8473998 7864903 7105131 6133184 5590562 5697293 6115602 6667456
32796F667456M59392j62931o30412P899R20145N46609m38989j19638R51654N88568
$$ 6667456 7126848 6963917 6333505 6341404 7261549 7808158 7369169 7249531 8201185 8789753
32786H789753n67373L25113K898533L642052K249863K515433N274105O352600
$$ 8789753 8222380 8547493 11446026 15088078 17337941 19853374 25127479 31480079
32778C1480079M239134L664696P617700J1976943J3766956J9264268L5900685
$$ 31480079 35719213 39383909 47001609 58978552 72745508 92009776 127910461
32771A27910461N8283986O9492100N6635563K1627184k1132189n3272868o2122075
$$ 127910461 186194447 255686547 312322110 333949294 312817105 259544237 197422162
32764A97422162m9381108l0373981j9695020j7946378j6327640j1102760o549904
$$ 197422162 148041054 117667073 97972053 80025675 63698035 52595275 46045371
32757D6045371n356416m702680k962123k660412m431574m616195j770820K39624
$$ 46045371 40688955 35986275 33024152 30363740 25932166 21315971 19545151 19784775
32749A9784775j155074k826226j692836l1698r54355k700665j975520J74282M35878
$$ 19784775 18629701 15803475 14110639 14078941 13124586 10423921 8448401 8622683 9058561
32740I058561j024593j317116M7231Q38766K46581j91915L16502O49008q8726
$$ 9058561 8033968 6716852 6764083 7602849 7849430 7657515 7974017 8623025 8534299
32731H534299j300799j982330j676531m62264R42205J395832N45105n93916q61526
$$ 8534299 7233500 5251170 3574639 3112375 4054580 5450412 5995517 5401601 4540075
32722D540075j67387Q53557J500719J103486l76194j643208j310121O6838P45056
$$ 4540075 4372688 5226245 6726964 7830450 7454256 5811048 4500927 4567765 5312821
32713E312821M96917N25385P35076k86281k154698k464593o23120R48065O94095
$$ 5312821 5809738 6335123 7070199 6783918 4629220 2164627 1541507 2489572 3183667
32704C183667J35879O38676Q90037l53336j678796j511724q04740q12774m99962
$$ 3183667 3319546 3958222 4848259 4494923 2816127 1304403 499663 -313111 -813073
32695h13073J151299K398900J303709p56169j220863m66939o03175j459552j171808
$$ -813073 338226 2737126 4040835 3284666 2063803 1596864 993689 -465863 -1637671
32686a637671J26163O18653K89001P09814J599251J009063q63720j406602K01025
$$ -1637671 -1511508 -892855 -603854 105960 1705211 2714274 1850554 443952 644977
32677F44977J595393J062129l7452j8535M24435k3001p80759n43520L11398L34737
$$ 644977 2240370 3302499 3265047 3246512 3670947 3647946 2867187 2323667 2635065 2969802
32667B969802o44080j326537q70713J38008O53871L77162j21351j50348L11087
$$ 2969802 2325722 999185 128472 266480 920351 1297513 1176162 1025814 1336901
32658A336901O01408K74663k11653j03057N23738P78786J29997q77971j197572
$$ 1336901 1938309 2212972 2001319 1898262 2422000 3200786 3330783 2452812 1255240
32649A255240l85975Q75216J377956O94019k60955m16832m9739k34427r43949
$$ 1255240 869265 1744481 3122437 3816456 3555501 3138669 3088930 2854503 1910554
32640A910554r67886M4953Q69276N95406j22843m38629n46640o78430l22525M74226
$$ 1910554 942668 987621 1856897 2452303 2329460 1890831 1344191 665761 343236 817462
32630H17462N24613m78839q87963L86160J788116J426477O4477l72627k4169l21447
$$ 817462 1342075 863236 -24727 361433 2149549 3576026 3640503 3267876 3243707 2922260
32620B922260r81147n86234L99940J61620j065247j099781M16969J310208N54879
$$ 2922260 1941113 1354879 1754819 1916439 851192 -248589 168380 1478588 2033467
32611B033467k05593J71956M14373m71567j104750j87259J030069Q24474j04335
$$ 2033467 1827874 1999830 2414203 1942636 837886 650627 1680696 2505170 2400835
32602B400835k9620P26040M11497j119845k158915j744965p05450j7988L59361
$$ 2400835 2371215 3097255 3508752 2388907 229992 -1514973 -2220423 -2238411 -1879050
32593a879050P46826R74442P36535P2457o43016q27728r1093J037180J288728
$$ -1879050 -1132224 -157782 578753 651210 8194 -819534 -910627 126553 1415281
32584A415281K44224q12030m99409P01925J175073N03563j43981Q8117O75328
$$ 1415281 1659505 847475 348066 1049991 2225064 2728627 2584646 2672763 3348091
32575C348091P75658L25960k86175p94133r17649m24450K64054K51584n66733
$$ 3348091 4123749 4449709 4163534 3369401 2451752 2027302 2291356 2542940 1976207
32566A976207j088259m42167P35428J171523O57618N9196j30993l12843p39145
$$ 1976207 887948 445781 1181209 2352732 3010350 3069546 2938553 2625710 1886565
32557A886565q22986j6922J078843J168962j24149j561062j565909j11381J134014
$$ 1886565 1063579 1046657 2125500 3294462 3170313 1609251 43342 -68039 1065975
32548A065975Q10359m06697p44778K08164J015530O08086k07615k82509p4177
$$ 1065975 1876334 1469637 724859 933023 1948553 2556639 2349024 2066515 1992338
32539A992338o75169j606405j343369J37104J179051J037328P82551J058201Q73979
$$ 1992338 1317169 -289236 -1632605 -1495501 -316450 720878 1503429 2561630 3435609
32530C435609l06837j102728l77076O39003K37278r08706q47855M38614J112281
$$ 3435609 3128772 2026044 1648968 2287971 2525249 1616543 768688 1207302 2319583
32521B319583M51932l47014l79048j09860M300K50956O08435M38406l39847r90607
$$ 2319583 2771515 2424501 2045453 1935593 1939893 2190849 2799284 3237690 2897843 1907236
32511A907236j121542r54392m48325N03895J076659K94692j125296j399332l09126
$$ 1907236 785694 -168698 -617023 -113128 963531 1258223 132927 -1266405 -1575531
32502a575531N37487L11523n3645J19833K18445n3702O3707P51239J032378N80093
$$ -1575531 -1038044 -726521 -780166 -660333 -441888 -495590 -431883 319356 1351734 1931827
32492A931827K89561L55092k04440j287570j226259L13846J251367L43373p43949
$$ 1931827 2221388 2576480 2372040 1084470 -141789 172057 1423424 1766797 1022848
32483A022848l22983N76249L66014k81785p0837L25848k10184p61939m3075Q83038
$$ 1022848 699865 1276114 1642128 1360343 1289506 1615354 1405170 643231 600156 1483194
32473A483194K95874r81491r02988L01074Q45403P08928J136709J511854J11720
$$ 1483194 1779068 797577 -105411 195663 1041066 1749994 2886703 4398557 4510277
32464D510277k197185k462408k24898J600202J149404l4997q7814M45023K92023
$$ 4510277 2313092 -149316 -374214 1225988 2375392 2340395 2252581 2697604 2989627
32455B989627l49947p06922p69056n89284J78767J091473Q62640n73684j514693
$$ 2989627 2639680 1932758 1163702 574418 753185 1844658 2707298 2133614 618921
32446F18921r17449J65385M79227L04491K84354R2885n23098p79261k08053K71100
$$ 618921 -298528 -133143 346084 650575 934929 1027814 504716 -274545 -482598 -211498
32436b11498p4568l38011M72964J464215J076928l86529j134835n43972J08188
$$ -211498 -286066 -624077 -151113 1313102 2390030 2003501 868666 324694 432882
32427D32882k65996j006770p85735N17171J666554J571088M43529o20035q96546
$$ 432882 166886 -839884 -1625619 -1108448 558106 2129194 2572723 1952688 1056142
32418A056142n58591j17575J20654J3966l48079l65925M93367J562819J421914
$$ 1056142 497551 379976 500630 514596 166517 -199408 293959 1856778 3278692
32409C278692l0661j135628q59649k63052m73168o90962J39866J054469N61460
$$ 3278692 3248031 2112403 1252754 989702 516534 -174428 -34562 1019907 1581367
32400A581367o52200q47077k18429k08454n13119L18209J611595J096274j066934
$$ 1581367 929167 82090 -136339 -344793 -857912 -539703 1071892 2168166 1101232
32391A101232k017369o69994O80721L29982l21601K50381J047095Q00268L72408
$$ 1101232 -916137 -1586131 -905410 -575428 -897029 -646648 400447 1200715 1573123
32382A573123P70655R47127j43764j209675p49293J31850m27073j712819j608438
$$ 1573123 2343778 3290905 3147141 1937466 1188173 1320023 892950 -819869 -2428307
32373b428307j47358P40286M73420K84065O60126O83969K8673m33691k77474m3502
$$ -2428307 -2575665 -1835379 -1361959 -1077894 -417768 266201 294874 -138817 -416291 -459793
32363d59793J13742O77447J379431J111608k81444j418654j180498j00074N77353
$$ -459793 -346051 331396 1710827 2822435 2540991 1122337 -58161 -158235 419118
32354D19118M20384j27175n96944q39102p76495k61480O92388J588540J644949
$$ 419118 839502 712327 115383 -723719 -1500214 -1761694 -1069306 519234 2164183
32345B164183P08496k29166j24486N92342N35444n19514j250431q93840l81766
$$ 2164183 2872679 2643513 2519027 3111369 3646813 3127299 1876868 983028 601262
32336F01262o23794r58254m26486M60942N27180k03418o58456k79070N53134J216262
$$ 601262 -22532 -980786 -1407272 -946330 -419150 -622568 -1281024 -1560094 -1006960 209302
32326B09302J208291L72106n88167n81928K56583M79439m05710r28653l7149R77850
$$ 209302 1417593 1789699 1201532 619604 876187 1355626 949916 21263 -15886 961964
32316I61964N22317o65331q85143l90872o24092j252955n75991J232677J879329
$$ 961964 1484281 818950 -66193 -457065 -1081157 -2334112 -2910103 -1677426 201903
32307B01903M59310j058222p69413N71906J048838L24172l51751j16089N73673
$$ 201903 661213 -397009 -1166422 -594516 454322 778494 426743 310654 884327
32298H84327P49422J25766n29675l09676M52684L99457p12834j139325L44065
$$ 884327 1633749 1759515 1229840 920164 1372848 1772305 1059471 -79854 264211
32289B64211K067715J535290p17963j692752l64788R62256L92632r07175j047674
$$ 264211 2331926 3867216 3149253 1456501 1091713 2053969 2446601 1539426 491752
32280D91752l14121l0006j34155K04092O68026M02055j96035j05084L98829K25323
$$ 491752 177631 147625 13470 217562 885588 1287643 1091608 986524 1385353 1610676
32270A610676m41825l61440M98762P55135k8614n58433o4206L24674m48491j405082
$$ 1610676 1168851 807411 1306173 2061308 2032694 1474261 1410055 1734729 1286238 -118844
32260a18844j027937K05358N05232m06866r34717k00351O91966O15305J72825
$$ -118844 -1146781 -941423 -436191 -843057 -1777774 -1978125 -1286159 -670854 -498029
32251d98029M29197R98553P59115j67826n79533p4816N68411Q45905J018336J003417
$$ -498029 -68832 929721 1688836 1521010 941477 866661 1435072 2280977 3299313 4302730
32241D302730J69783j273830j949562j137355Q1127L62566p2656j25457L60701
$$ 4302730 4472513 3198683 1249121 111766 192893 555459 482803 357346 718047
32232G18047N80117K04757k28525l09964k64504l53466l92862p5727N21608Q76941
$$ 718047 1298164 1502921 1274396 964432 699928 346462 -46400 -122127 399481 1276422
32222A276422M77042m94404j046491m47463O75700J045296N46795L03967P08328
$$ 1276422 1753464 1259060 212569 -234894 440806 1486102 2032897 2336864 3045192
32213C045192O63598n18480j730271j658305p34671k25652k04579J22268O72388
$$ 3045192 3708790 3190310 1460039 -198266 -932937 -1158589 -1363168 -1240900 -568512
32204e68512O55718K00976K31405P09354N08987o75139j628044j338429l58889
$$ -568512 87206 288182 519587 1228941 1737928 1062789 -565255 -1903684 -2262573
32195b262573J89842J85172L53689R69453J372563Q46136l15989r14675k34314
$$ -2262573 -2072731 -1887559 -1533870 -564417 808146 1654282 1338293 423618 189304
32186A89304R04747J070869J28436o44952m65910M9956K62852M54942O89567J81022
$$ 189304 1094051 2164920 2293356 1648404 1182494 1232450 1495302 1950244 2639811 2820833
32176B820833j087619j565477m20304P52658K92944p76842n45885M36872K87607
$$ 2820833 1733214 167737 -252567 500091 793035 16193 -529692 -92820 194787
32167A94787n91937j60968J268541J116667r24381j869530j63883J739444J323217
$$ 194787 -397150 -558118 710423 1827090 902709 -966821 -1130704 608740 1931957
32158A931957k32515n06796J80751j12580j349492j690211n28386Q81293J426639
$$ 1931957 1699442 1192646 1373397 1260817 -88675 -1778886 -2307272 -1425979 660
32149F60J030675r126j075157j167273j60219N50711r465p14459j34938R89802
$$ 660 1031335 1022209 -52948 -1220221 -1380440 -829729 -839194 -1553653 -1688591 -698789
32139f98789R83070Q5709j20567L96537J97282p89795r29513K77340J224626P32568
$$ -698789 284281 369990 249423 645960 843242 53447 -876066 -598726 625900 1358468
32129A358468l30695p04834l85279J11992O38371Q49880J62485j022967j372149
$$ 1358468 1027773 322939 -62340 49652 688023 1537903 1700388 677421 -694728
32120f94728n24092L86221O34228P81100J025388M87341q81200j485443m91196
$$ -694728 -1218820 -832599 -198371 582729 1608117 2095458 1214258 -271185 -762381
32111g62381O41963N08551k9016K87653O88225j4993q46792k64982P78932K75188
$$ -762381 -120418 388133 359117 646770 1334995 1320002 473210 208228 987160 1262348
32101A262348j041010n45448J681478K475268M94529j639010j404234J75847Q32801
$$ 1262348 221338 -324110 1357368 3832636 4327165 2688155 1283921 1459768 2292569
32092B292569M06574p4133o62915j633588j890209n37886J051451R47219l84373
$$ 2292569 2699143 2625010 1962095 328507 -1561702 -2099588 -1048137 -100918 -485291
32083d85291r35222k87840K42825J32007J23338L32654j7154p97510q06143K23205
$$ -485291 -1420513 -1708353 -1465528 -1333521 -1210183 -877529 -894683 -1692193 -2498336 -2275131
32073b275131J050724Q03140N6591l37659l12484j36822O3999J33577R0034L96404
$$ -2275131 -1224407 -421267 -364676 -702335 -1014819 -1151641 -1087642 -954065 -864031 -467627
32063d67627J107321J193227j6889j257687q51084O14729J093290L33087N9159
$$ -467627 639694 1832921 1816032 558345 -292739 321990 1415280 1748367 1807526
32054A807526P89716R35882k78637j340802r46057J7405J65385l63023o89805
$$ 1807526 2597242 3533124 3254487 1913685 967628 985033 1150418 787395 97590
32045I7590n61304n6589O45835O55653p45013k187772j431409R12958J622969
$$ 97590 -463714 -520303 125532 781185 36172 -2151600 -3583009 -2670051 -1047082
32036a047082j12314j085177O93600K466883J239665j149617j104073Q23666J222096
$$ -1047082 -1159396 -2244573 -1550973 915910 2155575 1005958 -98115 725551 1947647
32027A947647l78877j281836n97405k40708q53449o95572O92839J292262J77344
$$ 1947647 1568770 286934 -310471 -551179 -1404628 -2100200 -1407361 -115099 62245
32018F2245p96890j68735R55836J220643J061565J049692M75695q66061j500331
$$ 62245 -734645 -903380 52456 1273099 2334664 3384356 3860051 2993990 1493659
32009A493659n33599O19419M23879l71436k39730M84976L33222p46223j337074
$$ 1493659 960060 1579479 2003358 1631922 1392192 1877168 2210390 1464167 127093
32000A27093p36491K52157O65926M60270J17092j39654m66113q86962q63604J81293
$$ 127093 -609398 -357241 308685 768955 886047 746393 280280 -606682 -1470286 -1288993
31990a288993J681495K045911P27313o50696m46008N09299K26780j229815j911843
$$ -1288993 392502 2438413 3165726 2515030 2069022 2578321 2805101 1575286 -336557
31981c36557j123760j46017K78810Q29600J547565J286939Q371o51514p6826K66205
$$ -336557 -1460317 -1606334 -1327524 -497924 1049641 2336580 2344951 1693437 1616611 1882816
31971A882816m38489q37975l677P11732J21028o08830j89031L39935l54250j182687
$$ 1882816 1444327 606352 602675 1314407 1435435 826605 637574 977509 623259 -559428
31961e59428n16797O97264N15442m39630l0686J445162J551401j28114j260027
$$ -559428 -1076225 -378961 136481 -303149 -333835 1111327 2662728 2534614 1274587
31952A274587o53126O8100l86045q60681k25753L74617l83955j424335r10950
$$ 1274587 621461 689561 303516 -557165 -782918 -408301 -792256 -2216591 -3127541
31943c127541O53454J168323K53709k95951N49088J566109J351671L73209o4319
$$ -3127541 -2474087 -1305764 -1052055 -1348006 -798918 767191 2118862 2492071 2427752
31934B427752J11108p4172q73435j465034j297644p08558m4706Q06747J647048
$$ 2427752 2538860 2464688 1591253 126219 -1171425 -1879983 -1924689 -1117942 529106
31925E29106J716815Q25972j13418l79250m39809q55703j077211m35109M64737
$$ 529106 2245921 3071893 2958475 2579225 2139416 1283713 206502 -228607 236130
31916B36130O55382M48595O77436Q95913R3568j167504j295289k73823K94695
$$ 236130 891512 1340107 2017543 2913456 3007024 1839520 544231 270408 565103
31907E65103j08544k78718K86123N08647n2909k89945K33357K85938o26341r72481
$$ 565103 456559 177841 463964 972611 919702 629757 863114 1149052 522711 -449770
31897d49770J91959J278949O30884p17465o77950P82900K017583K070446J025134
$$ -449770 -257811 1021138 1652022 934557 256607 1039507 3057090 5127536 6152670
31888F152670q14801k437173k170042o8042J173474j98231j977008j148529J260861
$$ 6152670 5337869 2900696 730654 662612 1836086 1637855 -339153 -1487682 -226821
31879b26821J668889m35941j856313q11274O83794M59907p01156r93316l21691
$$ -226821 1442068 1006127 -850186 -1661460 -977666 -517759 -1218915 -2212231 -2533922
31870b533922M24830J069423J605223J335121J6593j131282q74252K82015Q58561
$$ -2533922 -2109092 -1039669 565554 1900675 1917268 785986 -88266 193749 1052310
31861A052310L79667l27708m23655Q6309N78128M82244j03330m25277m7111L84083
$$ 1052310 1431977 1104269 680614 766923 1345051 1827295 1723965 1298688 1251577 1635660
31851A635660P579q14900q70587J23350J133632J328418R39129L61788n16221
$$ 1635660 1643239 828339 -42248 81102 1214734 2543152 3482281 3844069 3327848
31842C327848j574688j947806r95881O31879J458081O21149j234945k402691j672916
$$ 3327848 1753160 -194646 -1190527 -558648 899433 1520582 285637 -2117054 -3789970
31833c789970K88647J553940J261748N77163O83624Q76488m3620j362327j278381
$$ -3789970 -3501323 -1947383 -685635 -108472 575152 1451640 1408020 45693 -1232688
31824a232688K00686J124125M64287o91834j146701j037477p13371J48186J403274
$$ -1232688 -1032002 92123 556410 -135424 -1282125 -2319602 -3032973 -2884787 -1481513
31815a481513J810409O47751r60221j322004j90870J210172J673293R98858p5084
$$ -1481513 328896 976647 16426 -1305578 -1496448 -286276 1387017 2385875 2310791
31806B310791o09517m15023j86510l28097k26842M73380P03373m53912j722822
$$ 2310791 1701274 1286251 1099741 771644 544802 1018182 1721555 1267643 -455179
31797d55179j182628N15358Q67892m93878j199029q1091J059395P68414K74480
$$ -455179 -1637807 -1122449 -254557 -748435 -1947464 -2028555 -969160 -200746 73734
31788G3734Q29775J261646L54258n58744N4003Q73630l6711j455374p92159J246841
$$ 73734 903509 2165155 2519413 1960669 2014672 2888302 2851591 1396217 604058 1850899
31778A850899J414094p46866j972773m82963J245678N55071j252868j151929R49964
$$ 1850899 3264993 2518127 545354 62391 1308069 1863140 610272 -541657 408307
31769D08307K260006J132212j052087k053792j295470J47473J084027J196230
$$ 408307 2668313 3800525 2748438 694646 -600824 -453351 630676 1826906
31761A826906Q68874M61889n8376o85802q90664j66102R57322J198608J36895
$$ 1826906 2695780 3157669 3099293 2413491 1522827 1356725 2314047 3512655 3649550
31752C649550j117346j314855n76082M6064L7066k48073m37111n33735m86545
$$ 3649550 2532204 1217349 641267 687331 724397 476324 39213 -494522 -981067
31743i81067j15379L46214L01794k51441m03020M49182J477032J315897n7261
$$ -981067 -1096446 -750232 -448438 -699879 -1102899 -653717 823315 2139212 2081951
31734B081951j217218j189067n36553j69861m3262J88430J00495p24455j416772
$$ 2081951 864733 -324334 -860887 -1030748 -1074010 -885580 -785085 -1509540 -2926312
31725b926312p59654P62701J368123N81497j00353L81522J101992Q45922l9757
$$ -2926312 -3685966 -2923265 -1555142 -973645 -1073998 -692476 409516 1255438 1215681
31716A215681o03782q88979j215488r02798O17867K084478J657172l05015j510909
$$ 1215681 611899 -277080 -1492568 -2395366 -1777499 306979 1964151 1659136 148227
31707A48227q98834J98237M42854L10876O58414R73843L63015p01373j032189
$$ 148227 -750607 -552370 -109516 201360 859774 1833617 2196632 1495259 463070
31698D63070o13360m76117q71191q72976j0083Q37440P15946j0256k46323K88250
$$ 463070 -150290 -626407 -1497598 -2370574 -2380657 -1543217 -827271 -837527 -1083850 -795600
31688g95600Q29225P65161M09289L99238P65750R25728M46007m38446j051124
$$ -795600 33625 798786 1208075 1607313 2373063 3298791 3744798 3306352 2255228
31679B255228r06544j64288M74820M10807k38403p65500o86643k47338J4510k7814
$$ 2255228 1348684 1184396 1659216 2070023 1831620 1066120 379477 132139 146649 118835
31669A18835j00447o1671l8121p4565l7782O0984k0853l78860p17344o19641L5297
$$ 118835 18388 -43283 -81404 -155969 -193751 -132767 -153620 -532480 -1249824 -1869465 -1834168
31658a834168R25383J441655J112576J11102p58700q57689l94604j6432J02452
$$ -1834168 -908785 532870 1645446 1756548 997848 140159 -254445 -270877 -168425
31649a68425K83421N49266M35299k31051q76461q27854j29501N32805N67975K8920
$$ -168425 114996 664262 1099561 868510 -7951 -835805 -965306 -432501 135474 164394
31639A64394m45381k51921M65897Q75178M45380l67902p79597o92558n36915m16826
$$ 164394 -280987 -532908 -67011 808167 1253547 885645 106048 -586510 -1123425 -1540251
31629a540251j32372J54167P8834j84763j44821J20812J29361m6186P6289L57586
$$ -1540251 -1672623 -1518456 -1439622 -1624385 -1769206 -1648394 -1519033 -1565219 -1488930 -1131344
31619a131344K40134l6061L24064J097443J111933J87152m82874l51843l11596
$$ -1131344 -891210 -927271 -603207 494236 1606169 1793321 1310447 958604 647008
31610F47008p67211o78075L95255J026040J95854p38201j85157R15547O34982
$$ 647008 -120203 -798278 -403023 623017 818871 80670 -104487 811060 1446042
31601A446042o45911r08542P2831N13176k14237o82645j08265L74394l8016l30966
$$ 1446042 800131 -108411 -35580 477596 263359 -419286 -527551 -153157 -191173 -522139
31591e22139M00766J187326P26243m68320q48261q5266O38617K78086r29924j779272
$$ -522139 -121373 1065953 1792196 1323876 475615 390349 1028966 1307052 377128 -1402144
31581a402144j208983N27302J743214J082322n85166j101150j2528Q09367J14160
$$ -1402144 -2611127 -2083825 -340611 741711 156545 -944605 -957133 -147766 -33606
31572c3606p80044k04364J071884J039326l53009j171447n27374K55749p1047
$$ -33606 -813650 -1018014 53870 1093196 740187 -431260 -958634 -702885 -773932
31563g73932q41415q04303j16934J75161j3879J93095Q95361R83226m1540q74985
$$ -773932 -1615347 -2419650 -2536584 -2361423 -2375302 -2182207 -1286846 -303620 -345160 -1220145
31553a220145j03325J483580J695127J16284j080340k59229J184117R15859p65159
$$ -1220145 -1323470 160110 1855237 1971521 891181 631952 1816069 2731928 1966769
31544A966769j461966m71889K02552q43751k149817j633237L78413J833125J717479
$$ 1966769 504803 32914 235466 -608285 -2758102 -4391339 -4012926 -2179801 -462322
31535d62322O80243m56015j314682j391348l05329J240380J841439J005703l47143
$$ -462322 217921 -238094 -1552776 -2944124 -3249453 -2009073 -167634 838069 490926
31526D90926j122689j111651p00822j87777L35547P89965J020566Q37448K82588
$$ 490926 -631763 -1743414 -2444236 -2632013 -2296466 -1506501 -485935 351513 634101
31517F34101q6714L43744J219829J284223L5872j305223j314261l02052L07321
$$ 634101 547387 891131 2110960 3395183 3431055 2125832 811571 509519 816840
31508H16840J48844J70034P59942J019314L21688n74436o89553k52193j55005
$$ 816840 965684 1135718 1895660 2914974 3236662 2662226 1972673 1720480 1565475
31499A565475n45922p96632n88159k33394N8191N33718J242410J503355N73163
$$ 1565475 1019553 222921 -365238 -598632 -540441 -6723 1235687 2739042 3312205
31490C312205j177701k290088j789021l87867M59910M65401N59247J048973R79866
$$ 3312205 2134504 -155584 -1944605 -2332472 -1872562 -1407161 -847914 201059 1180925
31481A180925j03114j016049o41449K42880K33885l78488k30707O59014R29083
$$ 1180925 1077811 61762 -579687 -336807 -102922 -481410 -712117 -53103 875980
31472H75980K52431k65400k50350o10306j405305j230480L10879J440082Q37995
$$ 875980 1128411 863011 612661 2355 -1402950 -2633430 -2322551 -882469 -44474
31463d4474k36603n0005Q36973P43866l04222r01405o47545k67109R6749P58106
$$ -44474 -281077 -331082 505891 1249757 945535 44130 -603415 -870524 -773775 -15669
31453a5669J067757J45281j155741j076702K33618Q38239J60759k07831N75394
$$ -15669 1052088 1197369 41628 -1035074 -801456 36783 197542 -10289 565105
31444E65105J136180L78283n97805m86210N3581j33016n02352M3986R01638O35785
$$ 565105 1701285 2079568 1481763 995553 1049134 916118 413766 457752 1359390 1995175
31434A995175n49647j135893p07342k20690p0235K75572O99695L62755n01749
$$ 1995175 1445528 309635 -397707 -618397 -688632 -413060 286635 649390 147641
31425A47641n25362M94314R59315R82r64604m21025Q54999J079305J65469m93989
$$ 147641 -377721 116593 1075908 1076890 112286 -308739 546260 1625565 1791034 1297045
31415A297045l50923j19225j16366J52441O70443P07789K36790J16941M55970
$$ 1297045 946122 826897 710531 862972 1533415 2241204 2477994 2594935 3050905
31406C050905K50290p19244j158231l82108L25361j78686q13727j12132R69330
$$ 3050905 3301195 2581951 1423720 1041612 1366973 1188287 374560 262428 1231758
31397A231758L60776j561980k261338r14660N53610Q39290J056612K053517K416304
$$ 1231758 1592534 30554 -2230784 -3145444 -2591834 -1752544 -695932 1357585 3773889
31388C773889R35732r55836j329163p55968q93715j382009o91652P91763J183936
$$ 3773889 4709621 3753785 2424622 1668654 774939 -607070 -1298722 -506959 676977
31379F76977K16849n51635m49510j98283J38069J136029J918170Q59471j255740
$$ 676977 893826 342191 -107319 -305602 -167533 968496 2886666 3746137 2490397
31370B490397j684108l2155R01582k84970j301894k17405J205350O63092p53584
$$ 2490397 806289 774134 1675716 1390746 88852 -128553 1076797 1739889 986305
31361I86305o92975L66710L07797p40425r04515p2011K18120j21644K47407J164075
$$ 986305 293330 660040 967837 227412 -677103 -749114 -530994 -652638 -405231 758844
31351G58844R98314k85588q73995k31763J61410l24791m82527J46929K49966o64997
$$ 758844 1757158 1471570 597575 365812 527222 202431 -280096 -133167 116799 -548198
31341e48198j021168J45735J321000Q56131m90409r14713j52010P47466J149805
$$ -548198 -1569366 -1423631 -102631 753500 263091 -651622 -803632 -56166 1093639
31332A093639J049582M73379k15456k74106K56249L10075m82333j017591n62322
$$ 1093639 2143221 2616600 2401144 2127038 2383287 2693362 2211029 1193438 631116
31323F31116k4734k31128l25396N97192J483703P96574q35486j389591m59065
$$ 631116 606382 375254 49858 647050 2130753 2927327 2091841 702250 243185
31314B43185L82637J38971m37630m42860n9183K42682M95968O87392M12975k95530
$$ 243185 625822 764793 327163 -115697 -174880 67802 563770 1251162 1664137 1368607
31304A368607n56113K49089J368336J372221q5962j672757j781569l78264R37523
$$ 1368607 812494 1061583 2429919 3802140 3716178 2043421 261852 -116412 821111
31295H21111Q46752j92781q44622p80468p23429q79056o28584N6561K97341o8704
$$ 821111 1667863 1475082 630460 -150008 -873437 -1752493 -2381077 -2324516 -2027175 -2095879
31285b095879O3532J136298J774255P86800p57738r39495K67026J188344R30438
$$ -2095879 -2032347 -896049 878206 1665006 907268 -32227 234799 1423143 2353581
31276B353581J40269m58129p81516o83759N910N81962j7852j435234j902677n92499
$$ 2353581 2493850 2035721 1254205 570446 576356 1158318 1140466 -294768 -2197445 -2789944
31266b789944J125907J496903O01645p0196K64046Q78010P35219j85419r60136
$$ -2789944 -1664037 -167134 434511 364315 628361 1506371 2241590 2056171 1096035
31257A096035q41879q1639M43757L39816J29378L95076Q19726N67150m59182j277403
$$ 1096035 254156 172517 616274 956090 1085468 1480544 2300270 2867420 2408238 1130835
31247A130835r79394R5844P25255L41360j90790K45176J250071J173225m85423
$$ 1130835 151441 247285 972540 1313900 1123110 1368286 2618357 3791582 3306159
31238C306159j910777j266085N51110J022649l27935j261678k38666J357215J436041
$$ 3306159 1395382 129297 680407 1703056 1375121 113443 -125223 1231992 2668033
31229B668033J08326r78894j061804n82161L2920M84999J98827p97261j198853
$$ 2668033 2776359 1797465 735661 153500 186420 671419 870246 72985 -1125868
31220a125868n2455J492221J552040K01603p67607m96617J50053L67800L86347
$$ -1125868 -1178323 313898 1865938 2067541 1299934 803317 953370 1321170 1707517
31211A707517M84354M30495J80864j4915l25869j034463j535533r18032M09276
$$ 1707517 2191871 2622366 2803230 2788315 2462446 1427983 -107550 -1025582 -616306
31202f16306J031604N99471J82795L44918L68125j77946n87330l82668j84321
$$ -616306 415298 1014769 1197564 1542482 1910607 1732661 1145331 762663 578342
31193E78342m58318o02791j11955M27597L83059J68907L83247O59576L11457m89963
$$ 578342 120024 -482767 -594722 -167125 215934 384841 768088 1427664 1739121 1249158
31183A249158j012851r51723m65455K50725Q52890Q68840L77274P6461J87158
$$ 1249158 236307 -715416 -1180871 -930146 -77256 791584 1168858 1245319 1432477
31174A432477L6580o46308q76170J95542J656445J735218J18854j609572j884119
$$ 1432477 1469057 822749 -53421 142121 1798566 3533784 3652638 2043066 158947
31165A58947p68173M73632Q65217N34887K67100M38647N51617l773r14648j175910
$$ 158947 -609226 -135594 729623 1264510 1531610 1970257 2521874 2518101 1603453 427543
31155D27543l91315O76251J012141L82088o39274j238809r26865M284O11240L78054
$$ 427543 36228 712479 1724620 2106708 1467434 228625 -698240 -693956 -82716 295338
31145B95338m1510J51181M76154j11389j239180j285461J97883J646038J634440
$$ 295338 253828 405009 881163 769774 -469406 -1754867 -1556984 89054 1723494
31136A723494O00519k57816n78416n43699j76744J77750k03867j063233r33419
$$ 1723494 2324013 2066197 1487781 944082 767338 945088 741221 -322012 -1255431
31127a255431O27545J821773J024475p28614j321112o51115k36758m48577l00194
$$ -1255431 -627886 1193887 2218362 1489748 168636 -482479 -719237 -1167814 -1468008
31118a468008K91065K73060l55404k55755Q47261J434368O53325k50335L118P48368
$$ -1468008 -1176943 -903883 -1259287 -1515042 -667781 766587 1419912 1169577 1172695 1921063
31108A921063O68541j67467q35012j094656j092845m43314R08257J617174M31659
$$ 1921063 2589604 2422137 1587125 492469 -600376 -1043690 -135433 1481741 1913400
31099A913400j578750k024166m70851R74632P46882j59203r5027P29357R28687
$$ 1913400 334650 -1689516 -2160367 -1185735 -438853 -598056 -693083 36274 964961
31090I64961K29292l69697l17451m9429J04612L34808N64718L51724j94890m14286
$$ 964961 1194253 824556 507105 457676 562288 897096 1461814 1813538 1618648 1204362
31080A204362k73661m53890q87219n03093Q24164J420085J65976j399292j043355
$$ 1204362 930701 476811 -410408 -913501 -89337 1330748 1496724 97432 -945923
31071i45923P60023J387522p3241j574725j235959J42614P21211L11554N7316
$$ -945923 -185900 1201622 1128381 -446344 -1682303 -1539689 -818478 -506924 -449608
31062d49608L65451O07030M55467K42086Q2962k95215p89289q36505k91134K61201
$$ -449608 -84157 522873 978340 1220426 1303388 1008173 218884 -617621 -908755 -647554
31052f47554L14797J00108J29171L68419K43035m80048j095068o66639N79376
$$ -647554 -332757 -232649 -103478 264941 507976 27928 -1067140 -1733779 -1154403
31043a154403J159510J79327j208142j135085L95095J447469Q50025l24717n33596
$$ -1154403 5107 184434 -1023708 -2158793 -1763698 -316229 533796 209079 -324517
31034c24517J68459P28096P88858O70228L47825l33423q42259n36791J58762K45522
$$ -324517 -156058 572038 1360896 2031124 2378949 2045526 1203267 666476 825238 1070760
31024A070760l06827n68558j50952L70961N79318O52699N12912k92926j422899
$$ 1070760 763933 195375 44423 415384 994702 1647401 2160313 1867387 444488
31015D44488j580842k66546J218802J426363P19117M98841R31242P58437n52891
$$ 444488 -1136354 -1402900 -184098 1242265 1961382 2460223 3391465 4149902 3597011
31006C597011j735155j396870O2756J017339O47598l77925j056128j093806p31791
$$ 3597011 1861856 464986 527742 1545081 2192679 1814754 758626 -335180 -1066971
30997a066971k03123L34340O93885P17840L02384n05501j145902p02232Q14480
$$ -1066971 -1270094 -935754 -241869 475971 778355 272854 -873048 -1575280 -760800
30988g60800J720768M90407j698350j924317M18621K364406J407130r43474j551329
$$ -760800 959968 1450375 -247975 -2172292 -1753671 610735 2017865 1074391 -476938
30979d76938k32304N67999l5905l57686N33030J216325N33782m98137o21247l27004
$$ -476938 -709242 -141243 -177148 -534834 -1804 1214521 1748303 1250166 628919 301915
30969C01915n27182p34363o1492J046346J460860R74387J58066o32444j170962
$$ 301915 -225267 -959630 -1021122 25224 1486084 2460471 2618537 1986093 815131
30960H15131j068417m29966j9050p4343O2830N16322L89340m36209n53535O54506
$$ 815131 -253286 -683252 -702302 -776645 -713815 -197493 191847 -244362 -797897 -143391
30950a43391J478346L40016j497099j655176j68777Q01065K63937o11868o50454
$$ -143391 1334955 1674971 177872 -1477304 -1646081 -845016 -581079 -1192947 -1843401
30941a843401l0355N55180O99072K70678k80101L8246J278638J770728K67834
$$ -1843401 -1873756 -1318576 -619504 -348826 -628927 -590681 687957 2458685 2726519
30932B726519j795776j956880j69078J281343J041832l1943p74334r75519o45579
$$ 2726519 930743 -1026137 -1195215 86128 1127960 1096017 321683 -653836 -1299415
30923a299415K13835R09702O80254K8963p9150l7921p39809j302710j06228J947059
$$ -1299415 -1085580 -175878 504376 533339 454189 416268 -323541 -1626251 -1732479 214580
30913B14580K034189j76491j605082l82817J362267J035580n30495q98615Q6359
$$ 214580 2248769 2072278 467196 84379 1446646 2482226 1951731 1053116 1139475
30904A139475O35504J06138n10108o01558n36577n32123l95073j89534r4276O4260
$$ 1139475 1774979 1881117 1371009 769451 232874 -299249 -694322 -883856 -978132 -913872
30894i13872L34291L01312l8607N7917P17929Q24124k09256j176455q71772j6561
$$ -913872 -579581 -278269 -316876 -258959 458970 1283094 1073838 -102617 -974389 -990950
30884i90950J06461j25096L85841J161972Q69303j60605l01815N46428O61876
$$ -990950 -884489 -1009585 -623744 538228 1407531 1246926 945111 1491539 2153415
30875B153415o19858j699395j154183K16265P79510L28309j17980k1616J76828
$$ 2153415 1533557 -165838 -1320021 -1103756 -324246 4063 -113917 -135533 41295
30866D1295k9331n21731p58022l90820K65584M58640l6636l78438L64886J790526
$$ 41295 11964 -509767 -1267789 -1658609 -1393025 -934385 -971021 -1349459 -984573 805953
30856H05953K384421J286782p02931k009635j729609j84034J426331J826331O79594
$$ 805953 3190374 4477156 3774225 1764590 34981 -149053 1277278 3103609 3783203
30847C783203r66609j609043q16703M38914R73429N16723l66966j001070j046269
$$ 3783203 2816594 1207551 390848 829762 1803191 2319914 1952948 951878 -94391
30838i4391n98344j05989j3440l07819n28684l21192J30021L21569L8821l65599
$$ -94391 -692735 -798724 -812164 -1119983 -1648667 -1969859 -1839838 -1518269 -1479448 -1845047
30828a845047l74502O3242M86211N30702K92215l8211m28713n82863R5563J423614
$$ -1845047 -2219549 -2156307 -1670096 -1139394 -847179 -885390 -1314103 -1896966 -1801403 -377789
30818c77789J962733P23250j084734j392191j76679O04336R0331l61298K74694
$$ -377789 1584944 2308194 1223460 -168731 -345410 258926 349257 -12041 262653
30809B62653R58103N35377k77907l34706m9868l09145o09871j15387M44591q3359
$$ 262653 1220756 1756133 1478226 1143520 1093652 784507 174636 59249 503840 420481
30799D20481r86188o28903P77761J445533P98951m1431m14825o63300n65760N05867
$$ 420481 -565707 -1194610 -416849 1028684 1827635 1786204 1371379 708079 142319 648186
30789F48186J650141J040779r54368j654055l2992J513739P89990r26164j100969
$$ 648186 2298327 3339106 2384738 730683 697691 2211430 3001420 2075256 974287
30780I74287K21825R83988M47597k52625m12896n65767r60389r34703j71432O24321
$$ 974287 1196112 2180100 2627697 2375072 1962176 1396409 436020 -498683 -670115 -45794
30770d5794P37826L52185R9771J96776K71780j15446p93047q99008Q8873J301641
$$ -45794 692032 1044217 1143988 1340764 1612544 1497098 704051 -194957 -106084 1195557
30760A195557J267880o6077j103476q11175o8286j09592p24223r67014o91084
$$ 1195557 2463437 2397360 1293884 482709 414423 304831 -419392 -1386406 -2077490
30751b077490k74570L09806R81656R56953k8758o96820J03530J393320J360830
$$ -2077490 -2352060 -2042254 -1060598 -103645 -132403 -829223 -725693 667627 2028457
30742B028457J03152p06554n04435k55523l32878k5091O39958N84523l10938p27489
$$ 2028457 2131609 1425055 920620 665097 332219 307128 947086 1531609 1220671 493182
30732D93182p7425N52883L38435p7541j20729l52360j009779j107569j84577N52893
$$ 493182 415757 968640 1307075 1229534 1108805 756445 -253334 -1360903 -1545480 -992587
30722i92587J54236m07555N6261Q68233P26588p7364l78002j50357j31143k67014
$$ -992587 -838351 -1245906 -1189645 -321412 405176 327812 -50190 -200547 -331690 -598704
30712e98704j93151l71267j017139r21443O12184J723108M47816j625356j254448
$$ -598704 -791855 -1163122 -2180261 -3101704 -2489520 -766412 -318596 -1943952 -3198400
30703c198400J229686K112049J46742j468202l38131J400414Q85566q33415r19293
$$ -3198400 -1968714 143335 290077 -1178125 -1516256 -115842 769724 -63691 -982984
30694i82984N28917J092682K12491l78011N6188L42506j80087p18908p39339n91015
$$ -982984 -454067 638615 851106 473095 529283 871789 691702 -27206 -766545 -1357560
30684a357560k11454Q63272J915944J402470o01941k047135j612406k22405P06108
$$ -1357560 -1569014 -705742 1210202 2612672 2010731 -36404 -1648810 -1871215 -1165107
30675a165107R59304P93228J04937p34916o50601M80209J194690N46197m10507
$$ -1165107 -205803 587425 692362 -42554 -693155 -212946 981744 1527941 1117434
30666A117434m46202j90393p61550j448634p42673Q94776J423237L53121n67834
$$ 1117434 671232 480839 -280711 -1729345 -2472018 -1577242 -154005 199116 -368718
30657c68718k06140L69384K4006m75325j4440O92336K61839q16882p98854L69896
$$ -368718 -574858 -205474 -181468 -656793 -671233 21103 282942 -533940 -1332794 -962898
30647i62898Q15570j41042p03890M30730J662420Q94282r29134j081154O60080
$$ -962898 -147328 -288370 -992260 -561530 1100890 1995172 1066038 -15116 644964
30638F44964J607678L47568j260532j285090n31972m66704m15877P75917J798797
$$ 644964 2252642 2600210 1339678 54588 -477384 -944088 -1359965 -584048 1214749
30629A214749N40115j905728k021939R36826L376277K178339j172094k930512
$$ 1214749 1754864 -150864 -2172803 -1235977 2140300 4318639 3146545 216033
30621B16033j944570k41956L36559J23669K74808R24820J257926P80998j679k19858
$$ 216033 -1728537 -1970493 -1633934 -1510265 -1235457 -310637 947289 1728287 1726608 1506750
30611A506750K05691M13530j14282o54559l80318J03280m06167j537502j558640
$$ 1506750 1712441 2125971 2011689 1357130 976812 1080092 673925 -863577 -2422217
30602b422217j9379J397456J305586M24451O2159J54613q339k48293o4708J10683
$$ -2422217 -2441596 -1044140 261446 685897 748056 902669 894330 646037 581329 692012
30592F92012l49178q61335l87870P29617J049397J01645r55354q83429K48467
$$ 692012 342834 -518501 -906371 -176754 872643 974288 18934 -864495 -616028
30583f16028J347111J433079N17624l47254j82783N43230L34125j147419k249104
$$ -616028 731083 2164162 2681786 2334532 2151749 2694979 3029104 1881685 -367419
30574c67419j473457M19732J481983J046336L6090n95485n93981o5638M89309
$$ -367419 -1840876 -1421144 60839 1107175 1143265 547780 -46201 -111839 377470
30565C77470K79294o20302q67555K26193J205545M46214j120498j203116L26347
$$ 377470 656764 36462 -831093 -604900 600645 1046859 -73639 -1276755 -950408
30556i50408J268604N11322n67486n95864r0617n667j18133J02582L76282L62261
$$ -950408 318196 829518 262032 -333832 -424449 -430116 -548249 -445667 -69385 292876
30546B92876L85929N40836J93295p30426j095807k16271Q54734P87275j19569
$$ 292876 678805 1219641 1412936 682510 -413297 -629568 225166 1012441 892872
30537H92872o06494l11304J45258L34365K13646l31026j092997j173871r3029
$$ 892872 286378 -24926 120332 454697 668343 337317 -755680 -1929551 -2022580
30528b022580J116122J045110j04991q10751l85294L00172L50096Q63j13122L8826
$$ -2022580 -906458 138652 33661 -777090 -1162384 -862212 -512116 -511253 -624375 -585549
30518e85549J30690J18045J01756m9170m27924o52799j91281Q51801J631460J445826
$$ -585549 -454859 -336814 -235058 -284228 -712152 -1364951 -1556232 -704431 927029 2372855
30508B372855N44152k08746l95686l79018m84867m21239M1354L31639j68059q99573
$$ 2372855 2917007 2708261 2312575 1933557 1448690 1027451 1068805 1400444 1232385 332812
30498C32812o74983N11478J278916P86559j67293n25890m56682o06816p23788
$$ 332812 -342171 169307 1448223 2234782 2067489 1541599 1084917 478101 -245687
30489b45687j86448N59889M02746o11940j053673j03257J153586J124342j21744
$$ -245687 -432135 127754 530500 -81440 -1135113 -1238370 -84784 1039558 917814
30480I17814r26176k58459R16842R82308q2221o92854q914P51130J13968j328590
$$ 917814 -8362 -266821 650021 1632329 1550108 857254 848340 1599470 1713438 384848
30470C84848j684979n19656O58874P97186O02995Q48613Q91218O991r66505p31192
$$ 384848 -1300131 -1819787 -1160913 -363727 239268 1087881 1979099 1986090 1019585 288393
30460B88393M13439R62830K73745r14041j681966j606555o36630O08751Q79247
$$ 288393 701832 1664662 1938407 1024366 -657600 -2264155 -2900785 -2292034 -1412787
30451a412787j63753r70197j17747J243831Q74137r03355j392040K78384J678528
$$ -1412787 -1576540 -2546737 -2664484 -1420653 -546516 -1449871 -2841911 -2563527 -884999
30442h84999R17392m33642j05250J125253R22074n78439j001362L23157J321046
$$ -884999 32393 -401249 -506499 618754 1540828 962389 -38973 284184 1605230
30433A605230N16138q59404j020101j12583O23061Q44585R60033Q76211K12692
$$ 1605230 2121368 1261964 241863 129280 752341 1596926 2556959 3433170 3645862
30424C645862o42385p91805p0237O90928O14726l98152j626765k063097j313135
$$ 3645862 3003477 2211672 2141435 2832363 3447089 3048937 1422172 -640925 -1954060
30415a954060j46529L22186R3487J50312O87090O37062l97773j014228j48J538506
$$ -1954060 -2100589 -1778403 -1684916 -1534604 -847514 -210452 -608225 -1622453 -1622601 -84095
30405h4095J574384P5927j087507q37069J43696R85575J482815J285756O068j495017
$$ -84095 1490289 1566216 478709 -358360 -214664 770911 2253726 3539482 3545550 2050533
30395B050533j603004k90225O38939K47494l26561j92392l08300j386180j989740
$$ 2050533 447529 157304 796243 1043737 717176 524784 216484 -1169696 -3159436
30386c159436o63317J351458J714306M88116j89419M69475J035835M57543n29371
$$ -3159436 -3822753 -2471295 -756989 -268873 -458292 11183 1047018 1504561 975190
30377I75190r48137p99686k93393N68866J176405O13478o54168r07958K84802
$$ 975190 27053 -772633 -1066026 -497160 679245 1292723 638555 -269403 15399
30368A5399J147700K94100j102368j034864M24954J386720P91664n36720j335170
$$ 15399 1163099 1457199 354831 -680033 -255079 1131641 1923305 1386585 51415
30359E1415j281830q32716m62117k79221j7041O37376J510384J941271J548826
$$ 51415 -1230415 -2063131 -2525248 -2804469 -2821510 -2184134 -673750 1267521 2816347
30350B816347P25193J07656j46992l13344o38626j149719j574039j317725l4120
$$ 2816347 3541540 3649196 3502204 3188860 2550234 1400515 -173524 -1491249 -1525369
30341a525369J572144K126268J142572l58915j165053j141994p37728n0197P64461
$$ -1525369 46775 2173043 3315615 2956700 1791647 649653 -88075 -138272 626189
30332F26189Q69055k57062j518275j236502M10164J282923J44271j507534j424456
$$ 626189 1495244 1238182 -280093 -1516595 -1106431 176492 320763 -1186771 -2611227
30323b611227L24792J547325R83425j92987l43138L70910O64260K68280K6892
$$ -2611227 -2286435 -739110 244315 51328 -291810 79100 743360 1011640 1038532
30314A038532J17913k89989j284175j573467m31187R22974J013266K52089O4057
$$ 1038532 1156445 866456 -417719 -1991186 -2422373 -1499399 -486133 -234044 -169987
30305a69987N65330O64980J14287k03685l2676j72314q32576j038868k39370P39202
$$ -169987 395343 1060323 1174610 970925 938249 765935 -66641 -1105509 -1344879 -605677
30295f05677R71296O05351J70633k60599n96174l94617L12087P58170O27681N65096
$$ -605677 365619 970970 1141603 881004 284830 -109787 202300 960470 1588151 2153247
30285B153247Q66832P18020m04021j546393j547567p16828j86424k18073k12862
$$ 2153247 3020079 3738099 3334078 1787685 240118 -476710 -663134 -881207 -1094069
30276a094069R0345M38827P09028Q59810O38807R5410j22945K51484M68526n1120
$$ -1094069 -1003724 -564897 144131 1003941 1642748 1738158 1615213 1866697 2335223 2284103
30266B284103o41322n42925l12874p38953j091225j82517J237840J143696n84218
$$ 2284103 1642781 1099856 786982 48029 -1043196 -1225713 12127 1155823 571605
30257E71605j605422m22535J461906J768048N21681m40542k69852P0799l38853
$$ 571605 -1033817 -1456352 5554 1773602 2295283 1854741 1584889 1655688 1316835
30248A316835r68419p51230K97210J042776O80041l42039j051176j153224r76917
$$ 1316835 348416 -402814 -105604 937172 1617213 1275174 223998 -929226 -1906143
30239a906143n48279L45484J121386O32276r50200j631785j05121K089697K372255
$$ -1906143 -2454422 -2108938 -987552 -355276 -1305476 -2937261 -3042382 -952685 1419570
30230A419570O09739q42136n06328N30989P02647J32835j17806K11229N68912
$$ 1419570 2029309 1187173 680845 1211834 1914481 2047316 1929510 2140739 2709651
30221B709651N04970j99245j515900k541690j848955N00634K218099J443749n66640
$$ 2709651 3214621 3015376 1499476 -1042214 -2891169 -2390535 -172436 1271313 704673
30212G04673j096074J16182O85006n23546j601320p49395Q14878Q91745k11994
$$ 704673 -391401 -275219 409787 -113759 -1715079 -2464474 -1649596 -757851 -969845
30203i69845m53022M91029R59093L29129j38897J54629J37062n92873p00735L61029
$$ -969845 -1422867 -931838 27255 356384 217487 372116 509178 -83695 -784430 -423401
30193d23401R48512J0339p85362J53630J295303M15673j418270j470048L1621
$$ -423401 525111 535450 -249912 -96282 1199021 1614694 196424 -1273624 -1242003
30184a242003M15936o35760o33798J004752J689675K94487o78017N05097J632012
$$ -1242003 -826067 -1461827 -2095625 -1090873 598802 893289 215272 720369 2352381
30175B352381L53403j683297j572257J38479P46839r1373m39821K28108N48178
$$ 2352381 2705784 1022487 -549770 -411291 335548 244175 -195646 32462 580640
30166E80640P3176k29188j20576k68174m41309J29240P84909K15085r34025p26117
$$ 580640 653816 424628 304052 35878 -405431 -276191 508718 723803 -210222 -936339
30156i36339P23717J164491j45147j259857p52313K87968M87243K74968M62972
$$ -936339 -212622 951869 806722 -453135 -1205448 -917480 -430237 -155269 307703
30147C07703N56690o4893o78746l62570M10208N98237K24677L7554J38985K858
$$ 307703 864393 799500 120754 -241816 168392 766629 991306 1028860 1167845 1170703
30137A170703m63150o91008k11476P54844J403057J047129m8428p99764o67733
$$ 1170703 707553 16545 -194931 559913 1962970 3010099 2961671 2161907 1494174
30128A494174l74408o02492p51670j17388M82376j06246j107039p42774P25006
$$ 1494174 1119766 517274 -234396 -351784 130592 24346 -1082693 -1825467 -1100461
30119a100461J107195k33273j246204l63449J205969J537366O92947j0794j64407
$$ -1100461 6734 -226539 -1472743 -1836192 -630223 907143 1600090 1589296 1424889
30110A424889k58493l73635j99538J15247J31062j73388m83929n88241l72423
$$ 1424889 1166396 792761 593223 708470 839532 666144 182215 -406026 -778449
30101g78449J31472M93515K95897j34716j67896J0600k73870p90158n84292L50182
$$ -778449 -646977 -153462 142435 7719 -160177 -149577 -423447 -1213605 -1797897 -1447715
30091a447715R26667O82960K64961k557n00550r84495n42636O35945J134266N29371
$$ -1447715 -521048 161912 426873 424316 -76234 -1060729 -1603365 -967420 166846 696217
30081F96217L9741L34606N40633J97076K00526P67799N36420r27874j774390p59863
$$ 696217 735958 1070564 1611197 1808273 2008799 2776598 3313018 2385144 610754 -149109
30071a49109M05582k70935j660411j273166O52223J479315K10381j246806j033957
$$ -149109 256473 -14462 -1674873 -2948039 -2295816 -816501 -606120 -1852926 -2886883
30062b886883L83620J374965J202694M05046r2705M7299K06208l47754j136760
$$ -2886883 -2503263 -1128298 74396 479442 386737 434036 640244 292490 -844270
30053h44270q65400N02329J304047N80681m29752l01973M13719M57333N7843J55449
$$ -844270 -1709670 -1207341 96706 677387 247635 -54338 359381 816714 874557 1030006
30043A030006M04355j58376j080142j002452J13203R44191Q14250K78272j26882
$$ 1030006 1434361 1275985 195843 -806609 -693406 250785 1065035 1343307 1216425
30034A216425l79490l85807p9060J17284o5154q4414M01673N62637l29167j381186
$$ 1216425 836935 451128 372068 489352 424198 339784 741457 1304094 974927 -406259
30024d06259j273642l18365K01971J47017L26957P03086N22112o5161k00315R0264
$$ -406259 -1679901 -1998266 -1796295 -1649278 -1322321 -619235 -97123 -162284 -362599 -272335
30014b72335P5421j73653k6917K69232L3136l12070J25358Q45453N91416l89837
$$ -272335 -196914 -370567 -397484 -128252 -95116 -407186 -281828 563625 1155041 765204
30004G65204o67098m3429L78211M16081Q37446J135771j57722k445826k975461
$$ 765204 98106 54677 432888 848969 1686415 2822186 2664464 218638 -2756823
29995b756823q30288J364878J163353l58073p16948K44768Q37890N84876N54214
$$ -2756823 -3587111 -2222233 -1058880 -1416953 -2133901 -1889133 -1051243 -466367 87847
29986H7847J030972R03490l30351j484488j316099k88097J88768j36795n9201
$$ 87847 1118819 2022309 1691958 207470 -1108629 -1396726 -1207958 -1344753 -1403954
29977a403954J009352J710672N91881j315254j512897K57231J395991L89794q18899
$$ -1403954 -394602 1316070 1907951 592697 -920200 -662969 733022 1122816 303917
29968C03917q5257J335301R30995p93272j197240R4269Q24021J2250q20456o60764
$$ 303917 218660 1553961 2484956 1691684 494444 588713 1412734 1424984 604528 -56236
$$ [...]
##END NTUPLES=NMR SPECTRUM
##END=
