##TITLE=31Pdec_LY-13Dix.3.B
 CD3CN, 24 sc
 3.06.2021
##JCAMPDX= 6.0         $$ Bruker NMR JCAMP-DX V2.0
##DATA TYPE= NMR SPECTRUM
##DATA CLASS= NTUPLES
##ORIGIN= UXNMR, Bruker Analytische Messtechnik GmbH
##OWNER= root
$$ XWIN-NMR		Version 3.5
$$ Thu Jun  3 10:45:35 2021 Russian Standard Time (UT+4h)  she@DPX200
##.OBSERVE FREQUENCY= 81.013821
##.OBSERVE NUCLEUS= ^31P
##.ACQUISITION MODE= SIMULTANEOUS
##.ACQUISITION SCHEME= undefined
##.AVERAGES= 24
##.DIGITISER RES= 16
##SPECTROMETER/DATA SYSTEM= spect
##.PULSE SEQUENCE= zgpg30
##.SOLVENT NAME= CD3CN
##.SHIFT REFERENCE= (INTERNAL, CD3CN, 0, 248.564)
##AUDIT TRAIL= $$ (NUMBER, WHEN, WHO, WHERE, WHAT)
$$ ##TITLE= Audit trail, XWIN-NMR		Version 3.5
$$ ##JCAMPDX= 5.01
$$ ##ORIGIN= Bruker BioSpin GmbH
$$ ##OWNER= she
$$ F:/spectra/data/she/nmr/P31/1/pdata/1/auditp.txt
$$ ##AUDIT TRAIL=  $$ (NUMBER, WHEN, WHO, WHERE, WHAT)
(   1,<2021-06-03 10:44:13.00 +0400>,<she>,<DPX200>,
      <created by zg, POWCHK disabled, PULCHK disabled
       configuration hash MD5:
       00 E9 B6 7A A2 85 ED C7 34 08 36 98 17 FE 4E 26
       data hash MD5: 32K
       1B A1 86 14 A1 90 85 E9 03 07 66 61 5B 0D 1F 7B>)
(   2,<2021-06-03 10:44:15.81 +0400>,<she>,<DPX200>,
      <Start of raw data processing
       efp BC_mod = 2 LB = 1 FT_mod = 6 PKNL = 1 PHC0 = -5252.207 PHC1 = -1165.73 SI = 64K 
       data hash MD5: 64K
       0D 42 81 EC 09 BD F5 A6 C6 BB 80 4D FB 72 18 60>)
(   3,<2021-06-03 10:44:52.39 +0400>,<she>,<DPX200>,
      <pk PHC0 = -710.7785 PHC1 = 1412.802 
       data hash MD5: 64K
       8A AA 10 8B 06 68 1F BC DB C7 B3 FA 1C 04 58 B9>)
(   4,<2021-06-03 10:44:56.50 +0400>,<she>,<DPX200>,
      <abs ABSG = 5 
       data hash MD5: 64K
       98 27 AD F6 B6 B8 18 48 F9 E1 2A 8C 54 10 02 15>)
$$ ##END=
$$ 
$$ hash MD5
$$ E5 93 7F 24 AC F8 9E D5 54 57 40 99 EF D2 93 BD
##$RELAX= 
##$RELAX= 
##$RELAX= 
##$RELAX= 
##$RELAX= 
##$RELAX= 
##$RELAX= 
##$RELAX= 
$$ Bruker specific parameters
$$ --------------------------
##$DU= <F:/spectra>
##$EXPNO= 1
##$NAME= <P31>
##$PROCNO= 1
##$TYPE= <nmr>
##$USER= <she>
##$AMP= (0..31)
100 100 100 100 100 100 100 100 100 100 100 100 100 100 100 100 100 100 
100 100 100 100 100 100 100 100 100 100 100 100 100 100 
##$AQSEQ= 0
##$AQ_mod= 1
##$AUNM= <au_zg>
##$AUTOPOS= <>
##$BF1= 81.014009
##$BF2= 200.13
##$BF3= 200.13
##$BF4= 200.13
##$BF5= 200.13
##$BF6= 200.13
##$BF7= 200.13
##$BF8= 200.13
##$BYTORDA= 1
##$CFDGTYP= 0
##$CFRGTYP= 5
##$CHEMSTR= <none>
##$CNST= (0..31)
1 1 145 1 1 1 1 1 1 1 1 1 1 1 1 1 1 1 1 1 1 1 1 1 1 1 1 1 1 1 1 1 
##$CPDPRG= <waltz16>
##$CPDPRG1= <>
##$CPDPRG2= <waltz16>
##$CPDPRG3= <>
##$CPDPRG4= <mlev>
##$CPDPRG5= <mlev>
##$CPDPRG6= <mlev>
##$CPDPRG7= <mlev>
##$CPDPRG8= <mlev>
##$CPDPRGB= <>
##$CPDPRGT= <>
##$D= (0..31)
0 1 0 0 0 0 0 0 0 0 0 0.03 2e-05 3e-06 0 0 0 0 0 0 0 0 0 0 0 0 0 0 0 0 
0 0 
##$DATE= 1622702652
##$DBL= (0..7)
120 120 120 11 120 120 24 19 
##$DBP= (0..7)
150 150 150 150 150 150 150 150 
##$DBP07= 0
##$DBPNAM0= <>
##$DBPNAM1= <>
$$ [...]
##$SUBNAM3= <"">
##$SUBNAM4= <"">
##$SUBNAM5= <"">
##$SUBNAM6= <"">
##$SUBNAM7= <"">
##$SUBNAM8= <"">
##$SUBNAM9= <"">
##$SW= 501.771253377433
##$SWIBOX= (0..15)
0 1 3 0 0 0 0 0 0 0 0 0 0 0 0 0 
##$SW_h= 40650.406504065
##$TD= 32768
##$TD0= 1
##$TE= 0
##$TE2= 300
##$TE3= 300
##$TEG= 300
##$TL= (0..7)
0 120 53 12 22 120 120 120 
##$TP= (0..7)
150 150 150 150 150 150 150 150 
##$TP07= 0
##$TPNAME0= <>
##$TPNAME1= <>
##$TPNAME2= <>
##$TPNAME3= <>
##$TPNAME4= <>
##$TPNAME5= <>
##$TPNAME6= <>
##$TPNAME7= <>
##$TPOAL= (0..7)
0.5 0.5 0.5 0.5 0.5 0.5 0.5 0.5 
##$TPOFFS= (0..7)
0 0 0 0 0 0 0 0 
##$TUNHIN= 0
##$TUNHOUT= 0
##$TUNXOUT= 0
##$USERA1= <user>
##$USERA2= <user>
##$USERA3= <user>
##$USERA4= <user>
##$USERA5= <user>
##$V9= 5
##$VALIST= <valist>
##$VCLIST= <CCCCCCCCCCCCCCC>
##$VD= 0
##$VDLIST= <DDDDDDDDDDDDDDD>
##$VPLIST= <PPPPPPPPPPPPPPP>
##$VTLIST= <TTTTTTTTTTTTTTT>
##$WBST= 1024
##$WBSW= 4
##$XGAIN= (0..3)
0 0 0 0 
##$XL= 0
##$YL= 0
##$YMAX_a= 8332
##$YMIN_a= -12705
##$ZGOPTNS= <>
##$ZL1= 120
##$ZL2= 120
##$ZL3= 120
##$ZL4= 120
##$ABSF1= 248.5645
##$ABSF2= -253.2056
##$ABSG= 5
##$ABSL= 3
##$ALPHA= 0
##$AQORDER= 0
##$ASSFAC= 0
##$ASSFACI= 0
##$ASSFACX= 0
##$ASSWID= 0
##$AUNMP= <proc_1d>
##$AZFE= 0.1
##$AZFW= 0.5
##$BCFW= 0
##$BC_mod= 2
##$BYTORDP= 0
##$COROFFS= 0
##$CY= -3
##$DATMOD= 1
##$DC= 0
##$DFILT= <>
##$DTYPP= 0
##$F1P= 0
##$F2P= 0
##$FCOR= 1
##$FTSIZE= 65536
##$FT_mod= 6
##$GAMMA= 0
##$GB= 0
##$INTBC= 1
##$INTSCL= 5.30512e-09
##$ISEN= 30
##$LB= 1
##$LEV0= 0
##$LPBIN= 0
##$MAXI= 10000
##$MC2= 0
##$MEAN= 0
##$ME_mod= 0
##$MI= 50
##$NCOEF= 0
##$NC_proc= -4
##$NLEV= 6
##$NOISF1= 182.463
##$NOISF2= 159.3651
##$NSP= 0
##$NTH_PI= 0
##$NZP= 0
##$OFFSET= 248.5645
##$PC= 4
##$PHC0= -5962.985
##$PHC1= 247.072
##$PH_mod= 1
##$PKNL= yes
##$PPARMOD= 0
##$PSCAL= 0
##$PSIGN= 0
##$REVERSE= no
##$SF= 81.014009
##$SI= 65536
##$SIGF1= 159.3651
##$SIGF2= -187.1042
##$SINO= 113.3802
##$SIOLD= 16384
##$SREGLST= <1H.CDCl3>
##$SSB= 0
##$STSI= 65536
##$STSR= 0
##$SW_p= 40650.406504065
##$SYMM= 0
##$S_DEV= 0
##$TDeff= 32768
##$TDoff= 0
##$TI= <>
##$TILT= no
##$TM1= 0
##$TM2= 0
##$TOPLEV= 0
##$USERP1= <user>
##$USERP2= <user>
##$USERP3= <user>
##$USERP4= <user>
##$USERP5= <user>
##$WDW= 1
##$XDIM= 65536
##$YMAX_p= 404646462
##$YMIN_p= -44257325
$$ End of Bruker specific parameters
$$ ---------------------------------
##NTUPLES= NMR SPECTRUM
##VAR_NAME=  FREQUENCY,     SPECTRUM/REAL,   SPECTRUM/IMAG
##SYMBOL=    X,             R,               I
##VAR_TYPE=  INDEPENDENT,   DEPENDENT,       DEPENDENT
##VAR_FORM=  AFFN,          ASDF,            ASDF
##VAR_DIM=   65536,         65536,           65536
##UNITS=     HZ,            ARBITRARY UNITS, ARBITRARY UNITS
##FACTOR=    0.620285442955139, 1,           1
##FIRST=     20137.2065510759, 0,            0
##LAST=      -20513.1999529892, 0,           0
##MIN=       -20513.1999529892, -44257325,   0
##MAX=       20137.2065510759, 404646462,    0
$$ Real data points
##PAGE= N=1
##DATA TABLE= (X++(R..R)), XYDATA
$$ [...]
37807 -1063445 -1699823 -2137714 -1865562 -1077091 -337598 -109381 -506072 -1126740 -1270193
37798 -1270193 -692320 22450 213077 10099 -9394 218822 220048 -194724 -657335 -820886
37788 -820886 -741095 -614807 -502251 -379530 -216236 24979 319540 580619 795988 956028
37778 956028 819316 174617 -541652 -486668 405231 1108145 853634 153044 -162548 -262072
37768 -262072 -781159 -1483314 -1544883 -950006 -517741 -560115 -527525 -104924 281737 291351
37758 291351 182222 210745 210534 60378 -28077 56118 136382 170769 309913 401023 57418
37747 57418 -596840 -903409 -641314 -383027 -563384 -806244 -582378 -8568 464110 744476
37737 744476 1028485 1318917 1403439 1132144 500431 -308327 -829311 -623284 114852 597924
37727 597924 338374 -285834 -552326 -187088 549142 1254049 1625584 1546656 1157400 733609
37717 733609 422113 212941 89783 -28493 -364760 -967630 -1456514 -1467749 -1173347 -898204
37707 -898204 -492664 258940 859342 612446 -166412 -443234 -56805 28284 -675532 -1392390
37697 -1392390 -1370928 -955116 -737708 -555974 -103401 234021 25652 -313967 -152931 301540
37687 301540 410116 188524 172465 480963 778494 946213 1084565 1047543 646946 153034
37677 153034 -25928 6927 -118502 -355961 -395624 -295290 -354754 -531487 -552099 -425381
37667 -425381 -302818 -66818 363052 587401 247309 -255862 -252943 200404 534520 627512
37657 627512 755659 800846 434397 -10865 146335 712122 746660 120530 -110807 677134
37647 677134 1637378 1675047 989520 641149 1022864 1497445 1388135 759146 198406 139757
37637 139757 436026 528870 117029 -416795 -493235 -143161 84505 -32950 -165134 -76253
37627 -76253 101894 376144 997600 1754496 1818362 808083 -487881 -1036829 -859922 -791147
37617 -791147 -1155024 -1343746 -738189 472886 1548910 1938837 1629254 1011796 580294
37608 580294 621822 1038432 1476302 1681521 1708237 1744927 1790538 1633240 1205941 808968
37598 808968 776945 1005039 1084714 886824 665382 571000 516952 607713 1084907 1586008
37588 1586008 1186901 -262966 -1520320 -1442392 -550443 -167951 -461377 -490533 47083
37579 47083 437939 360374 350786 566905 347238 -488451 -1061733 -820639 -447330 -606508
37569 -606508 -775508 -271270 402244 337372 -259416 -473845 -203806 -148820 -498763 -705683
37559 -705683 -533383 -404101 -627407 -1033346 -1416592 -1697890 -1669725 -1209322 -675044 -471193
37549 -471193 -365910 62581 499283 285247 -359150 -500676 24654 314898 -136592 -667548
37539 -667548 -582083 -154581 104829 392639 1046057 1616202 1369279 425720 -350397 -460107
37529 -460107 -154350 172758 387449 443439 325627 206910 258295 300009 29912 -405560
37519 -405560 -486763 -27215 585760 953205 1084652 1109077 955804 584722 215920 -3787
37509 -3787 -314085 -912807 -1389683 -1125055 -277063 206029 -177095 -733540 -533773 240777
37499 240777 543792 -69378 -917719 -1249542 -1153832 -1079119 -992814 -551833 187494 757648
37489 757648 870445 626680 237256 -102583 -153895 169076 553641 552586 104990 -426975
37479 -426975 -681625 -545421 -107569 352607 445726 47197 -478147 -683974 -559040 -383191
37469 -383191 -263073 -152609 -147059 -357669 -647150 -874244 -1186406 -1621005 -1697035 -1020207
37459 -1020207 -71593 340574 275870 479987 1055919 1262536 782727 232700 93084 46668
37449 46668 -193665 -289890 -66519 -54846 -571171 -994008 -714232 -142507 39645 11346
37439 11346 284911 593221 338348 -228416 -346013 -34103 7207 -349626 -562514 -520919
37429 -520919 -658778 -908079 -648819 86394 440286 108212 -143836 202298 573967 395450
37419 395450 119669 408845 1000631 1204395 977130 716107 452178 54800 -157139 135692
37409 135692 465093 103100 -746682 -1107646 -578781 208993 543342 366000 -47162 -506623
37399 -506623 -810908 -744952 -400006 -119009 -817 166636 408833 428310 83532 -384468
37389 -384468 -706538 -797848 -580835 -58102 362460 147247 -580096 -1047676 -846103 -403840
37379 -403840 -190670 -50154 237259 305761 -226962 -925610 -1001803 -437906 48940 119645
37369 119645 205440 667272 1174197 1222131 869952 616058 737449 1024827 1119617 947811
37359 947811 766194 772760 753553 336358 -379483 -818745 -764781 -759135 -1236903 -1686774 -1357170
37348 -1357170 -529719 -218194 -621702 -816850 -227048 508521 594326 199332 -113933 -389158
37338 -389158 -899597 -1272371 -904795 -9598 626737 821074 1076096 1474337 1370098 443053
37328 443053 -659989 -1111879 -816574 -204776 404169 849363 919962 550307 47576 -204670
37318 -204670 -167542 -72305 -62324 -77593 26095 352059 826150 1147721 1067256 722829 454752
37307 454752 307555 71610 -159737 57451 820102 1532144 1516353 707583 -406068 -1212229
37297 -1212229 -1245156 -470758 500977 900873 659114 307280 -50791 -876448 -1971569
37288 -1971569 -2087655 -577069 1301495 1781560 843605 -29989 -64652 75452 -236191
37279 -236191 -641315 -687032 -621926 -773341 -935234 -927874 -1097227 -1677802 -2197052 -2091035
37269 -2091035 -1496035 -908486 -438479 75827 535846 704953 649715 589728 481293 171539
37259 171539 -186173 -267194 -17716 361175 741837 1075521 1202057 973389 510113 108732
37249 108732 -53309 -4476 97518 66384 -84422 -17803 478801 946933 714344 -9085
37239 -9085 -210775 447013 1013019 649963 -107769 -270063 91179 213614 54277 204593
37229 204593 632009 673461 285963 177557 511060 551784 -38007 -538446 -323076 155949
37219 155949 146698 -283398 -538867 -426346 -206090 -70466 -65609 -226226 -389509 -214898
37209 -214898 242761 373587 -167159 -879993 -1108591 -904146 -699786 -523942 -168291 145668
37199 145668 -32787 -610294 -989361 -885812 -616556 -575776 -860405 -1392974 -1977129 -2220053
37189 -2220053 -1815949 -973314 -248202 61705 84236 1024 -158898 -380559 -609524 -794001
37179 -794001 -759715 -241504 624054 1095573 637785 -214834 -398751 308645 1052928 1069962
37169 1069962 490332 -119976 -415400 -294912 135468 391169 -20179 -780692 -920870
37160 -920870 -160417 545094 328353 -309178 -272718 485873 972680 650533 74746 -72991
37150 -72991 148630 310639 291625 238974 224763 263382 433094 733697 1004324 1143966
37140 1143966 1212390 1192596 927564 473352 225330 425071 777424 865007 742073 746890
37130 746890 861634 706441 188095 -256701 -201227 284438 807531 1039602 817114 174599
37120 174599 -523802 -771485 -482288 -116487 -5019 132389 633754 1192157 1259728 950465
37110 950465 868533 1074940 966931 340300 -186889 -176957 -101794 -513575 -1060120 -1036381
37100 -1036381 -519124 -158419 -58100 292475 973924 1327382 893606 34781 -625758
37091 -625758 -867993 -748006 -304421 303291 743084 871360 848704 744208 419823 -14196
37081 -14196 -99412 323288 793551 892577 815224 898599 978725 702026 181221 -168063 -244329
37070 -244329 -244350 -214286 -101702 -110624 -488420 -1014277 -1186171 -921662 -635670 -594993 -608018
37059 -608018 -418353 -41572 365319 659295 688444 409624 62489 -55004 8239 -35156
37049 -35156 -217184 -266495 -72038 143514 164324 -2406 -268674 -513954 -495584 -69232
37039 -69232 470769 628234 319637 -95962 -389432 -628722 -757735 -541725 -81383 131546
37029 131546 -97970 -386821 -428878 -465772 -788350 -1204554 -1389758 -1409344 -1488628 -1550588
37019 -1550588 -1380080 -1032285 -739721 -604479 -633508 -820163 -960140 -732698 -237070 -38835
37009 -38835 -345138 -593982 -290396 252554 552469 788041 1233724 1354623 479064 -863660
36999 -863660 -1383649 -831174 -281711 -425324 -660813 -346539 59938 -145205 -668191 -707073
36989 -707073 -250835 -26962 -320501 -596422 -335020 310086 803098 815913 432523 -11588
36979 -11588 -236502 -250158 -214490 -76202 408494 1176838 1724434 1691627 1280876 850334
36969 850334 442804 30999 -161686 -43845 -26321 -447726 -873249 -616468 154399 534445
36959 534445 149871 -393125 -532450 -548861 -920071 -1399501 -1340606 -712319 -202097 -278947
36949 -278947 -610805 -599693 -196343 111917 27829 -159617 -28620 352249 535164 359585
36939 359585 164991 242030 391850 250490 -196340 -688419 -1074232 -1310436 -1245003 -767501
36929 -767501 -113805 299359 310631 31922 -441263 -988148 -1246234 -895548 -179487 284764
36919 284764 294683 270322 570369 979188 1036382 583290 -138104 -671740 -608334 1432
36909 1432 493332 284685 -262033 -238922 436629 762516 111817 -751506 -719332 135103
36899 135103 807878 776930 363445 -125610 -742854 -1303039 -1222560 -298594 836120 1368378
36889 1368378 1133378 598948 296671 434230 827178 1057627 879774 537617 470349 678780
36879 678780 678656 168493 -560095 -1026244 -1106308 -988227 -792644 -469883 5092 484974
36869 484974 701627 495740 81485 -29695 412743 1007899 1158681 827960 454496 186316
36859 186316 -243644 -777672 -811980 -77099 787680 1035001 780793 611986 557669 168348
36849 168348 -498536 -741178 -222800 496734 723129 454357 123517 -94527 -307383 -475126
36839 -475126 -401457 -112680 96332 44893 -130942 -216032 -182102 -130183 -81618 54921 321753
36828 321753 613798 816516 1002621 1336509 1715793 1708689 1085599 287055 7921 315144
36818 315144 584588 431362 231081 396300 587016 228162 -419655 -429232 477859 1436243
36808 1436243 1543720 953439 463572 401999 415849 169732 -248389 -588005 -692726 -455036
36798 -455036 144301 845708 1197435 951081 263830 -491096 -989966 -1097081 -922969 -713073
36788 -713073 -541333 -225639 288376 674755 658646 478087 482989 469214 6850 -653032
36778 -653032 -738739 -151601 265233 -22440 -450758 -327428 66588 44775 -301034 -298865
36768 -298865 182948 613600 692316 609885 421884 -110702 -925039 -1527737 -1653316 -1539557
36758 -1539557 -1391376 -1078646 -554428 -90779 127278 218319 211895 -121616 -796666 -1373520
36748 -1373520 -1490783 -1314928 -1194340 -1166685 -1069096 -865824 -618347 -356001 -156276 -113063
36738 -113063 -115242 15947 73030 -392515 -1260705 -1694046 -1185554 -340934 -157271 -822741
36728 -822741 -1679108 -2126134 -2101326 -1831617 -1554384 -1428889 -1423595 -1368210 -1276222 -1359913 -1528686
36717 -1528686 -1276356 -442747 294274 196182 -527364 -994090 -728271 17872 796108 1272227
36707 1272227 1185464 587145 39618 54791 425147 602193 549064 595351 622494 193150
36697 193150 -508112 -713987 -251828 117352 -112786 -395862 -46027 618810 710610 70052
36687 70052 -490444 -226840 677755 1383275 1283032 503295 -396665 -1048218 -1437902 -1545774
36677 -1545774 -1236697 -697753 -532591 -1002160 -1538231 -1522913 -1193823 -1141316 -1262150 -1032844
36667 -1032844 -559911 -387126 -395001 10844 606116 464383 -416825 -892659 -510906 -250865
36657 -250865 -729563 -1004218 -218564 721286 483790 -510775 -759387 -35905 442868 48846
36647 48846 -496629 -513339 -267573 -186509 -168364 -37131 68357 44786 -14602 -103384 -173815
36636 -173815 189532 1226276 2220211 2166339 1248599 690237 992441 1337079 1023400 447173
36626 447173 146765 -160131 -874732 -1584562 -1599865 -943122 -163137 430264 778968 718978
36616 718978 200043 -396846 -637217 -522372 -298749 -100023 -46735 -271573 -533235 -292855
36606 -292855 460693 992345 852147 550406 676623 938314 753258 270131 4763 -118786
36596 -118786 -494603 -908008 -803145 -315662 -120889 -295193 -236760 202381 394702 -23674
36586 -23674 -571847 -695691 -464477 -173065 145192 421291 290852 -392295 -1103499 -1128066
36576 -1128066 -351794 651732 1180709 973649 442373 357035 1011315 1741208 1673166 891762
36566 891762 302219 302633 294381 -248532 -924106 -1062882 -696007 -353973 -303988 -458371 -685773
36555 -685773 -772733 -429853 229174 589699 363138 82934 261576 547448 398584 109804
36545 109804 278967 608764 304139 -480308 -737019 -232945 118628 -193067 -506727 -292081
36535 -292081 -130024 -616909 -1221569 -1188935 -846590 -947621 -1273479 -1057634 -443162 -287075
36525 -287075 -650014 -730784 -382411 -436092 -1165940 -1588371 -896474 323973 996306 943189
36515 943189 680892 438360 126808 -153192 -269537 -396637 -624992 -608593 -170912 170966
36505 170966 -44416 -359551 -51928 680766 1025788 802059 517465 346075 9762 -353287
36495 -353287 -217553 284373 329562 -285906 -736251 -488794 -156113 -435890 -962373 -967811
36485 -967811 -552051 -487805 -1040954 -1693032 -1916826 -1660979 -1128857 -546065 -128009 82356
36475 82356 323367 792315 1282020 1391323 1045162 599316 455817 683885 968152 912772
36465 912772 497354 143072 130105 166025 -51173 -98108 606017 1561074 1472893 59066
36455 59066 -1352601 -1538491 -862364 -396799 -345710 -208277 77880 147164 36118 97489
36445 97489 278960 285406 268662 561771 895496 713171 178702 26521 386252 565560
36435 565560 137415 -461491 -612907 -244719 273413 520763 268456 -272172 -535944 -356946
36425 -356946 -373419 -1083000 -1811259 -1478234 -234639 634923 468272 -90122 -324361 -383181
36415 -383181 -614468 -818713 -671663 -286234 64993 299479 325681 19250 -376585 -377835
36405 -377835 15833 292773 260392 231110 231696 -161212 -897580 -1189951 -629674 134263
36395 134263 312017 -38047 -364759 -378331 -62462 462799 746197 339117 -356851 -367557
36385 -367557 354366 645961 -94330 -851598 -520958 422430 792246 494470 326826 490305
36375 490305 474340 162699 -25784 -16829 -200555 -692477 -1183920 -1454844 -1451226 -1052142
36365 -1052142 -341160 158981 102891 -160316 -247710 -427165 -946352 -1248304 -760955 16795
36355 16795 214957 -46079 -52700 153603 18036 -265522 -58765 336063 366 -905540
36345 -905540 -1210561 -644647 -233637 -477257 -591613 -77414 368204 221405 125237 644321
36335 644321 1158038 968281 527202 507758 499894 -204495 -1164153 -1330493 -653346 -34058
36325 -34058 90088 83160 155283 49227 -279251 -500202 -544317 -714438 -1041158 -1129724 -805573
36314 -805573 -405213 -237493 -141634 227219 899217 1479778 1446696 663251 -277376 -485997
36304 -485997 171367 758358 409121 -512002 -954033 -673299 -454845 -811577 -1222306 -990572
36294 -990572 -269195 265954 394993 459504 658047 792914 768691 860763 1250967 1619388
36284 1619388 1519746 996454 507873 308603 228001 59991 -149538 -276206 -298925 -233087
36274 -233087 -146160 -259752 -674793 -967604 -567792 319016 767036 398743 -48939 137802
36264 137802 639632 854964 940747 1211633 1137480 124276 -1092238 -1184496 -283910 77435
36254 77435 -754590 -1689608 -1711666 -1264689 -1154311 -1207701 -902032 -440973 -263841 -139227
36244 -139227 332721 799026 606761 -147028 -770252 -933335 -840875 -687770 -511658 -382213
36234 -382213 -286503 -69283 172802 23069 -571981 -1027440 -926204 -556891 -222182 299698
36224 299698 1008184 1153626 318795 -597142 -483112 353318 721595 370077 113745 288579
36214 288579 277652 -289625 -917762 -1107317 -980093 -747184 -307526 291743 634834 521437
36204 521437 271605 182313 133834 -46967 -273193 -459579 -701291 -999116 -1151644 -1074079
36194 -1074079 -922067 -810669 -703175 -599901 -517624 -303850 165302 634352 705564 392463
36184 392463 40914 -227044 -526798 -736002 -556552 -94229 141057 -82707 -466545 -660560
36174 -660560 -574870 -213623 315528 611126 329554 -208404 -308644 91276 277614 -182890
36164 -182890 -784229 -781726 -134779 563763 798410 501173 -64451 -553624 -768049 -722545
36154 -722545 -462721 15847 506298 555405 59538 -396732 -289960 40330 -41587 -373747
36144 -373747 -282189 173808 188298 -456857 -961250 -693898 -21351 381989 339046 -36864
36134 -36864 -632534 -1042730 -705695 212337 743575 441586 119259 640601 1557648 1715966
36124 1715966 854955 -152738 -500179 -239366 106583 242337 324933 691376 1352074
36115 1352074 1782289 1508159 878978 732106 1164991 1280922 469750 -691786 -1269028
36106 -1269028 -1126722 -738791 -377388 -99371 -91407 -381156 -554199 -348887 -161143 -365574
36096 -365574 -589641 -395411 -232562 -783707 -1667852 -1855601 -1276070 -899217 -1101754 -1084085
36086 -1084085 -317035 456929 340207 -372170 -751541 -617564 -517868 -619791 -503949 -75659
36076 -75659 100018 -341544 -911312 -878318 -241336 308622 273866 -158501 -495796 -476439
36066 -476439 -130439 405233 919394 1155210 1042448 805436 647730 456073 57161 -367619
36056 -367619 -466772 -270497 -183260 -377568 -549727 -398747 -49804 145157 1606 -401252
36046 -401252 -798798 -861164 -485013 -5854 153709 58635 147588 529840 818418 759821
36036 759821 593443 617854 791911 929028 913212 615521 39218 -364415 -95565 511549
36026 511549 460088 -560517 -1659997 -1957223 -1606480 -1135962 -527516 329670 941376
36017 941376 864288 581888 790464 1175006 889210 17154 -498609 -331950 -132743 -295972
36007 -295972 -366872 9859 380381 157550 -572675 -1275154 -1548921 -1276090 -657250 -261020
35997 -261020 -544146 -1178950 -1371176 -946290 -509597 -399181 -226613 236202 478785 86380
35987 86380 -456784 -416654 163885 668426 796347 695707 499973 280844 224961 333100
35977 333100 180568 -462713 -1002526 -683662 222127 633847 158860 -343951 2559 885632
35967 885632 1280005 751932 -201291 -909563 -1153211 -1074836 -885742 -767745 -812301 -936930
35957 -936930 -994761 -999828 -1087716 -1228884 -1177232 -785402 -202911 327233 694915 851112
35947 851112 737184 469334 379677 613944 858576 764151 474363 358862 363103 127004
35937 127004 -274171 -294125 218120 667474 531864 71284 -154655 -85519 -39718 -104706
35927 -104706 -131757 -144185 -280481 -438881 -397715 -214651 -123207 -99250 89439 438743
35917 438743 680139 697384 644495 634320 601013 492731 352100 199271 44110 -25450
35907 -25450 26065 42460 -104688 -252020 -150665 149775 369807 362286 181067 -75518
35897 -75518 -244755 -101704 316939 560889 263737 -371872 -905091 -1245070 -1511770 -1561870
35887 -1561870 -1190137 -661936 -480188 -660674 -749857 -535613 -247666 -88243 -67123 -257419
35877 -257419 -672469 -919385 -564579 137762 479989 301331 129254 259625 380184 257914
35867 257914 103620 18405 -244819 -669316 -775897 -389470 6286 54523 56474 298921
35857 298921 472907 288323 104922 345077 742943 802091 598815 495671 429972 177905
35847 177905 4515 274633 619289 318100 -527992 -1022001 -774542 -392294 -382831 -305929
35837 -305929 441202 1475285 1753311 947465 -81121 -331865 197903 697689 634577
35828 634577 256232 -1001 -159818 -455452 -738206 -604544 -69897 363410 408965 352499
35818 352499 520616 753491 684047 310231 6278 54157 336431 458913 144833 -430626
35808 -430626 -791475 -786676 -843203 -1274616 -1609229 -1178434 -223535 309007 97226 -208160
35798 -208160 -111003 94617 134419 348711 952863 1441568 1357711 1033424 924218 804882
35788 804882 337753 -126635 -122387 47248 -135838 -384904 -86245 519675 645972 281444
35778 281444 190195 617189 973066 902759 754035 794768 785766 567772 347158 167997
35768 167997 -226979 -786741 -1036870 -788719 -389611 -127626 15718 -43841 -426798 -714592
35758 -714592 -272551 636850 934212 253492 -468186 -359464 283626 789416 1127866 1430734
35748 1430734 1291279 431494 -506782 -731301 -429022 -290455 -325335 -66056 370137 409272
35738 409272 72979 -30161 257111 466321 384900 277237 156046 -318945 -1039175 -1360252
35728 -1360252 -1092188 -819569 -885345 -788589 -90840 692115 726346 10121 -682262 -781030
35718 -781030 -379032 114710 360960 230246 -117114 -349796 -337550 -241263 -111405 269076
35708 269076 887186 1209947 796836 -57335 -711712 -981334 -1091211 -1054138 -686466 -169437
35698 -169437 23442 -166702 -311780 -265547 -432622 -1007148 -1473230 -1277444 -621478 -142143
35688 -142143 -72103 -162079 -232485 -327979 -422801 -418368 -397116 -469892 -405437 130569 922700
35677 922700 1265949 835552 86331 -404979 -589531 -684272 -664995 -409666 -72781 87446
35667 87446 77840 21082 -152487 -473903 -615721 -296423 146387 146160 -216900 -373902 -296508
35656 -296508 -582321 -1291024 -1536762 -783507 153003 170362 -522516 -763690 -169612 432090
35646 432090 346200 -90077 -223567 13079 303522 507049 611756 550660 421366 494133
35636 494133 677598 440203 -322946 -838386 -449059 347255 562737 143513 -82049 226945
35626 226945 484389 243855 -117616 -125648 60195 97963 114622 389708 773317 933795
35616 933795 897857 844443 611594 -25868 -727095 -846525 -369483 -37681 -352998 -901585
35606 -901585 -971640 -537136 -232921 -442798 -796519 -715129 -214431 135601 36818 -92422
35596 -92422 269601 933038 1206640 859411 386662 198043 44460 -416862 -902548 -859345
35586 -859345 -341372 2381 -188532 -574236 -697423 -600042 -625482 -822541 -833979 -389692
35576 -389692 275095 653277 593277 466912 566600 601249 177647 -387320 -333304 397389
35566 397389 919241 586734 -159822 -524040 -395115 -165720 12534 202153 286953 205458
35556 205458 240102 484207 411061 -332489 -1094241 -1009933 -312673 73055 -10708 47762
35546 47762 326635 254575 -146025 -137945 340051 382234 -320277 -790362 -297725 459956
35536 459956 505791 27446 -197914 -72272 51917 255973 755434 1165915 980020 452906
35526 452906 207083 273915 294758 319638 564811 671445 111831 -811928 -1219991 -840949
35516 -840949 -201816 276318 616285 773354 557633 127536 -97383 -79226 -152854 -386701
35506 -386701 -524226 -529195 -607540 -723637 -671331 -562285 -649132 -761726 -576165 -336882
35496 -336882 -546860 -970043 -785590 138013 924534 879847 299913 -171112 -361056 -472849
35486 -472849 -706033 -1198776 -1864026 -2173451 -1656277 -678686 -76072 55537 407175 1133484
35476 1133484 1412307 757992 -75490 -134134 436552 785325 545493 -9532 -596484 -1070438
35466 -1070438 -1222324 -999730 -739613 -722432 -696180 -273050 379174 651009 207536 -668240
35456 -668240 -1329064 -1238515 -448223 302070 325741 -84063 12227 786292 1254284 697686
35446 697686 -220562 -394682 201652 679370 572522 230148 15865 -159764 -456827 -777009
35436 -777009 -912815 -734945 -273436 176981 227995 -84452 -240277 19554 264045 83402
35426 83402 -180517 42513 626772 958035 831159 540523 279757 77325 160781 706444
35416 706444 1297661 1298224 776641 449874 671500 1055422 1160495 980014 652975 223463
35406 223463 -173348 -340702 -347554 -423347 -492878 -270353 145618 264231 -112865 -635106
35396 -635106 -899707 -788572 -314601 363725 749596 382751 -500425 -1182546 -1361558 -1256914
35386 -1256914 -860961 91708 1230029 1520317 599896 -590571 -1037683 -870966 -774047
35377 -774047 -826824 -687171 -435032 -380882 -318999 173153 803662 755561 -129556 -1064446
35367 -1064446 -1370952 -1212027 -1039622 -860524 -447273 42494 96769 -523925 -1433493 -1976361
35357 -1976361 -1879253 -1460943 -1131729 -809966 -119128 832041 1299125 799811 -164513 -647096
35347 -647096 -303077 428132 944143 893773 219593 -701813 -1106328 -574953 329080 673746
35337 673746 354694 82630 178090 124398 -431239 -952195 -798685 -240801 -80323 -520269
35327 -520269 -979906 -956831 -611918 -466549 -823888 -1510048 -1982943 -1742095 -828321 134856
35317 134856 554112 424012 134122 -92826 -327889 -648400 -1000034 -1266283 -1270455 -857293
35307 -857293 -201332 188476 104269 40869 499642 1100049 1027732 316407 -81070 302875
35297 302875 734993 417320 -306617 -542913 -216300 -78263 -521063 -1141061 -1517959 -1732496
35287 -1732496 -1893872 -1740533 -1093918 -337234 -31187 -220860 -437352 -298742 125783
35278 125783 489986 518322 208416 -178547 -341310 -225742 -67299 -127335 -435871 -767642
35268 -767642 -779788 -257681 572607 1046351 688479 -141810 -587767 -348868 20629 20108
35258 20108 -113409 1237 113377 -231580 -803673 -943742 -587965 -312461 -343109 -271815
35248 -271815 79916 278888 101888 21846 364341 618831 275989 -154493 184035 1078927
35238 1078927 1419809 765975 -121040 -465071 -383156 -278078 -55973 507986 1118537 1275643
35228 1275643 997957 749609 788057 946309 927808 542731 -154014 -710949 -557614 244750
35218 244750 866940 743291 369437 492685 851970 546862 -451321 -1086899 -713689 28263
35208 28263 213484 -190881 -649093 -976806 -1309529 -1529334 -1366263 -900556 -451120 -97777
35198 -97777 241036 410730 186041 -242548 -402827 -147072 253124 578994 856953 1110331
35188 1110331 1288279 1431670 1579974 1564644 1242550 849708 720066 745311 592725 381316
35178 381316 541833 972629 1006417 417536 -175682 -227848 2319 37763 -45631 61199
35168 61199 270671 374794 602956 1284707 2200081 2875795 3320006 3794656 3998113 3259752
35158 3259752 1647442 183273 -290394 67416 606097 968033 1085762 910570 542348
35149 542348 286197 253653 221761 139932 345013 910027 1240337 854204 207706 103867
35139 103867 504747 622418 108041 -554313 -894110 -1012789 -1109562 -1061732 -773434 -459828
35129 -459828 -292513 -173255 -81188 -157380 -192671 355543 1385100 1797853 829799 -680657
35119 -680657 -1165582 -272795 865757 1251588 1068808 962264 1043461 1011489 750210 388465
35109 388465 53675 -157177 -190810 -183934 -344723 -591328 -606045 -313618 49075 381564
35099 381564 780406 1068779 837852 193777 -115144 296969 823136 707741 99450 -285680
35089 -285680 -243879 -225738 -527553 -879203 -868842 -428167 138499 416159 226635 -169330
35079 -169330 -362787 -337405 -429649 -702750 -819947 -686954 -651571 -790483 -639740 -64740
35069 -64740 272609 -77458 -509291 -291144 213587 155259 -400830 -682075 -545586 -577053
35059 -577053 -977696 -1344386 -1504040 -1595535 -1373259 -498993 417160 222850 -1061140 -2019167
35049 -2019167 -1733097 -888880 -517621 -619898 -685125 -713523 -932555 -1114676 -937853 -611090
35039 -611090 -540922 -747461 -1082887 -1589339 -2159840 -2286248 -1657699 -669939 52737 278559
35029 278559 44542 -547146 -1073127 -950131 -291129 16432 -436063 -909450 -663528 -80447
35019 -80447 60897 -204798 -351245 -338765 -398804 -316704 134811 429218 -46795 -803170
35009 -803170 -737743 261328 1144132 1154486 615177 189464 129611 381314 763083 902046
34999 902046 533177 -73510 -438013 -518309 -518859 -288801 362817 921075 614023 -367508
34989 -367508 -955450 -658254 -141908 -159058 -652971 -1195311 -1608643 -1811470 -1648471 -1224581
34979 -1224581 -902989 -702903 -235033 499080 845633 427695 -189913 -227306 323413 884767
34969 884767 1115273 1058673 723514 48955 -727607 -1064161 -622576 317284 1008979 863429
34959 863429 25466 -723319 -780955 -358929 -113345 -292081 -569062 -636429 -565222 -535419
34949 -535419 -528998 -383456 19236 587144 920889 595266 -239467 -841656 -795358 -570609
34939 -570609 -695709 -802471 -222313 765793 1160121 627549 -163065 -590909 -640831 -382895
34929 -382895 221162 835285 908868 528569 339927 470225 383870 -21197 -157464 114046
34919 114046 138447 -278623 -339271 366023 958949 605612 -121038 -179387 351251 649498
34909 649498 551728 488374 418526 -73252 -805851 -1120525 -899376 -618272 -462880 -197853
34899 -197853 140905 204220 -22371 -206701 -251313 -241236 32806 740603 1340995 1116572
34889 1116572 343265 199 249490 210164 -499708 -1015754 -546714 394178 747793 304846
34879 304846 -318213 -645249 -616587 -217169 495716 1109322 1159519 728865 367306 431754
34869 431754 786956 1090318 1088962 699147 72149 -440774 -607714 -563488 -567652 -624948 -567514
34858 -567514 -392258 -222310 -8315 387192 810600 903260 669220 574539 853055 1059662
34848 1059662 685191 -25831 -357845 -147631 8910 -324932 -824680 -992099 -876868
34839 -876868 -782296 -616644 -111029 500949 640282 217515 -239221 -349867 -242957 -57488
34829 -57488 320496 792432 900406 520745 210979 413451 740493 591461 145835 113914
34819 113914 671144 1265547 1450103 1326801 1099318 724660 201771 -207940 -291594 -151196
34809 -151196 21085 210521 473329 771559 1063000 1368647 1604572 1539154 1116309 670828
34799 670828 568370 697113 606874 201376 -24484 320623 825138 706845 -68189 -620787
34789 -620787 -361589 141999 20720 -540188 -565383 161286 661781 148587 -872490 -1349224
34779 -1349224 -992698 -303475 287755 678094 738931 355507 -206253 -473121 -338128 -92272
34769 -92272 94358 338523 662385 805177 539672 -30906 -576147 -833707 -808400 -747591
34759 -747591 -853387 -1013644 -1007940 -959948 -1202384 -1609419 -1596374 -1057532 -707295 -986601
34749 -986601 -1209499 -561037 481067 692440 -85245 -721705 -525350 -171499 -449301
34740 -449301 -938169 -682827 295834 973874 703968 -34049 -394443 -210714 32044 51682
34730 51682 154241 599752 935873 496294 -455337 -749843 160153 1283057 1321134 387498
34720 387498 -318769 -298274 -222275 -569946 -830707 -492493 6494 -49666 -578968 -950512
34710 -950512 -950692 -858574 -746258 -323490 485252 1250873 1473738 1111967 596550 379375
34700 379375 463159 425763 27721 -341425 -154116 396841 544572 51189 -419622 -333887
34690 -333887 -124444 -474775 -1178356 -1379324 -794757 -59019 196227 81681 92493 375107
34680 375107 606217 465577 43133 -261940 -230050 -108567 -242737 -493515 -378756 134926
34670 134926 439037 155338 -236643 -94778 405988 573401 285122 114898 364681 612565
34660 612565 433899 63172 5313 293587 457950 113561 -602001 -1115472 -910856 -64972
34650 -64972 734096 880433 481792 49679 -282234 -766239 -1315742 -1390971 -815042 -156956
34640 -156956 24664 -153466 -356309 -651566 -1143515 -1402657 -940917 -35288 587949 746326
34630 746326 791402 719454 131336 -817871 -1299716 -989669 -599725 -751097 -1005070 -659813
34620 -659813 60837 410971 324930 324757 403826 -38931 -1021862 -1596747 -1040092 150694
34610 150694 897162 818608 472861 522648 989560 1295707 919851 43202 -538431 -329232
34600 -329232 195562 192734 -402723 -851548 -713824 -368053 -291172 -439433 -609718 -825987
34590 -825987 -1008814 -819650 -273411 18562 -270772 -565515 -266974 209653 51665 -613629
34580 -613629 -873982 -423603 75285 120322 48451 305274 702803 818550 675877 598932
34570 598932 659668 628498 342535 -107730 -469689 -495687 -146411 297973 464906 278422
34560 278422 9007 -45399 211759 692551 1169043 1370704 1256859 1107402 1111410 1013734
34550 1013734 505458 -161214 -379244 13414 555625 807118 769901 626231 473243 425938
34540 425938 622858 1006472 1369453 1629531 1748127 1473850 663345 -168663 -240551 426269
34530 426269 954915 856808 669166 969607 1402332 1293915 774056 557125 821717 1000263
34520 1000263 668832 69720 -348865 -462017 -385628 -212510 -39922 -61488 -423344 -1016416
34510 -1016416 -1499058 -1558977 -1188457 -703480 -429550 -371080 -271875 35443 477460 886897
34500 886897 1107429 1001678 612022 282629 308418 477098 354558 56997 226743 1037724
34490 1037724 1736682 1553960 688985 -38405 -222137 -92270 78453 267707 444892
34481 444892 468578 330718 225089 301604 520277 753794 909488 986851 1083066 1221345
34471 1221345 1143915 558044 -282506 -625742 -166828 404754 268583 -373226 -596320 -110738
34461 -110738 353567 169966 -284942 -244011 339284 795368 697543 313683 40796 -158062
34451 -158062 -465202 -659278 -323562 435378 961213 908160 692340 781442 952868 732658
34441 732658 221570 -149350 -438036 -982739 -1477483 -1183081 -198533 436024 257280 49319
34431 49319 440911 771153 210316 -736833 -911329 -229386 349456 341053 165090 130083
34421 130083 13239 -251371 -382211 -426132 -798844 -1436134 -1685896 -1308960 -851266 -726681
34411 -726681 -656564 -376874 -181858 -294426 -336678 23748 434281 442084 267698 384768
34401 384768 681477 673756 321521 27664 -39455 -67414 -115408 -18071 226963 401899 419659
34390 419659 378773 273453 -3973 -356135 -500942 -346136 -85776 86477 109392 -69069
34380 -69069 -424775 -637916 -297449 517751 1140800 1029163 413471 3500 120278 351662
34370 351662 111015 -633841 -1312810 -1365118 -775130 -26688 324147 22248 -711096 -1237783
34360 -1237783 -960960 10488 797681 670054 -62330 -443722 -103494 389087 473529 337106
34350 337106 387096 458162 78826 -678146 -1148651 -918450 -342579 -99942 -429850 -932387
34340 -932387 -1062984 -739611 -367716 -218144 3186 660621 1427953 1563622 983951 420315
34330 420315 275982 51433 -587957 -893389 -58972 1276530 1632130 732550 -90138
34321 -90138 211479 1024343 1091095 223804 -640252 -734444 -221075 234036 218908 -120640
34311 -120640 -335255 -195371 66504 135515 70483 63688 -76647 -649950 -1315592 -1331097
34301 -1331097 -694404 -285105 -517981 -654179 -61125 574278 192822 -944627 -1547077
34292 -1547077 -1118187 -479050 -381992 -544352 -387986 23571 257734 203095 40415 -109597
34282 -109597 -139690 114210 536530 613637 34027 -794576 -1178929 -938303 -447663 -22373
34272 -22373 377849 855811 1300603 1484013 1281071 779344 276760 126457 443182 972269
34262 972269 1337395 1374228 1152004 789294 411843 202182 255119 370527 217765 -194219
34252 -194219 -414870 -125371 318100 238704 -431462 -953453 -759615 -287823 -359741 -922552
34242 -922552 -1090850 -509466 96082 109204 27729 578674 1368072 1357642 476328 -223402
34232 -223402 -77012 433640 659140 660921 697958 574033 64467 -525594 -778731 -750238
34222 -750238 -671685 -483682 -166184 -123836 -637241 -1239917 -1284762 -910973 -765638 -878336
34212 -878336 -559486 462203 1447103 1501025 630617 -361062 -804598 -720632 -533950 -460489
34202 -460489 -314941 50951 302287 -66342 -950804 -1570006 -1383290 -719287 -216617 -8591
34192 -8591 143310 240816 109347 -109643 -75676 168013 194879 -175680 -613089 -703491 -394085
34181 -394085 -5644 22421 -495790 -1188720 -1383639 -899498 -344245 -335379 -704459 -836198
34171 -836198 -506716 46675 606996 1028953 1053398 605455 89411 -99163 -104745 -165159
34161 -165159 -33823 470051 754549 212646 -611648 -672996 -70584 150173 -171409 -42192
34151 -42192 833145 1341406 758761 -7313 100032 620740 510497 -83196 -247446 16261
34141 16261 -132851 -813885 -1199219 -930004 -631075 -722309 -687847 -14206 894949 1338328
34131 1338328 1327987 1332932 1335402 873723 13871 -416570 101254 935252 1060936 462649
34121 462649 143767 675672 1425086 1598828 1425710 1614273 2053296 1933733 1047722 88239
34111 88239 -421153 -650942 -720459 -292931 653120 1366219 1199966 464247 -83310 -184460
34101 -184460 -109262 -153966 -491016 -1090045 -1443143 -895944 329874 1035177 518759 -419053
34091 -419053 -627117 -213292 -136389 -581126 -768016 -298217 297747 518421 560896 704516
34081 704516 681385 118933 -762356 -1306467 -1138768 -497260 66970 198664 -3136 -197819
34071 -197819 -258790 -373368 -621540 -708310 -352009 252765 660543 752118 788932 939904
34061 939904 1029055 789776 209558 -408859 -682940 -500129 -143064 33805 -6142 -106683
34051 -106683 -307013 -724379 -1102621 -996372 -509599 -319266 -741065 -1256308 -1243285 -742729
34041 -742729 -218626 21020 -104824 -527774 -910994 -884181 -622394 -689296 -1090854 -1117051
34031 -1117051 -440389 319530 560473 530146 657001 716457 306742 -397348 -973096 -1305249
34021 -1305249 -1294681 -680945 248330 534749 -124923 -708094 -369237 213282 32751 -506268
34011 -506268 -319563 506645 971462 815620 543999 179792 -544818 -1041200 -461199 677953
34001 677953 1017488 473333 231231 584050 525281 -208812 -498221 152034 652408 215913
33991 215913 -318917 -43238 507433 510954 333648 618149 902649 473230 -174048 -69673
33981 -69673 558610 655721 71743 -296764 -775 403023 367814 61473 -126932 -152726
33971 -152726 -182161 -286417 -407783 -440038 -341307 -232950 -238859 -244625 -128451 -160211 -646800
33960 -646800 -1208149 -1119069 -466453 -137246 -430587 -599694 -150216 379733 478710 502238
33950 502238 716567 477574 -650697 -1761430 -1719979 -834711 -275936 -282455 -148038 283743
33940 283743 359402 -144497 -607852 -564705 -266141 -86202 -69052 -181900 -399287 -460455
33930 -460455 -89002 524847 930884 1004842 859386 423060 -286869 -753057 -552188 -114760
33920 -114760 -84442 -172485 374060 1317344 1584954 959934 446898 648028 892647 489070
33910 489070 -170836 -426432 -405595 -496458 -475789 -30783 372326 44256 -819046 -1418280
33900 -1418280 -1521471 -1538445 -1569218 -1255504 -636590 -305245 -442644 -418278 232606 994767
33890 994767 1045624 364201 -346179 -584128 -386839 58905 541615 599604 -195115 -1537126
33880 -1537126 -2461511 -2367254 -1587131 -757391 -112393 296886 252746 -208806 -467277 -85376
33870 -85376 401376 213256 -381761 -395167 304384 714513 211942 -585469 -881294 -790890
33860 -790890 -786635 -743295 -260021 510697 1044775 1175419 1077067 807603 424958 291946
33850 291946 663127 1142207 1128426 687767 417484 501551 479252 44592 -414685 -317257
33840 -317257 328013 873309 744894 104562 -323119 -138743 266509 414189 568279 1208964
33830 1208964 1874516 1506448 116141 -935347 -787186 -206716 -191490 -431700 -129805
33821 -129805 487814 665662 513281 623714 738051 185822 -557754 -232687 1192857
33812 1192857 2251700 2015325 1152442 566494 201571 -219100 -381319 -69911 201602
33803 201602 17144 -202628 -371 267432 141219 -17291 330852 844209 809918 363265
33793 363265 263248 633447 839667 593281 300545 174378 -198017 -1061881 -1875688 -1933139
33783 -1933139 -1264319 -536092 -250774 -349828 -496617 -477627 -322266 -198796 -251699 -486320
33773 -486320 -768936 -925379 -853986 -594143 -299037 -77027 155992 558184 1042084 1224823
33763 1224823 864996 267093 20055 291613 591768 383260 -226963 -655898 -659724 -639211
33753 -639211 -971495 -1364923 -1262693 -707446 -283674 -192439 23678 603669 1005065 697289
33743 697289 70704 -92998 196632 219047 -245280 -555421 -265087 154154 68756 -339377
33733 -339377 -391588 73968 562627 703063 648136 631333 580393 396885 282220 440693
33723 440693 633924 434459 -83129 -318097 24544 443054 289256 -366459 -920920 -1083365
33713 -1083365 -1033646 -847156 -376180 218560 426549 102907 -295066 -419047 -423727 -366235
33703 -366235 131826 1117265 1794272 1477246 648433 326115 649136 845397 462904 -115641
33693 -115641 -382345 -284441 -40638 118414 31884 -149720 24315 557487 590051 -509571
33683 -509571 -1887300 -2034321 -867150 93846 -149376 -852576 -921390 -505109 -403264
33674 -403264 -628269 -530791 699 360060 172930 -243366 -400791 -154254 318431 694830
33664 694830 690138 357214 144439 376526 758602 701313 112616 -419096 -281801 509494
33654 509494 1376448 1770854 1628370 1264010 925445 609197 330608 287209 526992 710748
33644 710748 563735 361001 519727 889020 1012269 981243 1321130 1980479 2206528 1662462
33634 1662462 943782 638849 583119 511545 750249 1570146 2361847 2245611 1262352 285123
33624 285123 -96110 -2493 279712 652012 1007474 1184857 1188371 1138090 1044329 897699
33614 897699 829071 884854 871378 762694 940869 1547920 1933421 1419005 408107 -34869
33604 -34869 331543 657394 334713 -170023 -109978 550978 1299818 1717881 1621885 1029575
33594 1029575 343097 148346 480008 699043 460223 325144 903275 1801465 2098462
33585 2098462 1646168 1207095 1329476 1713790 1803310 1491099 1067053 841172 960041 1285557
33575 1285557 1387056 997321 522113 675076 1502656 2243972 2355020 2170076 2222209 2408931
33565 2408931 2345804 2164688 2294823 2614915 2520583 1897822 1410901 1589199 2102832 2269873
33555 2269873 1968429 1697428 1884880 2428116 2883193 2920194 2583443 2205055 2097151 2325751
33545 2325751 2752304 3172125 3359904 3178363 2818670 2742551 3133291 3586519 3662902 3551480
33535 3551480 3745471 4198442 4347271 3958311 3391207 2959354 2602186 2326397 2377237 2728122
33525 2728122 2939064 2803060 2637929 2673194 2679440 2499200 2366105 2341382 2063322 1517615
33515 1517615 1391181 2030537 2665663 2468115 1896918 2074325 3108328 3974597 3984955
33506 3984955 3523299 3277686 3465903 3920045 4346680 4426227 4129085 3891721 4019434 4106009
33496 4106009 3647632 3010335 2996427 3547685 3776803 3383798 3141352 3658409 4426576 4556616
33486 4556616 3936174 3212976 2961087 3205351 3578936 3757019 3809558 4051840 4433251 4432162
33476 4432162 3898681 3497428 3688859 3819102 3175600 2480306 3013182 4400054 4786134
33467 4786134 3479215 1957729 1678188 2228549 2471397 2313634 2287361 2311887 2030412
33458 2030412 1741517 1918900 2273986 2251517 2010444 1986265 1935345 1418303 852876 1011701
33448 1011701 1724297 2170819 2310766 2845025 3712951 3850174 2836971 1771665 1873610
33439 1873610 2888570 3527813 3098459 2130960 1569519 1784794 2386042 2758397 2677649
33430 2677649 2376172 2069196 1696118 1293242 1257678 1800450 2371447 2208771 1421541 949283
33420 949283 1332149 2030388 2181269 1626797 922770 617648 795677 1162318 1353944 1234245
33410 1234245 1003816 971735 1216887 1576763 1906076 2140740 2157295 1879111 1581738 1762443
33400 1762443 2503013 3193653 3154842 2420661 1650006 1308348 1224080 1035136 796364 866509
33390 866509 1290971 1642118 1590770 1373036 1451543 1858508 2152352 1995823 1536695 1183410
33380 1183410 1176466 1415732 1596916 1519080 1316902 1294177 1474778 1551557 1422698 1432725
33370 1432725 1763277 1959277 1588960 1082790 1215270 1881496 2180318 1771302 1341086
33361 1341086 1480805 1854458 1876355 1583066 1370253 1369243 1534298 1900328 2309163 2292424
33351 2292424 1682096 983334 725656 798522 816966 730055 620896 345012 -81816 -135861
33341 -135861 529014 1347737 1487498 1037435 848560 1254607 1655770 1460166 813252 183101
33331 183101 -271215 -606593 -703511 -332893 445754 1185416 1459638 1352071 1404154 1928238
33321 1928238 2498133 2432766 1735613 1122498 1056585 1260048 1358394 1442056 1635429 1638480
33311 1638480 1213827 750285 793393 1268961 1668888 1780096 1741552 1601761 1371633 1393976
33301 1393976 2094414 3313409 4307415 4569034 4510006 5305878 7952630 12070148 15558615
33292 15558615 16067084 13266386 9271179 6424144 5149564 4431876 3676027 3134654 2886986
33283 2886986 2529982 1954725 1540802 1401668 1180664 804262 736905 1170034 1549972 1322210
33273 1322210 725242 426041 633404 959325 1015075 778885 360431 -284239 -1159009 -1839697
33263 -1839697 -1663048 -570255 514254 644721 87964 -35207 613457 1094708 648856
33254 648856 -153266 -331688 60739 188936 -281757 -926670 -1325066 -1368665 -1000597 -312562
33244 -312562 242892 324664 215106 338317 574860 666460 900983 1567178 2054913 1518329
33234 1518329 332834 -159482 533078 1456546 1651685 1277329 948267 780781 611211
33225 611211 569099 895541 1516535 2141006 2529933 2506539 2026539 1374113 971053 910531
33215 910531 976573 1076459 1245270 1294819 982151 533220 472734 888165 1350172 1569646
33205 1569646 1623820 1551156 1285181 990522 895388 814178 439409 37029 134775 559876
33195 559876 614677 264111 257298 893575 1562670 1779470 1792371 1826269 1614860 1130917
33185 1130917 930559 1246825 1530014 1440889 1513683 2199400 3006551 3319155 3383491 3685764
33175 3685764 3959892 3695090 3166456 3085569 3561892 4193047 4846961 5590218 6209494 6624689
33165 6624689 7410296 8994761 10674664 11474278 11777146 12935647 15256190 17568657 19005671
33156 19005671 20001913 21052385 21614369 21046320 19810036 18817701 18102167 17020586 15449764
33147 15449764 13912253 12647781 11357059 9899721 8561837 7500754 6515779 5580934
33139 5580934 5097846 5302810 5762626 5782692 5137248 4181937 3406570 3053246 3025191 3005151
33129 3005151 2759257 2398102 2205642 2216483 2219987 2189549 2317382 2522648 2413662 1991781
33119 1991781 1869847 2370651 2906869 2822664 2386543 2221825 2166190 1650433 971866 1047053
33109 1047053 1827767 2130975 1405830 592958 651249 1182529 1274213 931535 795712 985210
33099 985210 1098270 1028940 1006479 1055296 1046968 1045722 1068429 831966 266864 -132901 -47066
33088 -47066 73633 -187146 -367205 63195 574818 319106 -380000 -452069 186228 558662
33078 558662 300916 142655 467626 594623 9588 -672517 -628376 9795 535976 673349
33068 673349 617520 484420 255464 42421 4818 125409 270792 329064 210970 -84734
33058 -84734 -393491 -583210 -743821 -930341 -927834 -641044 -441149 -609757 -721103 -237629
33048 -237629 515761 753767 458367 345942 656588 884175 774522 670463 703079 553811
33038 553811 262977 367157 897746 1116927 662303 121112 -15695 -160407 -774465 -1389284
33028 -1389284 -1198950 -208524 812756 1234184 984047 367680 -165352 -320719 -247302
33019 -247302 -248335 -173012 392855 1258123 1625408 1195632 613652 503746 700448 788515
33009 788515 768364 760170 619813 289039 23750 -110738 -452263 -1079774 -1489031 -1335018
32999 -1335018 -966857 -810493 -735729 -444265 25755 565180 1208825 1696202 1445952 468440
32989 468440 -290934 -93500 622775 988094 921429 969308 1303606 1513809 1198131 338292
32979 338292 -684848 -1202595 -792528 65353 406967 108171 90700 845091 1576394 1405016
32969 1405016 623863 32634 -234115 -366453 -72647 854781 1683093 1537922 729682
32960 729682 257951 288071 208418 -8403 273284 1015167 1281281 686333 71697 250937
32950 250937 862547 1024453 549770 -62445 -457259 -679049 -777003 -642779 -272392 102715
32940 102715 265623 301094 521678 1058438 1608241 1764974 1582341 1518227 1716764 1689840
32930 1689840 997913 5782 -410347 158122 1243893 2045054 2154024 1751431 1266300
32921 1266300 946225 758426 642394 658835 754580 615572 77904 -463781 -452196 115166
32911 115166 767989 1245466 1592344 1673795 1252789 620841 493689 1074357 1770025 2024602
32901 2024602 1897688 1658116 1386008 1181392 1189206 1203574 833786 268062 224094 878745
32891 878745 1518777 1579647 1355787 1292378 1252469 991372 777254 978457 1444621 1758828
32881 1758828 1761381 1491833 984581 394781 -29919 -239627 -238900 270149 1413106 2386551
32871 2386551 2151966 1010856 410052 901498 1458774 1259565 895461 1113489 1550123
32862 1550123 1621508 1619226 1910017 1973054 1315951 557762 507337 854008 847954 630123 780406
32851 780406 1125212 1113427 880743 864503 850722 488462 265149 824293 1723062 2015600
32841 2015600 1710936 1517111 1514148 1305917 1172709 1725213 2530371 2424645 1290076 315102
32831 315102 297058 768439 1066716 1278653 1720719 2214002 2279852 1668344 588845 -279316
32821 -279316 -214529 665258 1293222 990095 451851 662483 1336090 1443217 900061 559079
32811 559079 687128 671963 302100 184492 631898 1114776 1164563 1037007 1142073 1435190
32801 1435190 1648512 1651450 1441010 1168368 1137485 1365551 1347407 782369 245976 458832
32791 458832 1156640 1470811 1214443 944240 920269 924025 1018780 1523992 2200033 2386402
32781 2386402 2053868 1839691 1923963 1792418 1332597 1230104 1856736 2549024 2537163 2036730
32771 2036730 1847822 2170822 2321424 1603636 224596 -774327 -591122 368162 900341
32762 900341 466475 -219989 -292667 167704 575933 790150 968004 964436 637190 414816
32752 414816 791537 1478982 1758931 1487312 1114104 927813 904334 1074793 1427669 1664054
32742 1664054 1591735 1463142 1413135 1024294 98824 -636768 -400421 475431 1066380 1180358
32732 1180358 1299093 1525950 1520761 1294852 1204104 1254879 1161999 977984 1000364 1201397
32722 1201397 1328246 1349200 1289948 970549 420487 116946 282632 477250 421516 546119
32712 546119 1082047 1387356 975519 434275 437161 630617 464796 304444 619327 864303
32702 864303 372687 -334390 -347414 178260 539315 728244 955921 763897 -32908 -376334
32692 -376334 538320 1609728 1333309 195595 -234281 84313 -50206 -691737 -759162
32683 -759162 -203212 -69115 -406215 -99120 1076423 2058175 2328787 2420881 2441667 1814322
32673 1814322 727690 205474 438374 544017 210113 103909 435585 559034 240776
32664 240776 -3803 174 -80575 -142650 189995 536703 228684 -339493 -223303 411546
32654 411546 621919 433890 662632 1219202 1290266 1025240 1287305 1856784 1697779 950849
32644 950849 821672 1478703 1877180 1700855 1663650 1840415 1531089 878435 831582 1393479
32634 1393479 1618864 1399038 1572260 2311984 3067295 3886248 5032891 5644555 4746210
32625 4746210 3257567 2888691 3387238 3124673 2064291 1691164 2212844 2395200 2099776
32616 2099776 2376506 3006248 2587224 1229957 619432 1212184 1811361 1967544 2289798
32607 2289798 2427172 1412832 -3565 -80605 931787 1295642 1033690 1653282 2870707
32598 2870707 2916924 2007876 2052820 2919212 2625146 1366065 1528883 3331347 4258379
32589 4258379 3349428 2336900 2084283 1666777 1350117 2526029 4289193 4125959 2369927
32580 2369927 1855158 3002137 3682713 3909369 5631332 7806639 7234481 4666939 4235329
32571 4235329 6234944 6693229 4840790 4314154 5868035 5997516 4239696 4393309 6717839
32562 6717839 6761343 4051613 3698431 6903174 8589312 7215431 7582265 10766084 11491054
32553 11491054 9240080 10833697 17505358 21603965 21363939 25231570 35170774 41615355
32545 41615355 43479641 54654984 79033673 101731133 123977353 180539092 287711093
32538 287711093 390229644 404646462 317785982 203741901 134570988 110299311 91924095
32531 91924095 66394066 48841188 43850867 39135979 30314445 25159044 24989654 22192814
32523 22192814 15769220 12751623 14136986 13470809 9530942 7927590 9741261 9804730
32515 9804730 6891496 5506718 6801065 6852196 4770037 4141792 5624409 5822458 4277713
32506 4277713 4311534 6134451 5999319 3165116 1361017 2324557 3660589 3929099 4389540
32497 4389540 5030121 4165566 2606665 3114181 5140264 5136234 2675700 1297109 2519706
32488 2519706 3849989 3633207 3259557 3497515 2998067 1632675 1346150 2550441 3281216
32479 3281216 2828710 2708173 3337062 3313087 2663226 3197171 4863431 5321474 4007219
32470 4007219 3149450 3799085 4259925 3553530 3140037 3888970 4355713 3492547 2456962
32461 2456962 2402707 2775615 2909705 3178866 3653013 3637910 3257903 3519692 4312049 4374991
32451 4374991 3607444 3274382 3629171 3555184 2867486 2685697 3174694 3193751 2555218 2372420
32441 2372420 2803594 2708199 1915850 1600864 2037530 2188558 1837732 1904533 2368808 2175336
32431 2175336 1466820 1536292 2260445 2053640 780023 189665 914366 1526606 1223672
32422 1223672 964823 1199865 939640 -16515 -297911 593111 1266987 880662 458236
32413 458236 767423 965917 460864 137634 586257 933520 563213 267124 596552 745660
32403 745660 174077 -244626 211112 853186 902487 679849 557045 100837 -810026 -1312582
32393 -1312582 -891539 -212498 91576 282954 577569 601594 355233 451707 889446 881744
32383 881744 342365 165297 618134 914188 795414 995403 1646518 1795745 1065714 309147
32373 309147 109190 106886 201821 798301 1471669 1157234 139465 1860 1033812 1619753
32363 1619753 904683 88930 204326 548567 342354 83159 161156 -84648 -799630 -854963
32353 -854963 158374 878958 346053 -449145 -447718 -264706 -656329 -907967 -312478 263596
32343 263596 -57653 -418087 249669 1186607 1070709 267432 53058 457774 588373 373477
32333 373477 354168 348433 -129439 -642043 -466347 22179 -35591 -446911 -375383 130362
32323 130362 322262 147753 229505 683602 1063005 1276095 1566200 1778239 1558043 1101007
32313 1101007 916556 1064640 1293637 1603273 1998791 2063335 1476370 644723 220078 318972
32303 318972 690471 1183874 1566675 1430131 804676 327946 328037 360793 119683 56412 513957
32292 513957 991434 950974 692002 743546 982259 980722 678630 192940 -441456 -936551
32282 -936551 -893865 -652320 -1074761 -2041371 -2232170 -1045910 366597 773000 481593
32273 481593 384415 444483 232369 49166 310755 528168 74812 -605985 -656755 -171932
32263 -171932 100142 -41670 -270542 -474582 -613318 -346518 341437 692534 208117 -438286
32253 -438286 -398098 29931 2849 -496632 -851275 -880177 -798590 -579038 -226414 -193639
32243 -193639 -669864 -996388 -643882 -152357 -190050 -381503 -136864 57989 -549435 -1428942
32233 -1428942 -1399657 -471939 284883 498220 772736 1281128 1399620 918401 480390 529632
32223 529632 717580 607832 234243 -229761 -720555 -1068181 -1068682 -836516 -644182 -471664
32213 -471664 -135908 289833 610396 834041 957593 769136 319490 162898 584542 1033827
32203 1033827 922267 516925 390637 476946 401328 272595 344433 325766 -128264 -618493
32193 -618493 -545639 -120735 -11445 -300769 -583632 -735705 -793433 -506378 111445 251330
32183 251330 -651531 -1742203 -1711164 -652028 171595 212999 124111 413242 778003 895487
32173 895487 882787 795644 472622 -24528 -483840 -959914 -1434807 -1364047 -455666 416525
32163 416525 175990 -788518 -1115398 -512173 16420 15607 205610 923543 1342100 882819
32153 882819 244761 256372 629265 648997 371702 341309 643070 936571 1054809 1032493
32143 1032493 874631 699626 746433 929580 838911 473986 414950 868640 1148952 677708
32133 677708 318 96014 967604 1643253 1508455 981223 736088 766142 523499 -234074
32123 -234074 -1049100 -1258271 -733393 6896 402266 388442 259045 207088 207059 200261 151756
32112 151756 15573 -143170 -112060 149298 298586 9677 -533961 -856198 -807450 -645799
32102 -645799 -569450 -502750 -328167 -40069 312722 592397 566666 224574 -11806 245010
32092 245010 727759 768955 202516 -394697 -484329 -221183 -96025 -193385 -140253 269425
32082 269425 718348 774462 465659 189879 109812 -17642 -318633 -525751 -503879 -627376
32072 -627376 -1157638 -1621557 -1456079 -965342 -822782 -835687 -229129 836986 1187787 378041
32062 378041 -570468 -672021 -220130 68175 175969 305155 175556 -295544 -380654 409881
32052 409881 1294961 1238688 463839 -62011 -149712 -281717 -374868 106642 922972 1132245
32042 1132245 515317 -53472 135310 781894 1179233 1009478 392099 -320884 -709188
32033 -709188 -682307 -673562 -1020518 -1330384 -974370 -30221 807426 1078538 820992 254430
32023 254430 -253739 -238715 231257 348758 -318926 -943267 -514469 585645 1094296 671870
32013 671870 94499 -211947 -637570 -1298873 -1629900 -1375494 -1050615 -1050151 -1091301 -883669
32003 -883669 -647245 -605951 -549235 -226769 259383 658390 798576 577938 122881 -128779
31993 -128779 57855 326948 363784 513903 1015213 1084948 -89582 -1702840 -2030254 -845795
31983 -845795 237240 165291 -196417 256542 1077119 1128710 381593 -187594 -26717 521850
31973 521850 922014 964010 751134 595344 733252 908236 589723 -181369 -666390 -450525
31963 -450525 -49588 -88020 -391950 -422636 -188350 -122753 -307193 -389296 -186433 86204
31953 86204 183867 108880 6828 -11012 55088 82406 -67265 -372788 -650734 -747749 -677552
31942 -677552 -604264 -730363 -1061888 -1234829 -854302 -138683 170992 -194059 -597937 -467684
31932 -467684 -155288 -216861 -358596 29897 662501 712523 237962 163422 747120 1107130
31922 1107130 579397 -336299 -788809 -628341 -247788 60129 214459 216951 138483 -57999
31912 -57999 -608686 -1404887 -1601507 -554267 966421 1437313 522163 -585513 -875443
31903 -875443 -567382 -229127 53086 187496 -204131 -981134 -1281422 -750641 -172776 -241152
31893 -241152 -487899 -154588 581597 1027228 1015771 764454 243138 -504808 -884262 -450480
31883 -450480 227748 214468 -495957 -1053959 -958374 -496306 -86922 159298 227490 95585
31873 95585 -79232 -49433 196797 430686 455887 221036 -193592 -545296 -582464 -360182
31863 -360182 -154856 8031 352445 766795 742948 169448 -327588 -218832 194482 302342
31853 302342 55141 -142704 -108392 -15444 -58729 -305700 -672954 -849248 -561123 -90631
31843 -90631 -81897 -595396 -885133 -459280 190704 360743 86157 -214184 -516074 -933003
31833 -933003 -1096276 -574319 292875 704469 470969 154163 168374 313587 235829 -139659
31823 -139659 -701868 -1274303 -1572659 -1383976 -870326 -442723 -285628 -211031 -13678 199248
31813 199248 100309 -459302 -1131683 -1258211 -578936 316876 568353 56202 -530310 -626728
31803 -626728 -314767 135413 641313 1006066 833749 120335 -534027 -667471 -489465 -339995
31793 -339995 -97413 436732 978068 1079447 739732 313246 79918 175682 566064 813152
31783 813152 366114 -556044 -933445 -273183 607313 719468 250850 17121 84044 -92528
31773 -92528 -438731 -249271 560698 1151377 965045 475963 388840 690926 913633 898943
31763 898943 844222 811548 624235 241638 -63495 -34390 198150 276653 157727 214228
31753 214228 598580 820062 421381 -136570 40703 898475 1326073 693634 -280033 -650294
31743 -650294 -503110 -431393 -381096 103722 828577 1055113 608722 123156 97198 305838
31733 305838 289585 -32431 -410301 -626074 -670367 -687433 -757762 -709153 -313715 293160
31723 293160 700873 805916 885062 980868 810748 537337 879576 1916852 2493759 1616629
31713 1616629 -70731 -1086854 -1005679 -605884 -403659 -113845 434072 886516 1094436
31704 1094436 1356883 1612828 1197136 -119106 -1468234 -1826232 -1229939 -555985 -340430
31695 -340430 -305770 15404 611652 1088144 1228283 1234170 1356307 1465394 1244665 749968
31685 749968 409336 383109 339542 61018 -174336 -124495 -38481 -151494 -167477 190965
31675 190965 489562 133756 -598930 -796513 -131748 786520 1272361 1194173 753501 222364
31665 222364 -46590 98438 241696 -155037 -865269 -1027741 -330988 483116 578523 34468
31655 34468 -445684 -497274 -369341 -387100 -505843 -477477 -286485 -226210 -456353 -647788
31645 -647788 -375576 170514 322146 -90790 -426639 -195307 219727 279372 192206 431573
31635 431573 778453 656506 167076 -48623 152200 348978 465832 862782 1460242 1655919
31625 1655919 1309177 988551 982061 860087 361692 -61812 -34058 130085 126149 321698
31615 321698 1061162 1835735 1898053 1367269 957326 786683 265467 -749029 -1408369 -877325
31605 -877325 493506 1445689 1217435 349864 -59014 284847 607511 240105 -371297
31596 -371297 -274288 591637 1247234 1019543 422391 349020 855946 1253851 1147969 829732
31586 829732 667305 613758 486017 368100 451905 658470 724185 622199 586018 626841
31576 626841 359508 -395439 -1071370 -897328 28659 707630 444400 -373123 -958495 -1123116
31566 -1123116 -1156116 -1086644 -660973 79446 731895 1039938 1066354 890726 513769 40845
31556 40845 -379093 -751543 -1069765 -1095624 -697473 -237112 -117524 -80088 423574 1182042
31546 1182042 1261498 285101 -960329 -1512337 -1307020 -915386 -679561 -561548 -520204 -560524
31536 -560524 -562610 -424235 -258074 -173845 -25443 330141 672686 653273 309658 21179
31526 21179 -26639 -15177 -98295 -155140 -75206 -26070 -201643 -459490 -485670 -265009 -92093
31515 -92093 -89648 -53307 81965 -6148 -479947 -856429 -567827 154279 531393 344094
31505 344094 155878 330727 511193 374870 272319 636949 1255241 1651220 1799626 1905295
31495 1905295 1810631 1239363 431205 -56739 -106903 -129868 -454852 -993717 -1406509 -1319770
31485 -1319770 -602859 285259 560729 82169 -359995 -162935 186030 -42742 -557315
31476 -557315 -461766 375309 1238359 1650102 1683626 1361423 660466 44791 76119 492505
31466 492505 548098 238579 246180 685412 963784 958941 1172840 1517394 1207476 268770
31456 268770 -131469 508406 1114802 764394 159947 320811 810083 570866 -188339 -359028
31446 -359028 200910 532362 183307 -296119 -512642 -742816 -1093033 -1154027 -795385 -460621
31436 -460621 -362522 -152785 286585 478221 186663 -70747 145190 446412 278405 -148667
31426 -148667 -228862 80541 322733 335344 317147 239714 -94249 -405036 -100487 721415
31416 721415 1155707 750100 229124 423401 1056558 1324957 1210190 1249360 1254418 455752
31406 455752 -932491 -1520903 -685079 364260 303168 -386751 -330106 527589 946538 407647
31396 407647 -264447 -429738 -500471 -838866 -922158 -325224 338765 322239 -28601 123500
31386 123500 663753 678693 -32877 -558375 -217204 458653 550917 50003 -263202 936
31376 936 398731 445783 292773 302227 360597 110827 -320384 -399764 -2281 404227 512022
31365 512022 548266 669688 584495 180503 -27891 359362 877709 814587 243331 -194563
31355 -194563 -248372 -125652 139815 632889 1018569 820863 197643 -241387 -318847 -309582
31345 -309582 -200226 266460 837707 881795 351972 -147217 -301818 -309137 -170159 297400
31335 297400 674749 248162 -658149 -772756 271836 1269036 1201681 620761 499186 678726
31325 678726 437039 -138324 -411247 -351793 -410381 -539039 -291729 239178 434252 86600
31315 86600 -344129 -439192 -247709 1776 182640 263442 329058 533898 807422 797443 347899
31304 347899 -200260 -420351 -259926 81528 386342 372979 -117465 -683055 -658447 -112174
31294 -112174 93288 -402009 -817666 -420375 344727 576262 164214 -395502 -855533 -1105963
31284 -1105963 -768232 189979 866477 398892 -782173 -1557363 -1623120 -1426037 -967316
31275 -967316 105772 1321003 1580419 760248 -1201 32387 243774 -137025 -751110
31266 -751110 -705596 98254 883648 997905 547348 143653 243363 670586 794698 309480
31256 309480 -364968 -739478 -962788 -1313387 -1335265 -375286 1093531 1701897 985002 35611
31246 35611 -69093 340962 324563 -175869 -459639 -324144 -348230 -909355 -1538053 -1474989
31236 -1474989 -594339 414919 757728 380220 11167 242803 754502 801450 349144
31227 349144 150206 591747 1094005 1007324 574634 470086 741472 841022 555118 259850
31217 259850 190648 38952 -449759 -883894 -644582 244002 1039968 1139873 759193 603002
31207 603002 982946 1455808 1354425 547066 -397471 -743807 -248799 656388 1273793 1212330
31197 1212330 584940 -249410 -957904 -1250944 -949750 -292336 58863 -295838 -894030
31188 -894030 -906915 -202918 519696 675581 369384 -66414 -548291 -985615 -1044326 -565420
31178 -565420 101489 516916 625053 546200 244695 -262903 -669865 -692340 -394158 27973
31168 27973 470106 722298 468053 -214977 -763647 -841961 -709132 -612598 -403543 -117998
31158 -117998 -226992 -754812 -879524 -143007 638578 550748 5677 -46470 274010 194087
31148 194087 -156259 -29046 354206 37363 -856199 -1129876 -562625 -341089 -956592 -1279817
31138 -1279817 -552342 185909 -199109 -1022416 -919952 -15750 470153 203050 -71958
31129 -71958 15173 144312 309050 865762 1534007 1539091 966146 871125 1658485 2330193
31119 2330193 1905994 792538 65310 -15241 -14726 -217088 -293594 -5867 422846 741486
31109 741486 956000 993860 547516 -387017 -1124877 -957107 -158574 181343 -476297 -1371627
31099 -1371627 -1449509 -772535 -337800 -596122 -873216 -485806 214183 415206 49275 -217412
31089 -217412 -54744 95140 -245125 -897271 -1307264 -1218669 -837771 -514835 -455215 -613429
31079 -613429 -705448 -430295 173779 695993 819025 689410 619283 552471 168752 -482407
31069 -482407 -858777 -626707 -144431 64123 38774 153635 342952 137900 -476724 -827120
31059 -827120 -440359 284544 653884 566295 389022 224799 -142550 -629320 -720775 -142077
31049 -142077 667838 986417 586036 -60123 -301614 36357 527091 651043 360053 34712
31039 34712 -49654 3782 -31644 -254737 -692463 -1281335 -1669776 -1401592 -524699 300436
31029 300436 548628 372527 156169 -53534 -268558 -123950 670759 1634676 1877131 1152531
31019 1152531 107336 -504659 -466081 -26637 385082 400880 40241 -227096 -66208 192371
31009 192371 -5848 -601169 -999641 -924043 -676352 -534072 -384770 -80498 248927 391511
30999 391511 291003 7937 -349062 -649244 -855318 -1006284 -958675 -448202 345721 723746
30989 723746 379091 -67424 -22918 66855 -533502 -1476632 -1716805 -1099645 -516407 -473045
30979 -473045 -559098 -456592 -399014 -371575 69051 782466 901446 232136 -205438 286959
30969 286959 933917 696474 -155074 -626235 -549432 -527357 -704936 -618373 -151419 227545
30959 227545 225581 74716 67226 217212 388511 411538 178497 -86979 94983 770799
30949 770799 1274214 1082309 591620 479363 627792 394345 -247529 -629593 -456990 -210207
30939 -210207 -296045 -419656 -120598 490871 884875 788944 449875 288526 433040 610894
30929 610894 511174 208436 57487 167378 288763 325656 536453 937276 939116 90070
30919 90070 -1092272 -1617934 -1252355 -682719 -459100 -349485 62576 610501 738027 278550
30909 278550 -253304 -178488 625911 1566746 1932905 1630315 1202393 1130780 1340378 1469943
30899 1469943 1362943 1111239 832627 611676 501057 436253 334193 356269 754555 1314164
30889 1314164 1368418 672459 -117247 -229968 256720 652614 576076 196216 -193177 -350671
30879 -350671 -41068 660541 1147718 884008 143860 -339119 -368479 -379061 -583307 -655655
30869 -655655 -394656 -133290 -240488 -632604 -1020676 -1290140 -1390820 -1161448 -565248 78945
30859 78945 372198 285859 169362 318541 621630 671276 255911 -310351 -519228 -340787
30849 -340787 -268520 -552509 -756033 -401267 270081 644960 619227 596418 744300 839393
30839 839393 819510 871552 880681 415638 -496502 -1124113 -911710 -214268 192926 23477
30829 23477 -427807 -807571 -936283 -716896 -212728 240934 312903 63435 -144570 -79665
30819 -79665 193195 505861 710542 629144 144908 -539048 -913680 -646722 -30276 250050
30809 250050 -108588 -638063 -688155 -284620 -41447 -194357 -213513 316667 884684 705212
30799 705212 -43764 -366910 105373 545496 140457 -712980 -979963 -417577 192895 170340
30789 170340 -283043 -574175 -571306 -651699 -1060166 -1512062 -1502573 -909351 -187530 82355
30779 82355 -188620 -524039 -444526 16099 434073 507784 294347 16444 -162061 -158322
30769 -158322 49674 393533 764348 1107198 1343104 1227668 548563 -430761 -994829 -692249
30759 -692249 128298 739315 833990 619030 304346 -33815 -145341 267685 977359 1303359
30749 1303359 995136 551020 378451 193248 -307715 -737509 -616295 -208912 553
30740 553 272165 1091203 1934036 1718780 562474 -111760 399932 1083355 857101 165833
30730 165833 -2348 158021 -269917 -1191560 -1491178 -713602 338997 866539 991549
30721 991549 1102363 1091822 758606 390858 368589 515088 396107 113938 275312 1097386
30711 1097386 1946523 2013781 1264470 425537 50955 -68190 -382394 -790600 -804006 -381871
30701 -381871 -54124 -105608 -174003 74039 357180 273862 -11946 -66341 117706 232868
30691 232868 260150 415309 609252 518787 185915 19060 120794 101867 -265201 -615073
30681 -615073 -469100 101581 540235 443593 -6646 -254290 -5697 381007 309998 -231452
30671 -231452 -597054 -408034 -141368 -372227 -785619 -596689 175629 597361 128681 -605794
30661 -605794 -699550 -143805 308109 171013 -319393 -672469 -673425 -419224 -110405 72896
30651 72896 44771 -99284 -135298 21970 138887 -76499 -509408 -685354 -439010 -241212
30641 -241212 -508267 -838447 -496074 435762 1066388 963249 690169 803624 1036624 954768
30631 954768 762040 815133 875686 570462 160395 74790 50228 -403384 -955946 -835270
30621 -835270 -131084 270921 92898 6239 374444 629989 298684 -206926 -339972 -269336
30611 -269336 -400042 -605575 -562517 -446536 -667364 -1142061 -1383768 -1204686 -889439 -715636
30601 -715636 -648302 -525792 -338667 -293117 -623796 -1244970 -1636507 -1342406 -592081 -83408
30591 -83408 -76635 -104674 245647 679040 630331 64389 -511824 -684786 -496452 -244159
30581 -244159 -124789 -80409 45460 178003 -8846 -557933 -870732 -355909 610850 967246
30571 967246 360495 -318688 -118379 768965 1431706 1471376 1255945 1155401 1104829 954703
30561 954703 809001 828643 905775 720593 142229 -475950 -542725 89876 837157 1062934
30551 1062934 935094 1144526 1766203 2004014 1341525 397197 147171 661292 1166783
30542 1166783 1157546 843780 529964 137434 -443343 -939913 -976774 -602571 -244079 -150570
30532 -150570 -123780 97434 369809 315305 -68809 -281964 36228 585382 788102 513857
30522 513857 111982 -138632 -242894 -214839 15399 377308 659483 776390 782366 666273
30512 666273 441127 353925 600262 875814 678303 66380 -379442 -407913 -375288 -552587
30502 -552587 -711682 -619148 -426332 -301294 -144499 52171 28172 -258259 -412317 -197479
30492 -197479 85309 144843 166635 345150 415331 133691 -177490 -106592 154616 162748 10316
30481 10316 155396 600318 828997 564157 109563 -117213 -26854 228978 512695 787137
30471 787137 1053320 1185696 873998 7440 -854455 -859065 60154 938255 940570 311767
30461 311767 -234722 -549459 -855101 -954425 -439273 459865 980322 799430 312950 -49402
30451 -49402 -221706 -219315 -46003 37885 -316733 -995533 -1481964 -1542000 -1408492 -1248465
30441 -1248465 -955704 -573928 -401245 -476326 -427066 -79641 180560 -56614 -628836 -1012124
30431 -1012124 -935011 -592611 -401979 -639460 -1152665 -1420025 -1125954 -627460 -492429 -600490
30421 -600490 -213613 900282 1919452 1883950 822486 -374365 -949464 -816358 -320610
30412 -320610 146146 349734 323297 299902 415082 543766 517937 355958 155534 -58894
30402 -58894 -219288 -138525 223905 574077 611251 431549 347811 394984 305497 -45008 -456699
30391 -456699 -714478 -821632 -837615 -710949 -416655 -102414 48295 -2089 -199535 -500451
30381 -500451 -791640 -862579 -670139 -532324 -791779 -1298964 -1508259 -1165224 -656464 -546205
30371 -546205 -953379 -1514659 -1782422 -1533835 -898300 -340760 -288633 -579897 -555257 39701
30361 39701 589781 481647 110356 344028 1120134 1387755 618207 -375383 -525587 153534
30351 153534 804597 882037 537418 106665 -266959 -564763 -801457 -976067 -954548 -580665
30341 -580665 -57675 76597 -394876 -1021775 -1256025 -1061315 -692780 -270723 59172 -13477
30331 -13477 -422515 -451737 338883 1225481 1123890 106228 -701528 -694873 -410457 -456534
30321 -456534 -681670 -730264 -683373 -695957 -580985 -232267 16641 -68106 -147399 119826
30311 119826 408623 206106 -312612 -507055 -243811 -36368 -198957 -421890 -346268 -115716
30301 -115716 -110447 -422813 -839361 -1161397 -1322268 -1280325 -987043 -474488 102416 538456
30291 538456 722617 742528 778557 819525 604165 32502 -468244 -321920 395288 885365
30281 885365 583508 -94989 -293453 177243 672991 609436 84774 -475609 -868709 -1074535
30271 -1074535 -1019972 -735662 -546820 -742593 -1133656 -1241215 -888410 -356583 -5090 28058
30261 28058 -180167 -379230 -245668 269549 739803 708436 296125 28982 73347 27942
30251 27942 -434828 -1069379 -1356545 -1063568 -389997 249792 524083 439692 316991 376259
30241 376259 481484 511695 721901 1297148 1771412 1502314 644925 3825 -83196 -33596
30231 -33596 -155311 -258914 -284857 -523589 -942327 -1055097 -772095 -606887 -714573 -587660
30221 -587660 -122351 -16972 -507720 -714598 -79194 497039 7621 -965135 -1119061 -386843
30211 -386843 252528 461860 707402 1013984 927085 639925 857010 1488756 1706450 1386072
30201 1386072 1271369 1535715 1434939 699353 59787 -42703 -125994 -520527 -637490 -37298
30191 -37298 706186 904133 711822 520394 150241 -622140 -1363304 -1518623 -1158964 -639344
30181 -639344 -55438 447474 451263 -58614 -392469 -129626 228086 206756 272614 985108
30171 985108 1845017 1933252 1276126 635452 264451 -169552 -643056 -741596 -510546 -428167
30161 -428167 -487258 -161762 568045 958174 552955 -142473 -380737 -104470 154007 -5582
30151 -5582 -470517 -759053 -435561 438502 1250575 1427660 1038068 588977 333815 91329
30141 91329 -304249 -709836 -871485 -694766 -306922 11671 29583 -191604 -399089 -558335
30131 -558335 -862850 -1224677 -1216619 -803075 -610613 -1001874 -1364473 -944768 12612 682180
30121 682180 878813 1013944 1054703 522634 -433003 -933757 -600036 -55842 113441 149578
30111 149578 473035 937461 1210736 1320524 1329755 1002661 333570 -73801 226203 742003
30101 742003 673551 54620 -379300 -288327 -36643 28721 -32719 -133631 -346331 -579818
30091 -579818 -559421 -276122 -19407 153202 484465 887702 828848 189878 -301382 -48707
30081 -48707 442497 278647 -407990 -614999 -43124 393641 -19463 -644041 -372485 804851
30071 804851 1803535 1803702 996589 67792 -498362 -570074 -296879 2544 168193 393487
30061 393487 821649 1120244 896970 396382 230211 476275 645490 517934 316367 8556
30051 8556 -721809 -1574512 -1606082 -595484 375135 363220 -122672 -44555 565265 914103
30041 914103 910975 1153778 1573236 1274190 -13558 -1297339 -1584721 -1072267 -599298 -495929
30031 -495929 -529790 -599808 -855774 -1222783 -1298772 -839291 -100440 433954 582515 594337
30021 594337 705884 727205 339117 -230872 -277167 409972 1055347 793757 -243639 -1188961
30011 -1188961 -1522036 -1380259 -1012471 -540540 -165553 -8891 207916 757779 1280716
30002 1280716 1225644 829312 829298 1172767 1001700 219765 29399 1222084 2739963 2847875
29992 2847875 1296824 -525760 -1337794 -1051608 -265124 495380 875846 689678 147142
29983 147142 -221504 -99252 313414 601332 582563 402409 300773 333742 321221 142618
29973 142618 49779 445293 1274498 1920462 1874977 1270714 581047 75993 -210700 -281312
29963 -281312 -229242 -236466 -255704 -3827 446825 493768 -123589 -691628 -413769 347697
29953 347697 498238 -216614 -892724 -828213 -395129 -236384 -298811 -165253 155639 339814
29943 339814 353633 425593 564776 556102 372704 225582 214288 212864 103542 -93725 -305533
29932 -305533 -435417 -359484 -85016 130577 26601 -295728 -434320 -148920 345468 564780
29922 564780 192596 -600101 -1213002 -1129154 -490775 -10488 -133622 -467348 -326465 291969
29912 291969 682941 389386 -233627 -554890 -398833 -7957 401845 707947 728245 413352
29902 413352 103983 188771 493313 409354 -255367 -931858 -1018934 -658866 -477132 -739905
29892 -739905 -1115793 -1193020 -888613 -337136 284400 700339 599556 -2949 -610438 -696795
29882 -696795 -297960 24760 -163538 -696401 -1048185 -943897 -596072 -353524 -282208 -217206
29872 -217206 -123590 -167583 -384139 -508929 -312173 55970 262408 230490 157550 167271 199616
29861 199616 222580 296184 414803 520456 658681 850723 847927 389731 -267897 -540128
29851 -540128 -360632 -334014 -782344 -1182111 -1003286 -620667 -738797 -1227864 -1289844 -671258
29841 -671258 51208 440283 708768 1064285 1239835 1037856 783329 805073 893988 710578
29831 710578 379706 238375 276527 270396 238232 311315 327875 20082 -481814 -755371 -668647
29820 -668647 -503717 -513025 -650812 -726237 -582305 -184517 269248 473121 439652 518921
29810 518921 710402 395046 -682728 -1569402 -1117154 275162 927354 80621 -1109195
29801 -1109195 -1225976 -398511 230076 196018 21369 161156 506361 890258 1361278 1815011
29791 1815011 1889442 1432245 746186 243189 92711 236686 475239 504040 148906 -360046
29781 -360046 -567947 -301724 193470 634334 985807 1312884 1548492 1502930 1014465 115548
29771 115548 -819510 -1189402 -701084 193016 654519 338229 -297497 -629543 -565847 -434640
29761 -434640 -404322 -329576 -140512 -58049 -246289 -454646 -310227 72937 143950 -285755
29751 -285755 -675210 -529240 -212006 -427292 -1055818 -1225206 -608312 97657 272479 226676
29741 226676 467205 759357 612744 240353 244902 600382 708667 363135 -26635 -115063
29731 -115063 92338 556026 1178607 1538870 1312093 901761 958556 1331428 1293361 795452
29721 795452 556665 764220 713175 107438 -295459 76192 650691 759367 829509 1570673
29711 1570673 2562011 2741455 2020969 1374257 1374792 1580190 1454970 1060271 599479 4879
29701 4879 -662062 -945253 -572989 -1124 20736 -665414 -1424045 -1517483 -895297 -238745
29691 -238745 -180188 -552717 -636246 -153435 362046 391803 209957 399551 866457 896464
29681 896464 164380 -786685 -1173982 -787748 -121043 101554 -442046 -1286437 -1501051 -656124
29671 -656124 589185 1110043 471551 -743523 -1631341 -1733963 -1259102 -856714 -1082738
29662 -1082738 -1788901 -2154860 -1619076 -621435 -79363 -312386 -915319 -1509710 -2033532
29653 -2033532 -2321255 -2044796 -1273245 -603956 -472557 -657336 -668266 -347249 92134 382191
29643 382191 406682 267855 222381 387926 537849 405248 101904 -82429 -200266 -531120
29633 -531120 -967847 -1017756 -516724 120250 507104 704609 861255 887806 728689 550001
29623 550001 390799 4865 -665515 -1220091 -1315934 -1110586 -864151 -465747 212278 797897
29613 797897 795447 328001 -21345 -68248 -214867 -699023 -1136391 -1073063 -684562 -572537
29603 -572537 -940684 -1272340 -938882 26058 947883 1281899 1137878 931117 759783 429228
29593 429228 -29663 -265058 -85435 292257 585078 745899 799671 676572 398588 184992
29583 184992 158562 139773 -72432 -395157 -625181 -731934 -783958 -730479 -467269 -44157
29573 -44157 320781 362558 -90022 -867068 -1344037 -959022 9972 604720 379871 -15412
29563 -15412 155486 607303 582157 172652 208964 819639 1032726 207260 -871550 -986022
29553 -986022 -155519 435268 72619 -642133 -776885 -320562 -14463 -240933 -613674 -661452
29543 -661452 -437899 -234062 -29664 389104 887153 949428 274060 -847102 -1812035 -2157522
29533 -2157522 -1691663 -522285 813420 1508623 1152967 206613 -461586 -497629 -269306
29524 -269306 -168290 -87748 196094 437561 158968 -550594 -916759 -400802 539031 965446
29514 965446 628429 209283 359988 914181 1264143 1180021 926035 787890 854559 1146749
29504 1146749 1592917 1912848 1839778 1442638 968600 451839 -196002 -791117 -978588 -722976
29494 -722976 -314032 94420 505088 651921 143808 -800157 -1334767 -1024686 -427913 -294248
29484 -294248 -604731 -809577 -651714 -300429 56957 312890 342960 210132 258870 632527
29474 632527 932892 753647 289471 -31564 -233580 -554463 -775126 -483616 82907 186871
29464 186871 -348507 -884734 -908838 -596618 -248804 173179 610508 613533 -11210 -679505
29454 -679505 -681814 -92673 442514 611568 631860 664406 547278 177178 -225880 -382470
29444 -382470 -277866 -126526 -120283 -232355 -218175 104730 509056 475733 -166550 -911277
29434 -911277 -1138831 -841581 -461098 -157897 291764 880395 1177842 965033 639536 670050
29424 670050 945741 1033507 876889 820216 999798 1112004 863309 356901 -86377 -285734
29414 -285734 -265767 -117858 86233 304821 482638 461258 44133 -675485 -1164375 -928601
29404 -928601 -134160 556504 777910 736255 665530 502320 299769 440680 1028704 1475597
29394 1475597 1204746 482571 23183 -220 32945 -12775 103435 366326 414272 170159
29384 170159 -47057 -141226 -331351 -489952 -124375 683038 1063032 573909 -40037 62302
29374 62302 534558 427145 -326575 -869837 -715183 -252443 55529 230969 372059 331826
29364 331826 81523 -79229 59073 349765 633296 958982 1236171 1063558 270590 -629499
29354 -629499 -930409 -583708 -216367 -293868 -568259 -491262 31366 554693 738926 778978
29344 778978 991746 1215465 1036720 555158 380086 691885 868098 452688 2192 326714
29334 326714 1191887 1550720 1021966 369081 326707 625153 553367 18191 -398227 -210911
29324 -210911 452400 987790 828919 -4949 -822206 -970179 -638612 -575561 -965069 -1119061
29314 -1119061 -511423 409303 827127 553796 -21816 -601538 -1066324 -1179490 -802225
29305 -802225 -284556 -97146 -147019 6107 315492 264626 -194780 -385407 114355 788632
29295 788632 931608 667120 670866 1103414 1426283 1272443 926406 744521 575936 135259
29285 135259 -356396 -394561 28107 358838 297632 203301 421477 630246 329696 -277644
29275 -277644 -503199 -223750 -77108 -451437 -892988 -858508 -510887 -269238 -22473 543531
29265 543531 1120027 1060456 444934 76032 258060 335839 -188345 -755936 -566084 164616
29255 164616 471796 -1393 -604543 -681176 -378895 -240405 -419677 -624390 -598786 -357917
29245 -357917 -41449 218040 298148 146851 -116218 -270416 -222639 -99117 -47033 -4412
29235 -4412 198704 493001 515448 74349 -470115 -581426 -270821 -93406 -342290 -641953
29225 -641953 -566796 -281571 -197037 -290566 -233399 8559 204562 347087 557202 593377
29215 593377 101734 -617248 -797369 -325113 61058 -17686 41680 705682 1306728 970517
29205 970517 27539 -437181 -174694 54351 -161790 -322827 2132 484546 686664 721112
29195 721112 839453 902594 703338 394798 181322 -50195 -378853 -467277 8567 777459
29185 777459 1251862 1230734 962994 688869 496749 474375 589798 526492 49757 -521712
29175 -521712 -623381 -213799 171086 167024 -30271 -128255 -167835 -268884 -294998 -79936
29165 -79936 245338 464062 627165 849966 910391 513349 -58953 -106689 469132 829874
29155 829874 310769 -554144 -750444 -264050 -29367 -413410 -681959 -280719 278275 429164
29145 429164 619349 1430825 2239428 1930742 705425 -57046 215959 631992 432534
29136 432534 85691 227270 520192 347509 -93573 -199624 68245 358111 604096 808122
29126 808122 590176 -251825 -1066527 -1028047 -254402 488570 937311 1365102 1677690 1429136
29116 1429136 765463 459274 813601 1269950 1298209 973661 457534 -353077 -1285413 -1654772
29106 -1654772 -1082508 -118011 430725 460466 414216 418179 98419 -747407 -1670085 -1926056
29096 -1926056 -1246457 -187828 354468 51390 -532529 -636564 -178453 287527 331093
29087 331093 40557 -257260 -327490 -117150 164250 116553 -357570 -733666 -472844 127332
29077 127332 220234 -418783 -1063958 -1028802 -469108 21532 153293 7391 -231845 -310609
29067 -310609 -10362 476891 569390 1221 -730444 -925094 -494499 69660 380864 487269
29057 487269 570858 624511 543892 400322 439314 735305 975713 818420 425939 283304
29047 283304 409952 247721 -407294 -935768 -840633 -572369 -680252 -690245 126375 1203665
29037 1203665 1187931 17141 -827608 -490948 95484 -157159 -826111 -829660 -126865 410704
29027 410704 322128 -101688 -452667 -485283 -80812 490476 634549 262825 69130 434631
29017 434631 667659 66278 -851923 -1096467 -730698 -648727 -1108154 -1497178 -1432517 -1132668
29007 -1132668 -749811 -236278 138191 21170 -262654 -79203 359202 171850 -718402
28998 -718402 -1299163 -966806 -358430 -238316 -428147 -428485 -348836 -515688 -722262 -601528
28988 -601528 -358719 -442464 -761226 -886684 -851987 -1073371 -1502910 -1501077 -741466 226348
28978 226348 625944 408403 214534 444336 717282 449321 -269257 -752825 -637289 -261401
28968 -261401 -9378 198284 433303 340763 -222302 -595489 -169990 446510 75351 -1263641
28958 -1263641 -2229641 -2003067 -1277889 -1007873 -1077722 -886160 -535018 -578849 -954745 -985949
28948 -985949 -402169 241625 253164 -415289 -1116429 -1104537 -271086 653032 827577 260446
28938 260446 -264571 -210736 215020 632491 954229 1083911 783043 178053 -172338 -75955
28928 -75955 8507 -154348 -116505 346991 633288 301278 -69673 120920 315389 -297642
28918 -297642 -1217853 -1235522 -347564 230377 -46270 -424133 -304367 -96730 -206864 -245377
28908 -245377 170893 667824 755045 555364 373193 129273 -273910 -540343 -406080 -71865
28898 -71865 120574 50171 -297566 -761195 -747755 173414 1270365 1219664 8739 -829436
28888 -829436 -418912 222795 -22412 -576567 -386246 117793 -152904 -874912 -808216 -16711
28878 -16711 174870 -570568 -1111330 -836602 -527576 -702480 -633291 204271 1005950 918825
28868 918825 414378 390688 724828 713798 311605 -41354 -323404 -756485 -1122217 -1090113
28858 -1090113 -889832 -888661 -850219 -389250 187177 326894 216556 421201 756518 485237
28848 485237 -413635 -1118590 -1201055 -1104822 -1188550 -1121495 -600165 7239 197666 68142
28838 68142 92007 438458 833873 918978 538761 -176471 -894251 -1341988 -1489915 -1390154
28828 -1390154 -1011221 -454298 -102680 -193938 -423990 -366407 -87986 90051 196489 411260
28818 411260 489132 81580 -494475 -586203 -277916 -310294 -849517 -1204909 -982498 -642123
28808 -642123 -560477 -403300 63505 321313 -93032 -742839 -933203 -707404 -540341 -467406
28798 -467406 -224294 56895 688 -321649 -456791 -232278 121337 397827 557556 585436
28788 585436 558121 663442 860585 831576 589698 687106 1343501 1843536 1445219 495699
28778 495699 -82785 -82508 25476 130154 515102 949054 772486 42911 -348710 329
28768 329 411245 242470 -160839 -139022 279889 601976 626330 460947 150777 -226148
28758 -226148 -394623 -247594 -99261 -192976 -278247 -96143 58934 -211592 -668171 -729530
28748 -729530 -351536 -5983 142009 394249 805404 958387 681404 427274 583145 843986
28738 843986 704002 243409 -69888 -169117 -446156 -1047620 -1598265 -1716699 -1411079 -859492
28728 -859492 -199897 309670 364012 119270 211435 881338 1460592 1236338 511319 158414
28718 158414 314318 275778 -313620 -964997 -1193869 -1106699 -865213 -333042 327876 467328
28708 467328 -60315 -402431 69143 667041 410539 -375485 -558731 11547 411210 280498
28698 280498 292010 725150 798439 21502 -792726 -675734 55068 367252 41958 -235609
28688 -235609 -42052 340775 551573 517953 206876 -378664 -896717 -891765 -415572 27065
28678 27065 211546 392702 671594 697468 261202 -275907 -516167 -626089 -953202 -1304895
28668 -1304895 -1168665 -582376 -203214 -375266 -651724 -534986 -234404 -230824 -429954 -371403
28658 -371403 -140103 -353120 -1121174 -1709183 -1562498 -1082558 -905881 -917185 -620598 -137176
28648 -137176 -55298 -404525 -562433 -271967 -25660 -186889 -374293 -131528 282996 293043
28638 293043 -81887 -217644 261164 977639 1212823 669184 -195849 -596084 -268157 180487
28628 180487 23485 -578138 -792615 -397175 -198381 -789103 -1476214 -1163505 -2309
28619 -2309 696793 254742 -484264 -420152 283629 578240 92181 -442700 -376643 -63920
28609 -63920 -213295 -772795 -1044029 -746262 -344180 -228859 -164249 144575 432332 313415
28599 313415 3971 18862 322936 413001 212226 215824 596406 802030 388018 -249727
28589 -249727 -413375 -34356 391157 576616 685180 865923 961216 755952 295558 -110934
28579 -110934 -139285 222957 540128 310782 -377562 -812900 -515033 94726 217467 -283145
28569 -283145 -787282 -846031 -748727 -989104 -1509345 -1779603 -1483394 -847928 -324418 -162178
28559 -162178 -324468 -625234 -845292 -848637 -712686 -654203 -715631 -662197 -371234 -145384
28549 -145384 -293928 -517217 -219289 509887 821190 279390 -476482 -671886 -424631 -242794
28539 -242794 -56563 414088 767735 463172 27589 486423 1522315 1544981 46444
28530 46444 -1382257 -1177008 116227 891778 771986 621421 785859 646515 -115518
28521 -115518 -919446 -1155331 -886866 -520973 -371591 -618872 -1155605 -1472405 -1222710 -815933
28511 -815933 -863633 -1193241 -1160180 -833422 -946225 -1574206 -1840544 -1265467 -510530 -293552
28501 -293552 -359682 -143267 220553 259854 42154 -30434 71312 182189 485027 1138257
28491 1138257 1634607 1364175 706694 688429 1460490 1968792 1441819 453856 4496 118171
28481 118171 24488 -574934 -1127190 -1111062 -721402 -470883 -480600 -450785 -182938 114916
28471 114916 61069 -452350 -1076513 -1304002 -1004412 -605829 -603174 -915276 -960783 -452797
28461 -452797 141483 166055 -376795 -867048 -885929 -618255 -374352 -112547 301097 644216
28451 644216 542257 52900 -301531 -163556 225623 341892 3603 -437281 -501856 -110990
28441 -110990 342211 465600 327770 292617 438819 434912 107540 -186107 -45688 347936
28431 347936 492279 319927 234450 393097 452430 190254 -78219 -15494 157386 652
28421 652 -427165 -623462 -353142 83570 326546 357053 324961 271092 190131 154318 182404
28410 182404 132487 -88318 -320474 -355195 -265375 -318927 -577317 -787169 -720110 -465027
28400 -465027 -314136 -459361 -840736 -1206077 -1304566 -1107358 -815828 -558333 -192572 369550
28390 369550 766195 520796 -209141 -697067 -621728 -466553 -649753 -809266 -469836 68916
28380 68916 230081 192858 550570 1096953 954474 28112 -653627 -396320 246269 494073
28370 494073 448101 537498 598157 319458 62962 341454 836508 823974 357024 149163
28360 149163 390532 546273 335511 83352 2853 -103562 -279627 -278577 -161098 -309917
28350 -309917 -643463 -559386 61391 556493 551536 538585 880155 1028984 473033 -204886
28340 -204886 -124187 479975 624920 129156 -223425 -50693 114368 -81451 -129321 427338
28330 427338 1088194 1045481 334777 -271650 -310692 -31239 160647 184034 171703 222298
28320 222298 340550 410750 233017 -195274 -475864 -179423 554514 1089410 1055171 746475
28310 746475 605854 602845 395589 -96386 -615467 -982973 -1278303 -1581196 -1770681 -1632218
28300 -1632218 -1041136 -103063 730519 855608 161012 -609291 -563978 250967 922169 885748
28290 885748 538566 438748 490467 339871 71029 -60600 -208039 -604505 -937049 -770459
28280 -770459 -430379 -646969 -1300504 -1387827 -512711 363560 139509 -1032373 -2108232
28271 -2108232 -2478066 -2337341 -2017773 -1589863 -1098612 -693893 -446382 -346262 -489654
28262 -489654 -955401 -1480403 -1590906 -1180741 -711506 -659115 -905263 -887720 -344859 283936
28252 283936 356822 -144442 -554972 -409795 -91367 -248005 -753814 -786411 -6626 874058
28242 874058 973967 278815 -529370 -931820 -870327 -478627 -2848 154925 -211986 -745606
28232 -745606 -888405 -593954 -315671 -328645 -475381 -606576 -818135 -1082634 -1024969 -347550
28222 -347550 698243 1461098 1426936 579337 -580679 -1329951 -1284246 -778942 -504125 -700844
28212 -700844 -954799 -842810 -452923 -96054 162059 389274 462652 222177 -165915 -327793
28202 -327793 -132326 215276 471984 527146 363634 106606 30558 230394 361292 56867
28192 56867 -429181 -438062 141506 591057 295163 -413149 -716782 -385348 55967 142292
28182 142292 2649 -28787 17104 -172053 -662518 -1089949 -1088077 -787823 -701959 -1035298
28172 -1035298 -1288878 -819574 252679 1058292 1017259 507150 252288 397255 583348
28163 583348 668394 818370 974586 818717 365859 78586 200680 424055 451650 455392
28153 455392 642464 750751 427900 -125835 -375590 -218931 -85158 -244590 -413204 -197920
28143 -197920 307104 554021 116588 -821079 -1542550 -1447357 -703436 -145498 -392356 -1167956
28133 -1167956 -1649864 -1370744 -569845 232727 707501 763637 441357 -80248 -515419 -657731
28123 -657731 -502434 -153756 308595 820533 1256273 1439123 1257641 783760 271694 -1779
28113 -1779 69201 379057 737931 1010687 1167634 1247514 1244113 1037813 573577 116417 42651
28102 42651 227706 29628 -749932 -1291908 -784389 257425 563768 -45164 -401700 171766
28092 171766 821064 544348 -309859 -765166 -703749 -640291 -551260 -54216 515725 348071
28082 348071 -530210 -1186651 -1124746 -776887 -514269 -96568 583553 1048471 971735 707023
28072 707023 638748 564392 186480 -229641 -173528 382776 904277 790902 -117385 -1250243
28062 -1250243 -1570623 -627237 653490 864622 -96944 -896106 -651026 -101161 -349491
28053 -349491 -1197639 -1537451 -947633 -62893 467580 650054 754736 812734 649570 149511
28043 149511 -554804 -1044593 -921779 -305757 197077 194423 -84521 -261127 -332279 -430283
28033 -430283 -390039 49174 795322 1474320 1806597 1711733 1264866 750603 497504 463999
28023 463999 285707 -104869 -318276 -189498 -118432 -367914 -514614 -92182 617340 968203
28013 968203 809265 441582 29498 -376901 -481588 -22328 690361 1023662 748869 146421
28003 146421 -434395 -727728 -503417 163478 764810 933281 916277 1048965 1084928 625033
27993 625033 -71621 -375485 -212455 -41994 -29546 104443 480625 931253 1407527 1900985
27983 1900985 2052099 1520084 701490 368116 571151 626820 256043 -23164 179230 526676
27973 526676 562956 317455 20516 -267985 -490008 -508596 -393929 -359191 -317085 -20458
27963 -20458 288098 32470 -702179 -1031768 -465395 393032 734616 573904 438735 513152
27953 513152 569198 401613 -61334 -753310 -1271131 -1078705 -231684 522042 689915 600818
27943 600818 654263 596561 147766 -161099 391964 1477942 1926846 1245877 264617 54801
27933 54801 680658 1302317 1247920 703111 389326 720176 1372980 1717903 1527282 1050506
27923 1050506 498409 -153428 -806971 -1141168 -1074497 -938216 -930363 -766497 -195974 467680
27913 467680 722372 538631 255408 3838 -364635 -875465 -1317198 -1517138 -1493414 -1363020
27903 -1363020 -1252185 -1218387 -1157454 -917996 -561426 -297287 -137341 61563 177977 -81842
27893 -81842 -542813 -586802 -106303 176390 -203175 -640016 -376896 260663 342578 -264728
27883 -264728 -822697 -893360 -725520 -480124 38280 664539 692619 -165894 -1207927 -1557023
27873 -1557023 -1148866 -520140 4105 447879 755094 737689 441276 172936 62843 -125647
27863 -125647 -567633 -940393 -727287 2560 450910 19786 -824883 -1077695 -539379 -74452
27853 -74452 -359634 -963476 -1066034 -601586 -137770 38865 106194 171598 148636 92154
27843 92154 153346 259016 254677 224263 239026 48510 -409381 -498238 312349 1319459 1255970
27832 1255970 137799 -613650 -192461 496940 321847 -459264 -875869 -798256 -810302 -974675
27822 -974675 -776335 -172814 236578 164352 -19423 -36365 -87072 -251621 -150536 406182
27812 406182 920461 829594 334137 141912 532188 1094083 1352670 1256678 962043 483435
27802 483435 -190909 -811590 -988121 -626631 -78219 219406 162202 -1530 2468 180887
27792 180887 276610 73251 -268359 -278106 263725 938219 1146029 909528 805150 1027954
27782 1027954 1071069 642446 331437 758574 1462402 1430262 591387 -68992 33024 350490
27772 350490 241218 -33601 106991 530128 602717 160866 -355228 -652966 -943378 -1460438
27762 -1460438 -1985333 -2037176 -1437611 -589732 -134387 -266430 -506967 -351094 17280 49566
27752 49566 -229100 -194587 357282 800456 586882 -6199 -427092 -600179 -639811 -350117
27742 -350117 346225 902977 810342 470479 644613 1214664 1316392 664121 -74726 -323822
27732 -323822 -246486 -146717 53099 389272 499526 111509 -499969 -877674 -884605 -603328
27722 -603328 -92433 495780 884886 1019446 1152192 1387882 1468949 1217650 835754 550629
27712 550629 354959 332199 763496 1541690 1945036 1507251 756417 528509 844255 1109329
27702 1109329 1205850 1587817 2260351 2463507 1703394 522844 -179170 -205653 -8259 123082
27692 123082 290899 504895 496366 171237 -120828 -32461 278774 389356 250608 255505
27682 255505 622483 1027426 1021327 587507 83302 -171448 -22324 565177 1327045 1653815
27672 1653815 1173024 322984 -100090 60458 273864 267641 375880 752169 908492 467176
27662 467176 -157849 -351482 -170785 -93916 -224218 -306729 -279958 -232453 -14672 498628
27652 498628 902768 660572 -43149 -468865 -357606 -180974 -279297 -377474 -165278 175542
27642 175542 296490 143202 -121869 -332376 -334576 -129956 -37698 -297473 -532439 -199132
27632 -199132 384436 235338 -800475 -1574285 -1197135 -353917 -287897 -993517 -1342794 -783689
27622 -783689 18877 300297 155690 98627 221773 186419 -204512 -713415 -910771 -657363
27612 -657363 -358013 -577052 -1266224 -1626925 -1039996 82686 765933 634874 171142
27603 171142 -85543 -78585 30370 147839 128710 -203470 -726072 -1027840 -903176 -560055
27593 -560055 -246222 5814 154933 39147 -321503 -608578 -581056 -320985 7100 315094
27583 315094 377528 -122765 -1064994 -1783405 -1835073 -1550785 -1443462 -1406861 -1020637 -405843
27573 -405843 -127224 -281012 -332697 -24541 134446 -373167 -1229498 -1618956 -1215181 -465793
27563 -465793 21138 67398 -83217 -118272 38922 146148 -116330 -703659 -1089843 -790071
27553 -790071 45016 783118 1046603 1027621 1019317 957362 640409 167318 -151172 -222672
27543 -222672 -246743 -397474 -660168 -936661 -1063875 -774642 31710 932907 1239353 761388
27533 761388 47917 -312129 -352886 -466494 -741240 -915432 -860286 -741409 -690927 -607377
27523 -607377 -362321 -30691 160598 44091 -318977 -637409 -643539 -395273 -170484 -11794
27513 -11794 329863 825039 921855 280828 -529902 -633400 -28850 409263 134308 -468118
27503 -468118 -820471 -906033 -988280 -1084546 -1117488 -1212976 -1429894 -1483810 -1150538 -699904 -511733
27492 -511733 -483685 -280663 15044 49082 -80961 165014 933494 1668297 1844266 1572701
27482 1572701 1203831 721033 -61283 -928410 -1349221 -1103235 -482557 145435 648469
27473 648469 915617 679475 -155057 -1155724 -1665778 -1490905 -1037618 -701097 -393887
27464 -393887 114403 637539 737323 386924 53661 28484 79662 -5056 64633 603836
27454 603836 1261405 1355297 833404 345499 276856 268319 -58444 -425991 -388429 -107848
27444 -107848 -92040 -367243 -495110 -345444 -257267 -358762 -303111 110590 561266 735282
27434 735282 773518 844459 720193 248693 -125301 105551 690333 935466 695853 429568
27424 429568 344910 173024 -171434 -392394 -421466 -563796 -834820 -834715 -560751 -602347 -1089987
27413 -1089987 -1203265 -386561 582071 566384 -325758 -999560 -945429 -633551 -476056 -351593
27403 -351593 -231145 -381285 -710762 -688308 -228957 7526 -418152 -1024341 -1091460 -600390
27393 -600390 -68159 209204 331352 428016 476488 395128 127607 -271230 -563328 -496137
27383 -496137 -69224 516810 1076914 1385712 1152056 487476 152009 682232 1414594 1173641
27373 1173641 -53609 -997934 -821155 -55745 448082 578426 518803 181477 -270346
27364 -270346 -142200 805541 1755698 1924986 1587291 1295312 873645 125085 -227406 476461
27354 476461 1437537 1307701 211021 -467230 -190883 167195 -44647 -359831 -210332
27345 -210332 284828 875901 1501034 1737962 993857 -344143 -968619 -369128 445957
27336 445957 457146 -94555 -537917 -879727 -1283583 -1316489 -667890 36979 81854 -221031
27326 -221031 -161834 128367 43962 -310035 -341251 -113129 -224331 -666807 -800533 -461380
27316 -461380 -163844 -130660 2064 371453 592458 473558 311866 288697 239876 174242
27306 174242 319826 495305 186029 -530075 -899083 -614925 -239741 -162002 513 453717
27296 453717 572260 -60077 -710882 -513646 152316 291409 -123552 -281421 -10136 28604
27286 28604 -367176 -572177 -298736 -120614 -434859 -778786 -684247 -454340 -514397 -644758
27276 -644758 -497600 -318845 -459562 -631771 -400637 -46430 -119422 -400215 -208858 343708
27266 343708 381412 -308930 -802803 -398375 315845 347613 -283360 -708384 -514561 -193044
$$ [...]
##END NTUPLES=NMR SPECTRUM
##END=
