##TITLE=31Pdec_LY-13Dix.2.B
 CD3CN, 24 sc
 2.06.2021
##JCAMPDX= 6.0         $$ Bruker NMR JCAMP-DX V2.0
##DATA TYPE= NMR SPECTRUM
##DATA CLASS= NTUPLES
##ORIGIN= UXNMR, Bruker Analytische Messtechnik GmbH
##OWNER= root
$$ XWIN-NMR		Version 3.5
$$ Wed Jun  2 10:10:46 2021 Russian Standard Time (UT+4h)  she@DPX200
##.OBSERVE FREQUENCY= 81.013821
##.OBSERVE NUCLEUS= ^31P
##.ACQUISITION MODE= SIMULTANEOUS
##.ACQUISITION SCHEME= undefined
##.AVERAGES= 24
##.DIGITISER RES= 16
##SPECTROMETER/DATA SYSTEM= spect
##.PULSE SEQUENCE= zgpg30
##.SOLVENT NAME= CD3CN
##.SHIFT REFERENCE= (INTERNAL, CD3CN, 0, 248.564)
##AUDIT TRAIL= $$ (NUMBER, WHEN, WHO, WHERE, WHAT)
$$ ##TITLE= Audit trail, XWIN-NMR		Version 3.5
$$ ##JCAMPDX= 5.01
$$ ##ORIGIN= Bruker BioSpin GmbH
$$ ##OWNER= she
$$ F:/spectra/data/she/nmr/P31/1/pdata/1/auditp.txt
$$ ##AUDIT TRAIL=  $$ (NUMBER, WHEN, WHO, WHERE, WHAT)
(   1,<2021-06-02 10:08:09.89 +0400>,<she>,<DPX200>,
      <created by zg, POWCHK disabled, PULCHK disabled
       configuration hash MD5:
       00 E9 B6 7A A2 85 ED C7 34 08 36 98 17 FE 4E 26
       data hash MD5: 32K
       88 6A AB 60 B2 5C 43 27 C3 06 99 6C 02 F4 20 8B>)
(   2,<2021-06-02 10:09:44.59 +0400>,<she>,<DPX200>,
      <Start of raw data processing
       efp BC_mod = 2 LB = 1 FT_mod = 6 PKNL = 1 PHC0 = -5911.882 PHC1 = 128.2726 SI = 64K 
       data hash MD5: 64K
       EE A9 E1 F8 8F 60 F3 C8 12 55 0F A1 0E CD B8 26>)
(   3,<2021-06-02 10:10:02.31 +0400>,<she>,<DPX200>,
      <pk PHC0 = 19.46299 PHC1 = 0 
       data hash MD5: 64K
       DC BE 8C 88 A9 AD 5D 8B F8 29 22 98 F3 82 CB D6>)
(   4,<2021-06-02 10:10:05.75 +0400>,<she>,<DPX200>,
      <abs ABSG = 5 
       data hash MD5: 64K
       66 8B 20 43 44 17 5A C3 1C 1C 60 80 9A 08 68 AC>)
$$ ##END=
$$ 
$$ hash MD5
$$ 40 B6 F4 B7 4A F7 75 CF 46 86 AB 70 E0 A7 DB 79
##$RELAX= 
##$RELAX= 
##$RELAX= 
##$RELAX= 
##$RELAX= 
##$RELAX= 
##$RELAX= 
##$RELAX= 
$$ Bruker specific parameters
$$ --------------------------
##$DU= <F:/spectra>
##$EXPNO= 1
##$NAME= <P31>
##$PROCNO= 1
##$TYPE= <nmr>
##$USER= <she>
##$AMP= (0..31)
100 100 100 100 100 100 100 100 100 100 100 100 100 100 100 100 100 100 
100 100 100 100 100 100 100 100 100 100 100 100 100 100 
##$AQSEQ= 0
##$AQ_mod= 1
##$AUNM= <au_zg>
##$AUTOPOS= <>
##$BF1= 81.014009
##$BF2= 200.13
##$BF3= 200.13
##$BF4= 200.13
##$BF5= 200.13
##$BF6= 200.13
##$BF7= 200.13
##$BF8= 200.13
##$BYTORDA= 1
##$CFDGTYP= 0
##$CFRGTYP= 5
##$CHEMSTR= <none>
##$CNST= (0..31)
1 1 145 1 1 1 1 1 1 1 1 1 1 1 1 1 1 1 1 1 1 1 1 1 1 1 1 1 1 1 1 1 
##$CPDPRG= <waltz16>
##$CPDPRG1= <>
##$CPDPRG2= <waltz16>
##$CPDPRG3= <>
##$CPDPRG4= <mlev>
##$CPDPRG5= <mlev>
##$CPDPRG6= <mlev>
##$CPDPRG7= <mlev>
##$CPDPRG8= <mlev>
##$CPDPRGB= <>
##$CPDPRGT= <>
##$D= (0..31)
0 1 0 0 0 0 0 0 0 0 0 0.03 2e-05 3e-06 0 0 0 0 0 0 0 0 0 0 0 0 0 0 0 0 
0 0 
##$DATE= 1622614089
##$DBL= (0..7)
120 120 120 11 120 120 24 19 
##$DBP= (0..7)
150 150 150 150 150 150 150 150 
##$DBP07= 0
##$DBPNAM0= <>
##$DBPNAM1= <>
##$DBPNAM2= <>
$$ [...]
##$SUBNAM3= <"">
##$SUBNAM4= <"">
##$SUBNAM5= <"">
##$SUBNAM6= <"">
##$SUBNAM7= <"">
##$SUBNAM8= <"">
##$SUBNAM9= <"">
##$SW= 501.771253377433
##$SWIBOX= (0..15)
0 1 3 0 0 0 0 0 0 0 0 0 0 0 0 0 
##$SW_h= 40650.406504065
##$TD= 32768
##$TD0= 1
##$TE= 0
##$TE2= 300
##$TE3= 300
##$TEG= 300
##$TL= (0..7)
0 120 53 12 22 120 120 120 
##$TP= (0..7)
150 150 150 150 150 150 150 150 
##$TP07= 0
##$TPNAME0= <>
##$TPNAME1= <>
##$TPNAME2= <>
##$TPNAME3= <>
##$TPNAME4= <>
##$TPNAME5= <>
##$TPNAME6= <>
##$TPNAME7= <>
##$TPOAL= (0..7)
0.5 0.5 0.5 0.5 0.5 0.5 0.5 0.5 
##$TPOFFS= (0..7)
0 0 0 0 0 0 0 0 
##$TUNHIN= 0
##$TUNHOUT= 0
##$TUNXOUT= 0
##$USERA1= <user>
##$USERA2= <user>
##$USERA3= <user>
##$USERA4= <user>
##$USERA5= <user>
##$V9= 5
##$VALIST= <valist>
##$VCLIST= <CCCCCCCCCCCCCCC>
##$VD= 0
##$VDLIST= <DDDDDDDDDDDDDDD>
##$VPLIST= <PPPPPPPPPPPPPPP>
##$VTLIST= <TTTTTTTTTTTTTTT>
##$WBST= 1024
##$WBSW= 4
##$XGAIN= (0..3)
0 0 0 0 
##$XL= 0
##$YL= 0
##$YMAX_a= 3969
##$YMIN_a= -10104
##$ZGOPTNS= <>
##$ZL1= 120
##$ZL2= 120
##$ZL3= 120
##$ZL4= 120
##$ABSF1= 248.5645
##$ABSF2= -253.2056
##$ABSG= 5
##$ABSL= 3
##$ALPHA= 0
##$AQORDER= 0
##$ASSFAC= 0
##$ASSFACI= 0
##$ASSFACX= 0
##$ASSWID= 0
##$AUNMP= <proc_1d>
##$AZFE= 0.1
##$AZFW= 0.5
##$BCFW= 0
##$BC_mod= 2
##$BYTORDP= 0
##$COROFFS= 0
##$CY= -3
##$DATMOD= 1
##$DC= 0
##$DFILT= <>
##$DTYPP= 0
##$F1P= 0
##$F2P= 0
##$FCOR= 1
##$FTSIZE= 65536
##$FT_mod= 6
##$GAMMA= 0
##$GB= 0
##$INTBC= 1
##$INTSCL= 5.30512e-09
##$ISEN= 30
##$LB= 1
##$LEV0= 0
##$LPBIN= 0
##$MAXI= 10000
##$MC2= 0
##$MEAN= 0
##$ME_mod= 0
##$MI= 50
##$NCOEF= 0
##$NC_proc= -4
##$NLEV= 6
##$NOISF1= 182.463
##$NOISF2= 159.3651
##$NSP= 0
##$NTH_PI= 0
##$NZP= 0
##$OFFSET= 248.5645
##$PC= 4
##$PHC0= -5892.419
##$PHC1= 128.2726
##$PH_mod= 1
##$PKNL= yes
##$PPARMOD= 0
##$PSCAL= 0
##$PSIGN= 0
##$REVERSE= no
##$SF= 81.014009
##$SI= 65536
##$SIGF1= 159.3651
##$SIGF2= -187.1042
##$SINO= 113.3802
##$SIOLD= 16384
##$SREGLST= <1H.CDCl3>
##$SSB= 0
##$STSI= 65536
##$STSR= 0
##$SW_p= 40650.406504065
##$SYMM= 0
##$S_DEV= 0
##$TDeff= 32768
##$TDoff= 0
##$TI= <>
##$TILT= no
##$TM1= 0
##$TM2= 0
##$TOPLEV= 0
##$USERP1= <user>
##$USERP2= <user>
##$USERP3= <user>
##$USERP4= <user>
##$USERP5= <user>
##$WDW= 1
##$XDIM= 65536
##$YMAX_p= 527292738
##$YMIN_p= -48148155
$$ End of Bruker specific parameters
$$ ---------------------------------
##NTUPLES= NMR SPECTRUM
##VAR_NAME=  FREQUENCY,     SPECTRUM/REAL,   SPECTRUM/IMAG
##SYMBOL=    X,             R,               I
##VAR_TYPE=  INDEPENDENT,   DEPENDENT,       DEPENDENT
##VAR_FORM=  AFFN,          ASDF,            ASDF
##VAR_DIM=   65536,         65536,           65536
##UNITS=     HZ,            ARBITRARY UNITS, ARBITRARY UNITS
##FACTOR=    0.620285442955139, 1,           1
##FIRST=     20137.2065510759, 0,            0
##LAST=      -20513.1999529892, 0,           0
##MIN=       -20513.1999529892, -48148155,   0
##MAX=       20137.2065510759, 527292738,    0
$$ Real data points
##PAGE= N=1
##DATA TABLE= (X++(R..R)), XYDATA
$$ [...]
##PAGE= N=2
##DATA TABLE= (X++(I..I)), XYDATA
37766 -322019 -189234 -171557 -619027 -809969 2658 1214212 1503274 589430 -585638
37757 -585638 -1249175 -1379217 -1037806 -276597 224006 -368937 -1614148 -1974939 -868820
37748 -868820 534955 1095875 1155213 1444881 1632228 1066797 204667 27714 448875 495268
37738 495268 -80705 -483583 -213176 246379 280258 -77466 -463859 -691866 -712311 -549938
37728 -549938 -442827 -621411 -843122 -588259 170422 840282 982910 769697 506151 187114
37718 187114 -189436 -298855 96764 662925 837737 547045 223676 187637 361710 595289
37708 595289 885705 1144904 1088532 628638 149593 57861 192666 74920 -313054 -468501
37698 -468501 -162445 226206 390674 566968 935014 1079878 639973 69913 37926 372061
37688 372061 415346 203111 349072 851745 1063995 934761 1153701 1770260 1836175 955643
37678 955643 72617 -16088 128784 -214170 -524584 -27106 721662 626320 -83967 -248997
37668 -248997 238583 353724 -169792 -385585 142873 581935 334279 69346 510738 1198591
37658 1198591 1302543 905547 628445 551531 339134 27213 -84279 -42545 -73976 -48734
37648 -48734 256425 573677 465402 102671 93820 557569 942097 835745 455789 187891
37638 187891 62865 -75968 -172560 -20194 346596 545513 246715 -355586 -636407 -246736
37628 -246736 400232 613680 326088 138958 443120 942729 1217542 1288081 1312904 1161970
37618 1161970 747646 449185 650975 1035922 925795 303936 -69056 299087 944960
37609 944960 1076156 574829 64914 115512 643269 1096443 1049881 550190 -33891 -372187
37599 -372187 -351309 -24941 444103 821391 969146 1002764 1102980 1164200 882500 269662
37589 269662 -200805 -127210 360764 828373 991408 793780 310773 -202803 -424212 -351270
37579 -351270 -310459 -368063 -131386 515296 928392 521395 -282565 -590339 -283582 39971
37569 39971 195379 552774 1029736 978112 388460 208472 904413 1609742 1468068 1021417
37559 1021417 1254418 1854816 1659610 585699 -181923 -40351 217757 -139940 -584794
37550 -584794 -274447 579105 1081609 897139 379527 -169855 -658751 -869855 -657581 -335939
37540 -335939 -281456 -323746 -127194 53951 -255711 -797964 -876360 -573752 -672005 -1188774
37530 -1188774 -1102806 -31503 874250 523754 -479630 -812190 -399687 -236357 -615745
37521 -615745 -847565 -700228 -808931 -1317552 -1293213 -145099 1255520 1661828 1076338
37512 1076338 512028 519682 742179 768630 688472 709203 758149 665025 457136 324781 418383
37501 418383 720852 1053106 1227221 1197996 971481 458109 -300947 -825532 -580673 238357
37491 238357 820487 831118 803580 1112861 1236610 644606 -162279 -333409 -1956 2613
37481 2613 -413219 -469996 143071 769594 882779 799420 908346 971135 705161 407437
37471 407437 409842 438577 137349 -191884 -29808 467040 663467 373771 7653 -109058
37461 -109058 -18171 200786 517301 711430 538706 181014 103654 409203 733143 826676
37451 826676 817998 803465 623591 246077 376 162576 557901 826220 898566 967581
37441 967581 1094783 1076494 713323 108991 -351345 -375973 -144839 -171193 -657080 -1164411
37431 -1164411 -1167358 -761627 -478485 -520374 -620221 -607429 -598480 -569795 -290049 154223 305905
37420 305905 57716 -110812 72545 223935 90847 167831 845553 1473660 1195345 422534
37410 422534 411599 1361225 2034158 1605672 866526 935106 1585609 1759811 1247257 825958
37400 825958 853857 736536 57447 -583245 -395729 436991 1036632 1020091 784558 646689
37390 646689 362686 -230720 -647625 -360404 302019 488041 21426 -356920 -90716 466292
37380 466292 757152 865892 1114111 1295584 1047196 697753 913244 1571688 1838644 1448267
37370 1448267 1058022 1098071 1135522 804690 535546 718945 852599 323345 -474342 -678927
37360 -678927 -273816 57592 187690 666160 1537395 1979592 1442153 442516 -145211 -86327
37350 -86327 258827 549131 697950 776548 913588 1084554 957382 280176 -566616 -869870
37340 -869870 -531313 -222926 -442241 -921799 -1184146 -1149377 -913014 -469494 -32538 -102104
37330 -102104 -734180 -1204457 -939103 -380248 -327577 -762091 -1001524 -777640 -413394 -48633
37320 -48633 505602 1064427 1002705 195095 -584126 -607302 -120015 85879 -276170 -781939
37310 -781939 -963284 -758987 -325304 234803 815118 1190542 1169348 850225 590080 634657
37300 634657 833079 813009 422070 -104328 -407593 -334100 -24770 191696 51169 -307756
37290 -307756 -344337 235649 896223 796186 -44253 -652196 -394002 224410 431240 279255
37280 279255 273397 390213 236622 -87183 -99442 175355 215074 -51086 -29855 624618
37270 624618 1491738 1984469 1975899 1665015 1272947 1011930 960350 921976 786235 871204
37260 871204 1328373 1457116 545225 -689496 -698437 612916 1504212 906362 6623 328890
37250 328890 1377329 1584934 820951 337170 573334 677392 264594 72839 443589
37241 443589 536622 -229916 -1055806 -934652 -139648 371734 444483 654413 1077777 1095917
37231 1095917 440215 -318326 -514277 -142585 311671 466161 293995 -6544 -237414
37222 -237414 -351595 -421247 -467395 -421904 -289561 -174587 -53284 273200 829841 1262836
37212 1262836 1224696 849395 601550 713620 992131 1139856 1048367 781141 493416 413339
37202 413339 684606 1102175 1167054 609446 -188544 -520080 -182695 232640 93060 -405553
37192 -405553 -503951 4715 446811 299137 19858 306907 886448 800239 -155799 -1051177
37182 -1051177 -1069225 -471729 1539 115229 89216 37371 -34982 14092 238247 371461
37172 371461 229867 76550 155094 159970 -294915 -927525 -1114294 -790719 -368544 121194
37162 121194 1012732 2068857 2388228 1575279 344237 -434120 -716865 -891566 -959345
37153 -959345 -710437 -316190 -96729 63587 450188 844785 778176 388867 329038 716502
37143 716502 860886 307623 -435090 -627432 -308544 -79546 -171163 -264067 -110746 170997
37133 170997 422334 612919 615474 224200 -439638 -881954 -815902 -532357 -468054 -629876
37123 -629876 -707178 -564764 -305435 43504 546693 1059574 1235922 933947 388815 -93320
37113 -93320 -390560 -443706 -159717 373417 789105 812802 618688 576765 711399 674213
37103 674213 279396 -178987 -282738 -33792 132392 -102115 -477981 -370502 488394 1579345
37093 1579345 2026409 1474263 413249 -391804 -629316 -528255 -438869 -538991 -826842
37084 -826842 -1138591 -1193630 -857977 -386311 -187448 -303081 -342986 -34252 394677 565598
37074 565598 509870 602376 988725 1367469 1425160 1256106 1174602 1254672 1283252 1127480 916884
37063 916884 813634 793837 738238 566085 188182 -457400 -1155763 -1424837 -1039386 -368573
37053 -368573 118126 484343 1022246 1485309 1305283 651081 496584 1235866 1920992 1535846
37043 1535846 513462 126374 625507 965064 461195 -210864 -85554 723756 1284610
37034 1284610 1052813 286868 -484772 -929779 -990734 -891870 -968844 -1204637 -1123391 -482216
37024 -482216 166463 87374 -594475 -1018319 -749171 -219787 125146 491326 1150461 1699604
37014 1699604 1504392 668313 -17723 -73041 206334 332902 235273 123893 108605 168010
37004 168010 261351 301609 226258 199109 455654 818439 747526 133326 -351653 -94670
36994 -94670 590118 932352 781540 617262 647859 584313 308906 87048 5043 -151591
36984 -151591 -312983 -118509 271701 128383 -673251 -1191234 -729127 65528 176090 -265364
36974 -265364 -345964 107539 380614 133390 -154626 -110277 -8456 -159238 -414379 -528901
36964 -528901 -480572 -238715 283280 864490 1031635 655832 108765 -247456 -305276 35494
36954 35494 789909 1506334 1590510 1162797 981809 1331446 1620998 1342067 781373 449099
36944 449099 394326 458338 647174 861902 798736 521695 597056 1232303 1829478 1856026
36934 1856026 1584221 1431934 1182889 569365 101335 445447 1276113 1601722 1122333
36925 1122333 514141 397371 687678 998895 1112217 974942 686545 533021 694699
36916 694699 962828 1023772 845113 484497 -145457 -864482 -963220 -37579 1143715 1360956
36906 1360956 475909 -463559 -661315 -399809 -289482 -363405 -245589 216772 818615 1283606
36896 1283606 1503935 1590047 1681296 1648712 1207026 481786 95558 353111 733504 660822
36886 660822 390416 531916 1025701 1278933 1076741 688762 325002 171371 618904 1608370
36876 1608370 2090741 1194850 -286194 -765715 -141147 133476 -599898 -1215891 -676211
36867 -676211 433158 1017490 1049176 1125022 1285925 1217812 1045056 1090479 1274264 1379449
36857 1379449 1427458 1259872 408358 -959790 -1671156 -972891 242867 563392 -53769
36848 -53769 -486328 -199295 258421 388554 367522 423179 397133 147030 -177697 -413003
36838 -413003 -512167 -373188 58723 534247 732545 699960 699623 741280 659047 541417 657130
36827 657130 1002464 1270707 1220571 838832 302411 -15314 192141 630462 546348 -224621
36817 -224621 -816205 -437185 532029 1132571 1064764 650405 27852 -726918 -1004345 -220871
36807 -220871 1084633 1670993 1188043 495994 291809 284386 -22491 -504826 -723105 -474175
36797 -474175 213436 1105463 1620859 1263942 398829 -13973 309763 591692 185557 -469120
36787 -469120 -551951 -30784 427656 450716 351088 566634 1042818 1275500 924577 323944
36777 323944 168101 568317 779164 235188 -520853 -570781 -8260 226789 -172541 -477445
36767 -477445 -162539 334499 461349 402626 587774 934248 1111947 1140145 1233912 1360008
36757 1360008 1349097 1214591 1056948 866582 632012 420177 231275 37159 -7470 259117
36747 259117 643225 847658 1006782 1387817 1648670 1175804 188936 -388439 -308273 -264173
36737 -264173 -527665 -449128 191987 526046 56462 -330511 172044 817822 518239 -302947
36727 -302947 -469249 -41153 11029 -255024 149367 1117183 1240570 50150 -1069490
36718 -1069490 -914197 -131905 47455 -282581 -192393 343275 402515 -341332 -1036954 -805403
36708 -805403 166230 972188 1092704 856885 865572 1174650 1266609 852197 357279 288074
36698 288074 392668 21775 -763132 -1126287 -657932 9913 125702 -198378 -394139 -383646
36688 -383646 -507834 -737760 -614342 -25896 483986 423354 42663 4360 472705 843042
36678 843042 478296 -487283 -1300231 -1453270 -1102726 -624438 -177281 89051 -142481 -844511
36668 -844511 -1266976 -701538 474840 1157706 938767 515340 541241 780881 761988 608403
36658 608403 635537 597413 83662 -542610 -383732 724020 1820052 1972139 1359791 852223
36648 852223 843561 986398 952541 905376 1042133 1106017 753041 189964 -13875 287837
36638 287837 670464 819872 864405 871611 587520 43799 -128510 414064 940049 488680
36628 488680 -711523 -1456095 -1139115 -324371 315186 796487 1306639 1644642 1613914 1411744
36618 1411744 1221225 897205 420640 163563 298510 430455 254003 95753 311067
36609 311067 612262 569232 352187 332089 316129 -78436 -549778 -419543 266384 706011
36599 706011 454677 -90533 -393127 -340843 1779 586589 1115453 1106007 498317 -166559
36589 -166559 -364192 -84691 352854 622342 492640 34746 -223176 183084 914554 1138798
36579 1138798 677436 238429 316388 539920 469546 378452 695423 1207386 1447469 1463657
36569 1463657 1536258 1478259 979814 434985 577458 1290212 1607601 1109108 559045 756975
36559 756975 1350204 1353514 512421 -417161 -630714 -56584 799319 1391194 1448690 1083591
36549 1083591 737222 819218 1254547 1531104 1308020 809497 456287 288085 28400 -381656
36539 -381656 -676977 -706932 -583919 -288279 407834 1342609 1777438 1320967 661664 689732
36529 689732 1127348 893048 -187547 -1013940 -844604 -346242 -422428 -808813 -671152 -33671
36519 -33671 342425 199503 -28620 -127036 -296612 -457493 -234641 254890 429122 234127
36509 234127 291719 789449 1057807 680934 251570 436491 937217 1050410 742873 454353
36499 454353 256314 -11722 -77412 437507 1152522 1242040 664244 287388 605965 1063026
36489 1063026 985017 558954 389606 524869 490255 99796 -275415 -245151 144355 549737
36479 549737 700734 572976 337059 192986 193228 227791 222833 293011 590630 1010866 1162746
36468 1162746 728622 -142594 -875428 -990030 -580211 -161154 -11461 160455 736845
36459 736845 1511385 1776785 1154333 128607 -400784 -33477 777002 1264153 1146193
36450 1146193 816069 756680 912684 820264 316187 -180964 -246814 -33751 28772 -70140
36440 -70140 33660 359724 415131 -26596 -398721 -23976 879329 1369765 986818 332587
36430 332587 237261 683771 931961 569028 20302 -55155 450606 1087233 1388106 1205248
36420 1205248 680996 147154 -40411 182716 480562 520474 390446 372143 433296 316678
36410 316678 70892 35771 239183 276653 -39701 -346484 -274299 70786 430165 791561
36400 791561 1144786 1238992 984962 750612 822528 905987 634830 232743 93741 30721
36390 30721 -342468 -707004 -369360 525338 989530 605948 152849 457002 1277782 1782271
36380 1782271 1620497 1057406 434406 -17723 -106128 132905 325107 170181 -181514 -399255
36370 -399255 -404789 -288395 -38405 337203 611193 576922 366184 265878 328916 389937
36360 389937 344280 197724 -42013 -320322 -482317 -428119 -227296 11459 222624 274771
36350 274771 48479 -253642 -201555 235526 477663 69026 -623170 -807918 -218910 666036
36340 666036 1242058 1297896 988638 597477 362633 364631 535902 786024 1019013 1057314
36330 1057314 784363 383315 154493 90700 5439 61181 585945 1246391 1146708 132616
36320 132616 -733544 -581383 62447 231435 49566 298600 889823 965560 424124 153106
36310 153106 564622 962801 711387 105526 -330971 -569932 -625303 -190169 653418 1048962
36300 1048962 417130 -588747 -873103 -286017 408126 624499 387206 -68850 -481978
36291 -481978 -514419 -89829 361432 486079 597208 1106340 1635178 1437088 579665 -78601
36281 -78601 -89015 190098 447307 807408 1162716 1012942 387114 97794 517894 877489
36271 877489 494982 -10891 315693 1143404 1339980 800155 518315 800143 727245 -151667
36261 -151667 -794839 -153588 1174823 1757439 1266174 629766 523979 670411 624752 433696
36251 433696 326057 330510 376695 385782 229753 -34500 -2470 536671 1063115 952459 498335
36240 498335 519836 980616 966336 245564 -202585 239797 698940 103884 -1101398 -1570503
36230 -1570503 -986136 -326368 -306889 -546955 -450216 -100219 71536 -41232 -246466 -413022
36220 -413022 -498171 -419663 -130998 263208 574140 667010 547411 378582 340678 405562
36210 405562 390638 297137 336760 486211 363656 -167935 -606068 -415763 214812 651549
36200 651549 652267 488200 389492 337592 325754 395865 459998 434699 455550 629837 747632
36189 747632 612406 457884 623052 1034175 1441115 1865564 2280138 2200861 1322939 283210
36179 283210 -50101 140816 -21484 -583115 -655570 65001 768348 820742 570932 464743
36169 464743 335071 90914 174393 683437 888494 358864 -193696 -399 533179 579602
36159 579602 274743 349398 813171 1051800 975994 1042198 1242986 1070249 499504 81397
36149 81397 -47030 -339221 -820922 -786393 71605 961474 984476 340023 -29358 293024
36139 293024 832579 1042001 1013611 1220539 1769833 2154875 1834372 948732 232512 169663
36129 169663 501990 716097 696051 608040 452057 176467 39786 330206 776941 765903
36119 765903 218198 -208465 42986 754507 1281470 1297120 1002926 790478 857119 1069102
36109 1069102 1154308 1078169 1104152 1317003 1302087 676715 -178327 -419366 166432 854448
36099 854448 968726 749353 914827 1657087 2455071 2758673 2514302 2020182 1536024 1132514
36089 1132514 777493 434568 78263 -308638 -675722 -852768 -666063 -159073 404817
36080 404817 823329 1109569 1285371 1221371 874320 504978 385412 405530 276117 41729
36070 41729 27260 273254 419639 271412 121927 293565 634251 757483 614972 519959
36060 519959 645554 780016 649690 298713 36077 102717 484931 975431 1294862 1214868
36050 1214868 757722 300188 254638 529436 542784 -5178 -604782 -534040 175810 825797
36040 825797 1034177 1093262 1276677 1395941 1307240 1298604 1550816 1653664 1165911 364751
36030 364751 -58517 132673 568829 813636 686064 252168 -143186 -79671 346632 472170
36020 472170 43678 -189676 479801 1460933 1526620 577031 -196992 22473 735266 1049403
36010 1049403 751141 148004 -437751 -652174 -212781 588826 1032631 939729 905654 1237954
36000 1237954 1378005 911992 469569 858340 1786765 2275138 2037319 1621442 1341310
35991 1341310 940061 368680 82992 286922 497962 236438 -270697 -437966 -100019
35982 -100019 379898 611558 526296 337684 367596 818945 1514429 1916985 1625932 869529
35972 869529 318609 349175 660989 734568 475011 177591 15913 -50344 108942 743661
35962 743661 1570678 1707925 764364 -367844 -466122 434983 1111461 820536 170321 79124
35952 79124 522626 783462 548937 265785 524859 1372257 2167607 2090107 1020930 -92270
35942 -92270 -154813 746346 1439852 1208648 602618 445630 733352 1034301 1359058 1889552
35932 1889552 2248666 1860439 897841 167895 80885 306125 417316 348513 237424 308641
35922 308641 851924 1800579 2408494 1954062 789200 74854 359197 1003049 1190140
35913 1190140 918620 689445 721103 887185 1092449 1295390 1346904 1147161 858704 715563
35903 715563 704743 633021 439704 268062 241465 288774 241669 100913 137937 581092 1192446
35892 1192446 1419299 1101127 719111 702006 845501 823840 901887 1489509 2197352 2128295
35882 2128295 1157727 182621 -90167 79833 158886 115372 88175 -108622 -581734 -884504
35872 -884504 -545776 166666 530307 266067 -275253 -683895 -835298 -743534 -437649 8575
35862 8575 519524 1018395 1290077 1094560 594566 350859 607979 885887 620588 -67057
35852 -67057 -606599 -704257 -433311 111096 755815 1078079 830084 389106 277337 405541
35842 405541 363566 278732 643732 1306729 1440778 737809 -69759 -216875 149304 415859
35832 415859 382856 239695 65496 -139128 -159043 238680 923354 1528329 1831419 1773665
35822 1773665 1320296 612625 72225 10419 239348 355057 286640 272194 396557 467795
35812 467795 318853 -14322 -375417 -555329 -377047 74706 431397 480755 478931 741771
35802 741771 1085749 1044692 549546 3852 -265220 -229958 114424 760459 1369491 1460113
35792 1460113 1091841 886482 1137134 1378152 1166503 801000 776676 928298 747514 304976
35782 304976 147865 348811 386404 76889 -91713 155189 299063 -207301 -1069240 -1556615
35772 -1556615 -1433188 -965041 -307222 516565 1207410 1398666 1220087 1081769 939840
35763 939840 403767 -410321 -838121 -634664 -296684 -191596 -88399 112676 -19678 -571289
35753 -571289 -771454 -129281 559356 288586 -544222 -682988 95350 801801 913447 1017637
35743 1017637 1521649 1847867 1444337 705417 263774 50102 -315730 -723363 -759765 -339746
35733 -339746 290344 850616 1060175 820096 577277 915158 1561886 1573255 822332 360992
35723 360992 757423 1118534 611712 -57680 144064 723616 416946 -736760 -1537363
35714 -1537363 -1523695 -1271434 -976108 -267456 549754 621114 125233 227318 1109180 1568886
35704 1568886 1098405 791748 1377603 1835915 1093063 -140854 -516928 -80592 157474
35695 157474 -52886 -229125 -352131 -706070 -890884 -285050 696996 1005022 528651 178044
35685 178044 427367 834702 1042721 1222516 1390655 1253475 938446 991227 1394574 1425477
35675 1425477 799707 196114 273113 816059 1230855 1311005 1162527 897082 750759 1012501
35665 1012501 1468256 1377992 423642 -686193 -984847 -369057 422534 758844 677973 578766
35655 578766 665657 787195 724530 530552 460048 562145 603726 551781 793174 1519851
35645 1519851 2190445 2116614 1425346 886982 841807 846802 432700 -267696 -731662 -532691
35635 -532691 359276 1412481 1806718 1313657 724069 869947 1449740 1505486 856787 204713
35625 204713 -87277 -321263 -519436 -244254 352707 391756 -322241 -750352 -145441 771832
35615 771832 968033 657739 760551 1351875 1664641 1350920 835326 539567 519830 789633
35605 789633 1302388 1631520 1290496 424788 -291730 -464579 -275426 -4225 326776 783486
35595 783486 1281782 1565663 1340477 599129 -102557 -51611 737705 1451308 1551357 1430084
35585 1430084 1595590 1759409 1367759 635346 307918 587375 961937 1007354 781174 505961
35575 505961 371533 542725 898465 952207 535674 304557 924618 1956130 2290733 1634087
35565 1634087 809693 544191 671901 701324 515556 247894 -26214 -191660 -52203 391687
35555 391687 870275 1143475 1151777 894546 430536 -48279 -388475 -591523 -545675 25662
35545 25662 969296 1467770 992689 164111 -15662 501918 975370 1072569 1037513 904034
35535 904034 547039 389360 971712 1833290 1965138 1452203 1416983 2111667 2425690 1758861
35525 1758861 1024552 1075769 1413591 1371578 1385809 1944991 2306042 1602033 483309 247873
35515 247873 821464 980086 297650 -446891 -675089 -585052 -350568 89346 392103 77437
35505 77437 -459456 -286717 547457 941058 462386 35004 420333 1027979 906279 132258
35495 132258 -497050 -579814 -269209 201330 548899 409534 -139710 -362744 287501 1390418
35485 1390418 2126123 2323458 2396119 2487666 2312471 1779948 1211759 878875 759327 832749
35475 832749 1214795 1823148 2201396 1948349 1260837 836398 1115305 1690610 1706240 954043
35465 954043 292647 635395 1730364 2466756 2323878 1864264 1671298 1546097 1171649
35456 1171649 902011 1206623 1743536 1748904 1185302 795769 1022029 1495255 1701898 1613457
35446 1613457 1467196 1349776 1236269 1165271 1185526 1298215 1514810 1778655 1834527 1451869
35436 1451869 817307 429387 531146 875720 1080197 958366 505990 -107867 -468404
35427 -468404 -185090 615255 1342276 1614183 1595884 1561404 1490026 1331531 1324669 1664951
35417 1664951 2025317 1800552 848871 -249087 -726308 -323098 539899 1190257 1289704
35408 1289704 1004088 632437 265789 -31715 28636 603420 1233366 1274968 855882 781370
35398 781370 1296110 1616501 1119797 379756 371329 1072032 1598455 1508181 1214022 1148808
35388 1148808 1216041 1191679 1135992 1238960 1601956 2212226 2835530 3048674 2765228 2536211
35378 2536211 2816741 3168815 2894154 2270365 2230925 2808732 2965576 2259345 1611062 1856570
35368 1856570 2502975 2672706 2435448 2306594 2173824 1803228 1799111 2734511 3627688 2752402
35358 2752402 115356 -2215012 -2715495 -2198766 -2314260 -3214296 -3675900 -3003373 -1801743
35349 -1801743 -979639 -796385 -1010194 -1373222 -1710317 -1822303 -1586152 -1101901 -634812
35340 -634812 -387118 -306260 -135757 278466 760073 974149 778746 299465 -227546 -514812
35330 -514812 -318083 212332 459390 69139 -394359 -128621 627743 777377 -8919 -715865
35320 -715865 -482221 150432 202445 -215641 -281967 73478 153581 -210959 -407935 -170449
35310 -170449 12104 -141152 -195538 173630 601605 704698 662044 682459 539490 145830
35300 145830 -46583 179502 262254 -163624 -335753 611399 2062705 2479907 1482797 316258
35290 316258 103260 615315 1064997 1189952 1083788 740750 339695 351470 790381 921573
35280 921573 321839 -286995 37662 1106866 1913957 2015283 1839619 1785557 1768675 1656025
35270 1656025 1497630 1270715 909356 575590 425477 227833 -219896 -464489 79814
35261 79814 1046978 1395348 868904 351964 551041 1140836 1537521 1711906 1793855 1622689
35251 1622689 1233664 1131363 1504604 1775601 1511002 1153304 1192850 1274045 944053 677753
35241 677753 1144582 1902675 1958275 1389449 1238889 1827633 2345757 2271458 2057844 2063640
35231 2063640 1864811 1176089 569265 621833 1039529 1259473 1317666 1455947 1417690 897983
35221 897983 310697 329025 873730 1259299 1207753 1048584 983691 826665 532147 387464
35211 387464 525697 724526 834682 968766 1105421 956287 485540 174200 414064 897847
35201 897847 988761 549390 33196 -177101 -122748 82932 525766 1141177 1414046 895984
35191 895984 -31517 -394578 190975 963471 971500 304089 -98781 250072 814695 887207
35181 887207 520627 292785 454240 708916 722218 492238 211240 29352 22377 207545
35171 207545 498009 737248 842448 869958 926734 1068396 1285477 1524504 1689946 1658496
35161 1658496 1344125 794347 232488 -58116 25342 289869 449025 437910 435705 561130
35151 561130 660833 485222 25229 -409849 -462500 -51290 570530 1052406 1215228 1093639
35141 1093639 802516 469152 258968 295430 491572 590692 449159 174272 -51742 -123506
35131 -123506 46038 482041 920923 914080 395385 -106615 -128441 82754 -24274 -414101
35121 -414101 -467868 118249 892668 1243579 1101760 884502 963260 1321226 1595766 1403692
35111 1403692 750045 106870 -40222 341678 935127 1451259 1696063 1522984 1086942
35102 1086942 914503 1255775 1567121 1205859 480352 304086 838258 1277670 1131822
35093 1131822 893450 1080998 1366338 1181435 624351 205127 113701 237136 515278 803931
35083 803931 768703 399263 243723 619003 991991 750503 218927 183627 658233 915367
35073 915367 665868 413371 531451 687779 438839 -117193 -549184 -590644 -228812 387551
35063 387551 940635 1092020 810463 406729 176507 140554 123255 -62460 -441334 -729630
35053 -729630 -519904 153258 633239 377823 -278601 -506323 -21926 682887 1088190 1156530
35043 1156530 1102220 1119627 1395300 1946012 2361703 2137867 1372200 732320 636230 869138
35033 869138 1078316 1151963 975388 384393 -344994 -490755 206746 1044119 1229912 925541
35023 925541 892855 1341813 1702597 1463039 701177 -224819 -1005379 -1287225 -755358 379086
35013 379086 1280779 1252125 501922 -112891 -60116 411176 783765 924095 1030144 1154440
35003 1154440 1131510 970671 963326 1227839 1427568 1232161 891176 995262 1702790 2537077
34993 2537077 2985646 2979221 2690039 2199718 1584001 1069653 826814 741164 629706 568016
34983 568016 756189 1141488 1439612 1505046 1431079 1296961 1103053 996292 1229815 1741960
34973 1741960 2070110 1914494 1524896 1242388 960007 513288 369099 1191700 2652568
34964 2652568 3454222 2918155 1874213 1410363 1363798 886307 60044 -156823 454505
34955 454505 931013 604309 59807 106083 562932 720672 438486 122943 18416 123012
34945 123012 470873 935677 1073053 704425 336840 462114 812732 931040 1063295 1685872
34935 1685872 2442460 2480131 1751459 1085984 937985 920653 697502 502608 558757 727684
34925 727684 975398 1472635 1990292 1931934 1285435 827169 996117 1245705 956598 351087
34915 351087 -2956 -18206 108817 381374 735979 796203 480616 391871 974962 1710645
34905 1710645 1812864 1360351 1038564 1074978 1159785 1159894 1150092 948441 429594 144346 727594
34894 727594 1696795 1775209 606977 -692466 -995360 -403324 336328 900363 1321511
34885 1321511 1448045 1151077 743385 603134 599706 402721 152468 268520 692235 877591
34875 877591 579407 173222 67394 209331 378061 617516 1051316 1446950 1339837 641560
34865 641560 -130808 -388234 -107534 241203 345088 380449 616785 939139 1011480 786366
34855 786366 547139 463056 418398 348486 419484 698928 928468 882611 739241 778027 864042
34844 864042 632785 170115 64177 587711 1165553 998456 86957 -707401 -651066 85318
34834 85318 758203 929380 768200 585160 415451 204342 135803 454483 1021752 1371388
34824 1371388 1279102 997173 793499 566020 189094 -27523 311892 953908 1131518 594836
34814 594836 69562 366468 1315518 1963974 1704950 858724 171530 54544 361274 661765
34804 661765 630537 297243 -19524 -72281 78434 262561 483897 809827 1108772 1173231
34794 1173231 1049871 978954 1037163 1095162 1075879 976682 720129 325256 124036 356631
34784 356631 627744 353538 -223829 -179492 716937 1506692 1350424 651405 288210 338203
34774 338203 325462 264823 538247 962182 923936 453566 312591 873188 1629349 1993799
34764 1993799 1920758 1559155 962649 409725 380012 871302 1273895 1234887 1109669 1239519
34754 1239519 1379695 1266953 1157121 1257615 1191267 703637 410688 994620 1968489 2188126
34744 2188126 1501239 916289 1016103 1193141 852705 457780 672602 1155429 1140866 859153
34734 859153 1299737 2509378 3168862 2347290 890138 321448 855243 1371195 1148722
34725 1148722 647020 447817 400882 279901 438703 1067972 1433018 811627 -161989 -154036
34715 -154036 938819 1805407 1656719 1245455 1428346 1710348 1124737 -82127 -716844
34706 -716844 -355510 217018 343594 357177 767063 1301891 1349922 990675 967067 1649434
34696 1649434 2499343 2745082 2297651 1705194 1329592 968335 413539 -6033 161049
34687 161049 725532 1015893 816936 648077 938937 1395902 1490300 1195641 859188 621689
34677 621689 381089 160448 121316 305163 658789 1169353 1673273 1748424 1218661 605315
34667 605315 581210 1043300 1246050 857782 324270 75706 -32516 -209790 -205458 250195
34657 250195 858371 1135089 1164037 1410123 1854240 1898382 1270537 522577 324205 614425
34647 614425 837882 796530 801173 1026642 1198092 1067453 811746 693017 613843 354390
34637 354390 66926 141977 633650 1169437 1430599 1396844 1120479 654716 288625 422151
34627 422151 987516 1366495 1178730 831579 917356 1331991 1471373 1173809 930171 1090882
34617 1090882 1356319 1306737 1087891 1193266 1689209 2019071 1660696 764441 -8129 -185743
34607 -185743 112699 433826 470606 247718 6469 46376 556234 1393431 2055672 2059650
34597 2059650 1389705 486192 -155030 -245365 298976 1313625 2310261 2730365 2430773
34588 2430773 1802253 1357572 1312332 1528838 1662415 1376306 664024 -7161 -107206 375820
34578 375820 990856 1421694 1700678 1831558 1639385 1156080 780130 813301 1082892 1191905
34568 1191905 929771 362087 -208299 -338475 122655 659011 599618 59756 -208206 -22653
34558 -22653 -90610 -791533 -1435211 -1315163 -797315 -586686 -485691 166491 1161282 1550199
34548 1550199 1050435 421213 345323 692951 1036501 1220834 1224100 1009852 718099 576166
34538 576166 527168 359325 195598 353522 718925 821197 586143 450864 652021 967287
34528 967287 1246792 1593788 1898342 1844451 1578031 1705613 2343299 2798963 2553413 1972337
34518 1972337 1650776 1609545 1593247 1647286 1868090 1983282 1709932 1237054 913362 751083
34508 751083 625749 611373 698470 572710 168655 56031 682099 1545332 1778974 1338665
34498 1338665 931483 901102 903896 700518 570949 762387 1067718 1184013 1104640 974963
34488 974963 866646 822482 863273 880993 765012 632961 673654 813058 846688 823208 920309
34477 920309 1023074 885463 673141 820880 1308692 1626139 1561246 1456281 1506690 1408724
34467 1408724 994843 642221 657599 774665 710173 718958 1047850 1283997 914651 229081
34457 229081 -32911 267712 657554 929092 1273259 1595647 1525444 1212840 1302866 1862055
34447 1862055 2106565 1578670 865389 643589 693697 525854 394350 829886 1526871 1641740
34437 1641740 1103242 735177 991240 1391114 1446035 1389080 1588210 1848548 1803549 1561372
34427 1561372 1439441 1365141 1062542 628806 397997 332210 80000 -325381 -329868 377033
34417 377033 1324988 1771949 1541033 1069584 750210 555242 350127 258190 476564 885210
34407 885210 1137134 1128362 1096553 1195023 1279908 1269972 1369002 1624522 1583645 876963 -20608
34396 -20608 -197305 485594 1139381 991467 321461 -18508 347851 1071949 1620822 1749523
34386 1749523 1579043 1434657 1505640 1564909 1222953 537916 63247 123132 375325 354337
34376 354337 152502 230457 750541 1414607 1841086 1869509 1623275 1446643 1605561 1914225
34366 1914225 1906105 1502648 1157330 1151314 1196763 1047040 1008514 1377602 1807307 1806161 1500988
34355 1500988 1281285 1047912 576333 333802 991326 2186513 2749916 2303848 1693040
34346 1693040 1550114 1423422 877801 529366 1072843 1885801 1704907 515623 -306138
34337 -306138 69824 789696 642943 -156915 -333414 574024 1583599 1699749 1198939
34328 1198939 968963 1115486 1017063 553145 378007 824573 1349210 1440253 1373696 1537160
34318 1537160 1611751 1115415 324552 -88833 -46116 43495 132985 481666 881672 785608
34308 785608 241406 -72453 156248 558679 863586 1230307 1626090 1650404 1289308 1137357
34298 1137357 1493766 1873973 1814344 1547907 1435152 1309318 910410 470689 323298 350531
34288 350531 340857 470456 866658 1100448 768686 273588 329360 891562 1271746 1208578
34278 1208578 1118552 1264786 1357983 1152753 880726 850662 1044689 1339154 1750427 2202794
34268 2202794 2363614 2011640 1371277 808791 355099 -164980 -613850 -531069 218619 1055457
34258 1055457 1231378 703196 190780 330839 1038551 1813991 2369629 2687353 2708533 2375314
34248 2375314 1891002 1557898 1380915 1171337 985520 1051586 1279142 1304476 1071196 887421
34238 887421 826697 614936 273032 262409 672043 853786 351078 -305815 -332633 149993
34228 149993 373817 129185 -18615 283254 666130 722500 637831 791092 1101348 1203425
34218 1203425 1107098 1228546 1690557 1963569 1502860 568988 8287 192897 624289 779247
34208 779247 842288 1159867 1444750 1236287 838530 900152 1188245 851443 28062 -19144
34198 -19144 1132913 2158956 1900641 1148931 1325119 2175769 2265547 1379413 818627 1225043
34188 1225043 1656890 1313159 824802 1027726 1524590 1490260 1170333 1446777 2286699 2722915
34178 2722915 2320943 1713792 1545226 1695112 1818475 1940811 2095574 1930323 1234192
34169 1234192 527364 532277 1161751 1561946 1217090 580258 442260 982682 1661874 1878709
34159 1878709 1543560 1067662 890776 1013414 1058753 881897 897359 1455203 2070323 1885633
34149 1885633 960692 375594 734140 1312119 1288483 1109575 1674298 2626693 2692745 1707792
34139 1707792 1076642 1797898 3036821 3338492 2549476 1744989 1646988 1897301 1821855 1318622
34129 1318622 859859 902126 1400758 1855035 1871445 1634819 1637096 2005237 2398763 2531170
34119 2531170 2414805 2103705 1639221 1284977 1340455 1652708 1786849 1713721 1782538 1995319
34109 1995319 1984417 1790237 1878116 2198122 2088598 1430830 1004236 1248753 1585201 1532866
34099 1532866 1558836 2060815 2407561 1942669 1183510 977831 1125715 978618 840041 1470263
34089 1470263 2538161 2907534 2364568 1805094 1684187 1502969 1002236 702998 928622
34080 928622 1289530 1517462 1922545 2606454 3010542 2709546 2032843 1504570 1206276 1007579
34070 1007579 905767 853447 728965 692746 1089429 1832040 2388196 2505949 2423430 2282403
34060 2282403 1952860 1534749 1348216 1288307 919262 376399 360334 974621 1440908 1363623
34050 1363623 1383814 2004720 2611910 2430665 1794010 1599873 1967100 2277230 2242362 2118291
34040 2118291 2033075 1858367 1690778 1804444 2106449 2183908 1935552 1701881 1721338 1846566
34030 1846566 1857862 1744124 1621825 1609232 1787814 2100076 2324941 2319367 2205277 2161672
34020 2161672 2142256 1957799 1526510 923241 335053 56984 287665 797405 1091709 1079937
34010 1079937 1232520 1811511 2334976 2239825 1786691 1758560 2357697 2919454 2773574 1986038
34000 1986038 1148964 758422 922682 1420500 1871261 1986161 1797288 1603120 1642268 1863024
33990 1863024 2032071 2026977 1987259 2153435 2547221 2880725 2866169 2546364 2183828 1893003
33980 1893003 1584297 1240583 1003503 949716 1005782 1140641 1433684 1885229 2337665 2626843
33970 2626843 2658215 2375480 1878690 1500483 1445165 1406132 954207 305078 180468 755763
33960 755763 1282191 1081907 483135 336648 892371 1607829 1928129 1848969 1723679 1809161
33950 1809161 2063058 2265107 2308530 2333287 2460110 2504320 2253484 1958409 2082321 2497724
33940 2497724 2492112 1824382 1224472 1415456 2103911 2497227 2475847 2576022 2943910 2998151
33930 2998151 2259928 1027836 36765 -239836 169177 877747 1362680 1283554 810171
33921 810171 549215 988302 2000957 2949402 3291164 3084393 2861712 2968369 3122623
33912 3122623 2805475 2034381 1462452 1615430 2288865 2866769 3014669 2839585 2545333
33903 2545333 2224040 1954783 1865885 2014938 2289923 2489659 2520932 2508656 2626987 2789949
33893 2789949 2699911 2355501 2255234 2751331 3401504 3458979 2922621 2510029 2539950 2507570
33883 2507570 2009859 1435198 1286002 1353675 1159775 864100 1073868 1864135 2566629 2595115
33873 2595115 2087359 1632716 1605439 1836382 1834994 1365529 840323 960881 1867939 2875016
33863 2875016 3196573 2714805 1890422 1222655 1012067 1320848 1824526 1930874 1393946
33854 1393946 680247 473545 962886 1805974 2561581 2932683 2842217 2544538 2453103 2642644
33844 2642644 2770809 2653322 2535030 2573116 2538391 2362744 2431815 2841728 2923003 2185840
33834 2185840 1275858 1171641 1760997 2114792 1974281 1976988 2411595 2758260 2686996 2601035
33824 2601035 2815366 2979069 2781073 2574195 2766191 3106689 3132948 2940759 2967317 3259664
33814 3259664 3444151 3269415 2801199 2223927 1767578 1667897 1896937 2105176 2121716 2291904
33804 2291904 2948127 3747003 4019160 3706810 3420925 3479511 3435591 2877879 2257891 2359963
33794 2359963 3100072 3487029 2949135 2147333 2043349 2559112 2804864 2477560 2240386
33785 2240386 2533915 2783254 2311185 1495444 1325253 2067343 3024864 3499734 3387745
33776 3387745 2881456 2223006 1833253 2102429 2851213 3429687 3505957 3362488 3304482 3236976
33766 3236976 3021946 2818395 2785419 2760590 2494705 2001677 1532402 1393861 1792372 2545294
33756 2545294 3004469 2729988 2213697 2337101 3082083 3540101 3367159 3301000 3787085 4059347
33746 4059347 3367850 2291731 1819972 1789746 1456745 1155334 1925593 3543598 4424896
33737 4424896 3857297 3008046 3092189 3701573 3807791 3469142 3447808 3719508 3513194 2641248
33727 2641248 1816850 1610839 1823480 1985642 1930361 1773211 1721737 1925917 2236107 2249859
33717 2249859 1905211 1755844 2227068 2899554 3074900 2755229 2403892 2020711 1300466
33708 1300466 568209 582706 1305828 1795948 1580145 1272554 1482756 1934329 2132847 2168755
33698 2168755 2306374 2404530 2318859 2336638 2649904 2895970 2766402 2567059 2607702 2567407
33688 2567407 2117778 1664439 1712401 1928934 1679231 1178854 1219730 1896620 2455080 2393259
33678 2393259 1978178 1633237 1459113 1422476 1477750 1458584 1274399 1148810 1277898 1455169
33668 1455169 1466503 1542686 1883187 2103007 1819651 1421863 1483562 1765735 1673880 1375330
33658 1375330 1457767 1734754 1510740 903394 734990 1132239 1418746 1435407 1716923 2218497
33648 2218497 2172683 1489695 1014009 1049007 950946 598265 820704 1745603 2180686 1506810
33638 1506810 815578 1133871 1801481 1812962 1582686 1956121 2438405 1985822 918981
33629 918981 510768 1064520 1793633 2290851 2766812 3067637 2803873 2360839 2508510 3009350
33619 3009350 2816950 1736718 753672 548277 731143 772270 733388 790422 849673 934935
33609 934935 1275808 1774016 1976548 1755970 1499447 1539476 1874627 2409714 2947887 3072202
33599 3072202 2644370 2265105 2550242 3115529 3074384 2424045 2040228 2290264 2578491 2417299
33589 2417299 2069301 1860985 1646369 1309633 1169332 1508320 2138256 2686181 2982434
33580 2982434 3067757 3120235 3319789 3486355 3133758 2316720 1946755 2545431 3201441 2807878
33570 2807878 1925541 2073606 3309737 4040541 3457190 2621698 2574084 2811013 2539185
33561 2539185 2215826 2680138 3592136 3940755 3610621 3342326 3408255 3329048 2848480 2360311
33551 2360311 2257963 2436164 2577087 2579276 2611270 2899450 3423379 3774989 3546599 2944281
33541 2944281 2698258 3209959 4109148 4823025 5232737 5542482 5819755 5950820 5887342 5768769
33531 5768769 5881413 6446883 7298946 7997520 8541273 9509055 10840300 10938795 8131178
33522 8131178 3018577 -1748484 -4276844 -4984803 -5127308 -5050376 -4571260 -3941943 -3431274
33513 -3431274 -2708642 -1593380 -792526 -939686 -1429074 -1219451 -429393 -102468 -570567
33504 -570567 -1047186 -872973 -315076 38708 42889 -50899 4888 207397 230264 -285677
33494 -285677 -1114372 -1396450 -618593 614902 1263960 1090908 721846 668313 840924 944805
33484 944805 846100 562277 281782 326493 751830 1128776 1078934 819462 768400 855559
33474 855559 735646 482615 494355 821968 1161595 1432605 1784312 2072172 1942936 1494341
33464 1494341 1274228 1510907 1853260 1971432 1894979 1645871 1121635 578962 668562 1591232
33454 1591232 2615315 2849700 2238919 1438431 946614 765500 779183 1024695 1514574
33445 1514574 2064035 2425506 2509320 2438398 2423620 2548167 2646734 2505420 2240638 2294383
33435 2294383 2857182 3438469 3336228 2554751 1925959 2148107 2958664 3512833 3389582
33426 3389582 2890667 2460605 2238682 2223387 2441755 2754669 2830935 2558218 2218985 2051731
33416 2051731 1938297 1766229 1741843 1989932 2194410 2110320 2138803 2806367 3841079 4395799
33406 4395799 4159035 3656207 3412807 3382508 3304246 3102846 2785140 2386701 2150582 2333103
33396 2333103 2725703 2810865 2513022 2351447 2702502 3327394 3779366 3899259 3806200 3785797
33386 3785797 4239615 5301217 6453289 7000112 6937265 6814825 6778218 6481055 6016992
33377 6016992 6038385 6620507 6859553 6099320 4814624 3713526 2683155 1339884 13965
33368 13965 -673324 -840678 -1119071 -1588357 -1702764 -1227920 -610130 -354004 -484134 -665411
33358 -665411 -555659 -94551 325345 152873 -596067 -1150136 -844705 58943 758468 883467
33348 883467 711265 612446 681796 815347 836690 629867 351666 349847 699947 1061270
33338 1061270 1165099 1145960 1202366 1292896 1391198 1617410 1826870 1539577 682215 -41690
33328 -41690 -14526 431523 547648 269643 210651 716882 1458767 1922900 1933883 1721188
33318 1721188 1704917 2113274 2677433 2918896 2806538 2750453 2868107 2817341 2545141 2514523
33308 2514523 2832239 2889843 2405551 2089534 2548626 3173433 2994058 2164458 1665017 1860887
33298 1860887 2281383 2598621 2892343 3054709 2823128 2395113 2224896 2230625 1969535 1565612
33288 1565612 1624590 2142489 2323626 1725951 920890 742473 1380116 2386207 3120546
33279 3120546 3094641 2364983 1669129 1696895 2198711 2347517 1984834 1826756 2275513 2738147
33269 2738147 2517544 1847235 1549819 1963810 2649192 3032364 3002478 2858424 2857723 2924180
33259 2924180 2837472 2649364 2676072 2959215 3015594 2423672 1483958 947204 1145372 1683304
33249 1683304 1982805 1923062 1926085 2463711 3401941 3916014 3377285 2290882 1839712 2387404
33239 2387404 3041379 2953676 2385621 2054235 2075387 2143530 2204022 2283004 2108757 1584904
33229 1584904 1255342 1635200 2418093 2944872 3070239 2982466 2652800 2135156 1898804 2123923
33219 2123923 2199440 1708984 1305123 1682199 2335545 2449723 2375172 2889653 3548370 3345832
33209 3345832 2677426 2893884 3952023 4320734 3492253 2817822 3268288 3963466 3732514
33200 3732514 2797677 2038206 1705714 1715357 2210612 3002440 3326661 2932709 2596616 2869214
33190 2869214 3199706 3028064 2822433 3171525 3683406 3711440 3449194 3387881 3367515 3104264
33180 3104264 3009298 3482711 3977357 3831641 3542120 4060195 5148545 5613031 5057638
33171 5057638 4312235 4063633 4048364 3812262 3465205 3371931 3634174 4121532 4654052 5029190
33161 5029190 5119555 4947363 4519614 3817776 3145426 3066384 3620661 4048017 3787655 3299404
33151 3299404 3287259 3575430 3534907 3248088 3327112 3777507 3999397 3866041 3853443 4034321
33141 4034321 3894349 3364569 3141217 3624850 4315840 4660749 4781395 4907489 4778887
33132 4778887 4217399 3746462 3950481 4552190 4765678 4358376 3803350 3540234 3613026 3915402
33122 3915402 4265025 4293301 3780122 3117697 2974578 3447554 3979320 4159947 4123515 4039009
33112 4039009 3758160 3264839 3002778 3323290 3918193 4245669 4293450 4448808 4758872 4849322
33102 4849322 4596148 4396603 4608757 5055543 5277268 5077121 4669917 4390320 4303553 4070936
33092 4070936 3336299 2357752 1966204 2572684 3499919 3788555 3431842 3170198 3233339 3146568
33082 3146568 2847294 3023388 3942557 4789007 4764441 4199449 3920273 4046714 4122921 4025782
33072 4025782 4001299 4057380 4005025 3939779 4090246 4335826 4406486 4394542 4556301 4794617
33062 4794617 4859166 4859015 5024490 5149352 4858600 4292611 3939470 3882990 3778911 3508005
33052 3508005 3322026 3390673 3664960 4087110 4502511 4563400 4217034 4039680 4490769 5082442
33042 5082442 4989690 4293317 3830771 3916673 4078662 4117815 4537638 5612144 6725035 7044674
33032 7044674 6431427 5398191 4520504 4098365 4122203 4393834 4781018 5284579 5743694
33023 5743694 5792629 5417378 5178155 5429983 5722115 5535221 5173729 5180910 5272354 4798204
33013 4798204 4025880 3905741 4576893 5134011 5021831 4699749 4661344 4685430 4465926 4272999
33003 4272999 4524580 5161243 5777290 6048355 5898120 5570419 5516616 5827316 5926891 5342795
32993 5342795 4563258 4452534 4979718 5319134 5149888 5027151 5418023 6149925 6890746
32984 6890746 7431869 7436608 6682582 5666003 5228323 5453877 5616862 5302188 4889463 4844815
32974 4844815 5191288 5728295 6158745 6059324 5389524 4894287 5265948 6100488 6499327 6427185
32964 6427185 6485953 6629912 6311059 5742628 5693878 6046190 5944429 5481506 5734011 6808164
32954 6808164 7369747 6703222 5866503 6045076 6922931 7498494 7552087 7507522 7603681 7872420
32944 7872420 8292417 8505181 8076471 7370744 7333155 8059006 8487371 7928399 7009243 6667433
32934 6667433 7029419 7663671 8137990 8048941 7365648 6936700 7661539 8985922 9361003
32925 9361003 8420131 7439326 7336081 7599946 7663172 7861475 8344947 8434641 7916381 7722802
32915 7722802 8428508 9215591 9250546 8999640 9209087 9570988 9415554 8912307 8647169 8686833
32905 8686833 8828907 9109184 9430624 9401214 9062877 9004791 9340176 9486472 9337382 9568837
32895 9568837 10326926 10775683 10490882 10139338 10219988 10332391 10257859 10487218 11043787 11095521
32885 11095521 10444264 10112802 10731317 11614841 12120281 12564294 13091080 13065244 12389193
32876 12389193 12019598 12384739 12703451 12598434 12825771 13630165 14061473 13808702 13960706
32867 13960706 14958229 15599589 15188892 14837135 15399766 15943502 15576555 15000059 14894946
32858 14894946 14614944 13883964 13849411 14902467 15442258 14527658 13765963 14659924 16031733
32849 16031733 16197498 15863258 16544856 17703255 17834680 17115264 16737607 16784978 16785669 17170080
32839 17170080 18258344 19057653 18872782 18743045 19582087 20501445 20701649 21133657 22365394
32830 22365394 22890187 21780768 20911180 22056195 23830093 24169797 23871549 24812524 26493144
32821 26493144 27263143 27322969 27724496 28087621 27964292 28551492 30399549 31653160 31342772
32812 31342772 31755454 34315003 36057428 34124512 30968084 30690018 32748605 33971729
32804 33971729 34407253 36127351 38346246 38989475 39311145 41745469 44969737 46335328
32796 46335328 47195850 50307393 54144176 55773579 57053990 61436177 66987592 69793276
32788 69793276 71895702 77878012 85918256 91157932 95640571 104674155 115406368 121109167
32780 121109167 125646836 139472512 160774821 177522030 192110709 223687545 272451588
32773 272451588 296198241 241686777 98291295 -87294151 -244357254 -321313479 -310376742
32766 -310376742 -247695433 -186613906 -156984068 -148425074 -136802169 -118070048 -105388236
32759 -105388236 -102568668 -99009527 -89403169 -81128032 -79089688 -77545380 -71765763 -65983977
32751 -65983977 -64225441 -63016961 -58856933 -54711282 -53603306 -52803902 -49576971 -46457092
32743 -46457092 -45908717 -45404048 -42540808 -39866153 -39979984 -40560868 -38782942 -36376785 -35884759
32734 -35884759 -35832078 -33989433 -31882332 -31753574 -32168084 -30775486 -28672801 -28084134 -28208729
32725 -28208729 -27155190 -25747784 -25764420 -26361179 -25695496 -24381291 -24132171 -24522359 -24044700
32716 -24044700 -22945169 -22312717 -21791227 -20722709 -20097819 -20892347 -21849596 -21289115 -19820235
32707 -19820235 -19059517 -18983801 -18679018 -18367943 -18588573 -18642029 -17868142 -17196201 -17523658 -17892744
32697 -17892744 -17184157 -16244451 -16346447 -16839111 -16342083 -15101384 -14210195 -13594505 -12661489
32688 -12661489 -11912882 -12104322 -12754033 -13101624 -13497212 -14303734 -14620793 -13722291 -12574229
32679 -12574229 -12307739 -12399797 -11970369 -11546765 -11795722 -11857351 -10857456 -9822075 -10064110
32670 -10064110 -10800458 -10480740 -9495243 -9380263 -10110239 -10358325 -9903614 -9706968 -9951070
32661 -9951070 -9901725 -9470624 -9223263 -9064934 -8454377 -7687177 -7574763 -8094690 -8557562 -8731900
32651 -8731900 -8706945 -8196188 -7099189 -6131872 -5821438 -5630059 -5133435 -5072317 -5974614 -6812662
32641 -6812662 -6525077 -5873059 -6181452 -7196822 -7915689 -8601380 -10037728 -11517385 -11632702
32632 -11632702 -10635319 -10075094 -10408355 -10798658 -10998010 -11556716 -12304348 -12415654 -11980841
32623 -11980841 -11899048 -12241646 -12236402 -11787543 -11514299 -11403579 -10932565 -10387675 -10515229 -10991846
32613 -10991846 -10832293 -10210067 -10205739 -10774746 -10711863 -9774587 -9113762 -9304382 -9605814 -9574594
32603 -9574594 -9812269 -10571473 -11078211 -10869969 -10555485 -10676018 -10959061 -11166871 -11497932
32594 -11497932 -11679043 -10914072 -9333703 -8290421 -8503401 -9016874 -8768909 -8137636 -8016393
32585 -8016393 -8265356 -8153089 -7735024 -7737175 -8346114 -8957628 -9008248 -8456114 -7576957 -6802433
32575 -6802433 -6656434 -7376431 -8549844 -9374853 -9322068 -8505676 -7538058 -7061947 -7240488
32566 -7240488 -7635330 -7709150 -7416944 -7137881 -7123889 -7278136 -7423905 -7516355 -7585563 -7670004
32556 -7670004 -7781695 -7799548 -7504086 -6871655 -6214581 -5903610 -6074615 -6621896 -7226307 -7416967
32546 -7416967 -7024823 -6592207 -6792253 -7384134 -7437767 -6758482 -6245159 -6465980 -6776103 -6455649
32536 -6455649 -5896379 -5869738 -6294039 -6588946 -6703018 -6901484 -6978730 -6579332 -5979488 -5725055
32526 -5725055 -5774759 -5756538 -5750759 -6026263 -6292721 -6048224 -5481580 -5256646 -5532012 -5878098
32516 -5878098 -6033629 -6118198 -6212823 -6258566 -6235189 -6062001 -5608214 -5119211 -5146067 -5671353
32506 -5671353 -5928407 -5559593 -5216667 -5415327 -5622733 -5265104 -4816200 -4936762 -5287167
32497 -5287167 -5242117 -5096794 -5441077 -5956334 -6007159 -5864292 -6126289 -6451849 -6140181 -5508282
32487 -5508282 -5374724 -5568490 -5292837 -4641082 -4390487 -4548889 -4455003 -4114522 -4116540 -4409610
32477 -4409610 -4436177 -4255068 -4276001 -4232838 -3783992 -3671101 -4663211 -5757931 -5306878 -3722663
32467 -3722663 -3044738 -3795316 -4387392 -3941060 -3522687 -3960495 -4460610 -4275762 -3964941
32458 -3964941 -4043897 -3997501 -3585080 -3580640 -4221734 -4433427 -3686904 -3177170 -3913080 -4946753
32448 -4946753 -4867063 -3969601 -3553005 -3916225 -4382393 -4637718 -4830227 -4873004 -4700474 -4741007
32438 -4741007 -5267911 -5801789 -5878023 -5742796 -5598812 -5001666 -3832958 -3004077 -3233113
32429 -3233113 -3909361 -4134319 -4079319 -4274298 -4381267 -3880248 -3268180 -3293961 -3573645 -3276580
32419 -3276580 -2726552 -2960015 -3972559 -4721358 -4740559 -4534776 -4417186 -4113266 -3585293
32410 -3585293 -3240089 -3215451 -3297123 -3527408 -4059099 -4479304 -4190482 -3456716 -3161048 -3467112
32400 -3467112 -3616891 -3193286 -2729119 -2819615 -3352611 -3889839 -4222193 -4300120 -4090027 -3706376
32390 -3706376 -3358197 -3121419 -3046544 -3321426 -3908499 -4257821 -3939169 -3360992 -3251066 -3610628
32380 -3610628 -3851395 -3792944 -3769653 -3859489 -3813729 -3722336 -3924717 -4224643 -4037680 -3424275
32370 -3424275 -3113082 -3307606 -3352781 -2898485 -2522210 -2729328 -3119961 -3145271 -3048694 -3377744
32360 -3377744 -4014104 -4351965 -4157936 -3710390 -3325520 -3198971 -3433641 -3758287 -3530635
32351 -3530635 -2577166 -1776665 -2164217 -3561894 -4730649 -4873471 -4369273 -3943854 -3773307
32342 -3773307 -3682023 -3666037 -3784651 -3880623 -3813879 -3722077 -3698168 -3490668 -2949847 -2507334
32332 -2507334 -2661270 -3147939 -3270014 -3013158 -3101791 -3790375 -4371531 -4274025 -3934720 -3979256
32322 -3979256 -4132213 -3733214 -2950222 -2593695 -2869741 -3168223 -3100200 -2951077 -2987414 -3060335
32312 -3060335 -3104016 -3337056 -3686280 -3638162 -3016345 -2385656 -2330169 -2772889 -3319372 -3828438
32302 -3828438 -4305408 -4622874 -4678928 -4529173 -4166837 -3543229 -2928494 -2739485 -2843678 -2645968
32292 -2645968 -2110761 -1996208 -2681233 -3469310 -3595305 -3277860 -3149700 -3239084 -3228253 -3207368
32282 -3207368 -3396346 -3526241 -3268318 -2930217 -2976590 -3209939 -3203958 -3171450 -3513292 -3849255
32272 -3849255 -3534005 -2926719 -3006021 -3735318 -3984324 -3285065 -2546460 -2610174 -3087614 -3199468
32262 -3199468 -2959306 -2869791 -3037702 -3216135 -3304945 -3305387 -3149933 -2978817 -3168088 -3691008
32252 -3691008 -3911297 -3450345 -2789364 -2506904 -2402285 -2012428 -1572321 -1657399 -2106601 -2177440
32242 -2177440 -1764600 -1607558 -2082295 -2570633 -2437687 -1989497 -1890466 -2103961 -2115634 -1953642
32232 -1953642 -2186285 -2869612 -3276254 -2987752 -2603695 -2837053 -3397168 -3472492 -3033165 -2824609
32222 -2824609 -3103516 -3255896 -2905283 -2574312 -2768346 -3097726 -2964588 -2593808 -2613655 -2957330
32212 -2957330 -3005563 -2660404 -2456062 -2601257 -2688293 -2486851 -2324592 -2454116 -2656456 -2744696
32202 -2744696 -2916006 -3302153 -3652883 -3770152 -3804086 -3811325 -3490291 -2736439 -2028458 -1818889
32192 -1818889 -1908457 -1895751 -1899834 -2265461 -2795381 -2923265 -2584606 -2303912 -2355620 -2403840
32182 -2403840 -2155550 -1869445 -1900698 -2110730 -2133558 -2019366 -2158813 -2580143 -2767277 -2401957
32172 -2401957 -1980297 -2282913 -3286332 -4041018 -3816262 -3007409 -2557233 -2731726 -2971533
32163 -2971533 -2880715 -2758197 -2939130 -3123444 -2799708 -2078232 -1633419 -1836067 -2280949 -2274380
32153 -2274380 -1635058 -930807 -932230 -1795299 -2808315 -3090324 -2543417 -1904403 -1823820 -2199936
32143 -2199936 -2566503 -2790982 -3058390 -3382826 -3542775 -3467534 -3356154 -3345899 -3275593 -2877318
32133 -2877318 -2136382 -1429897 -1271519 -1805208 -2572743 -2972313 -2915427 -2732943 -2484247 -1906810
32123 -1906810 -1204720 -1201250 -2207774 -3298063 -3400650 -2728369 -2350116 -2617584 -2901106
32114 -2901106 -2782281 -2569438 -2544486 -2606583 -2856082 -3604881 -4474830 -4437417 -3296774 -2264637
32104 -2264637 -2348446 -2936865 -2856767 -2179766 -1898903 -2210512 -2318938 -1904886 -1652331 -2043528
32094 -2043528 -2545607 -2449462 -1887022 -1542287 -1736745 -2175846 -2370202 -2083488 -1543287 -1282578
32084 -1282578 -1559348 -1981100 -2027014 -1838994 -2005967 -2590530 -2968665 -2766833 -2376506 -2298610
32074 -2298610 -2499113 -2708312 -2883929 -3038398 -3025748 -2861228 -2885496 -3247286 -3556145 -3413401
32064 -3413401 -2974647 -2617978 -2374535 -2109656 -1982059 -2232010 -2682756 -2909503 -2801430
32055 -2801430 -2563881 -2280834 -1892618 -1541947 -1522374 -1851160 -2209442 -2330966 -2200716 -1897475
32045 -1897475 -1510024 -1203566 -1119294 -1189462 -1238147 -1239351 -1289364 -1365691 -1317617 -1094355 -829082
32034 -829082 -698202 -788491 -1059044 -1374799 -1657231 -2009204 -2524003 -2977817 -2997768 -2603163
32024 -2603163 -2249541 -2208331 -2258174 -2157731 -2021916 -1986191 -1909830 -1718951 -1635420 -1719730
32014 -1719730 -1625826 -1231899 -1055445 -1504004 -2133093 -2273199 -2020919 -1901305 -1875954 -1520483
32004 -1520483 -994246 -935593 -1408092 -1792860 -1787076 -1692475 -1619247 -1285626 -838196 -969409
31994 -969409 -1788664 -2377371 -2041224 -1347318 -1253651 -1725070 -1965023 -1700124 -1440143 -1523765
31984 -1523765 -1619693 -1361401 -988399 -1052787 -1697368 -2463123 -2772959 -2482685 -1934938 -1533594
31974 -1533594 -1347762 -1151981 -756219 -214290 219649 268052 -136319 -717980 -1092171 -1195937
31964 -1195937 -1293177 -1504140 -1674865 -1856500 -2427042 -3354847 -3802014 -3073526 -1708489
31955 -1708489 -984808 -1423246 -2328903 -2751449 -2392791 -1628734 -1122438 -1362707 -2156975
31946 -2156975 -2701951 -2544062 -2186860 -2264605 -2539951 -2425343 -2059767 -1939613 -1849860 -1298564
31936 -1298564 -778176 -1263025 -2453581 -2950703 -2430384 -2191021 -3019711 -3911683 -3683276
31927 -3683276 -2635838 -1727937 -1180504 -863114 -1056569 -1750963 -2054610 -1445762 -871540
31918 -871540 -1420548 -2551105 -2899645 -2346381 -1964729 -2243629 -2669895 -2931017 -3280537
31909 -3280537 -3684648 -3713226 -3368805 -3066720 -2765294 -2068891 -1209765 -922693 -1247180 -1444282
31899 -1444282 -1248910 -1194307 -1457763 -1423011 -815724 -354729 -731212 -1671131 -2517748 -3075746
31889 -3075746 -3369144 -3210932 -2612251 -2100654 -2040283 -2071431 -1790328 -1545703 -1885184 -2529459
31879 -2529459 -2657654 -2118343 -1644431 -1774034 -2173402 -2282778 -2157408 -2261902 -2663231
31870 -2663231 -2868050 -2495594 -1797810 -1331129 -1270879 -1280148 -1032168 -645801 -527756 -922104
31860 -922104 -1688510 -2413137 -2686406 -2400024 -1845962 -1446024 -1381596 -1581834 -1972990 -2507569
31850 -2507569 -3026342 -3392751 -3691147 -3932353 -3700105 -2666230 -1422079 -1041175 -1625127
31841 -1625127 -2072703 -1657013 -1017025 -1006417 -1337334 -1197154 -631202 -359658 -561908 -763740
31831 -763740 -731223 -616195 -361561 176408 582261 210015 -810705 -1668523 -2011867 -2243722
31821 -2243722 -2619948 -2841804 -2714724 -2494726 -2361155 -2174595 -1956364 -2006824 -2347760 -2605956
31811 -2605956 -2613861 -2571186 -2496366 -2145347 -1625083 -1417013 -1573961 -1564255 -1179658 -921341
31801 -921341 -1150885 -1522099 -1661063 -1774884 -2096781 -2294643 -1989837 -1417597 -1036232 -871976
31791 -871976 -768873 -893464 -1391834 -1843046 -1699286 -1138913 -911678 -1368017 -2105287 -2566658
31781 -2566658 -2584635 -2313669 -1983903 -1790377 -1762448 -1684246 -1346636 -911048 -822127 -1265235
31771 -1265235 -1838592 -1920918 -1402128 -930363 -1232430 -2177171 -2814984 -2529118 -1809897 -1517755
31761 -1517755 -1696657 -1709472 -1381670 -1260425 -1641208 -2061302 -2068421 -1904036 -2019222 -2352894
31751 -2352894 -2500755 -2276688 -1767017 -1140099 -713088 -871105 -1569545 -2217493 -2397433
31742 -2397433 -2388553 -2608800 -2886948 -2785149 -2380254 -2134388 -2093859 -1821612 -1201960 -772384
31732 -772384 -996622 -1560585 -1716646 -1181376 -415721 -38627 -194874 -591482 -975104 -1332494
31722 -1332494 -1642643 -1732125 -1553462 -1395438 -1554248 -1899523 -2011370 -1683571 -1094288 -590912
31712 -590912 -511749 -1032258 -1879877 -2371969 -2103640 -1462683 -1105371 -1131428 -1235209 -1413635
31702 -1413635 -1853125 -2246542 -2015481 -1276467 -818896 -954821 -1138594 -965528 -778197
31693 -778197 -922458 -1142563 -1187938 -1344743 -1804072 -2100966 -1821760 -1385841 -1458533 -1962267
31683 -1962267 -2318115 -2353834 -2318262 -2236821 -1913562 -1446262 -1153762 -1060868 -946253 -817956
31673 -817956 -888257 -1158599 -1434245 -1643330 -1773303 -1670106 -1318397 -1127467 -1453519 -1980242
31663 -1980242 -2078240 -1689293 -1352337 -1396836 -1605262 -1693387 -1674328 -1673430 -1733177 -1854537 -1972817
31652 -1972817 -1938017 -1762407 -1722583 -1892319 -1811777 -1095601 -170305 189563 -50067 -248118
31642 -248118 -253760 -699599 -1826993 -2747208 -2472718 -1279441 -418437 -627690 -1470990 -2123022
31632 -2123022 -2273559 -2071924 -1621014 -962041 -417841 -469405 -1131715 -1785572 -1898073 -1660934
31622 -1660934 -1568469 -1594406 -1310678 -728156 -372494 -426057 -479205 -408904 -791753 -1922912
31612 -1922912 -3027943 -3155254 -2448806 -1802279 -1562660 -1390287 -1211127 -1381354 -1843016
31603 -1843016 -1981922 -1579568 -1183685 -1211810 -1340191 -1199412 -1102537 -1523101 -2217001 -2451505
31593 -2451505 -1977210 -1315381 -1103569 -1472134 -2053370 -2362705 -2169648 -1668446 -1296253
31584 -1296253 -1302536 -1538768 -1699797 -1636972 -1373258 -1006027 -750090 -909317 -1565561 -2334936
31574 -2334936 -2631812 -2222894 -1441698 -859781 -814655 -1231751 -1792125 -2207861 -2368111 -2305156
31564 -2305156 -2101003 -1839698 -1583452 -1351420 -1162340 -1105289 -1265200 -1537354 -1669919 -1613278
31554 -1613278 -1668484 -2067963 -2517259 -2470130 -1881484 -1349656 -1335696 -1523766 -1280694 -614346
31544 -614346 -261280 -732911 -1630556 -2156627 -2059675 -1736386 -1560340 -1555682 -1708608 -2074370
31534 -2074370 -2408161 -2204092 -1430697 -774938 -722444 -825692 -463214 55479 -82839 -862037
31524 -862037 -1396779 -1233042 -831993 -619031 -427502 -184706 -278053 -749556 -906924 -369217
31514 -369217 148055 -195914 -1126487 -1727838 -1749700 -1666426 -1720088 -1686358 -1454013 -1149607
31504 -1149607 -777645 -343420 -208548 -691743 -1400065 -1593972 -1201663 -889894 -1135203
31495 -1135203 -1775326 -2458845 -2963313 -3048805 -2576763 -1882661 -1558805 -1774623 -2174579 -2397840
31485 -2397840 -2291670 -1764189 -975828 -548978 -937725 -1640752 -1724380 -1121252 -679347 -878599
31475 -878599 -1301144 -1518569 -1647313 -1730344 -1428300 -797065 -591724 -1172831 -1747167 -1418101
31465 -1418101 -529180 -200654 -800510 -1614180 -1945413 -1882611 -1873219 -2024344 -2049750 -1707124
31455 -1707124 -1134695 -751618 -801371 -1062864 -1182674 -1194444 -1377663 -1658532 -1627695 -1220288
31445 -1220288 -856363 -749187 -630658 -402286 -448072 -911956 -1247554 -1008531 -590747 -594089
31435 -594089 -865296 -828919 -436048 -93532 94370 295869 356309 -789 -466202 -428931
31425 -428931 82 29401 -596982 -1172959 -1087808 -629896 -371899 -358051 -357452 -428929 -709552
31414 -709552 -986311 -981453 -819977 -769293 -750807 -575637 -451808 -714014 -1156527 -1220808
31404 -1220808 -891897 -838840 -1439881 -2122730 -2036306 -1140531 -282753 -258523 -1029798 -1863564
31394 -1863564 -2096023 -1737396 -1368287 -1445057 -1781555 -1845075 -1480846 -1067020 -933549 -983576
31384 -983576 -1054519 -1281006 -1752593 -2091602 -1864615 -1330481 -1271286 -1976116 -2806277 -2967014
31374 -2967014 -2400378 -1684218 -1295005 -1260564 -1410125 -1646652 -1901173 -1992140 -1698055 -1027530
31364 -1027530 -348956 -88425 -254263 -458501 -512340 -705624 -1233797 -1672514 -1501997 -950008
31354 -950008 -722612 -977157 -1216803 -1223357 -1349544 -1699870 -1799708 -1462822 -1277686 -1704172
31344 -1704172 -2282867 -2326957 -1881913 -1389316 -908027 -375751 -185695 -677792 -1373425 -1554278
31334 -1554278 -1360536 -1445397 -1734793 -1528911 -841346 -615338 -1337874 -2278560 -2482556 -1889913
31324 -1889913 -1139782 -787095 -974322 -1408464 -1487670 -932441 -377383 -735931 -1865054
31315 -1865054 -2577246 -2226730 -1545059 -1492149 -1941598 -2053731 -1474725 -617100 -56029 -77070
31305 -77070 -580541 -1130439 -1336297 -1338938 -1563589 -1926939 -1867929 -1338912 -1054000 -1383620
31295 -1383620 -1708445 -1396583 -778025 -504776 -498804 -279256 80865 101555 -260502 -613694
31285 -613694 -779218 -821959 -667231 -316254 -200403 -635327 -1137043 -1033333 -598180 -732473
31275 -732473 -1524736 -2004993 -1523731 -600633 -90593 -162417 -479366 -828403 -1117489 -1171769
31265 -1171769 -1004502 -1002415 -1405854 -1826836 -1734794 -1286554 -1173470 -1597532 -1874616 -1330296
31255 -1330296 -282919 282636 -59195 -724852 -1013214 -991019 -1142923 -1507777 -1714560
31246 -1714560 -1703713 -1790131 -2015012 -2053750 -1857564 -1760652 -1788330 -1514854 -856096 -324990
31236 -324990 -174242 -11018 303181 162597 -734687 -1594891 -1605577 -1178698 -1193942 -1539890
31226 -1539890 -1463363 -972717 -740081 -828559 -700957 -424663 -662650 -1369010 -1672071 -1297907
31216 -1297907 -991726 -1188570 -1364489 -1165126 -1102317 -1505920 -1770611 -1428563 -1143964 -1741411
31206 -1741411 -2840935 -3350282 -2920240 -2130160 -1545940 -1314046 -1441180 -1809400 -2064925
31197 -2064925 -1999261 -1842841 -1784203 -1560630 -1006180 -587954 -794067 -1345173 -1646201 -1678438
31187 -1678438 -1758891 -1753418 -1339825 -835866 -908107 -1526996 -2009574 -2070755 -2038798 -2031523 -1781162
31176 -1781162 -1392699 -1393934 -1760124 -1714228 -898295 -18565 159081 -165437 -344209 -303243
31166 -303243 -444480 -884841 -1368581 -1716737 -1891036 -1802797 -1473994 -1207693 -1230189 -1363850
31156 -1363850 -1395510 -1494896 -1846253 -2148283 -2020078 -1699598 -1713702 -1940592 -1696059 -862009
31146 -862009 -259183 -570278 -1395055 -1803417 -1504356 -1013712 -827016 -880132 -862726 -724889
31136 -724889 -702204 -975629 -1451720 -1867868 -2041197 -1978302 -1773677 -1490570 -1182484 -934947
31126 -934947 -781118 -639866 -454546 -332751 -412836 -654635 -923628 -1211445 -1560688 -1827043
31116 -1827043 -1788762 -1493652 -1205654 -972270 -578441 -24488 325952 271150 70873 -73870
31106 -73870 -471565 -1413356 -2449340 -2769633 -2264340 -1653024 -1470524 -1447950 -1130157 -647101
31096 -647101 -482702 -753033 -1127526 -1339883 -1394501 -1305425 -1021068 -709710 -778545 -1348871
31086 -1348871 -1899070 -1767477 -1016751 -481230 -786998 -1573152 -1989724 -1821382 -1680036
31077 -1680036 -2042170 -2580071 -2711811 -2410084 -2061158 -1822078 -1604608 -1478128 -1517021 -1375063
31067 -1375063 -677544 151523 185539 -689624 -1487635 -1508119 -1293956 -1636611 -2260017 -2297595
31057 -2297595 -1681556 -1154637 -1044816 -923461 -548256 -308211 -475881 -728985 -779429 -883948
31047 -883948 -1290916 -1662550 -1550582 -1104454 -804803 -739945 -652647 -543294 -690999 -1084198
31037 -1084198 -1309356 -1132041 -848045 -891559 -1306254 -1747351 -1888262 -1731751 -1567048 -1622445
31027 -1622445 -1730689 -1453026 -655730 177841 429717 59184 -406309 -533175 -365351
31018 -365351 -180037 -189246 -543955 -1300085 -2200538 -2727646 -2576884 -1942365 -1210509 -554379
31008 -554379 19469 428184 558808 458143 276917 86966 -108984 -290850 -487992 -802762
30998 -802762 -1206427 -1464623 -1458862 -1403564 -1494434 -1543967 -1322926 -1092865 -1313916 -1862056
30988 -1862056 -2066861 -1632474 -1025020 -759492 -786038 -857779 -1030822 -1387631 -1644888 -1524935
30978 -1524935 -1248483 -1160824 -1096685 -685200 -138902 -76465 -526863 -768748 -376453 146557
30968 146557 121148 -381158 -803352 -971549 -1192140 -1617394 -1996689 -2085585 -1917241 -1577514
30958 -1577514 -1058986 -524716 -410827 -918392 -1538944 -1517160 -867690 -507016 -1076851 -1991603
30948 -1991603 -2176951 -1567689 -1157648 -1465224 -1749445 -1221032 -356401 -226826 -897737
30939 -897737 -1384949 -1124457 -637522 -597140 -974317 -1376519 -1605879 -1547373 -1037269 -235736
30929 -235736 274202 126064 -403698 -871800 -1202807 -1468378 -1531812 -1279414 -904011 -642230
30919 -642230 -515479 -561754 -912752 -1347734 -1267076 -545827 60024 -105747 -654202 -820122
30909 -820122 -669851 -842756 -1332556 -1434537 -935113 -521833 -766586 -1330303 -1486187 -1006350
30899 -1006350 -273994 192123 168279 -108390 -188799 -10824 -61407 -615925 -1121740 -914956
30889 -914956 -320461 -288170 -1001538 -1656639 -1695101 -1422579 -1201982 -876885 -361101 -42976
30879 -42976 -152030 -368606 -472735 -700987 -1026758 -874724 -158774 196150 -412209 -1122794
30869 -1122794 -811577 141487 464696 -6289 -279051 -56226 -195616 -1015627 -1498325
30860 -1498325 -882147 18459 18 -763851 -1136147 -760259 -396504 -647909 -1223508 -1562818
30850 -1562818 -1506656 -1154698 -599192 -72002 30095 -422926 -1042687 -1341857 -1283282 -1229704
30840 -1229704 -1438435 -1789163 -1998122 -1942446 -1693392 -1309935 -750107 -49620 522287 642705
30830 642705 267957 -327018 -824414 -1056510 -990755 -756307 -683593 -1029409 -1575516 -1779350
30820 -1779350 -1450868 -996062 -838971 -934875 -1071341 -1261431 -1489986 -1456198 -1058794 -805421
30810 -805421 -1125395 -1540459 -1283051 -601973 -540560 -1335208 -2023249 -1980791 -1851379 -2310305
30800 -2310305 -2808958 -2489377 -1702901 -1508181 -2003157 -2299008 -2041160 -1797366 -1811573 -1526082
30790 -1526082 -752795 -293634 -742143 -1456593 -1485175 -945961 -700119 -1039143 -1478466 -1628691
30780 -1628691 -1530303 -1232701 -748050 -425513 -704010 -1365258 -1611747 -1107982 -476416 -485950
30770 -485950 -1108057 -1684894 -1784163 -1551846 -1314728 -1149510 -952332 -788211 -944727 -1502082
30760 -1502082 -1979084 -1735328 -812016 -33015 -35075 -500159 -683466 -430767 -221242 -378895
30750 -378895 -755148 -1122500 -1363933 -1285721 -793891 -316030 -462344 -1109153 -1416024 -1011239
30740 -1011239 -540156 -626824 -905822 -727431 -353960 -600304 -1443360 -1872207 -1287554 -323426
30730 -323426 74962 -155738 -380616 -267723 -64687 -10333 14376 150539 239740 66963
30720 66963 -231032 -238447 217252 735465 663919 -215517 -1405656 -2178750 -2265204 -1931008
30710 -1931008 -1483884 -1008621 -618487 -568349 -857407 -1029089 -743748 -331850 -330582 -647411
30700 -647411 -767380 -710222 -1012218 -1592389 -1509205 -374562 749331 668954 -279103 -849071
30690 -849071 -780999 -906793 -1470930 -1664414 -1141054 -746208 -1082068 -1418148 -924561 -127766
30680 -127766 -58408 -565806 -675435 -259322 -81719 -271466 -48879 767477 1155822 360797
30670 360797 -903224 -1398339 -934581 -350531 -307117 -687860 -991644 -862472 -335577 161857
30660 161857 189116 -178589 -445749 -433274 -522918 -953246 -1331392 -1218070 -813476 -620566
30650 -620566 -732998 -916658 -1123928 -1407670 -1525142 -1195560 -668035 -485312 -690094 -797805
30640 -797805 -613048 -523823 -800052 -1102892 -1014345 -678930 -516441 -522293 -300077 235802
30630 235802 584255 253248 -575731 -1206276 -1222045 -926380 -887267 -1189579 -1375551 -1119908
30620 -1119908 -672864 -473089 -560470 -641701 -580807 -490053 -402753 -233529 -100734 -302340
30610 -302340 -823636 -1220497 -1220187 -1117668 -1264151 -1456288 -1275874 -842237 -669989 -809644
30600 -809644 -750956 -353056 -242134 -859302 -1618194 -1635464 -1009648 -653110 -916233 -1130635
30590 -1130635 -715434 -77738 -2313 -587462 -1243163 -1480371 -1288999 -903308 -563758 -430885
30580 -430885 -479803 -572912 -767036 -1272665 -1902521 -1974470 -1199433 -317805 -259193 -884598
30570 -884598 -1239280 -967968 -717155 -1009064 -1471640 -1552016 -1393328 -1485888 -1817263 -1898910
30560 -1898910 -1480806 -820114 -300883 -102227 -218638 -556168 -961257 -1257389 -1266299 -831645
30550 -831645 15528 895246 1298744 1055545 404990 -414455 -1348749 -2198968 -2474074 -1888401
30540 -1888401 -846444 -159165 -308330 -1088847 -1851419 -2005773 -1457659 -681513 -246871
30531 -246871 -252889 -437975 -789663 -1577415 -2635845 -3178072 -2761032 -2016952 -1842754 -2131624
30521 -2131624 -2004598 -1235372 -681316 -1056345 -1903142 -2238954 -1818786 -1219268 -873333
30512 -873333 -624191 -296989 -161015 -495193 -1027648 -1234693 -1060867 -904719 -903024 -713832
30502 -713832 -176346 278940 227114 -99793 -205333 -113564 -226296 -538030 -601593 -304364
30492 -304364 -87306 -226840 -428733 -390952 -307390 -478653 -777663 -853334 -619944 -257768
30482 -257768 51461 154024 -63984 -457734 -660948 -559161 -458005 -581318 -746277 -786794
30472 -786794 -888761 -1144349 -1199421 -845683 -596068 -1044482 -1895378 -2313238 -2110477 -1860538
30462 -1860538 -1831782 -1597422 -936531 -410836 -597037 -1231746 -1608652 -1507276 -1248524 -1038792
30452 -1038792 -772109 -456325 -379800 -705408 -1181651 -1444126 -1447928 -1416532 -1438325 -1325818
30442 -1325818 -928889 -416861 -90003 -917 16681 -33221 -345345 -833317 -957904 -408713
30432 -408713 232521 27515 -1061799 -1960774 -1805428 -1062607 -861060 -1467203 -2070878
30423 -2070878 -2090978 -1956525 -2205683 -2426970 -1831007 -604581 146676 -126923 -771934
30414 -771934 -1022029 -1012595 -1228178 -1536005 -1430479 -881764 -300184 107625 366710 353301
30404 353301 -15066 -425692 -611985 -887116 -1544275 -2023128 -1557057 -447703 311272
30395 311272 556413 930675 1339440 846727 -519041 -1305722 -735079 24222 -333638
30386 -333638 -1288896 -1534229 -1064422 -865783 -1133587 -1201144 -910718 -729655 -654710 -232040
30376 -232040 369305 457671 48053 -76615 343909 677679 482893 55739 -274133 -549911
30366 -549911 -730923 -649929 -579364 -1032652 -1850822 -2283106 -2097240 -1784419 -1580686 -1227398
30356 -1227398 -833109 -908171 -1273266 -1052607 -180662 211754 -490915 -1379466 -1474671 -1177993
30346 -1177993 -1357404 -1876696 -2088508 -2074663 -2255827 -2292063 -1557844 -422869 48120 -448958
30336 -448958 -1248563 -1826145 -2178182 -2186639 -1587360 -653705 -62717 25587 9438 -33660
30326 -33660 -401347 -868396 -707415 101370 598293 234458 -289370 -159090 294198 213561
30316 213561 -415546 -835720 -705069 -449923 -482023 -707485 -888003 -978886 -971274 -784763
30306 -784763 -470604 -247613 -221812 -295840 -430747 -752183 -1273499 -1712642 -1743729 -1336529
30296 -1336529 -759907 -331763 -200714 -261451 -253252 -56679 113657 -17646 -335409 -422924
30286 -422924 -160878 88357 50424 -76501 -100347 -314582 -992273 -1659894 -1544943 -718791
30276 -718791 -119073 -302750 -824944 -1089356 -1134059 -1164708 -969032 -423120 -68296 -430938
30266 -430938 -1102896 -1281201 -994372 -957377 -1331254 -1545099 -1394745 -1356062 -1562861 -1432152
30256 -1432152 -776715 -411877 -958968 -1742110 -1715055 -993854 -543856 -629687 -576600 -67497
30246 -67497 295413 23722 -439673 -420451 -1083 232006 104817 -35689 3737 5560
30236 5560 -190556 -396361 -430854 -445274 -633341 -845718 -834808 -763388 -1037878 -1585143 -1766269
30225 -1766269 -1275034 -707692 -780047 -1265261 -1322320 -771562 -320797 -394552 -496738 -151428
30215 -151428 188575 -159795 -963989 -1445274 -1552100 -1934769 -2628822 -2766396 -1977237 -1168553
30205 -1168553 -1225710 -1664021 -1509139 -1011537 -1274548 -2290864 -2700705 -1892226 -1083411
30196 -1083411 -1483374 -2395832 -2331649 -1335432 -790350 -1158977 -1421613 -956319 -545740 -912899
30186 -912899 -1458077 -1331801 -874247 -988967 -1661398 -2062129 -1777858 -1123916 -516900 -248164
30176 -248164 -563792 -1265985 -1570920 -1075487 -484956 -617203 -1141655 -1231035 -993886 -1091492
30166 -1091492 -1269340 -657931 515492 950935 234649 -563077 -606450 -322281 -244856 -128148
30156 -128148 138699 -40638 -809653 -1242932 -812466 -433749 -994637 -1783448 -1611429 -751538
30146 -751538 -422244 -855673 -1233745 -1231169 -1265884 -1313874 -784672 279273 1000053 907654
30136 907654 460200 104850 -300522 -854498 -1212999 -1181035 -1052405 -1036906 -921980 -596433
30126 -596433 -371764 -472309 -670014 -722626 -770368 -1009070 -1298962 -1362233 -1143977 -821052
30116 -821052 -640046 -770520 -1084153 -1143061 -725130 -255270 -301715 -752980 -1010578 -926759
30106 -926759 -921609 -1122148 -1077883 -578830 -163631 -448042 -1343727 -2235788 -2611343 -2317809
30096 -2317809 -1568726 -899252 -757067 -950481 -865966 -375422 -61412 -314072 -709410 -662555
30086 -662555 -292510 -190326 -590465 -1186100 -1606683 -1747613 -1732233 -1756809 -1842729 -1667159
30076 -1667159 -940653 -41639 205107 -362019 -888295 -698686 -319555 -626734 -1357632
30067 -1357632 -1379061 -394935 530603 448444 -231184 -498555 -234844 -249396 -984615 -1834411
30057 -1834411 -1911272 -1070213 79644 907645 1188222 938552 235663 -686891 -1437408
30048 -1437408 -1787271 -1872688 -1905797 -1830356 -1502067 -1085728 -929530 -1052500 -1122911 -1035198
30038 -1035198 -1120922 -1552955 -1877578 -1525956 -627818 88616 189045 -31528 -74127 119834
30028 119834 221606 5264 -414669 -728277 -652639 -111307 603466 891704 331637 -777387
30018 -777387 -1534371 -1303687 -422582 135388 -178516 -931842 -1289890 -985626 -530730 -531965
30008 -531965 -1040154 -1662044 -2110466 -2394596 -2507754 -2249555 -1565816 -860386 -612255 -708479
29998 -708479 -567760 -73337 51393 -821321 -2222634 -3052107 -2909378 -2374567 -1953472
29989 -1953472 -1418109 -475711 485396 815052 454699 -73112 -321057 -181196 289025
29980 289025 860216 1078026 666612 -39074 -434366 -385031 -257622 -247885 -133093 197236
29970 197236 382118 30792 -695317 -1201191 -1106964 -638449 -361062 -551644 -866080 -738520
29960 -738520 -134869 306952 41863 -704762 -1283433 -1437072 -1408119 -1379392 -1278256 -1132218
29950 -1132218 -1132556 -1207339 -967626 -326383 173975 -25700 -770811 -1381936 -1445360 -1127156
29940 -1127156 -776815 -536061 -400795 -416977 -633483 -947067 -1152103 -1157397 -1062510 -995731
29930 -995731 -962573 -904861 -821913 -745617 -673513 -633698 -719625 -906223 -943651 -665684 -311849
29919 -311849 -245728 -426847 -545812 -639959 -1043962 -1619707 -1648892 -844362 48568 152074
29909 152074 -421088 -875535 -867668 -731551 -733307 -731449 -616579 -571705 -739007 -949969 -921154
29898 -921154 -564403 -99014 65085 -284135 -798899 -917876 -738841 -1054442 -2141351
29889 -2141351 -3059071 -2796591 -1695446 -944753 -947690 -1080560 -939204 -841573 -983040 -1014004
29879 -1014004 -749583 -532968 -562261 -541222 -361943 -497687 -1270733 -2222453 -2635387 -2314574
29869 -2314574 -1558363 -753881 -253186 -210945 -292948 1443 517028 506346 -204969 -769358
29859 -769358 -494501 129923 181454 -397372 -923873 -1058418 -1050730 -1062348 -908045 -502746
29849 -502746 -95258 8177 -315935 -974282 -1622151 -1817051 -1472945 -995416 -734147 -558084
29839 -558084 -255251 -23951 -146439 -447770 -570674 -587156 -800020 -1059024 -866130 -198800
29829 -198800 308616 170948 -367762 -759243 -839351 -852871 -992019 -1169703 -1214242 -1104559
29819 -1104559 -934472 -716770 -370551 40090 230366 57083 -186190 -150739 -23613 -312986
29809 -312986 -1013579 -1458621 -1174035 -470663 14087 -14909 -476006 -1106291 -1469393 -1242216
29799 -1242216 -767704 -809159 -1428095 -1713686 -1117844 -419931 -632374 -1467359 -1807772 -1377633
29789 -1377633 -909121 -729143 -286690 628197 1156120 468470 -965650 -1839713 -1513075
29780 -1513075 -601231 -142460 -488033 -1060127 -1078301 -427294 292330 543689 394777 144866
29770 144866 -201889 -721880 -1161471 -1257756 -1251777 -1514624 -1824244 -1657682 -1120386 -864976
29760 -864976 -1042738 -1086634 -714956 -404320 -541669 -792169 -747523 -600351 -649088 -641996
29750 -641996 -221142 352329 540395 346265 195448 179249 16813 -314872 -500944 -457002
29740 -457002 -451805 -581927 -595639 -373343 -172081 -222711 -427374 -625347 -845919 -1112198
29730 -1112198 -1266963 -1181809 -915026 -538910 -101768 104763 -348067 -1343209 -2016354 -1691640
29720 -1691640 -762557 -147882 -94218 -128149 -54351 -219985 -689196 -963704 -851928 -859898
29710 -859898 -1216546 -1233131 -372771 619808 593877 -336909 -994080 -856113 -542970 -547580
29700 -547580 -562975 -342828 -209319 -250019 57139 828409 1233378 680591 -201480 -558482
29690 -558482 -593035 -933495 -1332805 -1111741 -521821 -488420 -1134180 -1675383 -1763849 -1817809
29680 -1817809 -1927947 -1588990 -811248 -391993 -601352 -596411 238846 1240972 1463502 980158
29670 980158 426443 -90239 -732644 -1112145 -738412 -31486 85448 -463342 -842893 -635289
29660 -635289 -382419 -588827 -926711 -828636 -365243 -100352 -327381 -763116 -890502 -475232
29650 -475232 161224 407684 69556 -322900 -209244 181709 197788 -163185 -223235 228637
29640 228637 497339 60896 -547501 -504077 95951 424953 68332 -618080 -1155934 -1380738
29630 -1380738 -1285186 -950956 -646623 -552055 -421752 11622 377416 22034 -936295 -1585936
29620 -1585936 -1454507 -1093966 -1101778 -1222624 -953657 -489746 -379960 -606127 -737531 -799273
29610 -799273 -1221890 -1941361 -2271615 -1838778 -1068207 -530060 -290641 -169097 -209417 -543829
29600 -543829 -1028300 -1318857 -1217233 -799337 -313933 -23741 -9331 -101799 -147486 -273187
29590 -273187 -657076 -1125846 -1317530 -1204320 -1066565 -956010 -640627 -152373 102181 -42923
29580 -42923 -229423 -122746 161553 391486 548677 574631 251443 -313548 -516729 -15030
29570 -15030 687102 872895 556368 305641 348580 385309 195775 -54869 -133438 -11714
29560 -11714 177985 218667 -49650 -407706 -275862 569168 1451157 1414908 345465 -937961
29550 -937961 -1680491 -1862760 -1847208 -1809906 -1725418 -1613899 -1549710 -1522108 -1413990 -1088298
29540 -1088298 -511732 116242 407772 108662 -607683 -1232032 -1282151 -601060 507054
29531 507054 1358219 1353072 567359 -279601 -621968 -632256 -816085 -1243315 -1496546 -1288154
29521 -1288154 -826030 -537640 -597421 -766041 -672846 -294157 -61565 -304883 -714640 -733195
29511 -733195 -406765 -308395 -561666 -608267 -200946 67366 -302160 -851658 -853198 -406207
29501 -406207 -181601 -378678 -592348 -537508 -331151 -164821 -137484 -272066 -379346 -183726
29491 -183726 132575 -22246 -679991 -994681 -445551 282864 328030 -93743 -311495 -421151
29481 -421151 -827707 -1161045 -900893 -614396 -1145648 -1876060 -1387271 180925 1086198
29472 1086198 523582 -391407 -587499 -404607 -384477 -227116 197664 176086 -521832 -869482
29462 -869482 -211144 478172 158697 -490548 -243097 544273 500422 -564089 -1533423 -1816194
29452 -1816194 -1876792 -1962821 -1629698 -783546 -151698 -349139 -1152831 -1887854 -1998081 -1267297
29442 -1267297 -85172 588516 180980 -665274 -889430 -480640 -352043 -849920 -1315753
29433 -1315753 -1230674 -899468 -741475 -684257 -585462 -580381 -661635 -503028 -51612 231273
29423 231273 68560 -169697 -58306 247690 333622 141040 -68708 -91760 130540 513659
29413 513659 707860 315231 -518124 -1063899 -856004 -264255 80100 117112 230538 527456
29403 527456 688280 450770 -113290 -759444 -1216594 -1241789 -855554 -514359 -724389 -1405559
29393 -1405559 -1902409 -1745218 -1188812 -842135 -923196 -1084705 -919453 -437902 1109 95970
29383 95970 -162438 -589580 -994356 -1221826 -1131561 -715706 -279610 -316480 -977322 -1712969
29373 -1712969 -1742652 -995335 -290923 -331912 -797079 -868910 -455809 -253590 -592222 -975652
29363 -975652 -1028529 -1126185 -1555523 -1763482 -1238120 -599269 -824838 -1698629 -2100890 -1732047
29353 -1732047 -1397703 -1469780 -1275807 -445694 239433 22701 -679138 -1050740 -1077926 -1178424
29343 -1178424 -1250235 -960147 -541205 -459247 -616856 -667612 -775013 -1211837 -1511433 -998360
29333 -998360 -37206 270434 -279476 -644587 -116854 623175 543242 -291457 -928566 -835170
29323 -835170 -391650 -167532 -201230 -166341 6422 -9264 -381307 -701579 -479762 28761
29313 28761 -13989 -908717 -1971088 -2461146 -2432583 -2277486 -1996614 -1515252 -1242625 -1558236
29303 -1558236 -2038758 -1971238 -1447084 -1170452 -1309389 -1365292 -1165837 -1133479 -1425724 -1589848
29293 -1589848 -1319380 -898283 -651823 -556705 -612914 -969246 -1390082 -1217039 -271695 683435
29283 683435 805593 151610 -531391 -674334 -244885 466439 1097254 1398246 1345394 995824
29273 995824 339397 -429319 -709773 -135835 667427 661080 -225533 -1032887 -1209195 -1239841
29263 -1239841 -1539965 -1669399 -1251256 -839185 -1057286 -1503533 -1402073 -886037 -690242
29254 -690242 -881740 -888260 -646136 -691297 -1031002 -924943 -117988 557975 321152 -451762
29244 -451762 -830813 -606396 -351325 -470706 -800239 -1083040 -1290079 -1364263 -1101610 -530158
29234 -530158 -111068 -262029 -812986 -1195894 -1111044 -768434 -516970 -520135 -815412 -1354801
29224 -1354801 -1837858 -1815963 -1216757 -540877 -276776 -335252 -359795 -361962 -635616 -1185137
29214 -1185137 -1681727 -1916600 -1884515 -1526788 -896551 -502085 -859154 -1635756 -1885000 -1306423
29204 -1306423 -637530 -522864 -655132 -472253 -110312 -70083 -353396 -554982 -562640 -616854
29194 -616854 -855299 -1255379 -1810776 -2319282 -2280789 -1546730 -796592 -728265 -1009121 -807157
29184 -807157 -232823 -293489 -1244016 -1952189 -1431323 -258803 253910 -166653 -615010 -446822
29174 -446822 -61839 -119452 -589607 -919149 -804168 -449868 -196143 -167745 -295138 -489178
29164 -489178 -704896 -881639 -883702 -550567 130442 880253 1243129 974629 340731 -76604
29154 -76604 37495 397067 469135 118700 -265637 -317952 -156738 -133885 -274202 -252474
29144 -252474 69262 389023 407168 269400 278972 318155 -33211 -764756 -1255120 -1065505
29134 -1065505 -563510 -382562 -520341 -471142 -120173 91929 -62678 -292398 -442692 -809454
29124 -809454 -1408737 -1567086 -878734 -92814 -229796 -1070589 -1428087 -890599 -347093 -538032
29114 -538032 -978946 -855705 -311327 -140069 -584769 -1136872 -1384690 -1453722 -1591452 -1787924
29104 -1787924 -1904782 -1854190 -1563493 -1018428 -432404 -175099 -415660 -921783 -1273360 -1246063
29094 -1246063 -983523 -801260 -796894 -714679 -329276 101459 44341 -584780 -1200890 -1224125
29084 -1224125 -718987 -150688 230013 439985 410894 32610 -445760 -459712 237544 1180887
29074 1180887 1602442 1175045 283270 -382836 -458200 -177085 -66423 -381163 -872653 -1106756
29064 -1106756 -916392 -487628 -97515 117512 167291 96450 -87130 -376926 -659473 -692960
29054 -692960 -305603 354071 864902 905751 541750 106432 -144863 -219348 -271742 -377915
29044 -377915 -459369 -426518 -323450 -237358 -115982 144187 421360 428269 146619 -63385
29034 -63385 38567 229985 208865 40714 -72525 -177890 -345029 -345975 -43909 163723
29024 163723 -115070 -491451 -266284 428620 749578 424393 78595 124378 195114 775
29014 775 -114997 52911 39725 -446474 -860911 -694498 -376249 -519087 -823451 -643853
29004 -643853 -225219 -348628 -948144 -1126510 -579640 -41790 -101067 -403005 -366784 -21510
28994 -21510 261798 347486 239713 -186332 -926811 -1558450 -1601441 -1126344 -755852 -1015815
28984 -1015815 -1749310 -2223225 -1893918 -1046598 -469813 -480048 -646086 -623128 -710998 -1147969
28974 -1147969 -1384198 -794532 201335 588247 226801 -7729 350559 675404 316544
28965 316544 -384659 -625453 -194982 434601 720918 439454 -208927 -640471 -410337 105856
28955 105856 16002 -838092 -1464258 -980113 165532 765156 334755 -515995 -989241 -845109
28945 -845109 -341796 82873 53824 -456705 -1041237 -1268512 -1134833 -921868 -745946 -510921
28935 -510921 -212304 -26175 -124235 -543733 -1138039 -1563214 -1534282 -1222467 -1091851 -1168792
28925 -1168792 -906355 -107638 503769 207219 -591127 -872748 -433970 -14555 -62117 -208868
28915 -208868 -117224 -34876 -186795 -312022 -216059 -187022 -414763 -545155 -311396 -89527
28905 -89527 -243563 -391697 -13621 596202 764391 559894 624139 1009581 1102900 753520
28895 753520 543884 683318 514003 -429252 -1592961 -2176542 -2147252 -1935168 -1636714 -1140663
28885 -1140663 -647169 -440744 -440513 -506895 -841024 -1500676 -1915163 -1600463 -1026737 -956534
28875 -956534 -1182519 -881743 -117816 85388 -669082 -1510596 -1610694 -1233935 -997853 -883596
28865 -883596 -597017 -288933 -266599 -444044 -649979 -1052443 -1700366 -2040072 -1526252 -458657
28855 -458657 355015 562184 399341 107026 -250158 -534386 -597083 -512214 -413564 -270555
28845 -270555 -97892 -78547 -169789 -15750 344959 222450 -678049 -1492757 -1288542 -485679
28835 -485679 -238912 -686596 -899558 -496823 -167501 -391442 -699556 -602402 -362090 -358753
28825 -358753 -437873 -396461 -468140 -793476 -976034 -720078 -422645 -556824 -872479 -809877
28815 -809877 -409246 -207704 -396117 -613800 -521490 -161552 215136 360194 126798 -362877
28805 -362877 -716080 -677175 -462852 -477023 -773396 -1004724 -849278 -331980 225331 475267
28795 475267 341037 89124 2763 4116 -204315 -655185 -1063797 -1273016 -1406710 -1508399
28785 -1508399 -1399329 -1043129 -715347 -643488 -769656 -976241 -1195903 -1194605 -686055 143196
28775 143196 654560 539498 173690 -16905 -52906 -1718 337890 921867 1169003 716746
28765 716746 915 -485591 -1014304 -1978795 -2870912 -2819003 -1937257 -1186760 -929876 -593795
28755 -593795 79945 428116 -75838 -949312 -1428053 -1457693 -1391476 -1224582 -811844 -494681
28745 -494681 -753608 -1339762 -1439013 -772213 27039 267867 -51354 -527094 -902512 -1052982
28735 -1052982 -856919 -485614 -468775 -970134 -1284405 -701190 293736 489719 -311927 -939121
28725 -939121 -578408 62942 6001 -424693 -299625 232008 224922 -355176 -579568 -265174
28715 -265174 -323366 -1034942 -1369496 -718313 -21729 -180338 -451842 302138 1591729 1955974
28705 1955974 1171489 368847 157547 55502 -180024 -33743 633624 1099706 881203
28696 881203 382549 41503 -275614 -591030 -420768 369869 1073555 1099165 773751 633082
28686 633082 579511 374149 313963 651224 866527 365731 -466301 -753944 -425027 -178955
28676 -178955 -299677 -346912 -63323 173093 -28318 -574560 -1151405 -1491346 -1327771 -628659
28666 -628659 41560 -23023 -695301 -1071505 -712770 -224393 -268071 -613100 -704390 -676391
28656 -676391 -1074385 -1789245 -2019984 -1358865 -326260 339053 452250 246522 -89327
28647 -89327 -406177 -453383 -167930 35561 -329821 -1133261 -1685090 -1555231 -1044690 -727627
28637 -727627 -784408 -963385 -992206 -807069 -526011 -424209 -802267 -1600303 -2225754 -2089054
28627 -2089054 -1317746 -633884 -490897 -675136 -849927 -1062466 -1416702 -1603944 -1243481
28618 -1243481 -559221 -228551 -509097 -926894 -974888 -766389 -752812 -1055315 -1397456 -1575542
28608 -1575542 -1657190 -1693079 -1525286 -1040554 -460911 -189193 -374080 -752422 -962421 -930065
28598 -930065 -862770 -898321 -900073 -677687 -302774 -39923 3985 -46028 -150778 -492424 -1108882
28587 -1108882 -1610503 -1575301 -1128384 -776373 -690956 -575815 -329269 -339390 -811850 -1243690
28577 -1243690 -1070238 -556596 -444080 -834205 -1091701 -899676 -697149 -810524 -842784 -429204
28567 -429204 -49517 -388807 -1193562 -1526060 -1103343 -665055 -865407 -1419331 -1645806 -1377210
28557 -1377210 -932406 -508144 -51960 376167 529142 336756 93045 128647 387062 484266
28547 484266 231942 -56894 -14753 93894 -423671 -1581499 -2303458 -1685711 -367494
28538 -367494 133440 -596652 -1415801 -1348207 -822148 -659341 -693242 -293517 292637 205017
28528 205017 -610391 -1275644 -1314722 -1158340 -1134415 -905972 -323065 13742 -352204 -919301
28518 -919301 -971945 -644759 -555404 -770636 -881805 -847725 -997565 -1316152 -1445573 -1340545
28508 -1340545 -1225498 -955831 -224402 540888 409793 -595555 -1157851 -367049 927849
28499 927849 1219197 317763 -610013 -749408 -508765 -602483 -997026 -1121068 -733478 -223375
28489 -223375 -129652 -515187 -849375 -595227 66695 349288 -141414 -824510 -887796 -340315
28479 -340315 129015 152391 -8350 -104163 -269347 -616044 -920444 -920632 -630430 -247775
28469 -247775 -30669 -283393 -1081509 -1928171 -2083459 -1388987 -435203 196129 483075 639029
28459 639029 672192 517036 272837 55848 -151787 -345435 -436029 -437231 -427159 -302934
28449 -302934 22722 176870 -339773 -1248364 -1600274 -1080763 -506090 -576650 -835502 -515160
28439 -515160 173118 404830 9944 -445116 -611063 -612611 -489304 -122552 314034 465257
28429 465257 326052 136593 -103671 -449517 -577758 -248238 30873 -358862 -1003636 -928230
28419 -928230 -174130 183783 -240082 -547828 -98835 443138 251213 -393967 -747296 -765260
28409 -765260 -793202 -691049 -171955 397227 414413 24755 -79881 333483 902454 1334991
28399 1334991 1544751 1330761 642007 16535 25576 378045 327596 -104291 -166938 295522
28389 295522 481666 -93622 -790533 -816057 -362630 -176206 -440715 -729943 -809276 -866328
28379 -866328 -1010123 -1051702 -846732 -506589 -187029 92659 353116 551590 632697 578572
28369 578572 394528 122769 -146535 -344012 -463667 -491810 -387290 -217023 -193389 -418558
28359 -418558 -664783 -609523 -288293 -105027 -311213 -666426 -796731 -758711 -948130 -1415357
28349 -1415357 -1618376 -1136018 -410298 -331493 -1064226 -1747627 -1592254 -881477 -479237 -610161
28339 -610161 -683329 -294176 173703 161226 -284634 -671716 -724644 -528678 -194796 223399
28329 223399 541615 570307 473333 621681 949919 849917 23957 -861282 -870670 -57929
28319 -57929 535002 268928 -255181 -118977 608319 1074415 896816 490829 162844 -333264
28309 -333264 -1045764 -1345499 -763657 162143 523430 219650 -172339 -483810 -1078766 -1866369
28299 -1866369 -2070115 -1354807 -492606 -361129 -765697 -882142 -549816 -412607 -844273
28290 -844273 -1401124 -1491181 -1080196 -517158 -67938 113298 -106457 -612343 -944549 -785566
28280 -785566 -424721 -397275 -729917 -907373 -598873 -44643 378741 603893 685271 531515
28270 531515 162440 -57234 104618 222731 -271769 -1096367 -1298251 -613189 38575 -139527
28260 -139527 -627002 -434276 255747 283446 -646745 -1357923 -890292 30627 -6987 -1125197
28250 -1125197 -2099243 -2134076 -1746442 -1646191 -1590785 -961156 49320 610007 476763 286735
28240 286735 480622 596079 63612 -756249 -957906 -355523 284641 370071 229015 397000
28230 397000 658745 383836 -406814 -960198 -833516 -461562 -460371 -802074 -1006106 -839340
28220 -839340 -458755 -59191 246791 315072 105293 -112049 -26543 227699 177930 -349868
28210 -349868 -980007 -1218416 -869074 -24627 982020 1544395 1164711 131336 -570527
28201 -570527 -371170 178205 201515 -319860 -698966 -658351 -603787 -772572 -822265 -532796
28191 -532796 -316509 -582640 -999289 -889414 -143917 697009 1118265 980392 347126 -556100
28181 -556100 -1234955 -1246943 -738817 -322663 -340130 -587321 -829000 -1147537 -1572480 -1775244
28171 -1775244 -1494163 -999176 -748966 -753736 -668282 -411087 -252697 -270242 -148692 305822
28161 305822 788087 866523 506767 -15470 -530825 -1005836 -1267623 -1057833 -423749 209969
28151 209969 485938 461912 407928 407905 298424 -83897 -687449 -1196381 -1172957 -458318 445275
28140 445275 643902 -210986 -1397478 -1860375 -1404717 -804082 -732891 -1003301 -995568 -477578
28130 -477578 248327 762534 837601 497643 -7864 -386148 -577766 -723480 -831758 -766483
28120 -766483 -637295 -774462 -1089409 -947013 -103596 670188 523859 -219885 -495715 -53454
28110 -53454 248179 -183108 -827856 -957779 -713910 -729822 -1105848 -1355501 -1190729 -851507
28100 -851507 -676098 -705911 -762390 -704553 -572443 -552410 -752630 -995580 -977801 -657507
28090 -657507 -279878 5289 271729 505355 516919 317353 228694 402013 552453 420892
28080 420892 162832 -18814 -277532 -766585 -1183304 -1151528 -862028 -830314 -1118673 -1285877
28070 -1285877 -1079563 -718748 -467570 -362277 -421751 -702123 -1007969 -928705 -363238 276276
28060 276276 581986 634744 756070 960477 922414 452935 -199582 -603720 -621673 -528850
28050 -528850 -627726 -841283 -829713 -469922 -23643 181710 22478 -475987 -1151131 -1590595
28040 -1590595 -1396629 -741433 -256998 -140813 136662 855635 1342482 899028 -465
28031 -465 -306127 27548 26322 -701456 -1332317 -1109236 -389030 77678 176405 120327 -266083
28020 -266083 -1148842 -1931053 -1772752 -817582 -138294 -318025 -743168 -620588 -159275 -204735
28010 -204735 -947784 -1612257 -1522376 -978164 -731826 -917453 -998369 -668888 -235285 6962
28000 6962 200416 441290 411459 -41519 -410793 -192884 322658 559721 589529 783325
27990 783325 863444 307976 -449776 -408642 303388 385529 -583981 -1343968 -938254 -305404
27980 -305404 -782218 -1956799 -2360030 -1720601 -1111164 -1100764 -1166373 -973971 -908969 -1044300
27970 -1044300 -785766 -33371 348216 -145970 -744560 -561420 27957 32985 -613857 -1087103
27960 -1087103 -998203 -780472 -730022 -500204 171817 862129 995244 597431 116653 -244554
27950 -244554 -590204 -880060 -909754 -779009 -905009 -1352737 -1570238 -1180412 -717630 -1008202
27940 -1008202 -1939645 -2507708 -2196740 -1654117 -1673286 -2102716 -2272937 -2036647 -1728849 -1378041
27930 -1378041 -689002 233669 802240 709916 302109 67846 138635 350712 433475 100573
27920 100573 -667299 -1405247 -1616150 -1438468 -1429182 -1690862 -1747715 -1365320 -916909 -746748
27910 -746748 -717245 -637009 -605500 -626177 -414500 -966 -25442 -882915 -1921091 -2078197
27900 -2078197 -1162281 -10404 517181 272639 -358005 -927511 -1174064 -1091870 -845625
27891 -845625 -542782 -186574 97603 51399 -343684 -759599 -976181 -1126413 -1267185 -1101811
27881 -1101811 -486374 148737 320569 145488 34855 42289 -266 -3979 146201 154853 -233597
27870 -233597 -558559 -159241 728774 1161986 780010 140726 -296642 -686252 -1083022 -1077369
27860 -1077369 -589902 -327530 -878260 -1833876 -2329546 -2076841 -1419597 -742851 -281170
27851 -281170 -177142 -272966 -118530 417995 848537 755458 424877 335654 376620 130516
27841 130516 -341177 -598396 -519833 -317582 -16470 463605 811701 582287 -25753 -267164
27831 -267164 167479 809975 1156613 1209726 1141485 969500 785056 797266 891099 625190
27821 625190 -19312 -364101 62954 726982 711668 -54041 -711731 -583023 82012 572041
27811 572041 601005 490463 573287 677967 391601 -232570 -570273 -249843 215746 71221
27801 71221 -551441 -736297 -86548 684257 739156 178230 -283035 -293011 -64335 128586
27791 128586 196467 137462 57024 139992 322336 226611 -267837 -703031 -695547 -571946 -813182
27780 -813182 -1174243 -1054500 -559460 -387434 -673130 -797437 -513706 -390361 -737526 -893440
27770 -893440 -213005 810398 1132364 515255 -373945 -955454 -1124825 -824157 -23732
27761 -23732 793280 860942 133414 -490899 -299236 312483 458824 -14383 -429365 -274682
27751 -274682 183469 361644 62374 -449642 -818246 -836038 -493803 -43792 78389 -313896
27741 -313896 -793990 -696948 19723 594664 393875 -239347 -460702 -91611 218144 26547
$$ [...]
##END NTUPLES=NMR SPECTRUM
##END=
