##TITLE=31Pdec_LY-12.Dix.1B
 CD3CN, 24 sc
 1.06.2021
##JCAMPDX= 6.0         $$ Bruker NMR JCAMP-DX V2.0
##DATA TYPE= NMR SPECTRUM
##DATA CLASS= NTUPLES
##ORIGIN= UXNMR, Bruker Analytische Messtechnik GmbH
##OWNER= root
$$ XWIN-NMR		Version 3.5
$$ Tue Jun  1 10:26:03 2021 Russian Standard Time (UT+4h)  she@DPX200
##.OBSERVE FREQUENCY= 81.013821
##.OBSERVE NUCLEUS= ^31P
##.ACQUISITION MODE= SIMULTANEOUS
##.ACQUISITION SCHEME= undefined
##.AVERAGES= 24
##.DIGITISER RES= 16
##SPECTROMETER/DATA SYSTEM= spect
##.PULSE SEQUENCE= zgpg30
##.SOLVENT NAME= CD3CN
##.SHIFT REFERENCE= (INTERNAL, CD3CN, 0, 248.564)
##AUDIT TRAIL= $$ (NUMBER, WHEN, WHO, WHERE, WHAT)
$$ ##TITLE= Audit trail, XWIN-NMR		Version 3.5
$$ ##JCAMPDX= 5.01
$$ ##ORIGIN= Bruker BioSpin GmbH
$$ ##OWNER= she
$$ F:/spectra/data/she/nmr/P31/1/pdata/1/auditp.txt
$$ ##AUDIT TRAIL=  $$ (NUMBER, WHEN, WHO, WHERE, WHAT)
(   1,<2021-06-01 10:24:32.10 +0400>,<she>,<DPX200>,
      <created by zg, POWCHK disabled, PULCHK disabled
       configuration hash MD5:
       00 E9 B6 7A A2 85 ED C7 34 08 36 98 17 FE 4E 26
       data hash MD5: 32K
       73 D3 49 8F 2B 19 F5 C9 D0 AB 34 A5 57 B2 5B 53>)
(   2,<2021-06-01 10:24:34.57 +0400>,<she>,<DPX200>,
      <Start of raw data processing
       efp BC_mod = 2 LB = 1 FT_mod = 6 PKNL = 1 PHC0 = -5853.561 PHC1 = 43.67221 SI = 64K 
       data hash MD5: 64K
       1F 4C 21 8C 81 75 76 26 3A CC 02 59 EA 4E EF 21>)
(   3,<2021-06-01 10:25:20.00 +0400>,<she>,<DPX200>,
      <pk PHC0 = 103.0036 PHC1 = -193.7995 
       data hash MD5: 64K
       ED 51 9C 97 F8 5C 8F CC D0 DB 17 10 E5 DD 78 85>)
(   4,<2021-06-01 10:25:23.06 +0400>,<she>,<DPX200>,
      <abs ABSG = 5 
       data hash MD5: 64K
       61 95 57 9B 95 B3 11 EB 2A 01 32 BD 4B 31 DF DC>)
$$ ##END=
$$ 
$$ hash MD5
$$ 93 77 55 51 83 C1 DC B8 DE 8C 28 80 93 7C 47 0C
##$RELAX= 
##$RELAX= 
##$RELAX= 
##$RELAX= 
##$RELAX= 
##$RELAX= 
##$RELAX= 
##$RELAX= 
$$ Bruker specific parameters
$$ --------------------------
##$DU= <F:/spectra>
##$EXPNO= 1
##$NAME= <P31>
##$PROCNO= 1
##$TYPE= <nmr>
##$USER= <she>
##$AMP= (0..31)
100 100 100 100 100 100 100 100 100 100 100 100 100 100 100 100 100 100 
100 100 100 100 100 100 100 100 100 100 100 100 100 100 
##$AQSEQ= 0
##$AQ_mod= 1
##$AUNM= <au_zg>
##$AUTOPOS= <>
##$BF1= 81.014009
##$BF2= 200.13
##$BF3= 200.13
##$BF4= 200.13
##$BF5= 200.13
##$BF6= 200.13
##$BF7= 200.13
##$BF8= 200.13
##$BYTORDA= 1
##$CFDGTYP= 0
##$CFRGTYP= 5
##$CHEMSTR= <none>
##$CNST= (0..31)
1 1 145 1 1 1 1 1 1 1 1 1 1 1 1 1 1 1 1 1 1 1 1 1 1 1 1 1 1 1 1 1 
##$CPDPRG= <waltz16>
##$CPDPRG1= <>
##$CPDPRG2= <waltz16>
##$CPDPRG3= <>
##$CPDPRG4= <mlev>
##$CPDPRG5= <mlev>
##$CPDPRG6= <mlev>
##$CPDPRG7= <mlev>
##$CPDPRG8= <mlev>
##$CPDPRGB= <>
##$CPDPRGT= <>
##$D= (0..31)
0 1 0 0 0 0 0 0 0 0 0 0.03 2e-05 3e-06 0 0 0 0 0 0 0 0 0 0 0 0 0 0 0 0 
0 0 
##$DATE= 1622528671
##$DBL= (0..7)
120 120 120 11 120 120 24 19 
##$DBP= (0..7)
150 150 150 150 150 150 150 150 
##$DBP07= 0
##$DBPNAM0= <>
##$DBPNAM1= <>
$$ [...]
##$SUBNAM3= <"">
##$SUBNAM4= <"">
##$SUBNAM5= <"">
##$SUBNAM6= <"">
##$SUBNAM7= <"">
##$SUBNAM8= <"">
##$SUBNAM9= <"">
##$SW= 501.771253377433
##$SWIBOX= (0..15)
0 1 3 0 0 0 0 0 0 0 0 0 0 0 0 0 
##$SW_h= 40650.406504065
##$TD= 32768
##$TD0= 1
##$TE= 0
##$TE2= 300
##$TE3= 300
##$TEG= 300
##$TL= (0..7)
0 120 53 12 22 120 120 120 
##$TP= (0..7)
150 150 150 150 150 150 150 150 
##$TP07= 0
##$TPNAME0= <>
##$TPNAME1= <>
##$TPNAME2= <>
##$TPNAME3= <>
##$TPNAME4= <>
##$TPNAME5= <>
##$TPNAME6= <>
##$TPNAME7= <>
##$TPOAL= (0..7)
0.5 0.5 0.5 0.5 0.5 0.5 0.5 0.5 
##$TPOFFS= (0..7)
0 0 0 0 0 0 0 0 
##$TUNHIN= 0
##$TUNHOUT= 0
##$TUNXOUT= 0
##$USERA1= <user>
##$USERA2= <user>
##$USERA3= <user>
##$USERA4= <user>
##$USERA5= <user>
##$V9= 5
##$VALIST= <valist>
##$VCLIST= <CCCCCCCCCCCCCCC>
##$VD= 0
##$VDLIST= <DDDDDDDDDDDDDDD>
##$VPLIST= <PPPPPPPPPPPPPPP>
##$VTLIST= <TTTTTTTTTTTTTTT>
##$WBST= 1024
##$WBSW= 4
##$XGAIN= (0..3)
0 0 0 0 
##$XL= 0
##$YL= 0
##$YMAX_a= 4599
##$YMIN_a= -7860
##$ZGOPTNS= <>
##$ZL1= 120
##$ZL2= 120
##$ZL3= 120
##$ZL4= 120
##$ABSF1= 248.5645
##$ABSF2= -253.2056
##$ABSG= 5
##$ABSL= 3
##$ALPHA= 0
##$AQORDER= 0
##$ASSFAC= 0
##$ASSFACI= 0
##$ASSFACX= 0
##$ASSWID= 0
##$AUNMP= <proc_1d>
##$AZFE= 0.1
##$AZFW= 0.5
##$BCFW= 0
##$BC_mod= 2
##$BYTORDP= 0
##$COROFFS= 0
##$CY= -3
##$DATMOD= 1
##$DC= 0
##$DFILT= <>
##$DTYPP= 0
##$F1P= 0
##$F2P= 0
##$FCOR= 1
##$FTSIZE= 65536
##$FT_mod= 6
##$GAMMA= 0
##$GB= 0
##$INTBC= 1
##$INTSCL= 5.30512e-09
##$ISEN= 30
##$LB= 1
##$LEV0= 0
##$LPBIN= 0
##$MAXI= 10000
##$MC2= 0
##$MEAN= 0
##$ME_mod= 0
##$MI= 50
##$NCOEF= 0
##$NC_proc= -4
##$NLEV= 6
##$NOISF1= 182.463
##$NOISF2= 159.3651
##$NSP= 0
##$NTH_PI= 0
##$NZP= 0
##$OFFSET= 248.5645
##$PC= 4
##$PHC0= -5750.558
##$PHC1= -150.1273
##$PH_mod= 1
##$PKNL= yes
##$PPARMOD= 0
##$PSCAL= 0
##$PSIGN= 0
##$REVERSE= no
##$SF= 81.014009
##$SI= 65536
##$SIGF1= 159.3651
##$SIGF2= -187.1042
##$SINO= 113.3802
##$SIOLD= 16384
##$SREGLST= <1H.CDCl3>
##$SSB= 0
##$STSI= 65536
##$STSR= 0
##$SW_p= 40650.406504065
##$SYMM= 0
##$S_DEV= 0
##$TDeff= 32768
##$TDoff= 0
##$TI= <>
##$TILT= no
##$TM1= 0
##$TM2= 0
##$TOPLEV= 0
##$USERP1= <user>
##$USERP2= <user>
##$USERP3= <user>
##$USERP4= <user>
##$USERP5= <user>
##$WDW= 1
##$XDIM= 65536
##$YMAX_p= 522377602
##$YMIN_p= -36231776
$$ End of Bruker specific parameters
$$ ---------------------------------
##NTUPLES= NMR SPECTRUM
##VAR_NAME=  FREQUENCY,     SPECTRUM/REAL,   SPECTRUM/IMAG
##SYMBOL=    X,             R,               I
##VAR_TYPE=  INDEPENDENT,   DEPENDENT,       DEPENDENT
##VAR_FORM=  AFFN,          ASDF,            ASDF
##VAR_DIM=   65536,         65536,           65536
##UNITS=     HZ,            ARBITRARY UNITS, ARBITRARY UNITS
##FACTOR=    0.620285442955139, 1,           1
##FIRST=     20137.2065510759, 0,            0
##LAST=      -20513.1999529892, 0,           0
##MIN=       -20513.1999529892, -36231776,   0
##MAX=       20137.2065510759, 522377602,    0
$$ Real data points
##PAGE= N=1
##DATA TABLE= (X++(R..R)), XYDATA
$$ [...]
35688C4839K85884K05739r6197p8783J76129R2963l54229n10138o9976M66642
$$ 34839 320723 526462 430265 351482 527611 620574 266345 -243793 -313769 152873
35678A52873N64074K62858j47481m98311o28066m27827j22510k6575j5307K16731
$$ 152873 716947 979805 832324 334013 -294053 -721880 -844390 -870965 -886272 -669541
35668f69541M57509K46771j99151j67346L62343N80969J19776l84853l17173P8865
$$ -669541 -212032 34739 -164412 -331758 30585 611554 731330 346477 29304 108169
35658A08169K53994J09227j39078l03908k00817K06061N23288L52857l2409j25433
$$ 108169 362163 471390 332312 28404 -172413 33648 556936 909793 877384 751951
35648G51951j43481o02193j068075n90104N43358R10246J68656l34387K05768
$$ 751951 608470 6277 -1061798 -1651902 -1108544 -198298 -29642 -364029 -158261
35639a58261P25622J58682p45849p06149Q1611N44413M86820M01071K15170l89282
$$ -158261 567361 726043 -19806 -725955 -644344 -99931 386889 787960 1003130 613848
35629F13848q91469n13049L84815O91729J68448l78155l84137k7676M00370P14824
$$ 613848 -277621 -790670 -405855 285874 454322 76167 -307970 -335646 64724 779548
35619G79548N75937j39342q46027q76526l88754J3897J92800K81625R5504l81543
$$ 779548 1355485 1216143 370116 -506410 -895164 -881267 -688467 -406842 -311338 -692881
35609f92881m53561K97309R73279N03127n85791q43537n6788O50381O93529N26492
$$ -692881 -1146442 -849133 124146 627273 41482 -802055 -858843 -208462 485067 1011559
35599A011559K94533m22295j279173j144266P1632R39583N15879l80660n77856
$$ 1011559 1306092 883797 -395376 -1539642 -1468010 -528427 -12548 -393208 -971064
35590i71064j22170L11359N56421O56986L16807m50958q45245l37850L87911M14007
$$ -971064 -1093234 -781875 -225454 431532 748339 297381 -547864 -885714 -497803 -83796
35580h3796m5176j50152J42024J46807k77869m77788o2829N09489N82123P0747
$$ -83796 -128972 -279124 -137100 9707 -268162 -745950 -808779 -299290 282833 353580
35570C53580n39827o98565k69620L11110M49877Q7702k36628j43520J18137J87850
$$ 353580 -186247 -884812 -1154432 -843322 -393445 -305743 -542371 -685891 -567754 -379904
35560c79904J62294K60194K92888m936l55123k34664K75057N04557J47855k97033
$$ -379904 -217610 42584 335472 330536 -24587 -259251 15806 520363 668218 371185
35550C71185k61033J07540K34484j8348k17229q8920N8480r4709k54962L6819
$$ 371185 110152 217692 452176 433828 216599 127679 186159 91450 -163512 -126693
35540a26693N09052L90161l68793q31822l99949K86273L42007n4925j17696K25350
$$ -126693 382359 772520 403727 -428095 -828044 -541771 -199764 -254689 -372385 -147035
35530a47035L53405P2342j81266j79750j31383j03038J6443L8684k55569m80779
$$ -147035 206370 278712 97446 -82304 -213687 -316725 -300282 -261598 -517167 -997946
35520i97946j47761L40843K14969k62817j41326M84824N16339j64591l42247L79573
$$ -997946 -1145707 -804864 -589895 -852712 -994038 -509214 7125 -157466 -499713 -120140
35510a20140P31663m4381p91468m16475K24213m5605n17099J01633J152735R25574
$$ -120140 611523 567142 -224326 -640801 -416588 -462193 -979292 -877659 275076 1200650
35500A200650m26982j045832l44632K76141o1780n00543l11485j31719m74819
$$ 1200650 773668 -272164 -616796 -340655 -402435 -902978 -1214463 -1346182 -1821001
35491a821001o00542O6493P10045M75974l0296J80510P86815Q07935K78339k7709
$$ -1821001 -2421543 -2355050 -1645005 -1169031 -1199327 -1018817 -232002 575933 854272 826563
35481H26563o7975m03385q56550o31909K08717O16026J28274m81027m69886r8685
$$ 826563 758588 355203 -501347 -1133256 -924539 -308513 -180239 -661266 -1131152 -1229837
35471a229837J13927K53953N28128O08277J85800k95620k26563J48753R4682l63432
$$ -1229837 -1115910 -861957 -333829 274448 460248 164628 -61935 86818 181500 -181932
35461a81932m02261K48440P38771L26462m58795n47228J22692N61910K06767l12940
$$ -181932 -584193 -335753 403018 729480 270685 -276543 -153851 408059 614826 301886
35451C01886j64024M99147Q10199L60407l92876p96246o74228l05261k4154N1975
$$ 301886 137862 637009 1447208 1807615 1414739 618493 -55735 -360996 -385150 -333175
35441c33175M5942J18427K11347J03277j98097l31647o5084K91084K59984j29965
$$ -333175 -287233 -168806 42541 145818 -52279 -383926 -449010 -157926 102058 -27907
35431b7907l85988k11617J94888M79869M63509J46801k94114n19277l41176l0083
$$ -27907 -413895 -625512 -430624 49245 512754 659555 365441 -153836 -495012 -525095
35421e25095N836j89844k23703j0423J36959J12340J77095L59392K51128k82455
$$ -525095 -519259 -709103 -932806 -943229 -806270 -693930 -516835 -157443 93685 -188770
35411a88770o77046l83191L34995P49553N77442J44380j58581j93275M443K58966
$$ -188770 -865816 -1249007 -914012 -164459 412983 557363 398782 205507 209950 468916
35401D68916K99749N4270k10190k57636k04958k26096j91945N2446K92327K43456
$$ 468916 768665 822935 612745 355109 150151 -75945 -267890 -215444 76883 320339
35391C20339O3497J06155K93087K24853j27049l37182j86311L9591K3066j76340
$$ 320339 383836 489991 783078 1007931 880882 543700 357389 396980 420046 243706
35381B43706l15163k81929j17170N6836Q0833o9398j85084j04761K3572K8935
$$ 243706 -71457 -353386 -470556 -413720 -332887 -402285 -587369 -692130 -668558 -639623
35371f39623P2298L12680M24154K4062n24671m55149J92995M89009L1382l09261
$$ -639623 -567325 -254645 169509 193571 -331100 -786249 -593254 -104245 -72863 -382124
35361c82124L65271J549008J876544Q75294m85770j008232n39225Q9438R6473
$$ -382124 -16853 1532155 3408699 4283993 3798223 2789991 2250766 2340204 2436677
35352B436677m57634q57874o16024k3486K88947J44218j49305l87397n72076m87086
$$ 2436677 1979043 1121169 505145 481659 770606 914824 765519 378122 -193954 -681040
35342f81040J40015R05730R09454L7475o28055k25813O64552Q84332K78254l51786
$$ -681040 -541025 364705 1274159 1311634 683579 457766 1122318 2006650 2284904 1933118
35332A933118n12106m08088k69693r8140k2998j87085l05793j5102M00666L45363
$$ 1933118 1421012 1012924 743231 645091 622093 435008 129215 114113 514779 860142
35322H60142p8910k09329Q117r5574o61395q95667l44793K95744K62691j13802
$$ 860142 781232 571903 580020 484446 -176949 -1072616 -1417409 -1121665 -858974 -972776
35312i72776p7353K91514L37243J3105r0360J88873L15852j6091l70542k59447
$$ -972776 -1050129 -758615 -421372 -408267 -498627 -309754 6098 -9993 -380535 -639982
35302f39982J32845K66630J3664k29711j13262K28408L65900J12677k34883k61783
$$ -639982 -507137 -240507 -226843 -456554 -569816 -341408 24492 137169 -97714 -359497
35292c59497L5564K69431K17139R4937J50688K55046J49526r8565k01115r1406
$$ -359497 -323933 -54502 162637 257574 408262 663308 812834 714269 513154 421748
35282D21748N5329J63796K74698K57099q0068n08326m53958J92934P12101L97179
$$ 421748 477077 640873 915571 1172670 1092602 584276 130318 323252 1035353 1432532
35272A432532m57693q91889n24509N4193K25315J27657J90630L48599K40616p3839
$$ 1432532 974839 82950 -441559 -387366 -162051 -34394 156236 504835 745451 671612
35262F71612j91057o4137l7397j59140o8229K89129M37600J40412j78646j44926
$$ 671612 480555 416418 379021 219881 151652 440781 878381 1018793 840147 695221
35252F95221k6794j64562l15014j31137J49198J41737N1630K34272L59722j08940
$$ 695221 668427 503865 188851 57714 206912 348649 400279 634551 994273 885333
35242H85333q06166q08280p3520M47625K74851k2735J4964K5334k38989k40195
$$ 885333 79167 -729113 -802633 -355008 -80157 -102892 -87928 -62594 -301583 -541778
35232e41778L31138O94220P8454q91032r68984j44683L82706O4892k55188J93531
$$ -541778 -210640 483580 562034 -328998 -1297982 -1442665 -1059959 -995067 -1250255 -1056724
35222a056724Q33092O17823l37162q45933l01262N09273N38056r4675l79907Q4454
$$ -1056724 -223632 394191 57029 -788904 -1090166 -580893 -42837 -137512 -517419 -432965
35212d32965N94676M88413Q0565k7673J4354k89125p19922o14482o2307J53273
$$ -432965 161711 650124 730689 703016 717370 428245 -291677 -906159 -968466 -815193
35202h15193j13348j37395K93337L58461l35636p95794p0117J114015J255728
$$ -815193 -928541 -1065936 -772599 -414138 -749774 -1545568 -1615685 -501670 754058
35193G54058K20147o48006m36000L36323P25720M85635q1884o73926j010463q04026
$$ 754058 974205 326199 -109801 226522 952242 1437877 1355993 682067 -328396 -1132422
35183a132422r9313O01832Q03108M70472l7589l17932j93845J53323L18830J09386
$$ -1132422 -1231735 -629903 173205 643677 606088 288156 94311 247634 566464 675850
35173F75850k20278l32537k50920j88293j13891J50818N09226O34434M06284L289
$$ 675850 455572 123035 -127885 -316178 -430069 -279251 229975 864409 1270693 1273982
35163A273982l79768o19569n77615k51900Q6733K30230L49979O04635O56235J35892
$$ 1273982 894214 274645 -302970 -554870 -468137 -237907 112072 716707 1372942 1508834
35153A508834n42732n44353J36553N13583n482p25528o62169N0697M15225K0189
$$ 1508834 966102 421749 558302 1071885 1066403 340875 -321294 -270597 144628 164817
35143A64817m62953l32095J82888L66681Q0255j28366P0651K85975O3383l29626
$$ 164817 -298136 -630231 -447343 -80662 -407 -128773 -58122 227853 291236 -38390
35133c8390k55591K96388O28084L47158p3790n9288J93074Q3663l92236n82594
$$ -38390 -293981 2407 630491 977649 903859 844571 1037645 1121308 729072 146478
35123A46478j25793N01483N71822j1493o30295o66383j44490L72359M37220J26258
$$ 146478 20685 522168 1093990 1082497 452202 -214181 -358671 13688 450908 577166
35113E77166k12557l75841l11120J2624M12342M29125o6424m37109q6276M73161
$$ 577166 364609 -11232 -322352 -309728 102614 531739 465315 28206 -58070 415091
35103D15091K16488p21634j014384q8924R61033J006082M26887J75715J65960
$$ 415091 631579 -90055 -1104439 -1193363 -232330 773752 1200639 1376354 1542314
35094A542314k73070r15017q71362j04905M29663J83974l71565n98813l64105
$$ 1542314 1269244 354227 -517135 -622040 -192377 -8403 -379968 -978781 -1342886
35085a342886J81225P58290Q79058L15238l58397m00531k7076q3056o02850o59713
$$ -1342886 -1161661 -403371 475687 790925 432528 31997 4921 -78135 -680985 -1340698
35075a340698J25262Q58705O36960j68176m58451J63472R96161J085869K12688
$$ -1340698 -1215436 -356731 280229 112053 -346398 -182926 813235 1899104 2111792
35066B111792q62673j119236l96678L89994M42218J16809K06669N64902L50188
$$ 2111792 1249119 129883 -266795 123199 565417 682226 888895 1453797 1803985
35057A803985m80974r53188n22163J74177L47257N0873k55551m50478n94528n53047
$$ 1803985 1323011 369823 -152340 21837 369094 419967 164416 -286062 -880590 -1433637
35047a433637k08005K94522P44065R76593P53006L6804o08738n65380j32853j60191
$$ -1433637 -1641642 -1347120 -603055 373538 1126544 1163348 554610 -10770 -143623 -303814
35037c03814o18075n27957L77364J002715N30452k48158j29332O75525R17318
$$ -303814 -921889 -1449846 -1072482 -69767 460685 212527 83195 758720 1676038
35028A676038J38436q23652j054454n34448J20419L49192M6246l71054l29869
$$ 1676038 1814474 990822 -63632 -598080 -477661 -128469 -82223 -453277 -783146
35019g83146K28128P00769N67724L6018l20153l09426k01428k42178l77603l68386
$$ -783146 -555018 145751 713475 749493 429340 119914 -81514 -323692 -701295 -1069681
35009a069681m6178M31414O09696K72982j48731j20420J67983J02959k78260k76846
$$ -1069681 -1115859 -684445 -74749 198233 49502 -70918 97065 200024 -78236 -355082
34999c55082K93041P36921N61133J37676o7623j63439l00851k29279J01057J95013
$$ -355082 -62041 674880 1236013 1373689 1306066 1142627 841776 612497 713554 908567
34989I08567j75633m72215k53772J20058K17742K60428M75401M56360o4325m83472
$$ 908567 732934 260719 6947 127005 344747 605175 1080576 1536936 1472611 989139
34979I89139k18682K72712K50949j04318j88439j07927k75409l67010J41316P57049
$$ 989139 770457 1043169 1294118 1189800 1001361 893434 618025 251015 392331 1149380
34969A149380N51029k29257m14128K16390N86499O1368o43593o80103k02774J79077
$$ 1149380 1700409 1471152 1057024 1273414 1859913 1921281 1277688 597585 394811 573888
34959E73888K76135J79039r1640l71915l50350j15904j64431n59301o66775r9395
$$ 573888 850023 1029062 937422 565507 215157 99253 -65178 -624479 -1291254 -1390649
34949a390649O01963O61903O1208n49742o30564j45347N33702Q49593M58538l37464
$$ -1390649 -788686 -126783 -65575 -615317 -1245881 -1391228 -857526 -7933 450605 113141
34939A13141p74489m51299K22929N57670L49080l3733j47872R3121L90997L87866
$$ 113141 -661348 -1112647 -889718 -332048 17032 -16701 -164573 -71452 319545 707411
34929G07411O1027k61629l39065k83066k40692r0624K48020M73647K79177j26438
$$ 707411 768438 506809 167744 -115322 -356014 -446638 -198618 275029 554206 427768
34919D27768l05565k22165j31657m2379J74576L11822Q4776k46526j96076N9357
$$ 427768 122203 -99962 -231619 -273998 -99422 212400 297176 50650 -145426 -86069
34909h6069j20634o85099p79437o2331O70965O51401K29883J75446M02233J83548
$$ -86069 -206703 -891802 -1671239 -1733570 -1062605 -411204 -181321 -5875 396358 579906
34899E79906n79896j085505p28856R7741N80834N05632L43151M48448N64247K79703
$$ 579906 10 -1085495 -1814351 -1716610 -1135776 -630144 -286993 161455 725702 1005405
34889A005405k71112n04996j52945M00094O21512L78863j31461o65693r54467
$$ 1005405 734293 229297 76352 476446 1097958 1476821 1345360 679667 -274800
34880b74800p90204l49897j04350j48435k1653M75394P78801L94156k28952l44754
$$ -274800 -1065004 -1414901 -1519251 -1667686 -1689339 -1213945 -435144 -40988 -269940 -614694
34870f14694p3568q9760l65081j79820N66537R94662N06103l44847o65788l57169
$$ -614694 -688262 -778022 -1143103 -1322923 -756386 238276 744379 399532 -266256 -623425
34860f23425K5339J42534J27346J42704Q2407k16888n92770n35215K34687J151962
$$ -623425 -598086 -455552 -328206 -185502 -103095 -319983 -912753 -1447968 -1213281 -61319
34850f1319J203441K11531p40902o52650P4836L38258k9748k30001O7531K76486
$$ -61319 1142122 1353653 612751 -39899 34937 373195 343447 113446 180977 457463
34840D57463J79l46216l18091q1659O2847J50028K24564J30073r2632j43259k5708
$$ 457463 457642 111426 -206665 -288324 -225477 -75449 149115 279188 186556 43297 17589
34829A7589r2728l21247k08455L26277O29389K90115k16434l09655j37811j48465
$$ 17589 -75139 -396386 -604841 -278564 350825 640940 424506 114851 -22960 -171425
34819a71425l45931m60961m00003j03150N34144J161624R94036q7206j009636
$$ -171425 -517356 -978317 -1378320 -1481470 -947326 214298 1208334 1121128 111492
34810A11492p98152O5580L70636p1543l14703J73924P62836O71159M2621l76883
$$ 111492 -686660 -621080 -250444 -321987 -636690 -462766 300070 971229 1013850 636967
34800F36967k33746J44969L02345J86705P5841J00646N2604k12113l91902j34373
$$ 636967 403221 548190 850535 1037240 1113081 1213727 1266331 1054218 662316 527943
34790E27943K73734J48919n29386q79965k94729O32330Q53865K18434m84209o39444
$$ 527943 801677 950596 421210 -458755 -753484 -121154 732711 951145 466936 -172508
34780a72508l86910r9106J61401M54553O03193L55355j85570n63969m98278k41744
$$ -172508 -559418 -658524 -497123 -42570 560623 915978 730408 166439 -331839 -573583
34770e73583k13505l55422k17723K39722M22057J2178l76860n8326N85489O06269
$$ -573583 -787088 -1142510 -1360233 -1120511 -698454 -686276 -1063136 -1121462 -535973 70296
34760G0296m7386m72264k39583O1359n2798k00150N5255M00103L43767J5405j62492
$$ 70296 22910 -449354 -688937 -627578 -680376 -880526 -825271 -425168 -81401 -65996 -228488
34749b28488j47671j36556j31163o3488r809K2267J33183J60299j88136o16894
$$ -228488 -376159 -512715 -643878 -707366 -717175 -694908 -561725 -401426 -589562 -1206456
34739a206456l76471N27791J035242M69144m61699p34592l77112j9888K35884
$$ -1206456 -1582927 -1055136 -19894 449250 -12449 -747041 -1124153 -1144041 -908157
34730i08157N99297P64592K97993m47217p00454l64760L1419K43536M12316M84285
$$ -908157 -308860 455732 753725 306508 -393946 -758706 -727287 -483751 -71435 412850
34720D12850L03384J01425J76970K86278N1535k93485l20022k53435n34594q18980
$$ 412850 716234 817659 994629 1280907 1332442 1038957 718935 465500 -69094 -888074
34710h88074m24098L81607O16312J13363k53297L482L73169M09064L93852N43088
$$ -888074 -1312172 -930565 -314253 -200890 -454187 -450705 -77536 331528 725380 1268468
34700A268468M33338k40261r98071j177894p33712p9459M22438N59123L17828
$$ 1268468 1701806 1461545 463474 -714420 -1448132 -1527591 -1105153 -546030 -228202
34691b28202O0514J98816N56099N64311J87226Q375K37193L42289k8582m56042
$$ -228202 -167688 31128 587227 1151538 1338764 1347139 1584332 1926621 1898039 1441997
34681A441997m80878l12980l44231m77713m29343k61579j44184L5354L60102N24103
$$ 1441997 961119 648139 303908 -173805 -603148 -864727 -1008911 -973557 -613455 -89352
34671h9352K63168j14965r9307K84824N12344K60335k34710n01356l36346L384
$$ -89352 173816 58851 -40456 244368 756712 1017047 782337 280981 -55365 -51981
34661e1981P8334j95462l86278j20236L51381M96038K40679p8996l28360n44263
$$ -51981 26353 -169109 -555387 -675623 -324242 171796 412475 333479 5119 -539144
34651e39144m56121J88434Q45791O20700l51883q88688m20920K65084L82257K43924
$$ -539144 -995265 -806831 38960 659660 307777 -580911 -1001831 -736747 -354490 -110566
34641a10566L45290L02265l40841r82686p51712M6522L80266R9707k7258K41011
$$ -110566 234724 536989 196148 -786538 -1538250 -1491728 -1111462 -1011755 -1039013 -798002
34631g98002K99950o0071j97023K26895N65494K09434m26998n66375k06011O6305
$$ -798002 -498052 -558123 -755146 -528251 37243 246677 -180321 -746696 -952707 -886402
34621h86402P1668J61959M30658M52639j5135n34740n02669O5687N78813O13141
$$ -886402 -814734 -652775 -222117 230522 215387 -319353 -822022 -756335 -177522 435619
34611D35619L24917R9536O5382Q7775L7073j17148l27777m18228j83842K56634
$$ 435619 760536 860072 925454 1013229 1050302 933154 605377 187149 3307 259941
34601B59941M28189J03639k80394j95297J86221K57104q8481l58358k83195j30403
$$ 259941 688130 791769 511375 316078 502299 759403 670922 312564 29369 -101034
34591a01034j12663p5714O5712J41999J52235K99816M25042O0030o75244r45491
$$ -101034 -213697 -289411 -223699 -81700 70535 370351 795393 855423 180179 -765312
34581g65312l93686K30964J97024j10924O4400N59638O20877K03682J2256L00446
$$ -765312 -1158998 -928034 -731010 -841934 -777534 -217896 402981 606663 618919 919365
34571I19365M80916Q9448n15453o85107k94468K21401M09629K16498l5900m5814
$$ 919365 1400281 1489729 974276 289169 -5299 216102 625731 842229 806329 760515
34561G60515R0288K5097l03388n55169m93166k72850r4786N7055J70811J30165
$$ 760515 850803 875900 572512 17343 -475823 -748673 -843459 -786404 -615593 -485428
34551d85428O6771K91093O50912N52361p1722m82260k45424Q5870n4515l31198
$$ -485428 -418657 -127564 523348 1075709 1003987 521727 276303 362173 307658 -23540
34541b3540k57986j25659l18275l76838K36113R83355R63498L47294j8329n6621
$$ -23540 -281526 -407185 -725460 -1102298 -866185 117170 1080668 1427962 1409633 1353012
34531A353012l01298o06959l51713K31297L00604n3880N6668N67907L76455o65092
$$ 1353012 1051714 444755 93042 324339 624943 571063 627731 1195638 1572093 907001
34521I07001j202864m53092N54181O02281j8631l35674k11500q8792j0485J77463
$$ 907001 -295863 -748955 -194774 407507 388876 53202 -158298 -247090 -257575 -80112
34511h0112K51928N0186m9855K16217M01491O0838m60949n73808k78557P5464
$$ -80112 171816 222002 172147 388364 789855 850693 389744 -184064 -462621 -387157
34501c87157L26803L28832j05385o14563m30579L49178N55515k74333r33653l52053
$$ -387157 -60354 268478 163093 -451470 -882049 -532871 22644 -251689 -1185342 -1537395
34491a537395O19321N28696l48069n40196J92486N97181O3627m95843k26999M30692
$$ -1537395 -918074 -389378 -737447 -1277643 -1085157 -487976 -424349 -920192 -1147191 -716499
34481g16499N94798J55637l48365m89487k25937J95831M36994M16696L82610L85250
$$ -716499 -121701 33936 -314429 -803916 -1029853 -834022 -397028 19668 402278 787528
34471G87528O6675n77514p77437q1050O59578L94079m38695n21126K64252O98308
$$ 787528 854203 276689 -500748 -581798 77780 471859 33164 -487962 -223710 474598
34461D74598K10220l60244l00118m9959j53040k86345l7326K41736J01482j70605
$$ 474598 684818 324574 24456 -25503 -178543 -464888 -502214 -260478 -158996 -329601
34451c29601r9218J42651J19057q2359q0733R8513J15344r5468k57991j42648
$$ -329601 -428819 -286168 -167111 -249470 -330203 -231690 -116346 -211814 -469805 -612453
34441f12453K38473O55446P55572L87969j19831l42535l72122n71202p87990n16248
$$ -612453 -373980 281466 1037038 1425007 1305176 962641 590519 19317 -768673 -1284921
34431a284921J13162L26689p6983l47804Q651M70560M42336J65254O9435m1579
$$ -1284921 -1171759 -845070 -922053 -1269857 -1261206 -790646 -348310 -183056 -113621 -155200
34421a55200m06022n47094J6903P64050P82348J06930m20497m35672l36759l69569
$$ -155200 -561222 -1108316 -1091413 -327363 454985 561915 141418 -294254 -631013 -1000582
34411a000582k87513j4206J15045j3055k7267L00552O48148O22170K70320j08226
$$ -1000582 -1288095 -1302301 -1187256 -1200311 -1227578 -927026 -278878 343292 613612 505386
34401E05386l37966l44605p1205L18928L95837o3398o61068p39552j68336M74721
$$ 505386 167420 -177185 -248390 70538 466375 402977 -258091 -997643 -1165979 -691258
34391f91258O01871K86571M5105J03791K07223J37050K2022j8157j35032l65136
$$ -691258 -89387 197184 242289 346080 553303 690353 712375 694218 559186 194050
34381A94050l64367L5299L27303l9080p36244r15574m06491J20032K09711J38803
$$ 194050 -170317 -135018 192285 153205 -583039 -1498613 -1905104 -1785072 -1575361 -1436558
34371a436558K13472K50954P7692l3831J66225M13182L01045j16332m04733k70347
$$ -1436558 -1223086 -972132 -894440 -928271 -762046 -348864 -47819 -164151 -568884 -839231
34361h39231J59105M48357K65872j48915j35928M42314P57049J10852q59865r47537
$$ -839231 -680126 -231769 34103 -114812 -250740 191574 948623 1059475 199610 -747927
34351g47927j48673L70629R7913j84294J55625O29037N78422J34771k88414n84772
$$ -747927 -896600 -525971 -428058 -612352 -456727 172310 750732 885503 597089 12317
34341A2317n70839O2275Q94984Q52615k34401j099887p84739L7599K86185Q0090
$$ 12317 -558522 -496247 398737 1251352 1016951 -82936 -867675 -830076 -543891 -463801
34331d63801J46256M29469L66538l0585l27305m19932l60783n062M72263M31990
$$ -463801 -317545 111924 478462 447877 120572 -299360 -660143 -665205 -192942 239048
34321B39048j53769l73359J03445K81593l88346p66574P7175R74306M44277o74077
$$ 239048 85279 -288080 -184635 96958 -291388 -1057962 -980787 -6481 437796 -236281
34311b36281m82927P81597J108143j8099r87446p84602j79365J03017L70495O47608
$$ -236281 -719208 62389 1170532 1152433 164987 -619615 -798980 -695963 -325468 322140
34301C22140K77990n37609n71400L69140Q80100K19627n02526k74527K39742J12961
$$ 322140 600130 62521 -508879 -139739 740361 959988 457462 182935 422677 535638
34291E35638k68477j98330N3j76859k65589K34588O78260K69387m68133m49991
$$ 535638 267161 68831 68884 -107975 -373564 -138976 539284 808671 340538 -109453
34281a09453K42408N58574J05678m34216l98328J06390M99389L04477m31511j041756
$$ -109453 132955 691529 797207 362991 -35337 71053 570442 874919 443408 -598348
34271e98348q60502q0262M76463N01681M38117M91176K95029j95099m17804j59510
$$ -598348 -1458850 -1539112 -1062649 -560968 -122851 368325 663354 468255 50451 -109059
34261a09059J22623K51724N85676R67479N98383n06319j134769o32509J18334
$$ -109059 13564 265288 850964 1818443 2416826 1910507 775738 143229 261563
34252B61563K02470m8833j04849k78708o91266m64069P68406J659855R20335o12506
$$ 261563 464033 415200 310351 31643 -659623 -1123692 -355286 1304569 2224904 1612398
34242A612398j163245n46395R658k5887j05001L7525J03484J14868L18623M14835
$$ 1612398 449153 -97242 -87584 -113471 -218472 -180947 -77463 37405 356028 770863
34232G70863J5812m12154j90862L22485K85392j80578k91793k8039j0747k21114
$$ 770863 786675 374521 183659 506144 791536 610958 319165 291126 280379 59265
34222E9265r2407L08944L85969J08687j03160l00431o63086o54508J70227R27226
$$ 59265 -33142 275802 661771 770458 667298 366867 -296219 -950727 -780500 146726
34212A46726M61646o80957r34056j24409M88232M33220M41549O10587J35198q11086
$$ 146726 608372 -72585 -1006641 -1131050 -642818 -209598 231951 842538 977736 166650
34202A66650q88490J41003Q07105L23370j93308J96732O55272J99836n31972m59498
$$ 166650 -721840 -580837 226268 549638 356330 553062 1208334 1408170 876198 416700
34192D16700J50874L51054N6841k31789m70964p74164p74101k42352K95018L78021
$$ 416700 567574 918628 975469 743680 272716 -501448 -1275549 -1517901 -1222883 -844862
34182h44862L51356N41867N18308j8082m53989k56408Q0745k1987j97903N499
$$ -844862 -493506 48361 566669 548587 94598 -161810 -81065 -103052 -300955 -295456
34172b95456J35768k18374l86932K39494Q48961L77002o37783q40220j72700L20231
$$ -295456 -159688 -378062 -764994 -525500 323461 700463 62680 -777540 -950240 -630009
34162f30009L80438N95717Q11872K32880q20372r62735P3932Q64025M55950k87565
$$ -630009 -249571 346146 1158018 1390898 570526 -392209 -318277 545748 1001698 714133
34152G14133k66880J69207Q1669m37831n75304j88242Q9141r0292l87105l94272
$$ 714133 447253 616460 698129 260298 -315006 -503248 -414107 -504399 -891504 -1285776
34142a285776j21860J63990K70370K18236J74188K06389J57904n5116j52684J35887
$$ -1285776 -1407636 -1243646 -973276 -755040 -580852 -374463 -216559 -271675 -424359 -288472
34132b88472N09676M14079p9520k93721L1719L40961J48748k40971l01519j07229
$$ -288472 221204 635283 555763 262042 293761 634722 783470 542499 240980 133751
34122A33751r0778k71550k57868O9984L30301J70938k46341m34563j72589K01217
$$ 133751 42973 -228577 -486445 -416461 -86160 84778 -161563 -596126 -768715 -567498
34112e67498J69034k91983o01413l01486L05822N58201L36476J42065K74158M02589
$$ -567498 -398464 -690447 -1291860 -1593346 -1287524 -729323 -392847 -250782 23376 425965
34102D25965J39903l39147n32716k64112J39318K39984n0615l55781k03542L70785
$$ 425965 565868 226721 -305995 -570107 -430789 -190805 -241420 -597201 -800743 -429958
34092d29958P20079L44259l71940n77005o7965M82866M78396P0508k86674m46386
$$ -429958 290121 634380 262440 -314565 -382530 100336 578732 649240 362566 -83820
34082h3820m33493j65177K66018L81629j06674p06435o31754J68017Q95540Q60314
$$ -83820 -517313 -682490 -416472 -34843 -141517 -847952 -1479706 -1311689 -416149 444165
34072D44165K07731l84174m65366j47324J50957J45770q9405k75928k47421n6398
$$ 444165 651896 267722 -197644 -344968 -194011 -48241 -137646 -413574 -660995 -717393
34062g17393J77656L59079L59785J02240k34308l30509j54124j2867m9804m537
$$ -717393 -539737 -180658 179127 281367 47059 -283450 -437574 -450441 -500245 -504782
34052e04782K90954N09751K94027j20697j93605J28665L61312K04777j08943k57642
$$ -504782 -213828 295923 589950 469253 275648 404313 765625 970402 861459 603817
34042F03817k39038k07186j88183j15041K7074J74189J87874o3308m45197n09382
$$ 603817 364779 157593 -30590 -145631 -118557 55632 243506 180198 -264999 -774381
34032g74381j7538N89826O63555K32978q1869o0682j46869n17576n93382K6495
$$ -774381 -791919 -202093 461462 694440 612571 551889 405020 -112556 -705938 -679443
34022f79443P10023N79497j78871n63820k00574K46412J90434r6788j39626o9812
$$ -679443 30580 610077 431206 -132614 -333188 -86776 103658 6870 -132756 -202568
34012b02568k59662n30925l54065K52230N90173K12378m13869m71367J71192Q25457
$$ -202568 -462230 -993155 -1347220 -1094990 -504817 -292439 -706308 -1177675 -1006483 -181026
34002a81026Q64931M07608j9501j92354k45056k02557O9597M19174L88077j48815
$$ -181026 683905 1091513 1072012 879658 634602 432045 501642 920816 1308893 1160078
33992A160078p05000q03633n33182k00069J69323N60493O09033J15087l66553
$$ 1160078 455078 -348555 -881737 -1081806 -912483 -351990 257043 372130 5577
33983E577j79168L48466L03709l14887m63836K86268R14035M11590o66964r97201
$$ 5577 -173591 174875 478584 163697 -300139 -13871 900164 1311754 644790 -352411
33973c52411l67137K10394J24825q1309J98547O25242N09333p7518m01015j29395
$$ -352411 -719548 -509154 -384329 -465638 -267091 358151 867484 789966 388951 259556
33963B59556K38107J24134l28825n16097k50471L1146Q676k4506K46401M49426
$$ 259556 497663 621797 292972 -223125 -473596 -442450 -433774 -458280 -211879 237547
33953B37547M8986n76238m24482N56941J068693K17468j037805j089143Q3015
$$ 237547 286533 -289705 -714187 -157246 911447 1128915 91110 -998033 -915018
33944i15018R19338M68613m80084p33172k53151J76507K07101J51508K76755M98651
$$ -915018 4320 472933 -7151 -740323 -993474 -816967 -609866 -458358 -181603 317048
33934C17048O66003O66105L25148l61508r42399q85711k83735K00236J73606n9288
$$ 317048 983051 1649156 1974304 1612796 670397 -215314 -499049 -298813 -125207 -184495
33924a84495n6997J29982J67023K5458r82J89456L05763P4613l46156n14911k18473
$$ -184495 -241492 -111510 55513 80971 79989 269445 575208 649821 303665 -211246 -429719
33913d29719K59313M18243R1075l40723l73166N262L08216K07529o4961j48905
$$ -429719 -170406 247837 338912 -1811 -374977 -369715 -61499 146030 81069 -67836
33903f7836j01178j56091j65854J89220O82532O44548n4449o91625o55996k14053
$$ -67836 -169014 -325105 -490959 -301739 380793 1025341 970892 279267 -376729 -590782
33893e90782P3255K06701M85943P68084O27492P3735m55139o87917o18810k18190
$$ -590782 -517527 -310826 175117 943201 1570693 1644428 1189289 501372 -117438 -335628
33883c35628L79651O04567O2720o87117p13232l5980M17793K26884l1606J08531
$$ -335628 44023 648590 711310 24193 -689039 -725019 -307226 -80342 -111948 -3417
33873c417L05774J98988N1797J03422L2724l33614m70222j1010M42000J73531
$$ -3417 302357 501345 553142 656564 689288 355674 -114548 -125558 316442 489973
33863D89973m42010m71559J25450M75546J43313l26410l28146J1858J76721o0374
$$ 489973 47963 -423596 -298146 177400 320713 -5697 -333843 -321985 -145264 -205638
33853b05638m76961o34923k25723N56554J028106O94557j36981p12452p06877
$$ -205638 -682599 -1317522 -1543245 -986691 41415 735972 598991 -113461 -820338
33844h20338m22844k01733k2106K75013O44792Q13329N08127k15507q31765p64398
$$ -820338 -1243182 -1444915 -1467021 -1192008 -547216 266113 774240 558733 -273032 -1037430
33834a037430p8452N39759O54660N42873N36860M09075j14843o54267o20594j26401
$$ -1037430 -1115882 -576123 78537 621410 1158270 1567345 1452502 798235 177641 51240
33824E1240J78552M5214j87080k47889k03672j11914L8411N8592k19667m59565
$$ 51240 229792 275006 87926 -159963 -363635 -475549 -437138 -378546 -598213 -1057778
33814a057778j46530N23927P05081P1123o21965n13125K25869O71664L64589k05835
$$ -1057778 -1204308 -680381 24700 95823 -526142 -1039267 -813398 -141734 222855 17020
33804A7020l45678k0859K50059J88905P4274J79140K83735J00311j24646O621
$$ 17020 -328658 -349517 -99458 89447 163721 342861 626596 726907 602261 608882
33794F08882K38416k3362n98761o22250K1800L20675k71737p96927k13735Q74901
$$ 608882 847298 823936 225175 -397075 -375275 -54600 -326337 -1123264 -1336999 -462098
33784d62098J017634L2446q18931o78911n1983K38777J54123J43900L58743N46159
$$ -462098 555536 587982 -230949 -909860 -961843 -723066 -568943 -425043 -66300 479859
33774D79859M41102M3499l58707m40502k24473n9166j01438j35800o6620j15586
$$ 479859 920961 964460 605753 165251 -59222 -118388 -219826 -355626 -422246 -537832
33764e37832k57308m4827N75993R03008M88488j12308k52371j83780l52835m11762
$$ -537832 -795140 -839967 -263974 639034 1127522 1015214 762843 579063 226228 -185534
33754a85534O2286M89740J18319n46047m33339K87913M74040p9910m04787q5873
$$ -185534 -123248 366492 484811 -61236 -494575 -206662 267378 187468 -217319 -303192
33744c03192J53090j59992n13880m19566q5628K13829M74050M62440r8664o85820
$$ -303192 -150102 -310094 -823974 -1243540 -1329168 -1115339 -641289 -178849 -277513 -963333
33734i63333m08884N04805Q25614J90545l74827j83567J45978O561j64010R7293
$$ -963333 -1372217 -867412 -41798 148747 -226080 -409647 -263669 -257108 -421118 -323825
33724c23825L40821J24167r3760J52437L88594M1965m82661m54057K1209K97668
$$ -323825 16996 141163 47403 199840 588434 630399 147738 -306319 -285110 12558
33714A2558K00585L9660N805J04015K85471K64210k45049p86353m43377O76696
$$ 12558 213143 252803 258608 362623 648094 912304 667255 -119098 -562475 114221
33704A14221J147527J32246j239905j317705j14783R27447R26399L17381j65630
$$ 114221 1261748 1393994 154089 -1163616 -1278399 -350952 575447 892828 727198
33695G27198l52813m18647m28450k87608P3091M60643M12029k37578q22738m81122
$$ 727198 374385 -44262 -472712 -760320 -687229 -226586 185443 -52135 -874873 -1355995
33685a355995N88867J204089P35034j62857o12749n27935k37925P5979J74917
$$ -1355995 -767128 436961 1171995 1009138 396389 -131546 -369471 -293492 -118575
33676a18575j93538o39197l72872M87085Q30518K70170j74414K02025N69318M1932
$$ -118575 -312113 -951310 -1324182 -837097 -6579 263591 89177 291202 860520 902452
33666I02452p13975n96412P5450K03138j99988j95884L30995N15951O3119k78516
$$ 902452 188477 -407935 -332485 -129347 -329335 -525219 -194224 321727 384846 106330
33656A06330L3318N54608N75256k4930p89871j116224o88971J52703O37941M49716
$$ 106330 139648 694256 1269512 1244582 454711 -661513 -1350484 -1197781 -559840 -110124
33646a10124Q2074L8968J76093K10161K59897L66606J37058m94533p97462k79289
$$ -110124 -28050 10918 187011 397172 657069 1023675 1160733 666200 -131262 -410551
33636d10551M14809M37582O01j60754l6309r8264k53227m4299L86605M78766J99859
$$ -410551 4258 441840 442441 281687 245378 147114 -106113 -150412 236193 714959 914818
33625I14818r102l3959q4888j33295o2905j04975m27325o12523k58524K42915
$$ 914818 905716 871757 786869 653574 590669 485694 58369 -554154 -812678 -569763
33615e69763K60030q4910k04870j830J71078J72088O4296j58518k82612J23908
$$ -569763 -309733 -394643 -599513 -601343 -430265 -258177 -193881 -352399 -635011 -511103
33605e11103Q30770Q22788j92500j015910o43521J85350K97234K2650L35142Q04727
$$ -511103 319667 1142455 949955 -65955 -709476 -524126 -226892 -204242 130900 935627
33595I35627K06314j162395j589312m51458R53626J319309P56194M7753l67263
$$ 935627 1141941 -20454 -1609766 -2061224 -1107598 211711 967905 1015658 648395
33586F48395l80226j03300M0762j67611k50849K06202O67379M52332k9393M957
$$ 648395 268169 164869 205631 38020 -212829 -6627 660752 1113084 1083691 1088648
33576A088648K32568j80947q91172q02832J3779L93121p031l92854m23042n46463
$$ 1088648 1321216 1140269 249097 -553735 -539956 -146835 -153866 -546720 -969762 -1516225
33566a516225o97075k43832N88442P85532K33764j26474L5893J43457J28856M81093
$$ -1516225 -2213300 -2457132 -1868690 -1083158 -849394 -975868 -939975 -796518 -667662 -186569
33556a86569Q07752K01404q13711p33797K68049L91373o22287q70729L16435J006698
$$ -186569 621183 822587 8876 -724921 -456872 -65499 -687786 -1558515 -1242080 -235382
33546b35382K5097r00381j79332Q35866L38121p02974l96570O31238M77044n55220
$$ -235382 -210285 -1110666 -1289998 -454132 -116011 -818985 -1215555 -584317 -107273 -662493
33536f62493o11163L54331P52249M01455N13153R38857N23745K31800K424087
$$ -662493 -1273656 -919325 -167076 234379 747532 1686389 2210134 2441934 4866021
33527D866021O136663O608049J571528m724720o444690l294617N9409N17617n85567
$$ 4866021 11002684 17610733 19182261 14457541 8012851 4718234 4777643 5295260 4709693
33518D709693r20950m40896k50359l87060k36911L5455j30577n13654m81124j61614
$$ 4709693 3788743 3347847 3097488 2710428 2473517 2508972 2378395 1864741 1383617 1222003
33508A222003k00764n45124m88323O1111L47198M0430j73118K48311P41605N35937
$$ 1222003 1021239 476115 -12208 48903 396101 436531 263413 511724 1253329 1789266
33498A789266p1948j98011J96321K87160k28110o38844l75773Q8505j9441n99064
$$ 1789266 1717318 1519307 1715628 2002788 1774678 1135834 760061 848566 829125 230061
33488B30061q05015k03969O50319Q86421L36383k88085k59635K73617N00833L8817
$$ 230061 -574954 -778923 -128604 757817 1094200 806115 546480 820097 1320930 1359747
33478A359747n70566o40229k20663J44891J98556M4474k52597n86790n45530J37895
$$ 1359747 789181 148952 -71711 73180 271736 316210 63613 -523177 -1068707 -930812
33468i30812R53846J075251M55254j35505k15051j09080k18383l82882k91260
$$ -930812 23034 1098285 1553539 1418034 1202983 1093903 875520 492638 201378
33459B01378o9699p3452l17407m27348j17812M11486N95572J14129o09323p79698
$$ 201378 131679 58227 -259180 -686528 -804340 -392854 202718 316847 -292476 -1072174
33449a072174k18250L84972M34052J94052K08601M14173L96410J64586L2310j8512
$$ -1072174 -1290424 -905452 -471400 -277348 -68747 345426 741836 906422 938732 920220
33439I20220k23818m77896m68930j99239J27918M71631P11980M55635l04620p95404
$$ 920220 696402 218506 -250424 -449663 -321745 149886 861866 1317501 1012881 217477
33429B17477m64751Q5191J1654l96853k66437L40154N74146K19138j77556m05017
$$ 217477 -247274 -162083 -150429 -547282 -813719 -473565 100581 319719 142163 -262854
33419b62854o66794p09702r0245P41616Q31642J94025k71966k79019l05218l18197
$$ -262854 -929648 -1639350 -1729595 -987979 -156337 37688 -234278 -513297 -818515 -1136712
33409a136712K12361R39143P98610j70567o62151j53613L41361O7155l72516l20899
$$ -1136712 -924351 14792 813402 642835 -19316 -172929 168432 235587 -136929 -457828
33399d57828r8279m2793J69025N37297L70803l52947n71931R7096N17103r4143
$$ -457828 -556107 -598900 -429875 107422 478225 125278 -446653 -349557 167546 73403
33389G3403p74374m44618K93989L10641j26719j682O12944P70964K43811l15180
$$ 73403 -700971 -1145589 -851600 -540959 -667678 -669360 -56416 714548 958359 643179
33379F43179m68781k84773J08820M29220J62521o29992r73891k59721P24855Q89209
$$ 643179 174398 -110375 -1555 427665 590186 -39806 -1013697 -1273418 -548563 340646
33369C40646L60731o697n6340k27199m72819l45400O4728J95436p4106k72141
$$ 340646 701377 694680 638340 411141 -61678 -407078 -342350 -146914 -221020 -493161
33359d93161k4870N41510R24980N98738l37632q48877j21674R38076O08082r80342
$$ -493161 -518031 23479 948459 1547197 1209565 360688 239014 1177090 1785172 804830
33349H04830j666720m52870Q89469O15212l12888q8419Q39875P17633m13972r09043
$$ 804830 -861890 -1314760 -425291 189921 -122967 -211386 628489 1346122 932150 23107
33339B3107l60735J9638k33312k63521J41874O7401o04728o65101L46049J169346
$$ 23107 -337628 -317990 -551302 -814823 -672949 -605548 -1210276 -1875377 -1529328 -359982
33329c59982P55022k11836n71935l09012m2250R7035K08790O7486l51634m75144
$$ -359982 395040 183204 -388731 -697743 -739993 -642958 -434168 -366682 -718316 -1193460
33319a193460l042M60880L59527J20175L52518O93782L91519l43023n76365j29936
$$ -1193460 -1196502 -735622 -376095 -255920 96598 790380 1181899 838876 262511 132575
33309A32575J75975r8353l14761J09535O22160L40168m88000p47861j45666L35021
$$ 132575 308550 210197 -104564 4971 627131 967299 479299 -268562 -414228 -79207
33299g9207m502m78011j85774M61144M16137k65166n70072k36358j8357j70014
$$ -79207 -83709 -561720 -747494 -286350 129787 -135379 -705451 -941809 -960166 -1130180
33289a130180k7761N37443O27907p1101m76787J90272J011578P61825k25099p55155
$$ -1130180 -1157941 -620498 7409 -63692 -540479 -350207 661371 1423196 1198097 442942
33279D42942n94082l60956j93464J96006N18398K22811l81836m58863J4534K76874
$$ 442942 -151140 -512096 -705560 -509554 8844 231655 -150181 -609044 -594510 -317636
33269c17636P2320q2458R6242L05252L41973L42934L06189P2990k33418l53870
$$ -317636 -245316 -327774 -231532 73720 415693 758627 1064816 1137806 904388 550518
33259E50518l46212l31940r1750M40209O93157K68883k09642o877M10212J05891
$$ 550518 204306 -127634 -219384 220825 913982 1182865 973223 966346 1376558 1482449
33249A482449o31369o72578J4342K64766k96939o05834O9846R65374J051657M05131
$$ 1482449 851080 178502 192844 457610 160671 -445163 -375317 590057 1641714 2046845
33239B046845l04550q20413j113921r29264k16588M98253P35141N90518K55112
$$ 2046845 1742295 921882 -192039 -1121303 -1337891 -839638 -104497 486021 741133
33230G41133l77789j126062j202722j99621J062198J391703O63666k26677n75586
$$ 741133 363344 -762718 -1965440 -2165061 -1102863 288840 952506 725829 150243
33221A50243l84828J11147O68383Q13955J77911p55389r02216L5046R65584P04731
$$ 150243 -234585 -123438 544945 1358900 1536811 781422 -120794 -85748 879836 1584567
33211A584567m87029j261543r05412m8309L82020K55242K9623j4175O8508J48667
$$ 1584567 1097538 -164005 -1069417 -1117726 -735706 -480464 -450841 -465016 -396508 -247841
33201b47841R3786j51467l20362l9627M84406N32364m6246m78279k68711K6534
$$ -247841 -154055 -305522 -625884 -665511 -181105 351259 305013 -173266 -441977 -415443
33191d15443p9169l082P47622J268425N19520p33772q91565n0365K48843l34090
$$ -415443 -494612 -497694 249928 1518353 2037873 1304101 412536 362171 611014 276924
33181B76924n19478J69874N87909J12282l02655Q017K91383J7979p2178M09168
$$ 276924 -242554 -72680 515229 627511 324856 332873 624256 642235 570057 979225
33171I79225N20007k01167o06445M2582N54284j37452r34955m08492O63610O03782
$$ 979225 1499232 1298065 691620 734202 1288486 1151034 216079 -192413 471197 1074979
33161A074979l44581o03829M4605M13495J13730j24552p5666k09310m33848k27768
$$ 1074979 730398 126569 171174 584669 698399 573847 498181 288871 -144977 -372745
33151c72745J67086J36404l0842K83433N93155N0654p75042o13168K96756N49617
$$ -372745 -205659 -69255 -100097 183336 776491 827145 52103 -561065 -264309 285308
33141B85308j8717j98371K89557L52875l00967n01605K83850R37881N52023k06869
$$ 285308 266591 68220 357777 710652 409685 -91920 191930 1129811 1681834 1474965
33131A474965m25969l35703m92303o75158m91854k15523k11292k18393J11366
$$ 1474965 1048996 713293 220990 -454168 -946022 -1161545 -1372837 -1591230 -1479864
33122a479864N30086O05139L44673K9211j41978l0857L17872M56709K8219n22083
$$ -1479864 -949778 -344639 34 29245 -112733 -143590 174282 630991 659210 137127
33112A37127m50344P6946J59233l57174n59265O0227P41818N88349j60569n66360
$$ 137127 -313217 -236271 -77038 -434212 -993477 -933250 -191432 396917 236348 -330012
33102c30012k43450L32391N12159J31400l89850m86230j03087J74508j37803p41401
$$ -330012 -573462 -241071 271088 402488 12638 -473592 -576679 -402171 -539974 -1281375
33092a281375r28032m44834L35815Q83571Q45043K31590l99891l49069L00368
$$ -1281375 -2209407 -2654241 -2318426 -1434855 -589812 -358222 -758113 -1107182 -806814
33083h06814O51804K73860j41791O9779M70556L40152r3283j39146J58238K31646
$$ -806814 -155010 118850 -22941 46838 517394 857546 764263 625117 783355 1015001
33073A015001R899j32119j06097l5550J79494N25099N41651J4719m90532m39828
$$ 1015001 1024900 892781 786684 751134 930628 1455727 1997378 2012097 1521565 1081737
33063A081737j15916J3991K0214j1645l52979p94665m84951N57299R56076M7565
$$ 1081737 965821 979812 1000026 988381 635402 -159263 -644214 -86915 869161 916726
33053I16726q44063m76784L01865J87815k60225J41850P85819L10300p58147p55903
$$ 916726 72663 -404121 -102256 85559 -174666 -32816 753003 1063303 305156 -450747
33043d50747K10210M71826k78866n95018J05917O99664M46403n147j01462j59518
$$ -450747 -240537 231289 -47577 -642595 -536678 162986 609389 604242 502780 343262
33033C43262k69758J4894N27229M58316j89045m44592M9156N17514L34613k62648
$$ 343262 73504 88398 615627 1073943 884898 440306 489462 1006976 1341589 1078941
33023A078941q24804j057585o53092K54041P67037L94317J85M09576Q23504J43728
$$ 1078941 254137 -803448 -1456540 -1202499 -435462 -41145 -40960 368616 1192120 1335848
33013A335848q96087p77404K14604M78456j97240n00345r07L61213J80554L6698
$$ 1335848 439761 -337643 -123039 355417 158177 -342168 -343075 18138 198692 235390
33003B35390J5932l52433o73023o0258J016967J089549k6850j002430j049273
$$ 235390 251322 -101111 -774134 -834392 182575 1272124 1245274 242844 -806429
32994h06429n71626P7454P88543R00054j7002r06704n73562K28391N2080n62462
$$ -806429 -1378055 -1300601 -512058 387996 370994 -535710 -1109272 -880881 -828801 -1391263
32984a391263m1967J164719J186327O1182l70667J98724K44695m67217m64843
$$ -1391263 -1433230 -268511 917816 978998 608331 807055 1051750 584533 119690
32975A19690L89558M45822n79315r18580L6000O61091R9669l85784n395K29096
$$ 119690 509248 955070 375755 -542825 -506825 154266 253935 -131849 -137244 91852
32965I1852k13398k77120M39838P13848J6811m56444o5461J93166j98000k98084
$$ 91852 -121546 -398666 41172 755020 771831 315387 249926 443092 245092 -52992
32955e2992K62491M71990q383j77049J85984J6400p24439o49566M11111Q49535
$$ -52992 209499 681489 673106 496057 682041 698441 -25998 -675564 -264453 585082
32945E85082J26776l50170L3413J14841m82805n27440K03960K79186m97038m56280
$$ 585082 711858 361688 395101 509942 27137 -500303 -296343 -17157 -514195 -970475
32935i70475O69727R22857k69988q21267K81106J133705M22349l61260J5199L17382
$$ -970475 -300748 622109 352121 -469146 -188040 945665 1368014 1006754 1021953 1339335
32925A339335l67777o51050K72144O89003m57352j309493l68217P26153K00397
$$ 1339335 971558 320508 592652 1281655 824303 -485190 -853407 -127254 73143
32916G3143o72315q7948R63761O87498k57239k49941K97773P6699n22298l80377
$$ 73143 -599172 -687120 276641 964139 706900 456959 754732 831431 309133 -71244
32906g1244J45521J64527P2967M94966P58913J91775m50565l96471k12656l96605
$$ -71244 74277 238804 311771 806737 1565650 1757425 1306860 910389 697733 301128
32896C01128l08852K33815K01488n79222o82438L47134R33116K58199k87227K02978
$$ 301128 -7724 226091 427579 -151643 -834081 -486947 446169 704368 417141 620119
32886F20119N36100p0588m70769n2485k4248p51270o67544N81958R50174l32981
$$ 620119 1156219 1085631 614862 562377 538129 -213141 -880685 -298727 651447 318466
32876C18466j055140P3828J040577K14130p84826k70704N16320Q8915m92423N3737
$$ 318466 -736674 -662846 377731 591861 -192965 -463669 52651 141566 -350857 -297120
32866b97120Q17163Q30994Q79870J212482M59099j279767j585252J01101J037327
$$ -297120 520043 1351037 2230907 3443389 3902488 2622721 1037469 1138570 2175897
32857B175897p3022q13395K57502Q80341l64780j151388L5058P99216n23804j498089
$$ 2175897 2102875 1289480 1546982 2427323 2062543 911155 946213 1745429 1221625 -276464
32847b76464k48035Q84441p7256r00087L47087J343104M3465j210173j97326R29231
$$ -276464 -524499 359942 282686 -617401 -270314 1072790 1116255 -93918 -291244 637987
32837F37987M1949p76071L27903R92686n10312j296469O32342J954379M8764j752756
$$ 637987 679936 -96135 231768 1224454 714142 -582327 50015 2004394 2053158 300402
32827C00402k63584J508523J48569j641424m33125J258998J23055j326420R6627
$$ 300402 36818 1545341 1693910 52486 -380639 878359 1001414 -325006 -228379
32818b28379J696980L19239j068655P20593K290331K51495j393780J381568M056704
$$ -228379 1468601 1787840 719185 1439778 3730109 3981604 2587824 3969392 8026096
32809H026096J289819k898963k263926M05169o03793k602127l32659K733501P14571
$$ 8026096 9315915 6416952 4153026 4558195 3954402 1352275 1019616 3753117 4467688
32800D467688k654406o83310L066392J301038k720422j340980K417136Q15651
$$ 4467688 1813282 1129972 4196364 5497402 2776980 1436000 3853136 4668787
32792D668787k842210m44343M110875J716454l315719m60681N914031L757784
$$ 4668787 1826577 1382234 5493109 7209563 3893844 3433163 9347194 13104978
32784A3104978k581597P14577R145868O312095k972333K504884J9481729K0643761
$$ 13104978 10523381 11237958 20383826 26695921 23723588 26228472 45710201 66353962
32776F6353962P333120K2984010Q8305040J52495543J41847780M3058147q5343913
$$ 66353962 73687082 96671092 184976132 337471675 479319455 522377602 437033689
32769D37033689j70604495j75059927j08197566j9403477L1505475K4200129m755489
$$ 437033689 266429194 91369267 -16828299 -36231776 -4726301 19473828 14718339
32762A4718339j1028087L748072Q699041k626657q323007l57684M549695j728031
$$ 14718339 3690252 7438324 16137365 13510708 5187701 4830017 9379712 7651681
32754G651681n822742j39091L913069r04861m489631L30519M539934P22023l547673
$$ 7651681 1828939 1689848 5602917 4698056 208425 538944 5078878 5800901 2253228
32745B253228r76699K346578o0175k833790j91340K713272K85679k639768n08899
$$ 2253228 1276529 3623107 3562932 729142 537802 3251074 3536753 896985 388086
32736C88086K293034K83935k599282r04750J975612O86167k002974r99073J507263
$$ 388086 2681120 2965055 365773 -538977 1436635 2122802 119828 -879245 628018
32727F28018Q37210j281034o98428J129235O13349q43005j36336J163025J71864
$$ 628018 1465228 184194 -514234 615001 1228350 385345 249009 1412034 1583898
32718A583898j366089n08228J111097N30293r56496o78480L08409j28232p71160
$$ 1583898 217809 -290419 820678 1350971 394475 -284005 24404 -103828 -874988
32709h74988J26086R15753j78870j219872j73964J010195O1531j250069m89286
$$ -874988 -748902 166851 -12019 -1231891 -1405855 -395660 -334129 -1584198 -2073484
32700b073484R76956Q65114J56858N62809R20712j68814j148750m51035M07725
$$ -2073484 -1096528 -231414 -74556 488253 1408965 1240151 91401 -359634 48091
32691D8091o8439l84681O39896J047803n11276j732769o87130O60115K93987j93145
$$ 48091 -20348 -405029 234867 1282670 771394 -961375 -1648505 -988390 -694403 -887548
32681h87548P44690J158666m30838j477827J20931J742012N48163j297407n57172
$$ -887548 -142858 1015808 584970 -892857 -771926 970086 1518249 220842 -336330
32672c36330J240398P87642j020262j084322K57945M64363k80283j2917P85601
$$ -336330 904068 1691710 671448 -412874 -154929 309434 29151 16234 801835
32663H01835L03632p38266m36548N01982J87398o83473k48616P71493M41239o58197
$$ 801835 1105467 367201 -69347 432635 620033 -63440 -312056 459437 900676 242479
32653B42479o33461J44817R1723l88135o5791K90921m31431r21137K56073J390774
$$ 242479 -390982 -246165 -154442 -542577 -608368 -317447 -748878 -1670015 -1413942 -23168
32643b3168L12505j455002j120639M74522N55084m51645N7668J715132J660640
$$ -23168 289337 -1165665 -2286304 -1811782 -1256698 -1708343 -1650675 64457 1725097
32634A725097k63412j219557k92482M19802p5727l07971L40142M75995l62063
$$ 1725097 1461685 242128 -50354 369448 293721 -14250 325892 801887 439824
32625D39824p11785J5919M61081j34643o81748l28710K55713L56237K27979J62449
$$ 439824 -271961 -256042 205039 70396 -611352 -940062 -684349 -328112 -100133 62316
32615F2316L2340J054L43153N80065Q0821p05003q68819m79375j62577J29268
$$ 62316 94656 95710 438863 1018928 1099749 394746 -474073 -953448 -1116025 -986757
32605i86757O28876Q01359K63724j72693K23223P16142M05723j64008j93099k10510
$$ -986757 -357881 443478 707202 534509 757732 1473874 1879597 1715589 1522490 1311980
32595A311980q20555j142286l35005N50407J88259p18512p21331n8323J96216
$$ 1311980 491425 -650861 -985866 -435459 -247200 -965712 -1687043 -1745366 -1549150
32586a549150K31923O76221Q58941O8613o30253o9104P29883K79536n74618j57602
$$ -1549150 -1317227 -641006 217935 286548 -343705 -412809 317074 596610 21992 -135610
32576a35610Q59191N96850n96046p87498M3053J31217p08758p65050M15224J213817
$$ -135610 723581 1320431 724385 -63113 -20060 111157 -597601 -1362651 -947427 266390
32566B66390O63922k73481n67664l57440l3183K96946L06050j71562m26661J01872
$$ 266390 930312 656831 89167 -268273 -301456 -4510 301540 129978 -296683 -194811
32556a94811N61778n7777j027913r17742Q3265O46461N11438M03014L30853j67159
$$ -194811 366967 309190 -718723 -1636465 -1553200 -906739 -395301 7713 338566 171407
32546A71407o09944k26787M74259M91095N1705q7364j95993o68340o47818M37838
$$ 171407 -438537 -665324 -191065 300030 351735 264371 68378 -599962 -1247780 -809942
32536h09942J150933J66325j075706n02506R04861O27985r84018j231310L01388
$$ -809942 340991 507316 -568390 -1070896 -166035 461950 -522068 -1753378 -1451990
32527a451990J133468J85719o78119j52778N30422K11204k74391k4698L11024
$$ -1451990 -318522 -132803 -810922 -963700 -433278 -222074 -496465 -521163 -210139
32518b10139P9286j29084R3902K3939o43651q61259O7354J167762J191590K87613
$$ -210139 -130853 -259937 -166035 -142096 -785747 -1647006 -1579652 -411890 779700 1067313
32508A067313n36344p41560m34338L1959K20201p336j73081J37214N16553M26108
$$ 1067313 530969 -210591 -644929 -612970 -392769 -400105 -573186 -435972 80581 506689
32498E06689J88502L13650L92387j54797p96091o68104p3925J57486J61090M19935
$$ 506689 695191 1008841 1401228 1246431 450340 -217764 -291689 -134203 26887 446822
32488D46822M21630l77863j005426k99460Q76929Q20567j75985l88534L54340
$$ 446822 868452 490589 -514837 -814297 62632 883199 707214 318680 673020
32479F73020N80333j34312o92025o38304n72540m43715L21634J032508M14366
$$ 673020 1253353 1119041 427016 -211288 -783828 -1227543 -905909 126599 540965
32470E40965q88177r14252L64587R14570N8370n82176j13092K65220k33358n58124
$$ 540965 -347212 -1261464 -896877 17693 76063 -506113 -619205 -353985 -587343 -1145467
32460a145467J2992M85621J02045k66953J49672O49931N10004K04518J95157N5447
$$ -1145467 -1132475 -646854 -544809 -811762 -662090 -12159 497845 702363 897520 952967
32450I52967l10030j60905M99295M78098n36890j103413k76607Q02550P17338
$$ 952967 642937 482032 981327 1459425 922535 -180878 -457485 345065 1062403
32441A062403j89854p37004o59058l57831N6954M92467N39686J93536M5947K34456
$$ 1062403 872549 135545 -523513 -881344 -824390 -331923 207763 401299 447246 681702
32431F81702J99037j18039m3288M30176L71118m24258q85982m22105J58833J60790
$$ 681702 880739 762700 719412 1149588 1520706 1096448 210466 -211639 -52806 107984
32421A07984N9869K91607L25440j87315n59141k33916K64830L29557J97094K13119
$$ 107984 167853 459460 784900 597585 38444 -195472 69358 398915 596009 809128
32411H09128J84955M7834J34417K96377j06736r01052j039171l21456J66285j31014
$$ 809128 994083 1041917 1176334 1472711 1365975 464923 -574248 -895704 -729419 -860433
32401h60433l94060l0757L11934Q8947j51611P9227L27026K12654J13912J78056
$$ -860433 -1254493 -1285250 -973316 -884369 -1035980 -956753 -629727 -417073 -303161 -125105
32391a25105n7202m70353k30364N12959M35934o73061j164371j06193J084719
$$ -125105 -182307 -652660 -883024 -370065 65869 -607192 -1771563 -1877756 -793037
32382g93037Q69860j12542m16692q0415j362j61282j2992K59788K42954K22156
$$ -793037 76823 -35719 -452411 -532826 -534188 -695470 -708462 -448674 -205720 16436
32372A6436M09920J69973p82819j394441p67730L07262O35986M74842O89352R74818
$$ 16436 426356 596329 -186490 -1580931 -2348661 -2041399 -1405413 -930571 -241219 733599
32362G33599M99069l75385o02528k02952l6761k26450j87442J02768J69110Q5491
$$ 733599 1232668 857283 254755 51803 15042 -211408 -398850 -296082 -126972 -41481
32352d1481K52146M25826J33124k62550p4721M17121L69461j71526l92938j27276
$$ -41481 210665 636491 769615 507065 432344 849465 1218926 1047400 654462 527186
32342E27186J1521j75848k47345r2500j01750k91802k03145K01875L76561Q8283
$$ 527186 538707 362859 115514 23014 -78736 -370538 -573683 -371808 4753 93036
32332I3036k42996k75658j96133k53019l37026k14628J33753M96432N69179J99850
$$ 93036 -149960 -425618 -621751 -874770 -1211796 -1426424 -1292671 -796239 -227060 -27210
32322b7210l27092m53703j7117M79805M89525N9242l48285l96844p9069L22201
$$ -27210 -354302 -808005 -825122 -345317 144208 203450 -144835 -541679 -620748 -298547
32312b98547L75874m6049m41576k46737L17273N43339L05102Q3724m790k84018
$$ -298547 77327 31278 -410298 -657035 -339762 203577 508679 592403 587613 303595
32302C03595n96572l86231J37105Q5644n50055o76223J13637Q11110O82769L78918
$$ 303595 -292977 -679208 -542103 -456459 -1006514 -1682737 -1569100 -757990 -75221 303697
32292C03697N33992N55106j25114p39444l82665L93890M65902j07468m47734l58987
$$ 303697 837689 1392795 1267681 528237 145572 539462 1005364 897896 450162 91175
32282I1175k53867j16361K60384M52042o433n87635m59861J39241L34539Q5565
$$ 91175 -162692 -279053 -18669 433373 426940 -160695 -620556 -481315 -146776 -61211
32272f1211N9475K92897K11314j19377L654N69061O52119j36124r50073q78847
$$ -61211 -1736 291161 502475 383098 386752 955813 1607932 1471808 521735 -357112
32262c57112j25309M09617K76314j55795k77982K6625K54909k8507m61213k72554
$$ -357112 -482421 -72804 203510 47715 -230267 -203642 51267 22760 -438453 -711007
32252g11007N20382R41631M06271m17199o09261k58834p1999k29812l65983l15663
$$ -711007 -190625 751006 1157277 740078 130817 -128017 -200016 -429828 -795811 -1111474
32242a111474j79494P7027M43987N56076J78099k57763j99792J93952L71756K78609
$$ -1111474 -1290968 -1213941 -769954 -213878 -35779 -293542 -493334 -299382 72374 350983
32232C50983K89275M31671L27660j30029n72040o48272l67243L9551L26961L60149
$$ 350983 640258 1071929 1399589 1269560 697520 49248 -317995 -278444 48517 408666
32222D08666J93153m3147l08550n02100l22284K54655N53574j4962q53190p95210
$$ 408666 601819 558672 250122 -251978 -574262 -319607 233967 219005 -634185 -1429395
32212a429395J21053N92329K4235n98603l23693M09214P17489N86563M36528K43473
$$ -1429395 -1308342 -716013 -691778 -1290381 -1614074 -1204860 -487371 99192 535720 779193
32202G79193r6294k74765j75699k31861n47442n22559M076K43897j52517l07097
$$ 779193 682899 408134 232435 574 -546868 -1069427 -1065351 -821454 -973971 -1281068
32192a281068L42032Q58785L47835m01043j86966N98912P39291K18379o2463j4881
$$ -1281068 -939036 -80251 267584 -133459 -320425 278487 1017778 1236157 1173694 1158813
32182A158813k47657o39191n32918n9564J21112P6871K59300L18549k85970q97648
$$ 1158813 911156 271965 -260953 -320517 -199405 -122534 136766 455315 169345 -728303
32172g28303m76600N10687O98388J03023j148N69888O03893k44376p75894l20621
$$ -728303 -1204903 -694216 4172 107195 106047 675935 1279828 1035452 259558 -61063
32162f1063K53501K29584J15697K99226J68740n41312r24092l96376K10511O5244
$$ -61063 192438 422022 537719 836945 1005685 464373 -459719 -856095 -645584 -580340
32152e80340k88339m4847M02076K91232o8880O6574M60857L51001j43117k69960
$$ -580340 -868679 -913526 -511450 -220218 -289098 -222524 238333 589334 446217 176257
32142A76257p525j1537l37093l18680K13224N73604K99891j93396l16069n3431
$$ 176257 168732 157195 -179898 -498578 -285354 288250 588141 394745 78676 25245
32132B5245K58911M19602L42469m6780n89662q45044n50560J7417L56939K95603
$$ 25245 284156 703758 1046227 999447 409785 -435259 -985819 -968402 -611463 -315860
32122c15860N2887j37861k35622k36421n9878K72706M91438L20364j37743m37441
$$ -315860 -262973 -400834 -636456 -872877 -932755 -660049 -168611 151753 14010 -423431
32112d23431k80216J46762L92291K19551j88971m33645k78241J03146K81478P6069
$$ -423431 -703647 -556885 -164594 54957 -134014 -567659 -845900 -742754 -461276 -385207
32102c85207j72612k9412M01554N73082K61114j01481k9950L29181L82369j19841
$$ -385207 -557819 -587231 -185677 387405 648519 547038 517088 846269 1228638 1108797
32092A108797o94106o42900M6534N18807O0009q13638q57420J63903R99054O51725
$$ 1108797 414691 -228209 -181675 337132 397141 -416497 -1273917 -1110014 -110960 540765
32082E40765k12483m28850j34359k11745n29666k57878L61117K85063k69779P0651
$$ 540765 328282 -100568 -234927 -446672 -976338 -1234216 -873099 -588036 -857815 -787164
32072g87164J296494J553080P2988j313094q80484L95351N39610m09581q72439
$$ -787164 509330 2062410 2135398 822304 -58180 337171 876781 467200 -405239
32063d05239l37217K91110M49350M02596K61157q9323l11576q4798P8913l43726
$$ -405239 -742456 -451346 -1996 400600 661757 572434 260858 176060 254973 -88753
32053h8753p01361j07019Q68930Q92075l7856o65917m92621k07069j63288N0061
$$ -88753 -790114 -897133 -28203 863872 826016 160099 -332522 -539591 -702879 -652818
32043f52818L94057K00771n03741q04627l51334J66469K70360K76314L69489K52043
$$ -652818 -258761 -57990 -561731 -1366358 -1717692 -1551223 -1280863 -1004549 -635060 -383017
32033c83017O561J63298N78280L93401m92050j034515n93039J90702N33997N07620
$$ -383017 -376456 -213158 365122 758523 266473 -768042 -1361081 -1170379 -636382 -128762
32023a28762L87834M2406m38699m44677J72301O37764L89384j09619k62690k33243
$$ -128762 259072 301478 -137221 -581898 -409597 228167 617551 507932 245242 11999
32013A1999l16197k18410K90986O90972M47883q7866k44921k9779J12212J11397
$$ 11999 -304198 -522608 -231622 459350 907233 819367 574446 544667 656879 768276
32003G68276J75132K14699J5435k57747k72208n2687J39951K34209K71671J62583
$$ 768276 943408 1158107 1173542 915795 643587 590900 730851 965060 1236731 1399314
31993A399314j02941k49796r7467Q0896o2083l98676m92811j87744K43231M48573
$$ 1399314 1296373 1046577 949110 1030006 967923 569247 76436 -111308 131923 580496
31983E80496L23376M8925j22428j81290l61440o68087o54307n7147N72506M62637
$$ 580496 903872 952797 830369 649079 287639 -380448 -1034755 -1091902 -519396 -56759
31973e6759k43611o00517j64487M55751N13418R955n40986p32954m43467J66719
$$ -56759 -300370 -900887 -1065374 -609623 -96205 -86250 -627236 -1360190 -1803657 -1636938
31963a636938O46436O17303K41696j8707o7554j44222k27562o2152K50494L14287
$$ -1636938 -990502 -373199 -131503 -150210 -217764 -361986 -589548 -651700 -401206 -86919
31953h6919R9993o6718j34537k75390k98393Q8770N08531L25918j90089j69309
$$ -86919 13074 -53644 -188181 -463571 -761964 -673194 -164663 161255 -28834 -198143
31943a98143L31127L05250m45980q35691k67693L82960K85564m3359J43420M82282
$$ -198143 132984 438234 -7746 -843437 -1111130 -728170 -442606 -485965 -342545 139737
31933A39737L37397N7798K20085L81733j32000p82767n24385L97347P22831J42326
$$ 139737 477134 534932 755017 1136750 1004750 221983 -302402 94945 817776 960102
31923I60102l37741r3124K80989J48271k05418k61207j05072o2679j02030p6807
$$ 960102 622361 529237 810226 958497 753079 491872 386800 324121 222091 145284
31913A45284j00052k53706l07691j08941Q3769K2807p0113J27239M39567M17053
$$ 145284 45232 -208474 -516165 -625106 -541337 -518530 -588643 -461404 -21837 395216
31903C95216N0288k03366j39840r9194l42640n43604k82638K11991L38439O6224
$$ 395216 445504 242138 102298 3104 -339536 -883140 -1165778 -953787 -615348 -549124
31893e49124J5223M44460P58776M00696k58598m49426q1720K89864L46482K41651
$$ -549124 -533901 -89441 669335 1070031 811433 362007 280287 570151 916633 1158284
31883A158284R5537j37236l46698l65687l29414m11275l41382J76413P10019N42894
$$ 1158284 1253821 1116585 769887 404200 74786 -336489 -677871 -501458 208561 751455
31873G51455j64100n09468k23822K855k32663m22367j47913J91176J67476M1201
$$ 751455 587355 77887 -145935 -143080 -375743 -798110 -946023 -754847 -587371 -546170
31863e46170R8336K2653l87955n56754J5803P61267P70758J45609k47110j38475
$$ -546170 -447834 -425181 -813136 -1369890 -1354087 -592820 177938 323547 76437 -62038
31853f2038q6801l68201m79846P580O95137Q14284J72287o22672q11725k54741
$$ -62038 -148839 -517040 -996886 -989306 -294169 520115 692402 69730 -741995 -996736
31843i96736M60729O78985L51075p8886l04282l55960k83265q6505M5117q5645
$$ -996736 -536007 142978 494053 415167 110885 -245075 -528340 -614845 -569728 -655373
31833f55373k51026q3730K02292N2460m00900l81365K35326N91818K46455n8224
$$ -655373 -906399 -990129 -787837 -735377 -1136277 -1517642 -1282316 -690498 -444043 -502267
31823e02267L03924O82932K27012o08060p30699j22469K81318J64359J10818L45567
$$ -502267 -198343 484589 711601 103541 -627158 -749627 -468309 -303950 -193132 152435
31813A52435L36415j16289l81094n460N23645N03916k3345m71248m80709j19643
$$ 152435 488850 372561 -8533 -13993 509652 1013568 990223 518975 38266 -81377
31803h1377L88592P65443O91129P6679o77132r18551l75708M62920P37831J47995
$$ -81377 307215 1072658 1763787 1840466 1163334 244783 -130925 331995 1069826 1217821
31793A217821o16330o80851j48667P9150k81239m13604K42846R24036O32463k56966
$$ 1217821 601491 -79360 -228027 -148877 -430116 -843720 -600874 323162 955625 698659
31783F98659n28250m398K62333k41761o81241k61493N27938P38376L60118J19602
$$ 698659 170409 166011 428344 186583 -494658 -756151 -228213 510163 870281 989883
31773I89883K62478L09244p4088n89641p77253n60877k03288M6452J56785K52556
$$ 989883 1252361 1561605 1487517 897876 120623 -440254 -643542 -597090 -440305 -187749
31763a87749L67526K89698j66665p13260p35444q1410O03832O43903J79277j37952
$$ -187749 179777 469475 302810 -410450 -1145894 -1227304 -623472 20431 199708 61756
31753F1756r5802o1573k21170k41225J33904N87581O22267J86584l28398n33978
$$ 61756 -34046 -95619 -316789 -558014 -424110 163471 785738 972322 643924 109946
31743A09946l16917J29595L99369K20830j61693k41105q519l0511m99096p28892
$$ 109946 -206971 -77376 321993 542823 381130 140025 131506 100995 -398101 -1126993
31733a126993j36754P05674P44879l6220n82182k53086M25284O64332L78680j7867
$$ -1126993 -1263747 -558073 186806 150586 -431596 -684682 -259398 404934 783614 765747
31723G65747k18789j43270J04886J92963j08264m58735l23113J46656K50519j45240
$$ 765747 546958 403688 508574 701537 593273 134538 -188575 -41919 208600 63360
31713F3360l87043j16344K29166K65528J86712J26695j26919m36596k94209J22429
$$ 63360 -323683 -440027 -210861 54667 241379 368074 241155 -195441 -489650 -367221
31703c67221j3644o10656m61696O57899J196340K42680p66330k80619P85822O12343
$$ -367221 -380865 -991521 -1453217 -795318 401022 643702 -122628 -403247 382575 994918
31693I94918m82344p33131M7752M37287K5288k22209j05818m08686q78924l16471
$$ 994918 512574 -220557 -172805 264482 289770 67561 -38257 -446943 -1325867 -1642338
31683a642338R82592J179879j02840r75390l06775N97840M15869j40610j5789
$$ -1642338 -659746 520133 417293 -558097 -864872 -267032 148837 8227 -7562
31674g562K71403q5890m95534j16185N47756O43447M44466M91744L75823k85815
$$ -7562 263841 177951 -317583 -433768 113988 757435 1201901 1693645 2069468 1783653
31664A783653p54821m17000l6980l75240o68821k3274P63373M83100l14066k76320
$$ 1783653 1028832 611832 574852 199612 -469209 -492483 270890 753990 439924 163604
31654A63604L74068L42871l79952n96598n2974L11757J37480k0497l2776k59157
$$ 163604 537672 880543 500591 -96007 -148981 162776 300256 279759 246983 -12174
31644a2174l73800K29605R22998M65166p88079j086235O753Q70533L40660o70974
$$ -12174 -385974 -156369 766629 1231795 443716 -642519 -635766 234767 575427 -95547
31634i5547q31772k53209K01820L39097M21121L80924R2208j87356k66675l52213
$$ -95547 -927319 -1180528 -978708 -639611 -218490 162434 254642 67286 -199389 -551602
31624e51602m89786l27732J52615L77789R7175j53655J9874K02374r284j96776
$$ -551602 -1041388 -1369120 -1216505 -838716 -741541 -895196 -875322 -672948 -682232 -879008
31614h79008J72415P48632P55335J32537m48089n47349l54080j69958o378K02614
$$ -879008 -706593 42039 797374 929911 481822 -65527 -419607 -589565 -595943 -393329
31604c93329L21984J53667k36837m85496l02037J70364N07430N06490L34522J76821
$$ -393329 -71345 82322 -154515 -640011 -942048 -771684 -264254 242236 576758 753579
31594G53579M9294O397J29748K05233r4157n39629m64086J80292N63803J81161
$$ 753579 802873 809270 939018 1144251 1050094 510465 46379 226671 790474 971635
31584I71635l99228m91030k47880o8196J49892M28196K41036m76390p34125J6873
$$ 971635 572407 81377 -166503 -234699 -84807 343389 584425 108035 -626090 -609217
31574f09217O86255J56674p53447n39387M65991O81397k0834k40703L77732N80912
$$ -609217 77038 233712 -519735 -1059122 -593131 88266 67432 -173271 204461 785373
31564G85373j73850p92055n17961p4656j23787j99152M8938O6600l15270k79413
$$ 785373 611523 -180532 -698493 -773149 -896936 -1096088 -1047150 -980550 -1295820 -1575233
31554a575233L81743N31371l85036j086071m04074P53254Q37896N4235k38112
$$ -1575233 -1193490 -662119 -1047155 -2133226 -2537300 -1784046 -946150 -891915 -1130027
31545a130027J97094L71613j05023n21463l11438K79116P42752P46770J97371
$$ -1130027 -932933 -561320 -666343 -1187806 -1499244 -1220128 -477376 269394 466765
31536D66765m84469n12451J93747O08045J9230p68770o07212K11903M89195K2517
$$ 466765 -17704 -530155 -336408 271637 290867 -477903 -1085115 -873212 -384017 -361500
31526c61500k77675K666K96382K11773M7139j0257j95698m48485k87437L01253
$$ -361500 -639175 -636509 -340127 -128354 -81215 -91472 -287170 -735655 -1023092 -721839
31516g21839O44233L74283m6020j19774J400J695N147K39806M95356L83387o0829
$$ -721839 -77606 296677 250657 130883 132283 133978 139125 378931 874287 1257674 1196845
31505A196845m04458l64233p8487J42942J69819J00920L4724p1221k20769k26187
$$ 1196845 792387 428154 349667 492609 662428 763348 798072 726851 506082 279895
31495B79895j0350P4761k99619p04324l26526P44997J348387P81217k01821n19863
$$ 279895 269545 344306 44687 -659637 -986163 -241166 1107221 1888438 1686617 1166754
31485A166754k27325n9406j09048K7848J73710j94316p32829m59034O19343J213921
$$ 1166754 939429 880023 770975 798823 972533 778217 45388 -413646 205697 1419618
31475A419618N26757o27611j032786o13256j04517J59609L28441L38268k300l93796
$$ 1419618 1946375 1318764 285978 -327278 -431795 -272186 56255 394523 392223 -1573
31465a573k97571J79822L43985k1232k97183k0865L58795K04034k60194k86086
$$ -1573 -299144 -119322 224663 203431 -93752 -114617 244178 448212 188018 -98068
31455i8068J74652L45609j36420n85087l15959K36348J55867m96587o92517N6458
$$ -98068 76584 422193 285773 -299314 -615273 -378925 -223058 -719645 -1412162 -1355704
31445a355704R62051J025959K69766m88696o70771l36664J56105M77629M52522
$$ -1355704 -393653 632306 902072 413376 -257395 -594059 -437954 39675 492197
31436D92197J72352q7256j92422k27061j95255J7158K74059K21707r4619j42241
$$ 492197 664549 577293 384871 157810 -37445 -20287 253772 475479 380860 238619
31426B38619K31324L73652k04031r02713p92122j552M52770J62492j66886J14569
$$ 238619 469943 843595 639564 -263149 -1055271 -1056823 -604053 -441561 -608447 -493878
31416d93878O29383N76434j22970p31766o04054J22473P33746O93935J53566k92644
$$ -493878 135505 711939 588969 -142797 -746851 -624378 109368 803303 956869 664225
31406F64225l07459j15140o9396j77423k39787k24435k20239j80610N39K67514
$$ 664225 356766 241626 172230 -5193 -244980 -469415 -689654 -870264 -869725 -602211
31396f02211M82308N76682M41642o0718p02861q51056k37277N28108P03758L83674
$$ -602211 -119903 456779 898421 837703 134842 -716214 -953491 -425383 278375 662049
31386F62049J38519N658l73042p82944n70552J57304M29787j58333p76052n97557
$$ 662049 800568 806226 433184 -349760 -920312 -763008 -333221 -491554 -1267606 -1865163
31376a865163N4087M13911M52807N92127P44023M89946n1731l47236l15718l38431
$$ -1865163 -1811076 -1397165 -944358 -352231 391792 881738 830007 482771 167053 -171378
31366a71378m57243k99056J45627L69779J45954j31252j17255M498l2679j28891
$$ -171378 -628621 -927677 -782050 -412271 -266317 -397569 -514824 -510326 -543005 -671896
31356f71896q1527R7050L39305O00272O22062J31317n26848n74453M5448L88387
$$ -671896 -753423 -656373 -317068 283204 905266 1036583 509735 -64718 -19270 369117
31346C69117j02360o40480l00423M48731M45019l16718p11276k57917L16077M16612
$$ 369117 266757 -373723 -674146 -225415 219604 -97114 -808390 -1066307 -750230 -333618
31336c33618L39690L71287K28181j17610q5340M16613N09806k53533r02179m30571
$$ -333618 6072 377359 605540 487930 402590 819203 1329009 1075476 173297 -257274
31326b57274N62753P41142J9951m90341k42341K09544L32329J92772j18871o49458
$$ -257274 305479 1046621 1066572 576231 333890 543434 875763 1068535 949664 300206
31316C00206j050855p79377K3907O33736P81716P82309O26626m6959r32645j086342
$$ 300206 -750649 -1530026 -1506119 -872383 -90667 691642 1318268 1271309 338664 -747678
31306g47678l38748L11932J80131j80338q7688J54871m712l02810j96333J07349
$$ -747678 -1086426 -774494 -594363 -774701 -862389 -707518 -712230 -1015040 -1211373 -1104024
31296a104024L7922k93421k63478K52176P34053P69320M05470j16159n17638n16561
$$ -1104024 -1066102 -1359523 -1623001 -1370825 -636772 132548 538018 421859 -95779 -612340
31286f12340j05232L29499M51024L31181J55866o9324k59390j41271K40624L61407
$$ -612340 -717572 -388073 62951 394132 549998 480674 221284 80013 320637 682044
31276F82044l0796m42988l62125Q72J75027J74208K34695K52760P9133l0162J35357
$$ 682044 651248 208260 -153865 -152993 22034 196242 430937 683697 762830 732668 868025
31265H68025K36436m7287l65776k93013j24859k89543l87029K15525J084843J070072
$$ 868025 1104461 1057174 691398 398385 273526 -16017 -403046 -187521 897322 1967394
31255A967394m1289j136147j188061l41940N10647O34534p3194r32673r03445
$$ 1967394 1926105 789958 -398103 -740043 -229396 405138 331944 -600729 -1504174
31246a504174K33951J315290J128526N7554n04116j60200J74880p3367m07803
$$ -1504174 -1270223 45067 1173593 1231147 727031 566831 741711 668344 260541
31237B60541m03083l84256n25079l47312L13811P83863N92904J98629P4633n7757
$$ 260541 -142542 -526798 -1051877 -1399189 -1085378 -301515 291389 490018 564651 506894
31227E06894m10826m29159K21761P32601K49251o61746p48391O2411O42785L87832
$$ 506894 96068 -333091 -111330 621271 870522 208776 -539615 -477204 165581 553413
31217E53413j04227j90021p3860j99952m43673l68222O7779M30973L41807p0761
$$ 553413 449186 259165 185305 -14647 -458320 -826542 -758763 -327790 14017 -56744
31207e6744k53094J42241O97751O17522j73831p68647m75236K00919L59616O4918
$$ -56744 -309838 -167597 530154 1147676 973845 205198 -270038 -69119 290497 355415
31197C55415P9232M75351N16987P089k66548J53679N26894N2423p73551q22162
$$ 355415 434647 909998 1426985 1434074 1167526 1321205 1848099 1900522 1126971 304809
31187C04809k7665N17641J71875m26340m43931n1203L5176k47433k93602R7322
$$ 304809 277144 794785 966660 540320 96389 45186 80362 -167071 -460673 -363351
31177c63351L58877O9438l49831k55259K67446N58694L23149o6586j86699o5726
$$ -363351 -4474 64964 -284867 -540126 -272680 286014 609163 542577 355878 290152
31167B90152J0468j15878l77799n46293l68395J20724M62314K67769j86401k62976
$$ 290152 300620 184742 -193057 -739350 -1107745 -987021 -524707 -256938 -443339 -706315
31157g06315J22764L95752K56516J53002M77003P91985M07745n37064j128437
$$ -706315 -583551 -187799 68717 221719 698722 1490707 1898452 1361388 232951
31148B32951p83672J02050O59797M35061k58428o97812m48808K17230O43151N07247
$$ 232951 -550721 -448671 211126 646187 387759 -310053 -758861 -541631 101520 608767
31138F08767O3189k89134l53973o2794M96112Q49126M63323m39802r27022n60845
$$ 608767 671956 382822 28849 -33945 462167 1311293 1774616 1334814 407792 -153053
31128a53053l453M7733j00595J36921M33470O7558o83462p76670k8850N56690
$$ -153053 -156506 -108773 -209368 -72447 361023 428581 -254881 -1031551 -1060401 -503711
31118e03711L22036j52055j08470K48831K59253j38427m65752m65092k80093q4670
$$ -503711 -181675 -333730 -442200 -193369 65884 -72543 -538295 -1003387 -1283480 -1368150
31108a368150Q1143K30681L96237N32718M27604K054l39577j41104L29418L63310
$$ -1368150 -1287007 -1056326 -660089 -127371 300233 302287 -37290 -178394 151024 514334
31098E14334o0497k10156J28747K36628k36048n07798N0633P32746N70664r3544
$$ 514334 453837 243681 372428 609056 373008 -134790 -84157 648589 1219253 1125709
31088A125709k46823P7499j1711n99394q05685l29205Q5597m4775k76236j96920
$$ 1125709 878886 956385 944674 345280 -460405 -789610 -704013 -748788 -1025024 -1221944
31078a221944k2791J45200O40699J311995J265124J80429r58443j151084o39428
$$ -1221944 -1244735 -1099535 -458836 853159 2118283 2298712 1340269 189185 -450243
31069d50243j88238Q5156L22017J70918m85547p02839L27128J636556J468312
$$ -450243 -638481 -553325 -231308 -60390 -545937 -1248776 -921648 714908 2183220
31060B183220j51740j260866o56766N84919Q68731J92292l66045m10498m14146
$$ 2183220 2031480 770614 113848 698767 1567498 1759790 1393745 983247 569101
31051E69101n71761n00821o3891K86366J55117k69287m90507k39635L09628O70348
$$ 569101 -2660 -503481 -567372 -281006 -125889 -395176 -885683 -1125318 -815690 -145342
31041a45342M40410k30045o71667m26288J76484M49000K34167N843J12254L24512
$$ -145342 295068 65023 -606644 -1032932 -856448 -407448 -173281 -167438 -55184 269328
31031B69328K69177j8450k13057j82758r3967r4656j25492r1817n2083j06583
$$ 269328 538505 520055 306998 124240 30273 -64383 -189875 -281692 -333775 -440358
31021d40358j73927m6776K88328N27264L73451p6551m16991l90155j24856Q5297
$$ -440358 -614285 -661061 -372733 154531 527982 451431 34440 -355715 -480571 -395274
31011c95274R5083l6322j59642j38380N0209K53671K79273J27351k2890p3956
$$ -395274 -300191 -336513 -496155 -634535 -584326 -330655 -51382 75969 53079 -20877
31001b0877q2143l3260K01633N42797N92574J23803m87717o47205k90381Q2241
$$ -20877 -103020 -136280 65353 608150 1200724 1324527 836810 189605 -100776 -18535
30991a8535J13411l0837q1611r4368k10326k74711m9857L19828M30607K13264
$$ -18535 94876 64039 -17572 -111940 -322266 -596977 -646834 -327006 103601 316865
30981C16865N8304K27177M28941K18508l45812p14201m99393Q2166M72312L54511
$$ 316865 375169 602346 1031287 1249795 903983 189782 -309611 -227445 244867 599378
30971E99378p6201l57402k28852J28248L22015J96233m8813j94743k77619l79635
$$ 599378 523177 165775 -63077 65171 387186 583419 534606 339863 62244 -317391
30961c17391l33876O6548O12739P64557K93096m03684p61908o37767k93016J8892
$$ -317391 -651267 -584719 28020 792577 1085673 681989 -79919 -717686 -1010702 -991810
30951i91810K39919L69990L60813J89779n3221k09013k00822j45913k33592m25591
$$ -991810 -751891 -381901 -21088 168691 115470 -93543 -294365 -440278 -673870 -1099461
30941a099461m17112o8703K74255J96143j45288j91620J87660N00583M10346K39092
$$ -1099461 -1516573 -1585276 -1311021 -1114878 -1260166 -1451786 -1264126 -763543 -353197 -114105
30931a14105M00696P16493O90392K28468k84862m81931k97043Q7211L26142J25353
$$ -114105 286591 1003084 1693476 1921944 1637082 1155151 858108 945319 1271461 1396814
30921A396814l79838o42222l42575J88018M10692K02717j82190m73772m61421
$$ 1396814 1016976 374754 32179 220197 630889 833606 651416 177644 -283777
30912b83777q5507K60850p359p24073q75145k2189Q12243N42959k50760j56640
$$ -283777 -369284 -108434 -115793 -839866 -1715011 -1737200 -924957 -381998 -632758 -789398
30902g89398Q24084J240844M70601l87690l46286N4415m9637l21679J5594O33509
$$ -789398 34686 1275530 1746131 1358441 1012155 1066570 1016933 695254 710848 1344357
30892A344357N28909l12599q28419m71099P9168M0035l97964n42322k36528Q6986
$$ 1344357 1873266 1560667 732248 261149 340317 380352 -17612 -559934 -796462 -709476
30882g09476J66204K03072L38297K66230k84780q97886q05591L5709P28116N88176
$$ -709476 -543272 -340200 -1903 264327 -20453 -918339 -1723930 -1688221 -960105 -371929
30872c71929L5541j42822M7434O5616j08798n1469J55109J7981l22456j80593
$$ -371929 -336388 -479210 -431776 -366160 -474958 -526427 -371318 -353337 -675793 -856386
30862h56386L80119M39110k19987n53179J07263Q84764O89772j24120m45087j10707
$$ -856386 -476267 -37157 -257144 -810323 -703060 181704 871476 747356 302269 191562
30852A91562J57133J08917J47638L27784K04122k98868p14454p94722p25431n44151
$$ 191562 348695 457612 605250 933034 1137156 838288 123834 -670888 -1396319 -1940470
30842a940470m7592O23199R41639O92049K09929j50722l18356k51743Q9355M41409
$$ -1940470 -1988062 -1364863 -423224 268825 478754 328032 9676 -242067 -152712 288697
30832B88697L97726r98k49988p0016K45870K77737k9091l90857m74815j62792
$$ 288697 686423 685425 435437 365421 611291 889028 859937 469080 -5735 -168527
30822a68527K83512M12409J15845k24491l14385l26400m12615l02353J36225M12522
$$ -168527 114985 527394 643239 418748 104363 -222037 -634652 -937005 -800780 -388258
30812c88258J46432j47379J87984P75624P35096J45994j09629J01413k5383o84113
$$ -388258 -241826 -389205 -201221 574403 1309499 1455493 1345864 1447277 1421894 737781
30802G37781r49889l13324L64598J60340n01265n83869J4944N11915M66228J73320
$$ 737781 -212108 -525432 -160834 -494 -501759 -1085628 -1070684 -558769 -92541 80779
30792H0779N598P959R5920J81977J33827p1334k21785j22609J51468L93284M53382
$$ 80779 86377 94336 190256 372233 506060 434726 212941 90332 241800 635084 1088466
30781A088466K24093k41366n33496k68952K24331J87774m01456o48766r7564N03690
$$ 1088466 1312559 1071193 537697 268745 493076 680850 279394 -369372 -466936 36754
30771C6754L86923l0579L2377L24394O2187n61633n88489O8182M13941l761m16702
$$ 36754 423677 393098 425475 749869 812056 250423 -338066 -269884 144057 140296 -276406
30760b76406k12985O2979k25253o06322k70058N20097P59956K09186l43497l04213
$$ -276406 -489391 -426412 -651665 -1257987 -1528045 -1007948 -247992 -38806 -382303 -686516
30750f86516L1418J49257J4904j43999k20612j18491K82739P43890O74678q0235
$$ -686516 -655098 -505841 -490937 -634936 -855548 -974039 -691300 52590 727268 647033
30740F47033q10374p59893j31450K42603P4764j19243O1604L35555K98213N2851
$$ 647033 -163341 -923234 -1054684 -812081 -737317 -856560 -794956 -459401 -161188 -108337
30730a08337n4314J5874P3264J01486K30830M29245N14199M06761J63699j52096
$$ -108337 -162651 -146777 -73513 27973 258803 688048 1202247 1609008 1772707 1620611
30720A620611m49929n79564n05103l83210l06338j52494J17307K49355O2484j97377
$$ 1620611 1170682 591118 86015 -297195 -603533 -756027 -638720 -389365 -326881 -524258
30710e24258j99964l2695J1604l1398R1748L35376M10043K76221J19480q7044
$$ -524258 -724222 -756917 -745313 -776711 -684963 -349587 60456 336677 456157 369113
30700C69113m68892p49076m84158J34986L83653Q9689p0070L04513O09215K03766
$$ 369113 -99779 -848855 -1333013 -1198027 -814374 -724685 -794755 -490242 118973 322739
30690C22739m47019l72002M31886R27868M74999l47735o05049k11628J12877j19089
$$ 322739 -124280 -496282 -64396 863472 1338471 990736 385687 174059 286936 167847
30680A67847n70538n95507r7173L85632M26623K26128J70730J82060m9734l51790
$$ 167847 -402691 -998198 -1095371 -709739 -283116 -56988 113742 295802 246068 -105722
30670a05722k10753L21528N43226J70364j96229r2783K3005l22278n73390J6431
$$ -105722 -316475 5053 548279 718643 522414 429631 452636 130358 -443032 -426601
30660d26601R11439Q50818j73412p50693j63764N44612K59660n18602o40415j54092
$$ -426601 484838 1335656 1162244 411551 247787 792399 1052059 533457 -106958 -261050
30650b61050O747k78406k37191K72658M50682j697l06556K6904L14419r7437o10176
$$ -261050 -254303 -532709 -769900 -497242 -46560 -48257 -354813 -327909 -13490 -110927 -721103
30639g21103l06271N03221P29866J90949k36927q2805J42976R723j46249K2011
$$ -721103 -1027374 -524153 205713 396662 159735 76930 219906 229629 83380 105391
30629A05391K07052M9788j76250l8131L05307L62178N6892k47413l07086j95773
$$ 105391 312443 362231 185981 147850 453157 815335 872227 624814 317728 121955
30619A21955o7844k0391p9803j30729k6616J05970l2219l67954m34179j37400
$$ 121955 54111 33720 -46083 -176812 -203428 -97458 -129677 -497631 -931810 -1069210
30609a069210l0721l96969n90930L4068R26404R17197r1394q68902m67288O07711
$$ -1069210 -1099931 -1496900 -2087830 -2053762 -1127358 -210161 -301555 -1170457 -1637745 -1030034
30599a030034J172095Q02313Q3935k77308j66191O1777J01755l4937k09981m28522
$$ -1030034 142061 944374 1028309 751001 584810 646587 748342 713405 503424 74902
30589G4902p23606q44451m35520L42658P70097M31536k15961m72891k50147R6413
$$ 74902 -648704 -1493155 -1928675 -1586017 -815920 -384384 -600345 -1073236 -1323383 -1226970
30579a226970L94905N97513M54435r6781m92370k21464K73558J95220k68042j74036
$$ -1226970 -832065 -234552 219883 123102 -369268 -590732 -317174 -121954 -389996 -564032
30569e64032N79302R69746M49000k16212k24801O7107m7341l90809l40384K8295
$$ -564032 15270 985016 1434016 1217804 993003 1060110 1012769 621960 281576 309871
30559C09871J43747k5729j1882K26202K33617r1716l23903k71764k43704l75364
$$ 309871 453618 427889 416007 642209 875826 784110 460207 188443 -55261 -430625
30549d30625l14604J21810M91499L35465j04498k26581N9968K63501R4833j12183
$$ -430625 -745229 -623419 -131920 203545 99047 -127534 -67566 195935 290768 178585
30539A78585L5681L07074J05911o15589j096033o60911L40083Q56552L87020m37067
$$ 178585 214266 521340 627251 11662 -1084371 -1745282 -1405199 -548647 -161627 -598694
30529e98694o49303o9898N88496O01398L769n04563l19825L94320Q10884L39858
$$ -598694 -1247997 -1317895 -729399 -128001 -124232 -628795 -948620 -554300 256584 596442
30519E96442n89908r09566j91835P39961P83569o3752p35600m84957K50086N86116
$$ 596442 6534 -903032 -1094867 -354906 428663 364911 -370689 -855646 -605560 -19444
30509a9444L70656J62350K53095K98441K518l63296m18340k48375j37597l9188
$$ -19444 351212 513562 766657 1065098 1067616 704320 285980 37605 -99992 -139180
30499a39180K10122L74702R7509l93415m69083l0650L52277L52912K94450M12948
$$ -139180 70942 445644 543153 149738 -319345 -349995 2282 355194 649644 1062592
30489A062592L79377l6652m14065l13208N874M7933j31099j74533j12865j88304
$$ 1062592 1441969 1405317 991252 678044 683918 731851 600752 426219 313354 125050
30479A25050k71620q9591J69588J06891j77720k32396J344J75886J74584J81443
$$ 125050 -146570 -236161 -66573 40318 -137402 -369798 -368454 -192568 -17984 163459
30469A63459J91393L0493j84461j66809L465Q885j00589N583L01797M32578L31240
$$ 163459 354852 385345 200884 34075 37540 46425 -54164 -48581 253216 685794 1017034
30458A017034K38262J67036l4941j63203J14739N18558L76607l22851q01306n63591
$$ 1017034 1255296 1422332 1387391 1224188 1338927 1857485 2234092 1911241 1109935 546344
30448E46344K2869L66705K91025p3313m63592m88430k7310L77608J62863k98042
$$ 546344 569213 935918 1226943 1153630 690038 201608 174298 551906 714769 416727
30438D16727j68166M62327O18113j1974n93831n11693k01918j74709j60909J57147
$$ 416727 248561 710888 1329001 1317027 723196 211503 9585 -165124 -326033 -168886
30428a68886L83757Q0873m17897n21084k30062N9327J58805N0858k80146n90604
$$ -168886 214871 295744 -122153 -643237 -873299 -813972 -655167 -604309 -884455 -1475059
30418a475059m47726R4618M22161K65506O8219J56340K59232K16692L67314P63663
$$ -1475059 -1922785 -1828167 -1406006 -1140500 -1072281 -915941 -656709 -440017 -72703 690960
30408F90960Q06981K27807l39813l57834j82060k38027k32233P9804J81660k72243
$$ 690960 1497941 1725748 1385935 1028101 846041 608014 375781 455585 637245 365002
30398C65002n98014j42981M94403L83354j96672k88505J26506K45991j04647l06981
$$ 365002 -233012 -375993 118410 501764 305092 16587 143093 389084 284437 -22544
30388b2544j07061J06860J23556R2959j6241k93532l77293O7043N47420L40720
$$ -22544 -129605 -22745 100811 193770 177529 -116003 -493296 -426253 121167 461887
30378D61887k87675m31179K4034L33960K02121Q8687J73673P4020k43653k74780
$$ 461887 174212 -256967 -232933 101027 303148 391835 565508 639528 395875 121095
30368A21095N7813J82524r8555k48508K3196K53872P1514k20958l02639l70154
$$ 121095 178908 361432 262877 14369 37565 291437 362951 141993 -160646 -530800
30358e30800n86762o27676k38724K60840M56020L91260L01324J94931L0046n8880
$$ -530800 -1117562 -1745238 -1983962 -1723122 -1267102 -875842 -574518 -379587 -349541 -408421
30348d08421L884P6343O6464N0880K1726j18022k36463p7704K48902L61117K52139
$$ -408421 -404537 -328194 -261730 -210850 -189124 -307146 -543609 -621313 -372411 -11294 240845
30337B40845K96924M95145L31029l53497r19661p32518K0190O32276O56002J38329
$$ 240845 537769 1032914 1363943 1010446 90785 -641733 -621543 10733 666735 805064
30327H05064n48041q82095n68516N7342L49331K02308J28235L46349M06263L5455
$$ 805064 257023 -625072 -1193588 -1136246 -786915 -584607 -456372 -110023 296240 331695
30317C31695k62070J1639M50174K93418l87985p41732l28734L17522M55160L5977
$$ 331695 69625 81264 531438 824856 436871 -304861 -633595 -316073 139087 175064
30307A75064l70099l19091N3704K77417J25588j21252m7013L26166N26788K53239
$$ 175064 -195035 -514126 -460422 -183005 -57417 -178669 -225682 100484 627272 880511
30297H80511k13007l90684k31159r3990j38446p8080K97122O25189L63016l80157
$$ 880511 667504 276820 45661 -48329 -186775 -264855 32267 657456 1020472 640315
30287F40315q23684n00754J12040K77087n956j61396J2260J59880R9228Q8584
$$ 640315 -183369 -684123 -572083 -294996 -300952 -462348 -450088 -290208 -190980 -102396
30277a02396K37276K45210l9931l15615l10616j18737J28648M15075N17390J43504
$$ -102396 134880 380090 340159 24544 -286072 -404809 -276161 138914 656304 799808
30267G99808m22015n06036j13688j0250m30005o28299j80350K83480K73971L03060
$$ 799808 377793 -128243 -241931 -252181 -682186 -1310485 -1490835 -1207355 -933384 -630324
30257f30324P07546P24560j38829q61768m21800L64050J33240o33925m09470O43127
$$ -630324 77222 801782 662953 -198815 -620615 -256565 -123325 -757250 -1166720 -523593
30247e23593Q06981l21297j161217p08593J36127M01254M40676O83703O00078
$$ -523593 283388 -37909 -1199126 -1907719 -1771592 -1370338 -929662 -245959 354119
30238C54119o1547l84814K16549P70453K39022p05737o93286K33701Q03966M27020
$$ 354119 292572 -92242 124307 894760 1133782 428045 -265241 -31540 772426 1199446
30228A199446k43564n03351l90710k70360l03504l88233k61495K26972P33021
$$ 1199446 955882 452531 61821 -208539 -512043 -900276 -1161771 -934799 -201778
30219b01778O52487k3338n45364l92039R2816L58869L62378K52585j6780l08113
$$ -201778 450709 427371 -117993 -510032 -417216 -58347 304031 556616 539836 231723
30209B31723j76992L52410N40296M3739l99413j04928L96725K10903m33827n58609
$$ 231723 54731 407141 947437 991176 591763 486835 883560 1094463 660636 102027
30199A02027j1013L40958l5987o47403p62127k69052L94261P27615N14576M916
$$ 102027 91014 431972 395985 -251418 -1013545 -1282597 -888336 -160721 353855 358771
30189C58771k72984j18129Q5822m5972l42839m14830k18860P6559M34108P27500
$$ 358771 85787 -32342 53480 7508 -335331 -750161 -969021 -892462 -458354 269146
30179B69146N66729j16513o45766l83236L05593N14800O4327l60499k81635J7740
$$ 269146 835875 719362 73596 -309640 -4047 510753 575080 214581 -67054 -49314
30169d9314J09178K7328L4584J43360J32799q9409l00072j87805J91770L24522
$$ -49314 59864 87192 121776 265136 397935 308526 8454 -179351 12419 336941
30159C36941j20740o69058n56000J20876M31956m940m33297j72182L34246L33143
$$ 336941 216201 -452857 -1008857 -887981 -456025 -460965 -894262 -1066444 -732198 -399055
30149c99055k7680j25169J1238q3650l06724j60243K41730K78062j08540l24065
$$ -399055 -426735 -551904 -540666 -624316 -931040 -1091283 -849553 -571491 -680031 -1004096
30139a004096j38654N2702P0244K08307M80525M32259r223k65528n1300J33146
$$ -1004096 -1142750 -1090048 -1019804 -811497 -330972 101287 92064 -173464 -224764 -91618
30129i1618r3663k76989Q3300N76591M56938j56445m37203j12019J94594R931
$$ -91618 -185281 -462270 -378970 197621 654559 498114 60911 -51108 143486 153417
30119A53417k62299m4720M51291N13366N690m14456k58770J11027Q7124k56266
$$ 153417 -108882 -153602 297689 811055 816745 402289 143519 254546 341670 85404
30109H5404l30807J8956K98804J69210n9497Q161K09446J18002k71410n41941
$$ 85404 -245403 -226447 72357 241567 182070 190231 399677 517679 246269 -295672
30099b95672m38690j40279L9060R545n0354P6205L59663N03194L19219J9934j15615
$$ -295672 -734362 -874641 -835581 -826036 -876390 -800185 -440522 62672 381891 401825 286210
30088B86210k17857n28585p24481k09319P94961J219209O01683j56465r8221L75055
$$ 286210 68353 -460232 -1184713 -1394032 -599071 620138 1221821 1065356 967135 1342190
30078A342190K35281m89470p94700l19121J69388Q1561j46663M0989L10357r826
$$ 1342190 1577471 1088001 293301 -25820 143568 225129 78466 119455 429812 419986
30068D19986p60306j025550l42304O59024R79046L72737m31978n75189K5012O73621
$$ 419986 -340320 -1365870 -1708174 -1049150 -70104 302633 -129345 -704534 -679522 -5901
30058e901P22750K19097k94090m08051j40629K27813L92644J88263k62131n69276
$$ -5901 716849 935946 641856 233805 93176 320989 713633 901896 639765 70489
30048G0489m25414M2233L75220K68861j03182k66460N3796O02902Q25192M78260
$$ 70489 -354925 -312692 62528 331389 228207 -38253 15543 618445 1443637 1921897
30038A921897q8961l91043l76765l14429k82762j56946j2055p3691k48716j99533
$$ 1921897 1832936 1441893 1065128 750699 467937 310991 298936 225245 -23471 -223004
30028b23004J6815q3993n93175q81601m48896L20219O69887M50610J64783K09373
$$ -223004 -206189 -290182 -883357 -1764958 -2213854 -1893635 -1223748 -773138 -608355 -398982
30018c98982M37655M25512k2106n87961o69586q5253N41173M93036k9206k01778
$$ -398982 38673 464185 442079 -145882 -815468 -900721 -359548 133488 104282 -97496
30008i7496J16388J58531m42106r76059p71328j97461R4557K35256O35220R93512
$$ -97496 18892 177423 -264683 -1240742 -2012070 -2209531 -2114974 -1879718 -1244498 -250986
29998b50986P44845J34567j03017N6072k9837m85893o77053k61196K73550L52706
$$ -250986 493859 628426 525409 581481 551644 65751 -611302 -872498 -598948 -246242
29988b46242M3077j79546k2890L65825N00974K2571p01259p71987L1450P09024
$$ -246242 -203165 -382711 -405601 -39776 461198 483769 -217490 -989477 -958027 -249003
29978b49003L67714l72317k51563O51509R99571K59835n58071n59642j88923j83949
$$ -249003 118711 -253606 -505169 146340 1145911 1405746 847675 288033 99110 -84839
29968h4839l20154m5881L66737K66671k16273l73949o1411J89598J07122l0451
$$ -84839 -404993 -450874 -84137 182534 -33739 -407688 -469099 -279501 -172379 -202830
29958b02830n7149j64470l45857k32010K57934O16132M29217k6491k20292r1131
$$ -202830 -259979 -424449 -770306 -1002316 -744382 -128250 300967 274476 54184 -36947
29948c6947K9208k3472j51906k90430l95196k85461P3449K63860p3747n08070
$$ -36947 -7739 -31211 -183117 -473547 -868743 -1154204 -1080755 -816895 -890642 -1398712
29938a398712k72850M96214P95567K84898j30862J94915N00851r3710r21210o59375
$$ -1398712 -1671562 -1175348 -379781 -94883 -225745 -30830 470021 376311 -544899 -1204274
29928a204274N28304J144172N61962k97984o23909o58218o51146k52537M59844
$$ -1204274 -675970 468202 1030164 732180 108271 -549947 -1201093 -1453630 -993786
29919i93786O23605K5882k78921L32928Q64331K73858p69229r58951l62797j09
$$ -993786 -370181 -344299 -623220 -290292 574039 847897 78668 -880283 -1243080 -1243189
29909a243189m1003J33803M80890L56686j44378k69319L6540J19096p3600M2599
$$ -1243189 -1284192 -1150389 -669499 -312813 -457191 -726510 -689970 -570874 -644474 -601875
29899f01875L72583J40818n90521p53106k3443N39042J86997l49543j45141M65348
$$ -601875 -229292 -88474 -678995 -1432101 -1455544 -916502 -729505 -1079048 -1224189 -758841
29889g58841N91759J93848j21112j67228j90509j86608K541J58303l5123l34057
$$ -758841 -167082 26766 -94346 -261574 -452083 -638691 -636150 -477847 -512970 -847027
29879h47027k05925L07892N83756K99616j76228l93009l87963m24016m56944k12694
$$ -847027 -1052952 -745060 -161304 138312 -37916 -430925 -818888 -1242904 -1699848 -1912542
29869a912542K66961N14783K57185j12544l6577L63269M45518P4596j44448J09730
$$ -1912542 -1645581 -1130798 -873613 -986157 -1022734 -659465 -213947 -139351 -283799 -174069
29859a74069L15710N9226j47375K50318P16722L69046m96537p42754j58100K74082
$$ -174069 141641 200867 53492 303810 1020532 1389578 893041 150287 -7813 266269
29849B66269J6443k56880O3707N04024L76657j22423l68440k70934j30487m02
$$ 266269 282712 25832 89539 593563 970220 847797 479357 208423 77936 77534
29839G7534J79249J83280j50678m53426k74141K07844M42963L11299J58679J64392
$$ 77534 256783 440063 289385 -164041 -438182 -230338 212625 523924 682603 846995
29829H46995J75299J05929K3042j53417n53045r10438p22817l1234M41066K65832
$$ 846995 1022294 1128223 1151265 997848 444803 -465635 -1188452 -1219686 -778620 -512788
$$ [...]
##END NTUPLES=NMR SPECTRUM
##END=
