##TITLE=31Pdec_LY-12Dix.5.B
 CD3CN, 24 sc
 4.06.2021
##JCAMPDX= 6.0         $$ Bruker NMR JCAMP-DX V2.0
##DATA TYPE= NMR SPECTRUM
##DATA CLASS= NTUPLES
##ORIGIN= UXNMR, Bruker Analytische Messtechnik GmbH
##OWNER= root
$$ XWIN-NMR		Version 3.5
$$ Fri Jun  4 12:20:01 2021 Russian Standard Time (UT+4h)  she@DPX200
##.OBSERVE FREQUENCY= 81.013821
##.OBSERVE NUCLEUS= ^31P
##.ACQUISITION MODE= SIMULTANEOUS
##.ACQUISITION SCHEME= undefined
##.AVERAGES= 24
##.DIGITISER RES= 16
##SPECTROMETER/DATA SYSTEM= spect
##.PULSE SEQUENCE= zgpg30
##.SOLVENT NAME= CD3CN
##.SHIFT REFERENCE= (INTERNAL, CD3CN, 0, 248.564)
##AUDIT TRAIL= $$ (NUMBER, WHEN, WHO, WHERE, WHAT)
$$ ##TITLE= Audit trail, XWIN-NMR		Version 3.5
$$ ##JCAMPDX= 5.01
$$ ##ORIGIN= Bruker BioSpin GmbH
$$ ##OWNER= she
$$ F:/spectra/data/she/nmr/P31/1/pdata/1/auditp.txt
$$ ##AUDIT TRAIL=  $$ (NUMBER, WHEN, WHO, WHERE, WHAT)
(   1,<2021-06-04 12:15:32.78 +0400>,<she>,<DPX200>,
      <created by zg, POWCHK disabled, PULCHK disabled
       configuration hash MD5:
       00 E9 B6 7A A2 85 ED C7 34 08 36 98 17 FE 4E 26
       data hash MD5: 32K
       44 A6 A0 14 F3 DD 2C D3 C1 FB 86 49 3A 31 91 D6>)
(   2,<2021-06-04 12:18:06.68 +0400>,<she>,<DPX200>,
      <Start of raw data processing
       efp BC_mod = 2 LB = 1 FT_mod = 6 PKNL = 1 PHC0 = -6071.105 PHC1 = 434.4749 SI = 64K 
       data hash MD5: 64K
       8D 6B BA CC 69 04 9C D9 75 BD BB BA 07 6F E1 D8>)
(   3,<2021-06-04 12:18:31.18 +0400>,<she>,<DPX200>,
      <pk PHC0 = 28.44886 PHC1 = 0 
       data hash MD5: 64K
       2A C1 1E AB CC 89 4A 6F 4C 43 12 97 7A 14 C0 6D>)
(   4,<2021-06-04 12:18:35.07 +0400>,<she>,<DPX200>,
      <abs ABSG = 5 
       data hash MD5: 64K
       4A 00 1A 9B 89 54 A0 C5 F1 A1 28 D0 6C 40 92 9F>)
$$ ##END=
$$ 
$$ hash MD5
$$ 05 46 73 FB 0F C5 07 52 E3 31 6A 58 AE 80 42 27
##$RELAX= 
##$RELAX= 
##$RELAX= 
##$RELAX= 
##$RELAX= 
##$RELAX= 
##$RELAX= 
##$RELAX= 
$$ Bruker specific parameters
$$ --------------------------
##$DU= <F:/spectra>
##$EXPNO= 1
##$NAME= <P31>
##$PROCNO= 1
##$TYPE= <nmr>
##$USER= <she>
##$AMP= (0..31)
100 100 100 100 100 100 100 100 100 100 100 100 100 100 100 100 100 100 
100 100 100 100 100 100 100 100 100 100 100 100 100 100 
##$AQSEQ= 0
##$AQ_mod= 1
##$AUNM= <au_zg>
##$AUTOPOS= <>
##$BF1= 81.014009
##$BF2= 200.13
##$BF3= 200.13
##$BF4= 200.13
##$BF5= 200.13
##$BF6= 200.13
##$BF7= 200.13
##$BF8= 200.13
##$BYTORDA= 1
##$CFDGTYP= 0
##$CFRGTYP= 5
##$CHEMSTR= <none>
##$CNST= (0..31)
1 1 145 1 1 1 1 1 1 1 1 1 1 1 1 1 1 1 1 1 1 1 1 1 1 1 1 1 1 1 1 1 
##$CPDPRG= <waltz16>
##$CPDPRG1= <>
##$CPDPRG2= <waltz16>
##$CPDPRG3= <>
##$CPDPRG4= <mlev>
##$CPDPRG5= <mlev>
##$CPDPRG6= <mlev>
##$CPDPRG7= <mlev>
##$CPDPRG8= <mlev>
##$CPDPRGB= <>
##$CPDPRGT= <>
##$D= (0..31)
0 1 0 0 0 0 0 0 0 0 0 0.03 2e-05 3e-06 0 0 0 0 0 0 0 0 0 0 0 0 0 0 0 0 
0 0 
##$DATE= 1622794532
##$DBL= (0..7)
120 120 120 11 120 120 24 19 
##$DBP= (0..7)
150 150 150 150 150 150 150 150 
##$DBP07= 0
##$DBPNAM0= <>
##$DBPNAM1= <>
##$DBPNAM2= <>
$$ [...]
##$SUBNAM3= <"">
##$SUBNAM4= <"">
##$SUBNAM5= <"">
##$SUBNAM6= <"">
##$SUBNAM7= <"">
##$SUBNAM8= <"">
##$SUBNAM9= <"">
##$SW= 501.771253377433
##$SWIBOX= (0..15)
0 1 3 0 0 0 0 0 0 0 0 0 0 0 0 0 
##$SW_h= 40650.406504065
##$TD= 32768
##$TD0= 1
##$TE= 0
##$TE2= 300
##$TE3= 300
##$TEG= 300
##$TL= (0..7)
0 120 53 12 22 120 120 120 
##$TP= (0..7)
150 150 150 150 150 150 150 150 
##$TP07= 0
##$TPNAME0= <>
##$TPNAME1= <>
##$TPNAME2= <>
##$TPNAME3= <>
##$TPNAME4= <>
##$TPNAME5= <>
##$TPNAME6= <>
##$TPNAME7= <>
##$TPOAL= (0..7)
0.5 0.5 0.5 0.5 0.5 0.5 0.5 0.5 
##$TPOFFS= (0..7)
0 0 0 0 0 0 0 0 
##$TUNHIN= 0
##$TUNHOUT= 0
##$TUNXOUT= 0
##$USERA1= <user>
##$USERA2= <user>
##$USERA3= <user>
##$USERA4= <user>
##$USERA5= <user>
##$V9= 5
##$VALIST= <valist>
##$VCLIST= <CCCCCCCCCCCCCCC>
##$VD= 0
##$VDLIST= <DDDDDDDDDDDDDDD>
##$VPLIST= <PPPPPPPPPPPPPPP>
##$VTLIST= <TTTTTTTTTTTTTTT>
##$WBST= 1024
##$WBSW= 4
##$XGAIN= (0..3)
0 0 0 0 
##$XL= 0
##$YL= 0
##$YMAX_a= 1607
##$YMIN_a= -2439
##$ZGOPTNS= <>
##$ZL1= 120
##$ZL2= 120
##$ZL3= 120
##$ZL4= 120
##$ABSF1= 248.5645
##$ABSF2= -253.2056
##$ABSG= 5
##$ABSL= 3
##$ALPHA= 0
##$AQORDER= 0
##$ASSFAC= 0
##$ASSFACI= 0
##$ASSFACX= 0
##$ASSWID= 0
##$AUNMP= <proc_1d>
##$AZFE= 0.1
##$AZFW= 0.5
##$BCFW= 0
##$BC_mod= 2
##$BYTORDP= 0
##$COROFFS= 0
##$CY= -3
##$DATMOD= 1
##$DC= 0
##$DFILT= <>
##$DTYPP= 0
##$F1P= 0
##$F2P= 0
##$FCOR= 1
##$FTSIZE= 65536
##$FT_mod= 6
##$GAMMA= 0
##$GB= 0
##$INTBC= 1
##$INTSCL= 5.30512e-09
##$ISEN= 30
##$LB= 1
##$LEV0= 0
##$LPBIN= 0
##$MAXI= 10000
##$MC2= 0
##$MEAN= 0
##$ME_mod= 0
##$MI= 50
##$NCOEF= 0
##$NC_proc= -5
##$NLEV= 6
##$NOISF1= 182.463
##$NOISF2= 159.3651
##$NSP= 0
##$NTH_PI= 0
##$NZP= 0
##$OFFSET= 248.5645
##$PC= 4
##$PHC0= -6042.656
##$PHC1= 434.4749
##$PH_mod= 1
##$PKNL= yes
##$PPARMOD= 0
##$PSCAL= 0
##$PSIGN= 0
##$REVERSE= no
##$SF= 81.014009
##$SI= 65536
##$SIGF1= 159.3651
##$SIGF2= -187.1042
##$SINO= 113.3802
##$SIOLD= 16384
##$SREGLST= <1H.CDCl3>
##$SSB= 0
##$STSI= 65536
##$STSR= 0
##$SW_p= 40650.406504065
##$SYMM= 0
##$S_DEV= 0
##$TDeff= 32768
##$TDoff= 0
##$TI= <>
##$TILT= no
##$TM1= 0
##$TM2= 0
##$TOPLEV= 0
##$USERP1= <user>
##$USERP2= <user>
##$USERP3= <user>
##$USERP4= <user>
##$USERP5= <user>
##$WDW= 1
##$XDIM= 65536
##$YMAX_p= 298115327
##$YMIN_p= -16040142
$$ End of Bruker specific parameters
$$ ---------------------------------
##NTUPLES= NMR SPECTRUM
##VAR_NAME=  FREQUENCY,     SPECTRUM/REAL,   SPECTRUM/IMAG
##SYMBOL=    X,             R,               I
##VAR_TYPE=  INDEPENDENT,   DEPENDENT,       DEPENDENT
##VAR_FORM=  AFFN,          ASDF,            ASDF
##VAR_DIM=   65536,         65536,           65536
##UNITS=     HZ,            ARBITRARY UNITS, ARBITRARY UNITS
##FACTOR=    0.620285442955139, 1,           1
##FIRST=     20137.2065510759, 0,            0
##LAST=      -20513.1999529892, 0,           0
##MIN=       -20513.1999529892, -16040142,   0
##MAX=       20137.2065510759, 298115327,    0
$$ Real data points
##PAGE= N=1
##DATA TABLE= (X++(R..R)), XYDATA
$$ [...]
$$ plain form
35746 -524091 -557036 -610582 -493395 -151071 45045 -136959 -411111 -465777 -389413 -317559
35736 -317559 -132365 145870 155619 -198438 -401369 -85542 300987 160571 -296881 -419907
35726 -419907 -145637 47013 3830 -44037 -156089 -587544 -1010591 -699463 315503 1087463
35716 1087463 1052016 734585 766969 939357 802521 584355 775110 1201409 1257634 847974
35706 847974 427445 229068 86918 -16567 148550 534515 730823 556185 308274 276242
35696 276242 380323 435662 407265 239455 -198897 -766278 -976270 -583552 -6260 172008
35686 172008 -37996 -134824 77842 202079 -146558 -775122 -1183360 -1186446 -989923 -763659
35676 -763659 -488121 -244407 -288140 -651863 -980414 -1036341 -1095566 -1456776 -1798235 -1583385
$$ packed form
35746e24091l2945n3546J17187L42324J96116j82004k74152n4666P6364P1854
35736c17559J85194K78235R749l54057k02931L15827L86529j40416m57452j23026
35726d19907K74270J92650m3183m7867j12052m31455m23047L11128J014966P71960
35716A087463l5447l17431L2384J72388j36836k18166J90755M26299N6225m09660
35706H47974m20529j98377j42150j03485J65117L85965J96308j74638k47911l2032
35696B76242J04081N5339k8397j67810m38352n67381k09992L92718N77292J78268
35686A72008k10004r6828K12666J24237l48637o28564m08238l086J96523K26264
35676g63659K75538K43714m3733l63723l28551n5927n9225l61210l41459K14850
$$ plain form
35666 -1583385 -1012816 -876684 -1317259 -1466614 -724049 239839 373822 -312456 -920184
35657 -920184 -987395 -845876 -759746 -556191 -252893 -279158 -735731 -1039911 -721587 -121304
35647 -121304 115240 -123363 -478410 -704236 -757976 -555744 -97122 301684 309527 44009
35637 44009 -110781 -75285 -117186 -359752 -579959 -518638 -135984 432928 932245 1031454
35627 1031454 606692 -8060 -313563 -211220 -23018 59620 223362 617850 982326 899375
35617 899375 281009 -549996 -1166682 -1330771 -1096428 -743551 -559843 -621197 -794110 -906168
35607 -906168 -831830 -499520 5643 389988 403408 119860 -224044 -577319 -957950 -1076791
35597 -1076791 -558811 361288 861837 516484 -161911 -475145 -423949 -414209 -469413 -339982
$$ packed form
35666a583385N70569J36132m40575j49355P42565R63888J33983o86278o07728
35657i20184o7211J41519Q6130K03555L03298k6265m56573l04180L18324O00283
35647a21304K36544k38603l55047k25826n3740K02232M58622L98806P843k65518
35637D4009j54790L5496m1901k42566k20207O1321L82654N68912M99317R9209
35627A031454m24762o14752l05503J02343J88202Q2638J63742L94488L64476q2951
35617H99375o18366q31005o16686j64089K34343L52877J83708o1354j72913j12058
35607i06168P4338L32310N05163L84345J3420k83548l43904l53275l80631j18841
35597a076791N17980R20099N00549l45353o78395l13234N1196R740n5204J29431
$$ plain form
35587 -339982 -176563 -404909 -928879 -1098604 -638278 -83148 -49265 -469854 -812370 -741365
35577 -741365 -327441 151056 403531 319053 100813 28007 61200 -27667 -152418 2427
35567 2427 329648 317885 -52411 -78698 565304 1117902 756262 -155286 -622721 -484937
35557 -484937 -428377 -700037 -781299 -446897 -214726 -409095 -581359 -346213 -126819 -454142
35547 -454142 -1009559 -1058580 -578156 -270236 -502349 -835905 -741001 -321041 -55598 -83000
35537 -83000 -84666 123043 196280 -266146 -971206 -1087273 -335945 495245 550885 73322
35527 73322 -51087 306134 396159 -76355 -409967 -63191 446990 402380 27090 50560
35517 50560 521943 805044 564597 94355 -261372 -455601 -548200 -634174 -902054 -1347663
$$ packed form
35587c39982J63419k28346n23970j69725M60326N55130L3883m20589l42516P1005
35577g41365M13924M78497K52475q4478k18240p2806L3193q8867j24751J54845
35567B427L27221j1763l70296k6287O44002N52598l61640r11548m67435J37784
35557d84937N6560k71660q1262L34402K32171j94369j72264K35146K19394l27323
35547d54142n55417m9021M80424L07920k32113l33556R4904M19960K65443k7402
35537h3000j666K07709P3237m62426p05060j16067P51328Q31190N5640m77563
35527G3322j24409L57221R0025m72514l33612L46776N10181m4610l75290K3470
35517E0560M71383K83101k40447m70242l55727j94229r2599q5974k67880m45609
$$ plain form
35507 -1347663 -1550476 -1186106 -621955 -480660 -704827 -633868 -16048 626876 747299 387894
35497 387894 -81849 -410634 -506095 -407395 -342395 -493633 -659275 -491540 -68159 199326
35487 199326 236052 376974 694327 813997 599749 475590 756326 1120245 1110094 778571
35477 778571 466693 274772 140886 151334 346051 429050 106678 -411681 -646104 -496686
35467 -496686 -289467 -225928 -179100 -71800 -69679 -226772 -233750 196644 815733 1018323 597899
35456 597899 80982 116342 684115 1199127 1328395 1295553 1288186 1065137 495514 53071
35446 53071 219020 645806 550833 -139231 -676352 -568697 -159030 19687 -100206 -327508
35436 -327508 -558913 -654328 -426851 -38292 30462 -303547 -488618 -177694 141683 -153152
$$ packed form
35507a347663k02813L64370N64151J41295k24167P0959O17820O42924J20423l59405
35497C87894m69743l28785r5461R8700O5000j51238j65642J67735M23381K67485
35487A99326L6726J40922L17353J19670k14248j24159K80736L63919j0151l31523
35477G78571l11878j91921j33886J0448J94717Q2999l22372n18359k34423J49418
35467d96686K07219O3539M6828J07300K121j57093o978M30394O19089K02590m20424
35456E97899n16917L5360N67773N15012J29268l2842p367k23049n69623m42443
35446E3071J65949M26786r4973o90064n37121J07655M09667J78717j19893k27302
35436c27508k31405r5415K27477L88559O8754l34009j85071L10924L19377k94835
$$ plain form
35426 -153152 -815421 -988117 -345379 516300 843418 525984 57217 -88421 75974 186094
35416 186094 94793 114990 480031 782995 445206 -320229 -642873 -225276 213751 20286
35406 20286 -495210 -663992 -396532 11883 511398 1102297 1384223 977418 186594 -333003
35396 -333003 -385524 -204169 106321 476681 478130 -209219 -994415 -819551 439444 1638040
35386 1638040 1665926 631273 -464694 -860112 -616662 -322358 -407480 -698030 -677121 -238331
35376 -238331 87744 -104485 -432673 -257698 361570 762340 588562 86848 -412834 -766931
35366 -766931 -799605 -364857 301894 733356 775984 634489 476861 442689 874424 1905637
35356 1905637 2872639 2844313 1835804 838557 511685 526177 418044 359832 660396 1073787
$$ packed form
35426a53152o62269j72696O42738Q61679L27118l17434m68767j45638J64395J10120
35416A86094r1301K0197L65041L02964l37789p65435l22644M17597M39027j93465
35406B0286n15496j68782K67460M08415M99515N90899K81926m06805p90824n19597
35396c33003n2521J81355L10490L70360J449o87349p85196J74864J258995J198596
35386A638040K7886j034653j095967l95418K43450K94304q5122k90550K0909M38790
35376b38331L26075j92229l28188J74975O19268M00770j73778n01714m99682l54097
35366g66931l2674M34748O66751M31462M2628j41495j57628l4172M31735J031213
35356A905637R67002k8326j008509r97247l26872J4492j08133n8212L00564M13391
$$ plain form
35346 1073787 1121189 751048 267153 -130050 -407275 -542095 -548980 -457705 -176048 303306
35336 303306 539160 19901 -941432 -1308907 -647495 240470 438393 114067 16507 254652
35326 254652 333165 166552 261803 832447 1356316 1237530 533767 -176407 -432391 -254997
35316 -254997 9532 108783 128919 273244 466632 424954 152828 38254 280403 549770
35306 549770 489571 271054 294393 533801 582062 281962 -45773 -48161 224318 388934
35296 388934 119251 -541024 -1190112 -1443812 -1318473 -1123042 -987004 -734020 -269946 205906
35286 205906 510781 701103 804399 639807 172145 -217350 -139481 282036 582666 532984
35276 532984 306220 184924 308950 605657 803085 646242 239244 -2990 128128 391964
$$ packed form
35346A073787M7402l70141m83895l97203k77225j34820o885R1275K81657M79354
35336C03306K35854n19259r61333l67475O61412Q87965J97923l24326r7560K38145
35326B54652P8513j66613R5251N70644N23869j18786p03763p10174k55984J77394
35316b54997K64529R9251K0136J44325J93388m1678k72126j14574K42149K69367
35306E49770o0199k18517K3339K39408M8261l00100l27735k388K72479J64616
35296C88934k69683o60275o49088k53700J25339J95431J36038K52984M64074M75852
35286B05906L04875J90322J03296j64592m67662l89495P7869M21517L00630m9682
35276E32984k26764j21296J24026K96707J97428j56843m06998k42234J31118K63836
$$ plain form
35266 391964 505662 500736 489097 413915 303391 430157 862532 1160983 936901 461862
35256 461862 266900 340847 235883 -140806 -367410 -158704 262752 522778 487610 242997
35246 242997 -35209 -143385 -4347 236657 428701 610830 787969 727208 327982 10621
35236 10621 262560 854190 1003193 395685 -393152 -655191 -376915 -107448 -235962 -611353
35226 -611353 -794992 -578848 -240728 -224147 -559049 -816273 -737882 -585308 -609910 -557137
35216 -557137 -150500 243877 48408 -591997 -966939 -844311 -668411 -666692 -508368 -76919
35206 -76919 151277 -90221 -303378 -12454 385251 192649 -472045 -807479 -477946 -16860
35196 -16860 -5947 -336813 -485238 -214348 216408 417849 301679 156537 309372 715501
$$ packed form
35266C91964J13698m926j1639p5182j10524J26766M32375K98451k24082m75039
35256D61862j94962P3947j04964l76689k26604K08706M21456K60026l5168k44613
35246B42997k78206j08176J39038K41004J92044J82129J77139o0761l99226l17361
35236A0621K51939N91630J49003o07508p88837k62039K78276K69467j28514l75391
35226f11353j83639K16144L38120J6581l34902k57224P8391J52574k4602N2773
35216e57137M06637L94377j95469o40405l74942J22628J75900J719J58324M31449
35206g6919K28196k41498k13157K90924L97705j92602o64694l35434L29533M61086
35196a6860J0913l30866j48425K70890M30756K01441j16170j45142J52835M06129
$$ plain form
35186 715501 979864 834891 455811 187354 101105 1318 -223731 -448939 -477235 -219322
35176 -219322 242288 652260 739323 529199 398611 616084 927375 874348 479214 253119
35166 253119 443914 656719 464197 65642 -61111 38015 -130273 -614447 -764284 -135645
35156 -135645 793445 1222936 1041654 750089 575750 266110 -240728 -551859 -429674 -178970
35146 -178970 -153289 -274981 -336200 -401568 -564997 -632789 -438519 -208736 -218128 -314319 -198504
35135 -198504 33670 73175 -61971 -125363 -118237 -186690 -207885 -20833 78831 -286166 -788323
35124 -788323 -719576 -135268 136109 -184697 -356262 130008 663612 533156 130750 283060
35114 283060 852280 980396 525423 254456 534670 757073 371191 -270646 -546746 -443621
$$ packed form
35186G15501K64363j44973l79080k68457q6249r9787k25049k25208k8296K57913
35176b19322M61610M09972Q7063k10124j30588K17473L11291n3027l95134k26095
35166B53119J90795K12805j92522l98555j26753R9126j68288m84174j49837O28639
35156a35645R29090M29491j81282k91565j74339l09640n06838l11131J22185K50704
35146a78970K5681j21692o1219o5368j63429o7792J94270K29783r392r6191J15815
35135a98504K32174L9505j35146o3392P126o8453k1195J87052R9664l64997n02157
35124g88323O8747N84308K71377l20806j71565M86270N33604j30456m02406J52310
35114B83060N69220J28116m54973k70967K80214K22403l85882o41837k76100J03125
$$ plain form
35104 -443621 -288865 -89922 259240 442428 58376 -643068 -993881 -860086 -749357 -886540
35094 -886540 -818339 -201769 575120 954003 938952 825166 601955 172577 -159285 -72450
35084 -72450 115440 -117288 -531462 -403208 228689 505278 161074 33672 653244 1215332
35074 1215332 760276 -290456 -743793 -382658 -85815 -340719 -633340 -443612 6697
35065 6697 299085 463450 721684 1023470 1138231 922034 339484 -482113 -1128741 -1164188
35055 -1164188 -631943 -20384 307194 362089 261695 106448 111589 431576 828569 929163
35045 929163 792256 745979 703736 264195 -438974 -682033 -187581 415215 491262 187249
35035 187249 -50699 -188417 -354301 -343361 67429 593584 740252 453769 86508 -115717
$$ packed form
35104d43621J54756J98943L49162J83188l84052p01444l50813J33795J10729j37183
35094h86540O8201O16570P76889L78883j5051j13786k23211m29378l31862Q6835
35084g2450J87890k32728m14174J28254O31897K76589l44204j27402O19572N62088
35074A215332m55056j050732m53337L61135K96843k54904k92621J89728M50309
35065F697K92388J64365K58234L01786J14761k16197n82550q21597o46628l5447
35055a164188N32245O11559L27578N4895j00394j55247N141L19987L96993J00594
35045I29163j36907m6277m2243m39541p03169k43059M94452O02796P6047l04013
35035A87249k37948j37718j65884J0940M10790N26155J46668k86483l67261k02225
$$ plain form
35025 -115717 -148217 -44608 132702 232456 200695 187810 288990 380686 382025 431206 634253
35014 634253 906421 1192948 1500045 1579742 1059398 128597 -410740 -143027 377000 452980
35004 452980 199802 157498 354037 368085 100109 -88567 84136 540027 974574 996922
34994 996922 395757 -458907 -842527 -612836 -452051 -794209 -1105262 -798743 -252162 -147873
34984 -147873 -353347 -365561 -377080 -808976 -1146157 -523052 622827 818836 -331465 -1544428
34974 -1544428 -1714674 -1214321 -856421 -682717 -449344 -324554 -306411 198079 1322787
34965 1322787 2000828 1275009 -176046 -847008 -390006 219963 274884 37527 -121881
34956 -121881 -270003 -376364 -101688 516915 834525 449082 -224139 -592280 -642405 -656865
$$ packed form
35025a15717l2500J03609J77310R9754l1761j2885J01180R1696J339M9181K03047
35014F34253K72168K86527L07097P9697n20344r30801n39337K67713N20027P5980
35004D52980k53178m2304J96539J4048k67976j88676J72703M55891M34547K2348
34994I96922o01165q54664l83620K29691J60785l42158l11053L06519N46581J04289
34984a47873k05474j2214j1519m31896l37181O23105J145879J96009j150301j212963
34974a544428j70246N00353L57900J73704K33373J24790J8143N04490J124708
34965A322787O78041p25819j451055o70962M57002O09969N4921k37357j59408
34956a21881j48122j06361K74676O18603L17610l85443o73221l68141n0125j4460
$$ plain form
34946 -656865 -567631 -105311 602878 1069390 1063837 840176 711759 678186 560575 308987
34936 308987 55577 -41342 74811 319241 484239 349775 -131462 -748185 -1189258 -1322529
34926 -1322529 -1285537 -1273633 -1293490 -1211113 -1016609 -888800 -912752 -866328 -489549 49126
34916 49126 197877 -325386 -1094901 -1426516 -1191249 -893429 -918483 -1055885 -964952 -787709
34906 -787709 -909375 -1265706 -1339422 -871265 -192536 239816 302658 92658 -301872 -732945
34896 -732945 -981201 -1000570 -936940 -782253 -334974 327622 725210 598615 297197 211870
34886 211870 184385 -93807 -418190 -336424 117436 476867 522926 437596 369656 304416 290080
34875 290080 362794 343878 135383 47118 317154 506981 49220 -704129 -768709 63035
$$ packed form
34946f56865Q9234M62320P08189M66512n553k23661j28417l3573j17611k51588
34936C08987k53410r6919J16153K44430J64998j34464m81237o16723m41073j33271
34926a322529L6992J1904j9857Q2377J94504J27809k3952M6424L76779N38675
34916D9126J48751n23263p69515l31615K35267K97820k5054j37402R0933J77243
34906g87709j21666l56331p3716M68157O78729M32352O2842k10000l94530m31073
34896g32945k48256j9369O3630J54687M47279O62596L97588j26595l01418q5327
34886B11870k7485k78192l24383Q1766M53860L59431M6059q5330o7940o5240j4336
34875B90080P2714j8916k08495q8265K70036J89827m57761p53349o4580Q31744
$$ plain form
34865 63035 885768 965658 604862 392314 316634 127941 3918 245428 654339 759978
34855 759978 473469 117701 -23222 109201 398026 535310 213855 -406891 -693562 -262194
34845 -262194 541709 1111320 1233998 1051802 714144 375647 245358 330568 372424 256030
34835 256030 175316 195226 72091 -220419 -271446 76268 295610 -74012 -671916 -871070
34825 -871070 -713953 -667193 -737074 -523553 -18250 293150 105172 -410122 -902685 -1043325
34815 -1043325 -637032 1798 82898 -660846 -1313344 -867893 242646 614409 -161914
34806 -161914 -971309 -809766 -31698 456167 482955 514918 776146 1056313 1142104 1005632
34796 1005632 705318 358219 70257 -217937 -592374 -840636 -620643 -28044 415935
$$ packed form
34865F3035Q22733P9890l60796k12548p5680j88693j24023K41510M08911J05639
34855G59978k86509l55768j40923J32423K88825J37284l21455o20746k86671M31368
34845b62194Q03903N69611J22678j82196l37658l38497j30289Q5210M1856j16394
34835B56030q0714J9910j23135k92510n1027L47714K19342l69622n97904j99154
34825h71070J57117M6760o9881K13521N05303L11400j87978n15294m92563j40640
34815a043325M06293O38830Q1100p43744o52498M45451J110539L71763p76323
34806a61914q09395J61543P78068M87865K6788L1963K61228K80167Q5791j36472
34796A005632l00314l47099k87962k88194l74437k48262K19993N92599M43979
$$ plain form
34787 415935 465659 416184 530582 666964 661698 605216 518511 266930 54364 410501 1277508
34776 1277508 1699244 1013413 -111911 -525331 -144428 102367 -288138 -830490 -964465
34767 -964465 -760998 -471438 -29810 577166 915378 602970 -26657 -261679 51664 366925
34757 366925 295474 154382 391519 817344 869063 494586 235852 380648 590218 590208 647333
34746 647333 927838 938667 281098 -456317 -407537 204096 367355 -113583 -390733 -105153
34736 -105153 18065 -408109 -531213 401950 1682698 2093366 1583060 984333 581806
34727 581806 86155 -304417 -41357 625529 783163 278408 -29713 323051 738885 663187
34717 663187 417238 389654 217897 -504190 -1275075 -1217060 -282703 697018 1025968 733725
$$ packed form
34787D15935M9724m9475J14398J36382n266n6482q6705k51581k12566L56137Q67007
34776A277508M21736o85831j125324m13420L80903K46795l90505n42352j33975
34767i64465K03467K89560M41628O06976L38212l12408o29627k35022L13343L15261
34757C66925p1451j41092K37137M25825N1719l74477k58734J44796K09570j0N7125
34746F47333K80505J0829o57569p37415M8780O11633J63259m80938k77150K85580
34736a05153J23218m26174j23104R33163J280748M10668n10306n98727m02527
34727E81806m95651l90572K63060O66886J57634n04755l08121L52764M15834p5698
34717F63187k45949k7584j71757p22087p70885N8015R34357R79721L28950k92243
$$ plain form
34707 733725 282963 89250 256547 506079 453646 112089 -101192 -12990 -1340 -366363
34697 -366363 -742438 -562122 112473 648744 611100 107619 -508691 -919160 -910118 -540593
34687 -540593 -232831 -394684 -936191 -1366691 -1318325 -790678 -23210 610012 729209 321172
34677 321172 -90977 5071 430677 522491 3126 -707961 -1080619 -1009547 -672587 -201268
34667 -201268 310637 688220 764076 521026 108836 -199027 -152789 167428 294282 -79503
34657 -79503 -589079 -647192 -366043 -460125 -1081963 -1404483 -808008 50322 40001 -836802
34647 -836802 -1415030 -970725 -134022 95707 -301690 -490196 8776 723516 881205 334481
34637 334481 -311476 -408949 4131 260859 -115006 -776251 -953922 -439958 164073 276123
$$ packed form
34707G33725m50762j93713J67297K49532n2433l41557k13281Q8202J1650l65023
34697c66363l76075J80316O74595N36271l7644n03481o16310m10469R042L69525
34687e40593L07762j61853n41507m30500M8366N27647P67468O33222J19197m08037
34677C21172m12149R6048M25606R1814n19365p11087l72658P1072L36960M71319
34667b01268N11905L77583P5856k43050m12190l07863M6238L20217J26854l73785
34657g9503n09576n8113K81149r4082o21838l22520N96475Q58330j0321q76803
34647h36802n78228M44305Q36703K29729l97397j88506M98972P14740J57689n46724
34637C34481o45957r7473M13080K56728l75865o61245j77671N13964O04031J12050
$$ plain form
34627 276123 48780 -1755 230059 433803 469470 500114 577529 536993 366100 284487 348151
34616 348151 337531 174223 92589 224378 353594 277568 75942 -163831 -483395 -682371
34606 -682371 -321207 498047 876785 257386 -623672 -706979 -219623 -332268 -1269847 -1858335
34596 -1858335 -1262602 -189088 232623 -528 -81753 255851 520667 363479 -28124
34587 -28124 -399322 -717842 -936831 -898934 -597477 -299595 -343041 -871044 -1647855 -2091219
34577 -2091219 -1764863 -953704 -398469 -318453 -185727 285998 565852 210045 -288851 -282179
34567 -282179 -69308 -323412 -813406 -770704 -329166 -394006 -1005300 -1081441 -178246 657004
34557 657004 445363 -279031 -421212 20626 209848 -91381 -315448 -133706 145614 228300
$$ packed form
34627B76123k27343n0535K31814K03744L5667L0644P7415m0536j70893q1613O3664
34616C48151j0620j63308q1634J31789J29216p6026k01626k39773l19564j98976
34606f82371L61164Q19254L78738o19399q81058q3307M87356j12645r37579n88488
34596a858335N95733J073514M21711k33151q1225L37604K64816j57188l91603
34587b8124l71198l18520k18989L7897L01457K97882m3446n28003p76811m43364
34577b091219L26356Q11159N55235Q0016J32726M71725K79854l55807m98896O672
34567b82179K12871k54104m89994M2702M41538o4840o11294p6141R03195Q35250
34557F57004k11641p24394j42181M41838J89222l01229k24067J81742K79320Q2686
$$ plain form
34547 228300 217708 271203 360703 437770 489325 450140 339510 350251 503957 445225 -31581
34536 -31581 -496599 -411639 56824 286302 93542 -203964 -479322 -860916 -1145139 -904284
34526 -904284 -300200 -40891 -284664 -328391 235036 773194 595660 66143 -5800 330861
34516 330861 308042 -294085 -849063 -889836 -653047 -425948 -47004 564965 942576 659423
34506 659423 58305 -147367 160311 438352 326235 48516 -108765 -242059 -488569 -598493
34496 -598493 -245883 372757 636587 234523 -477823 -953212 -1064070 -1069991 -1118473 -1036324
34486 -1036324 -664083 -194145 23191 -34193 -4011 321430 609817 409365 -136435 -360536
34476 -360536 45705 565170 517325 -60181 -530926 -536417 -377959 -493544 -866441 -1091485
$$ packed form
34547B28300j0592N3495Q9500P7067N1555l9185j10630J0741J53706n8732m76806
34536c1581m65018Q4960M68463K29478j92760k97506k75358l81594k84223K40855
34526i04284O04084K59309k43773m3727N63427N38158j77534n29517p1943L36661
34516C30861k2819o02127n54978m0773K36789K27099L78944O11969L77611k83153
34506F59423o01118k05672L07678K78041j12117k77719j57281j33294k46510j09924
34496e98493L52610O18640K63830m02064p12346m75389j10858n921m8482Q2149
34486a036324L72241M69938K17336n7384L0182L25441K88387k00452n45800k24101
34476c60536M06241N19465m7845n77506m70745n491J58458j15585l72897k25044
$$ plain form
34466 -1091485 -856979 -244783 352787 543068 223642 -374284 -896682 -1063683 -724763
34457 -724763 36374 780222 990328 662788 329206 260704 30130 -728950 -1519024 -1567172
34447 -1567172 -971405 -506783 -382433 -41817 694490 1175223 955417 509677 425538 543879
34437 543879 460708 308158 390494 501140 293938 879 88860 437266 532824 324920
34427 324920 226846 348704 364937 141772 -83036 -193248 -352139 -592438 -688825 -517808
34417 -517808 -193532 162647 462833 543591 389455 344958 671290 1032603 937455 558794
34407 558794 494522 771078 787585 317396 -159327 -314416 -457599 -849017 -1169759 -1102409
34397 -1102409 -900943 -896317 -865176 -420319 262424 619243 446213 74385 -76929 186761
$$ packed form
34466a091485K34506O12196N97570J90281l19426n97926n22398j67001L38920
34457g24763P61137P43848K10106l27540l33582o8502k30574p59080p90074m8148
34447a567172N95767M64622J24350L40616P36307M80733k19806m45740q4139J18341
34437E43879q3171j52550Q2336J10646k07202k93059Q7981L48406R5558k07904
34427C24920r8074J21858J6233k23165k24808j10212j58891k40299r6387J71017
34417e17808L24276L56179L00186Q0758j54136m4497L26332L61313r5148l78661
34407E58794o4272K76556J6507m70189m76723j55089j43183l91418l20742O7350
34397a102409K01466M626L1141M44857O82743L56819j73030l71828j51314K63690
$$ plain form
34387 186761 792894 1349157 1309756 558712 -287726 -514429 -161654 111363 -37881 -270616
34377 -270616 -239197 -181957 -483183 -878101 -638577 327602 1066207 721126 -212372 -468542
34367 -468542 186874 593190 -29181 -834454 -666018 88417 104611 -745320 -1195989 -635400
34357 -635400 -45381 -384032 -1136497 -1270620 -804877 -485860 -449256 -189459 383289 755990
34347 755990 656723 359581 91667 -251980 -675988 -867997 -606793 -61187 455393 783020
34337 783020 881455 727820 382339 57085 19259 369418 844418 920557 347853 -418325
34327 -418325 -622529 -114121 481723 586662 259935 -192317 -719863 -1306333 -1634082 -1394043
34317 -1394043 -726050 -69369 216750 -48442 -745241 -1251469 -910507 -12493 305087
$$ packed form
34387A86761O06133N56263l9401p51044q46438k26703L52775K73017j49244k32735
34377b70616L1419N7240l01226l94918K39524R66179P38605l45081r33498k56170
34367d68542O55416M06316o22371q05273J68436P54435J6194q49931m50669N60589
34357f35400N90019l38651p52465j34123M65743L19017L6604K59797N72748L72701
34347G55990r9267k97142k67914l43647m24008j92009K61204N45606N16580L27627
34337G83020R8435j53635l45481l25254l7826L50159M75000P6139n72704p66178
34327d18325k04204N08408N95844J04939l26727m52252n27546n86470l27749K40039
34317a394043O67993O56681K86119k65192o96799n06228L40962Q98014L17580
$$ plain form
34308 305087 -422605 -1235513 -1122106 -445364 -158439 -239166 -11441 409743 279294 -322829
34298 -322829 -518031 -206638 -306895 -1084841 -1519131 -938450 -174198 -268523 -934160 -1225387
34288 -1225387 -1052694 -1034383 -1297987 -1418866 -1311621 -1279500 -1276905 -935423 -324778 28688
34278 28688 -56683 -223269 -248509 -312968 -478093 -470578 -186107 78392 111400 76848 102205
34267 102205 -5388 -362885 -696649 -725862 -558941 -411005 -222211 92022 273889 44725
34257 44725 -354348 -406660 -86403 44561 -409942 -1168612 -1624522 -1437059 -696565 194922
34247 194922 686169 447981 -197538 -476229 -30924 626624 770855 330930 -193868 -447377
34237 -447377 -436792 -200227 253423 680215 735566 454170 205738 99335 -143157 -586886
$$ packed form
34308C05087p27692q12908J13407O76742K86925q0727K27725M21184j30449o02123
34298c22829j95202L11393j00257p77946m34290N80681P64252r4325o65637k91227
34288a225387J72693J8311k63604j20879J07245L2121K595L41482O10645L53466
34278B8688q5371j66586k5240o4459j65125P515K84471K64499L3008l4552K5357
34267A02205j07593l57497l33764k9213J66921J47936J88794L14233J81867k29164
34257D4725l99073n2312L20257J30964m54503p58670m55910J87463P40494Q91487
34247A94922M91247k38188o45519k78691M45305O57548J44231m39925n24798k53509
34237d47377J0585K36565M53650M26792N5351k81396k48432j06403k42492m43729
$$ plain form
34227 -586886 -811208 -497286 81506 458266 553651 540868 417907 112809 -158799 -48699
34217 -48699 448654 966269 1176655 1015073 577386 41911 -359879 -517838 -555822 -608367
34207 -608367 -583258 -351190 -72895 -70461 -375295 -632629 -529860 -192966 -59191 -347756
34197 -347756 -710539 -564266 134344 676436 457731 -167689 -378829 -96328 -8472 -339521
34187 -339521 -426709 136454 755200 815520 694609 1024005 1522424 1472874 965917 688582
34177 688582 698538 414344 -228243 -600464 -461467 -299707 -399566 -417818 -151553 77443
34167 77443 128307 365123 891416 1191536 995681 816265 1072393 1296155 862113 26483
34157 26483 -452961 -395670 -224460 -156268 -43404 89260 -8642 -295301 -388669 -135557
$$ packed form
34227e86886k24322L13922N78792L76760R5385j2783j22961l05098k71608J10100
34217d8699M97353N17615K10386j61582m37687n35475m01790j57959l7984n2545
34207f08367K5109K32068K78295K434l04834k57334J02769L36894J33775k88565
34197c47756l62783J46273O98610N42092k18705o25420k11140K82501Q7856l31049
34187c39521q7188N63163O18746O0320j20911L29396M98419m9550n06957k77335
34177F88582R956k84194o42587l72221J38997J61760r9859j8252K66265K28996
34167G7443N0864K36816N26293L00120j95855j79416K56128K23762m34042q35630
34157B6483m79444N7291J71210O8192J12864J32664r7902k86659r3368K53112
$$ plain form
34147 -135557 174983 274966 262146 353156 548746 691640 692831 569452 357079 109972
34137 109972 -40659 38947 261723 255002 -260171 -985835 -1244599 -863477 -539540 -933894
34127 -933894 -1657791 -1722083 -905150 -48699 93159 -287602 -536799 -351300 159177 776558
34117 776558 1237061 1321453 1113482 880283 609803 96440 -432878 -378905 304119 859444
34107 859444 764834 429983 422893 590216 508899 288142 259063 279010 38986 -262833 -257399
34096 -257399 -140023 -340472 -677417 -615500 -224887 -62700 -132000 164248 877338 1171643
34086 1171643 510921 -479396 -827713 -442615 -21759 -7184 -129595 35670 411408 483118
34076 483118 -19096 -630711 -566597 292898 1127896 1166794 667724 478722 825514 1110839
$$ packed form
34147a35557L10540R9983j2820R1010J95590J42894J191j23379k12373k47107
34137A09972j50631P9606K22776o721n15173p25664k58764L81122L23937l94354
34127i33894p23897o4292Q16933Q56451J41858l80761k49197J85499N10477O17381
34117G76558M60503Q4392k07971k33199k70480n13363n29318N3973O83024N55325
34107H59444r4610l34851p090J67323q1317k20757k9079J9947k40024l01819N434
34096b57399J17376k00449l36945O1917L90613J62187o9300K96248P13090K94305
34086A171643o60722r90317l48317L85098M20856J4575j22411J65265L75738P1710
34076D83118n02214o11615O4114Q59495Q34998L8898m99070j89002L46792K85325
$$ plain form
34066 1110839 872561 327648 -151196 -523322 -800547 -771969 -357584 91244 177116 -60301
34056 -60301 -275754 -234959 76785 531736 859734 807262 502327 434245 838012 1300540
34046 1300540 1238973 616426 -83453 -477653 -586681 -550551 -343245 92740 563495 661527
34036 661527 171383 -605514 -1077236 -987545 -670418 -544888 -559117 -426511 -234045 -329311
34026 -329311 -607584 -494996 118371 472282 -69611 -998520 -1238556 -587215 56911 -49505
34016 -49505 -617712 -943077 -872254 -731256 -647920 -492212 -349114 -483536 -784230 -772598
34006 -772598 -360298 -105528 -374781 -694908 -455142 85167 184559 -131030 -36225 726235
33996 726235 1265964 774840 -325115 -1059185 -1197200 -1148385 -962991 -353817 397705 505068
$$ packed form
34066A110839k38278n44913m78844l72126k77225K8578M14385M48828Q5872k37417
34056f0301k15453M0795L11744M54951L27998n2472l04935o8082M03767M62528
34046A300540o1567o22547o99879l94200j09028L6130K07306M35985M70755R8032
34036F61527m90144p76897m71722Q9691L17127J25530j4229J32606J92466r5266
34026c29311k78273J12588O13367L53911n41893r28909k40036O51341O44126j06416
34016d9505n68207l25365P0823J40998Q3336J55708J43098j34422l00694J1632
34006g72598M12300K54770k69253l20127K39766N40309R9392l15589R4805P62460
33996G26235N39729m91124j099955p34070j38015M8815J85394O09174P51522J07363
$$ plain form
33986 505068 -153717 -721274 -559240 -94006 -18574 -225283 -136830 265948 404677 -28029
33976 -28029 -705600 -1165514 -1238680 -969627 -509474 -162794 -200308 -504718 -647063 -389938
33966 -389938 112684 635792 1088434 1322533 1114393 554888 131148 124413 220408 98017
33956 98017 118242 843937 1975282 2464169 1874757 1001753 758289 978423 868190 265705
33946 265705 -227191 -229611 -35449 -26790 -173410 -251122 -144551 171001 576727 688985
33936 688985 208890 -540231 -867019 -588065 -190960 -55116 -62266 -102919 -312411 -538056
33926 -538056 -252881 579606 1172432 943214 311546 -51003 -166317 -312901 -262371 212744
33916 212744 558505 127641 -665515 -862859 -440674 -255569 -586679 -780613 -451688 -40851
$$ packed form
33986E05068o58785n67557J62034M65234P5432k06709Q8453M02778J38729m32706
33976b8029o77571m59914p3166K69053M60153L46680l7514l04410j42345K57125
33966c89938N02622N23108M52642K34099k08140n59505m23740o735R5995j22391
33956I8017K0225P25695J131345M88887n89412q73004k43464K20134j10233o02485
33946B65705m92896k420J94162Q659j46620p7712J06571L15552M05726J12258
33936F88985m80095p49121l26788K78954L97105J35844p150m0653k09492k25645
33926e38056K85175Q32487N92826k29218o31668l62549j15314j46584N0530M75115
33916B12744L45761m30864p93156j97344M22185J85105l31110j93934L28925M10837
$$ plain form
33906 -40851 54219 15815 5742 -136894 -314734 -113963 355670 396573 -125103 -413721
33896 -413721 801 494465 433490 208510 421393 733756 433687 -312413 -683642 -425162
33886 -425162 -45881 52612 -46972 -170696 -229840 -86070 269964 522574 425024 186857
33876 186857 76979 -46861 -350859 -535040 -293231 84120 176165 142663 298180 370081
33866 370081 -6814 -415723 -240040 150040 -103103 -783601 -775555 93942 659872 230494
33856 230494 -424612 -472916 -274717 -455136 -697411 -429707 18010 -32664 -414003 -460866
33846 -460866 -170819 -47664 -73779 176456 561567 500407 53875 -67101 330050 639141
33836 639141 532120 451184 710654 910820 702056 455795 620525 920482 776883 179865
$$ packed form
33906d0851R5070l8404j0073j42636j77840K00771M69633M0903n21676k88618
33896d13721M14522M93664o0975k24980K12883L12363l00069p46100l71229K58480
33886d25162L79281R8493r9584j23724n9144J43770L56034K52610r7550k38167
33876A86857j09878j23840l03998j84181K41809L77351R2045l3502J55517P1901
33866C70081l76895m08909J75683L90080k53143o80498Q046Q69497N65930m29378
33856B30494o55106m8304J98199j80419k42275K67704M47717n0674l81339m6863
33846d60866K90047J23155k6115K50235L85111o1160m46532j20976L97151L09091
33836F39141j07021q0936K59470K00166k08764k46261J64730K99957j43599n97018
$$ plain form
33826 179865 -389974 -655373 -684902 -563445 -387912 -426227 -816653 -1200454 -1085331 -535381
33816 -535381 -101797 -68774 -149681 7895 357167 613892 623917 431885 165295 -26844
33806 -26844 -43283 69055 166849 204369 280617 452594 596052 524736 221557 -93579 -158709
33795 -158709 41714 233892 196413 87368 236386 623626 851429 725217 542174 596289
33785 596289 702215 527971 170302 27813 240436 600368 894952 992398 730436 127956
33775 127956 -396570 -451953 -239672 -238283 -419507 -337628 36742 237522 157164 272649
33765 272649 753297 1018479 602120 -111921 -499494 -549169 -581989 -562139 -296859 2438
33755 2438 -7050 -174556 -92790 207153 375377 414462 615489 882620 745669 110495 -539977
$$ packed form
33826A79865n69839k65399k9529J21457J75533l8315l90426l83801J15123N49950
33816e35381M33584L3023q0907J57576L49272K56725J0025j92032k66590j92139
33806b6844j6439J12338R7794L7520P6248J71977J43458p1316l03179l15136o5130
33795a58709K00423J92178l7479j09045J49018L87240K27803j26212j83043N4115
33785E96289J05926j74244l57669j42489K12623L59932K94584R7446k61962o02480
33775A27956n24526n5383K12281J389j81224Q1879L74370K00780q0358J15485
33765B72649M80648K65182m16359p14041l87573m9675l2820J9850K65280K99297
33755B438r488j67506Q1766K99943J68224L9085K01027K67131j36951o35174o50472
$$ plain form
33744 -539977 -802297 -763499 -667569 -584573 -508340 -433794 -280609 -35995 91174 19746 145006
33733 145006 808838 1533065 1465170 633504 27683 227117 665821 602136 148220 -148558
33723 -148558 -188587 -208138 -196853 -22290 134873 18332 -220126 -257501 -148153 -172978
33713 -172978 -300632 -273871 -113871 -66705 -131580 -108829 -52957 -188105 -395733 -310272 20910
33702 20910 115011 -150339 -249697 187882 743803 788606 373091 68082 99029 153017 28507
33691 28507 -32661 159912 321738 86791 -406657 -685308 -603196 -468867 -493619 -487328 -258552
33680 -258552 12799 76888 48022 192570 429028 432407 200773 117383 378013 716086
33670 716086 828924 750565 619769 381399 -22430 -386896 -462087 -318432 -251848 -405930
$$ packed form
33744e39977k62320L8798R5930Q2996P6233P4546J53185K44614J27169p1428J25260
33733A45006O63832P24227o7895q31666o05821J99434M38704o3685m53916k96778
33723a48558m0029j9551J1285J74563J57163j16541k38458l7375J09348k4825
33713a72978j27654K6761J60000M7166o4875K2751N5872j35148k07628Q5461L31182
33702B0910R4101k65350r9358M37579N55921M4803m15515l05009L0947N3988j24510
33691B8507o1168J92573J61826k34947m93448k78651Q2112J34329k4752O291K28776
33680b58552K71351O4089k8866J44548K36458L379k31634q3390K60630L38073
33670G16086J12838p8359j30796k38370m03829l64466p5191J43655O6584j54082
$$ plain form
33660 -405930 -689832 -979304 -1177100 -1134890 -762347 -243220 53074 -31625 -237167 -175001
33650 -175001 198176 503786 426589 200051 362486 952634 1287407 863927 198538 219177
33640 219177 927926 1346903 918792 246953 73841 179413 -94800 -691572 -941941 -587863
33630 -587863 9053 567970 1086938 1347698 975312 188222 -184914 215559 724018 581591
33620 581591 -32629 -403696 -368423 -388657 -670987 -842184 -616995 -285593 -261538 -467874
33610 -467874 -504168 -261353 -34595 -44749 -144566 -99854 45316 34909 -284677 -838815
33600 -838815 -1398079 -1651830 -1368176 -702915 -222612 -315151 -635844 -503015 138325 576759
33590 576759 311125 -261881 -440957 -156423 87114 -22841 -334999 -624424 -839758 -964033
$$ packed form
33660d05930k83902k89472j97796M2210L72543N19127K96294q4699k05542O2166
33650a75001L73177L05610p7197k26538J62435N90148L34773m23480o65389K0639
33640B19177P08749M18977m28111o71839j73112J05572k74213n96772k50369L54078
33630e87863N96916N58917N18968K60760l72386p87090l73136M00473N08459j42427
33620E81591o14220l71067L5273k0234k82330j71197K25189L31402K4055k06336
33610d67874l6294K42815K26758j0154r9817M4712J45170j0407l19586n54138
33600h38815n59264k53751K83654O65261M80303r2539l20693J32829O41340M38434
33590E76759k65634n73006j79076K84534K43537j09955l12158k89425k15334j24275
$$ plain form
33580 -964033 -965055 -919159 -937740 -969260 -870288 -604285 -174020 478463 1213226 1532468 1115693
33569 1115693 411124 209703 651007 1137374 1230025 1064100 791789 263041 -459038 -854205
33559 -854205 -648309 -316428 -412109 -734803 -663854 -88636 489893 662366 473470 130656
33549 130656 -272789 -710528 -1117075 -1329489 -1092821 -342299 454820 644976 283643 197111
33539 197111 798136 1386189 1168537 440751 23143 10191 -5615 116671 754868 1456764
33529 1456764 1610554 2158112 4879663 9351970 12315257 11325889 7825879 5138547 4356351
33520 4356351 3919789 2688444 1408663 963681 949475 684035 359155 392481 544061
33511 544061 428093 221915 223644 301826 351349 675146 1293716 1487100 771288 -158587
$$ packed form
33580i64033j022M5896j8581l1520R8972K66003M30265O52483P34763L19242m16775
33569A115693p04569k01421M41304M86367R2651j65925k72311n28748p22079l95167
33559h54205K05896L31881r5681l22694P0949N75218N78529J72473j88896l42814
33549A30656m03445m37739m06547k12414K36668P50522P97119J90156l61333q6532
33539A97111O01025N88053k17652p27786m17608j2952j5806J22286O38197P01896
33529A456764J53790N47558K721551M472307K963287r89368l500010k687332p82196
33520D356351m36562j231345j279781m44982j4206k65440l24880L3326J51580
33511E44061j15968k06178J729P8182M9523L23797O18570J93384p15812r29875
$$ plain form
33501 -158587 -274372 339121 708328 412694 -49989 -257822 -359643 -456979 -278371 222845
33491 222845 560909 402983 118014 219431 573875 632843 311418 150919 504007 926780
33481 926780 693767 -200621 -915970 -763512 -44596 381849 176878 -221795 -348688 -255626
33471 -255626 -216357 -305854 -461627 -634588 -709740 -587535 -464710 -650356 -970669 -844801
33461 -844801 -185143 317989 170928 -198198 -168053 123209 162191 -13162 15390 204408
33451 204408 115036 -266301 -432002 -95542 486078 929080 1032427 741464 218391 -155147
33441 -155147 -225137 -320621 -672532 -903686 -623478 -165180 -57196 -106773 173405 520789
33431 520789 286227 -309309 -369969 176337 387220 -146488 -644271 -454841 -42305 -64658
$$ packed form
33501a58587j15785O13493L69207k95634m62683k07833j01821r7336J78608N01216
33491B22845L38064j57926k84969J01417L54444N8968l21425j60499L53088M22773
33481I26780k33013q94388p15349J52458P18916M26445k04971l98673j26893R3062
33471b55626L9269q9497j55773j72961p5152J22205J22825j85646l20313J25868
33461h44801O59658N03132j47061l69126L0145K91262L8982j75353K8552J89018
33451B04408q9372l81337j65701L36460N81620M43002J03347k90963n23073l73538
33441a55147o9990r5484l51911k31154K80208M58298J07984m9577K80178L47384
33431E20789k34562n95536o0660N46306K10883n33708m97783J89430M12536k2353
$$ plain form
33421 -64658 -306419 -237754 -3099 -104838 -497210 -658486 -366948 64042 204491 -79454
33411 -79454 -455773 -314388 545399 1444652 1549408 1029287 803133 1102377 1171888 625535
33401 625535 129471 256511 555352 414632 90941 115707 278510 3512 -661454 -1135657
33391 -1135657 -1093596 -628277 33590 523563 454825 -10422 -197292 73479 146333 -306747
33381 -306747 -563843 -34097 584829 303797 -567854 -898245 -414295 179835 515126 866753
33371 866753 1209604 1044084 318886 -353933 -599164 -663717 -754144 -683845 -370255 -85801
33361 -85801 -20176 -65023 -129428 -218521 -178280 146933 482437 352709 -206021 -623678 -531342
33350 -531342 -103078 332863 595574 565326 216479 -229171 -497462 -565556 -520653 -323690
$$ packed form
33421f4658k41761O8665K34655j01739l92372j61276K91538M30990J40449k83945
33411g9454l76319J41385Q59787Q99253J04756n20121k26154K99244O9511n46353
33401F25535m96064J27040K98841j40720l23691K4766J62803k74998o64966m74203
33391a135657M2061M65319O61867M89973o8738m65247j86870K70771P2854m53080
33381c06747k57096N29746O18926k81032q71651l30391M83950N94130L35291L51627
33371H66753L42851j65520p25198o72819k45231o4553r0427P0299L13590K84454
33361h5801O5625m4847o4405q9093M0241L25213L35504j29728n58730m17657R2336
33350e31342M28264M35941K62711l0248l48847m45650k68291o8094M4903J96963
$$ plain form
33340 -323690 -40317 -9432 -340511 -556122 -262109 149474 98901 -175501 35725 729541
33330 729541 1136385 820096 136838 -398418 -563094 -267688 413873 1039592 1186218 1001234
33320 1001234 860126 671490 169401 -324408 -227695 333453 696798 708938 736055 715850
33310 715850 194502 -623875 -889323 -394787 94983 86963 2356 205177 295345 -107008
33300 -107008 -621996 -716012 -467466 -242915 -117893 -41239 -103886 -272569 -291591 -140618
33290 -140618 -137927 -359910 -466909 -321290 -218485 -274174 -181840 151526 334891 154272
33280 154272 -88342 -186439 -360922 -667380 -712372 -333741 41028 93423 78924 231382
33270 231382 334481 296455 507122 1135133 1658172 1603506 1228187 986118 853642 664931
$$ packed form
33340c23690K83373L0885l31079k15611K94013M11583n0573k74402K11226O93816
33330G29541M06844l16289o83258n35256j64676K95406O81561O25719J46626j84984
33320A001234j41108j88636n02089m93809R6713N61148L63345J2140K7117k0205
33310G15850n21348q18377k65448M94536M89770q020q4607K02821R0168m02353
33300a07008n14988r4016K48546K24551J25022P6654o2647j68683j9022J50973
33290a40618K691k21983j06999J45619J02805n5689R2334L33366J83365j80619
33280A54272k42614r8097j74483l06458m4992L78631L74769N2395j4499J52458
33270B31382J03099l8026K10667O28011N23039n4666l75319k42069j32476j88711
$$ plain form
33260 664931 574787 676985 666240 359592 41515 -141906 -516142 -1116011 -1287418 -678155
33250 -678155 53586 248236 295618 818749 1419049 1263693 498355 -7304 -68271 -250734
33240 -250734 -633505 -596702 31975 588086 591226 360953 309175 299197 80197 -162334 -84213
33229 -84213 303207 675726 755224 503049 150578 56439 306632 512197 298991 -87968
33219 -87968 -62446 448471 871488 785295 424452 203322 98506 -192665 -663330 -891946
33209 -891946 -564638 87372 526848 551189 489376 653620 845563 720596 448657 508351
33199 508351 859243 920393 515939 217808 428498 700828 436020 -208651 -638534 -675082
33189 -675082 -536809 -277073 152702 476066 336284 -105337 -337353 -219424 -67583 -67384
$$ packed form
33260F64931r0144J02198j0745l06648l18077j83421l74236n99869j71407O09263
33250f78155P31741J94650M7382N23131O00300j55356p65338n05659o0967j82463
33240b50734l82771L6803O28677N56111L140k30273n1778r978k19000k42531P8121
33229h4213L87420L72519P9498k52175l52471r4139K50193K05565k13206l86959
33219h7968K5522N10917M23017q6193l60843k21130j04816k91171m70665k28616
33209h91946L27308O52010M39476K4341o1813J64244J91943j24967k71939N9694
33199E08351L50892O1150m04454k98131K10690K72330k64808o44671m29883l6548
33189f75082J38273K59736M29775L23364j39782m41621k32016J17929J51841J99
$$ plain form
33179 -67384 -76967 -23100 -53086 -226646 -405249 -494121 -502777 -373843 -59683 240095 238902
33168 238902 -6833 -107354 169483 627678 883669 718965 245470 -115574 63200 702919
33158 702919 1123585 746348 -172254 -798299 -695277 -264463 -181845 -637673 -1217687 -1380852
33148 -1380852 -969135 -312819 122676 181727 67385 -5400 -30622 -54999 -17827 124617
33138 124617 269534 301114 261101 299053 519056 876617 1129338 974234 431281 -16488
33128 -16488 38751 342416 306024 -145557 -534849 -643480 -789192 -1134888 -1290782 -915438
33118 -915438 -263387 201086 366323 338853 113158 -257728 -443207 -169840 359899 646367
33108 646367 413321 -148551 -527785 -294368 426109 962446 875503 540787 509697 562278
$$ packed form
33179f7384r583N3867k9986j73560j78603q8872q656J28934L14160K99778j193
33168B38902k45735j00521K76837M58195K55991j64704m73495l61044J78774O39719
33158G02919M20666l77237r18602o26045J03022M30814Q2618m55828n80014j63165
33148a380852M11717O56316M35495N9051j14342p2785k5222k4377L7172J42444
33138A24617J44917L1580m0013L7952K20003L57561K52721j55104n42953m47769
33128a6488N5239L03665l6392m51581l89292j08631j45712l45696j55894L75344
33118i15438O52051M64473J65237k7470k25695l70886j85479K73367N29739K86468
33108F46367k33046n61872l79234K33417P20477N36337q6943l34716l1090N2581
$$ plain form
33098 562278 122276 -566326 -646115 -70052 256663 22019 63563 855225 1530590 1215434
33088 1215434 430747 219398 564299 678273 375231 142556 127509 -28717 -448135 -822281
33078 -822281 -887224 -573736 129791 997836 1518244 1477967 1285344 1288139 1201880 720888
33068 720888 229659 286213 768309 1120870 1108586 802428 232512 -404410 -634299 -350546
33058 -350546 -99921 -208345 -214853 231119 606958 402548 61157 140136 211948 -350333
33048 -350333 -1081506 -1079707 -493788 -154855 -94406 304933 932715 1039753 623274 465095
33038 465095 764895 926175 759929 703075 708354 144978 -900900 -1390317 -850734 -140203
33028 -140203 -181520 -767593 -1159236 -1176356 -1126693 -1120301 -955311 -479503 156460 492977
$$ packed form
33098E62278m40002o88602p9789N76063L26715k34644M1544P91662O75365l15156
33088A215434p84687k11349L44901J13974l03042k32675j5047j56226m19418l74146
33078h22281o4943L13488P03527Q68045N20408m0277j92623K795q6259m80992
33068G20888m91229N6554M82096L52561j2284l06158n69916o36922k29889K83753
33058c50546K50625j08424o508M45972L75839k04410l41391P8979P1812n62281
33048c50333p31173J799N85919L38933O0449L99339O27782J07038m16479j58179
33038D65095K99800J61280j66246n6854N279n63376j045878m89417N39583P10531
33028a40203m1317n86073l91643j7120M9663O392J64990M75808O35963L36517
$$ plain form
33018 492977 135752 -608716 -816145 -137641 525376 230487 -583616 -810213 -407329 -258281
33008 -258281 -528175 -484170 5931 152827 -274810 -422849 181318 747281 465596 -268922
32998 -268922 -582858 -370808 -121323 -3677 233421 726343 1278314 1508558 1106929 227524
32988 227524 -422400 -333370 83538 103857 -169049 -74939 315989 209616 -509364 -939528
32978 -939528 -555822 17851 59976 -286366 -579921 -808594 -1004343 -831665 -152602 539315
32968 539315 760901 638358 460403 172746 -240677 -409617 -130320 157000 -51771 -583419
32958 -583419 -850883 -588430 19143 666238 1066073 1007281 565278 88103 -199742 -382617
32948 -382617 -554747 -620424 -525960 -429524 -481282 -601096 -573692 -278162 168279 463191
$$ packed form
33018D92977l57225p44468k07429O78504O63017k94889q14103k26597M02884J49048
33008b58281k69894M4005M90101J46896m27637j48039O04167N65963k81685p34518
32998b68922l13936K12050K49485J17646K37098M92922N51971K30244m01629q79405
32988B27524o49924Q9030M16908K0319k72906R4110L90928j06373p18980m30164
32978i39528L83706N73673M2125l46342k93555k28673j95749J72678O79063O91917
32968E39315K21586j22543j77955k87657m13423j68940K79297K87320k08771n31648
32958e83419k67464K62453O07573O47095L99835n8792m42003m77175k87845j82875
32948c82617j72130o5677R4464R6436n1758j19814K7404K95530M46441K94912
$$ plain form
32938 463191 465907 491051 909886 1428670 1343610 692415 385297 785246 1037559 492563
32928 492563 -106702 159460 774927 619945 -156589 -447219 -31089 245630 -12937 -335453
32918 -335453 -446580 -566096 -647416 -404461 -61955 -52665 -112853 248103 624743 288237
32908 288237 -362293 -301326 329402 421393 -140683 -285464 340286 813237 557305 92042
32898 92042 -147076 -372194 -543433 -252893 225231 103700 -495036 -681868 -509292 -961051
32888 -961051 -2003663 -2361306 -1647385 -986512 -966307 -738176 115351 579645 45685 -442196
32878 -442196 91107 903257 747626 -328738 -1395779 -1919687 -1803375 -1039238 -37823
32869 -37823 505436 565168 769084 1203850 1317974 1146774 1297822 1555595 1050957 75584
$$ packed form
32938D63191K716K5144M18835N18784q5060o51195l07118L99949K52313n44996
32928D92563n99265K66162O15467j54982p76534k90630M16130K76719k58567l22516
32918c35453j11127j19516q1320K42955L42506R290o0188L60956L76640l36506
32908B88237o50530O0967O30728R1991n62076j44781O25750M72951k55932m65263
32898I2042k39118k25118j71239K90540M78124j21531n98736j86832J72576m51759
32888i61051j042612l57643P13921O60873K0205K28131Q53527M64294n33960m87881
32878d42196N33303Q12150j55631j076364j067041n23908J16312P64137J001415
32869c7823N43259N9732K03916M34766J14124j71200J51048K57773n04638r75373
$$ plain form
32859 75584 4654 999515 1590442 1089456 553794 681104 682585 112538 -89109 584599
32849 584599 1116188 752241 213131 110431 -144528 -823015 -989865 -219066 464817 409475
32839 409475 420644 1019320 1378764 1045097 908940 1392590 1523856 888763 559254 963615
32829 963615 890644 -169037 -802030 -106322 759605 795918 781064 1323542 1520831 954899
32819 954899 751863 1295570 1303842 502378 521739 1725592 2153658 1233922 1241333 3117717
32809 3117717 4352433 3357911 2341838 3121420 3764465 2496803 1262897 1907389 2441615
32800 2441615 935543 -440032 617712 2050045 1300182 163700 1112395 2342470
32792 2342470 1515895 770552 2509234 3981365 2162171 183085 2094469 5132484
$$ packed form
32859G5584p0930R94861N90927n00986n35662J27310J481n70047k01647O73708
32849E84599N31589l63947n39110j02700k54959o78487j66850P70799O83883n5342
32839D09475J1169N98676L59444l33667j36157M83650J31266o35093l29509M04361
32829I63615p2971j059681o32993O95708Q65927L6313j4854N42478J97289n65932
32819I54899k03036N43707Q272q01464J9361J203853M28066r19736P411J876384
32809C117717J234716r94522j016073P79582O43045j267662j233906O44492N34226
32800B441615j506072j375575J057744J432333p49863j136482R48695J230075
32792B342470q26575p45343J738682J472131j819194j979086J911384L038015
$$ plain form
32784 5132484 4897885 4256815 8103567 13072895 13186805 12646369 20184055 32387001 38644264
32775 38644264 45650692 79883311 154616048 243647347 298115327 286190170 213813323
32768 213813323 116356635 36588938 503198 2074006 13082510 13250037 6659652
32761 6659652 5760361 9951326 9906309 4946274 2747111 4990923 5649948 2862527 1567189
32752 1567189 3550455 4490076 2530960 1392164 2860411 3624228 1929980 790745
32744 790745 2054049 3113147 2069075 973276 1446771 1754193 653098 -78343 744169
32735 744169 1416056 775850 347662 1101740 1506985 700348 306315 1230300 1775916 819795
32725 819795 -100648 295866 830505 377226 -54896 486981 1078473 940274 938799 1529714
$$ packed form
32784E132484k34599o41070L846752M969328J13910n40436P537686J2202946O257263
32775C8644264P006428L4232619P4732737Q9031299N4467980j1925157p2376847
32768B13813323r7456688p9767697l6085740J570808J1008504J67527o590385
32761F659652q99291M190965m5017m960035k199163K243812O59025k787421j295338
32752A567189J983266R39621j959116j138796J468247P63817j694248j139235
32744G90745J263304J059098j044072j095799M73495L07422j101095p31441Q22512
32735G44169O71887o40206m28188P54078M05245q06637l94033R23985N45616r56121
32725H19795r20443L96514N34639m53279m32122N41877N91492j38199j475N90915
$$ plain form
32715 1529714 1525972 431776 -271510 325087 940922 517414 54845 524645 1067395 815927
32705 815927 493369 678859 476941 -535527 -995530 -20906 1041082 789340 -19326
32696 -19326 -91103 201314 -43456 -370015 42794 708171 739093 381992 270534 195513
32686 195513 -143106 -247395 144545 259016 -351901 -807943 -371806 268046 310430 219264
32676 219264 605893 930060 572599 109668 260895 567359 326131 -100326 -53574 257180
32666 257180 424502 725530 1301798 1459288 857132 391396 799857 1392328 1296618 945723
32656 945723 1108333 1416631 1168569 736073 837528 1143481 921263 436244 440965 806877
32646 806877 856415 578909 425076 372458 213568 248041 681018 895749 372437 -225004
$$ packed form
32715A529714l742j094196p03286N96597O15835m23508m62569M69800N42750k51468
32705H15927l22558J85490k01918j012468m60003R74624J061988k51742q08666
32696a9326p1777K92417k44770l26559M12809O65377L0922l57101j11458p5021
32686A95513l38619j04289L91940J14471o10917m56042M36137O39852M2384r1166
32676B19264L86629L24167l57461m62931J51227L06464k41228m26457M6752L10754
32666B57180J67322L01028N76268J57490o02156m65736M08461N92471r5710l50895
32656I45723J62610L08298k48062m32496J01455L05953k22218m85019M721L65912
32646H06877M9538k77506j53833n2618j58890L4473M32977K14731n23312n97441
$$ plain form
32636 -225004 16093 733116 842484 226334 -270373 -249012 -73913 48712 299515 612068
32626 612068 656708 432475 218824 53754 -172468 -319688 -244933 -179083 -325834 -404527
32616 -404527 -129791 201560 155269 -146162 -293515 -195045 83015 660948 1484901 2016923
32606 2016923 1852315 1332559 1070257 1191341 1432785 1576010 1414667 790533 54670
32597 54670 -64130 517059 942776 632879 150880 273910 798326 958089 564905 62999
32587 62999 -195939 -161456 107025 365299 246718 -221446 -530110 -396641 -99855 109319
32577 109319 328286 497926 297422 -151018 -242310 112640 286002 82050 114902 578367
32567 578367 723975 219457 -80028 426777 927324 513972 -266046 -351343 111727 249145
$$ packed form
32636b25004K41097P17023J09368o16150m96707K1361J75099J22625K50803L12553
32626F12068M4640k24233k13651j65070k26222j47220P4755O5850j46751p8693
32616d04527K74736L31351m6291l01431j47353R8470K78060N77933Q23953N32022
32606B016923j64608n19756k62302J21084K41444J43225j61343o24134p35863
32597E4670j18800N81189M25717l09897m81999J23030N24416J59763l93184n01906
32587F2999k58938L4483K68481K58274j18581m68164l08664J33469K96786K09174
32577A09319K18967J69640k00504m48440r1292L54950J73362k03952L2852M63465
32567E78367J45608n04518k99485N06805N00547m13352p80018q5297M63070J37418
$$ plain form
32557 249145 77197 320310 938838 1096337 528325 -85380 -152786 196035 506737 462892
32547 462892 54842 -293712 -39446 688365 1072633 761331 401629 546721 781445 562929
32537 562929 142391 -113189 -526690 -1337408 -1859179 -1426335 -564588 -198785 -265028 -147565
32527 -147565 74278 -48919 -243504 72384 619046 626363 106364 -286024 -375049 -431314
32517 -431314 -351400 63894 335126 -75156 -649137 -469244 250654 467183 -43525 -537454
32507 -537454 -667432 -752918 -731974 -126355 825823 1205595 810527 448643 602894 807050
32497 807050 616951 278334 139227 193697 422759 855015 1179463 1044809 770155 947532
32487 947532 1357014 1203024 464552 11682 230961 510472 312940 -152039 -547988 -816621
$$ packed form
32557B49145j71948K43113O18528J57499n68012o13705o7406L48821L10702m3845
32547D62892m08050l48554K54266P27811L84268l11302l59702J45092K34724k18516
32537E62929m20538k55580m13501q10718n21771M32844Q61747L65803o6243J17463
32527a47565K21843j23197j94585L15888N46662P317n19999l92388q9025n6265
32517d31314P9914M15294K71232m10282n73981J79893P19898K16529n10708m93929
32507e37454j29978q5486K0944O05619R52178L79772l95068l61884J54251K04156
32497H07050j90099l38617j39107N4470K29062M32256L24448j34654k74654J77377
32487I47532M09482j53990p38472m52870K19279K79511j97532m64979l95949k68633
$$ plain form
32477 -816621 -762022 -140334 615239 688595 139729 -97011 256861 362778 -235650 -736684
32467 -736684 -367323 377764 571526 216572 -21202 99907 328378 537092 732828 742623
32457 742623 466652 207024 267164 448860 360383 4038 -311671 -432006 -393648 -205899
32447 -205899 83975 255702 120804 -215540 -451703 -373827 -13237 345331 364263 71871
32437 71871 -26450 439884 1104323 1265197 793657 192742 -169497 -364872 -459992 -330947
32427 -330947 -27435 155357 93035 -51264 -147666 -158142 55307 515852 810633 528868
32417 528868 -31489 -173336 217044 599152 654324 579607 522573 425159 443947 777255
32407 777255 1039719 639072 -129155 -281198 352883 807599 530108 237236 619914 1110201
$$ packed form
32477h16621N4599O21688P55573P3356n48866k36740L53872J05917n98428n01034
32467g36684L69361P45087J93762l54954k37774J21109K28471K08714J95736R795
32457G42623k75971k59628O0140J81696q8477l56345l15709j20335L8358J87749
32447b05899K89874J71727j34898l36344k36163P7876L60590L58568J8932k92392
32437G1871r8321M66334O64439J60874m71540o00915l62239j95375r5120J29045
32427c30947L03512J82792o2322j44299r6402j0476K13449M60545K94781k81765
32417E28868n60357j41847L90380L82108N5172p4717n7034r7414J8788L33308
32407G77255K62464m00647p68227j52043O34081M54716k77491k92872L82678M90287
$$ plain form
32397 1110201 783598 -162457 -732458 -534542 -25728 399921 782007 1107757 1114079 695207
32387 695207 120042 -252351 -286508 -130702 -85424 -305331 -562486 -484925 -61681 346935
32377 346935 510504 494068 313830 -119313 -627442 -827258 -708926 -657137 -739661 -548546
32367 -548546 1880 334784 68643 -329434 -244344 170035 311095 37144 -284688 -421957
32357 -421957 -454654 -419398 -222970 86381 251912 40433 -546977 -1182315 -1311817 -636967
32347 -636967 410098 1001647 857124 494223 406306 454788 341175 203882 322779 578610
32337 578610 661303 588397 611664 787484 998701 1231605 1479064 1516056 1126490 469937
32327 469937 -71458 -337091 -433080 -436907 -327694 -160204 -62828 -49223 13054 230850 551258
$$ packed form
32397A110201l26603r46055n70001J97916N08814M25649L82086L25750O322m18872
32387F95207n75165l72393l4157J55806M5278k19907k57155P7561M23244M08616
32377C46935J63569j6436j80238m33143n08129j99816J18332N1789q2524J91115
32367e48546N50426L32904k66141l98077Q5090M14379J41060k73951l21832j37269
32357d21957l2697L5256J96428L09351J65531k11479n87410o35338j29502O74850
32347f36967J047065N91549j44523l62901q7917M8482j13613j37293J18897K55831
32337E78610Q2693p2906K3267J75820K11217K32904K47459L6992l89566o56553
32327D69937n41395k65633r5989l827J09213J67490R7376J3605O2277K17796L20408
$$ plain form
32316 551258 776777 707434 347957 -43914 -234518 -291375 -413840 -564050 -532368 -348009
32306 -348009 -316809 -584649 -914680 -980526 -703450 -276218 -4601 -72937 -310246 -323502
32296 -323502 -43217 112817 -106645 -313732 -103638 204264 59776 -368912 -473807 -241250
32286 -241250 -188888 -371927 -346489 -130733 -248053 -669282 -686983 -137061 191295 -213027
32276 -213027 -782865 -784159 -287596 237458 596833 683448 318297 -245235 -338733 143095
32266 143095 485316 303369 125218 294895 217264 -550022 -1307265 -1242820 -756372 -763731
32256 -763731 -1236039 -1434524 -1154496 -735845 -198306 621140 1318844 1289707 698429 227925
32246 227925 35244 -187900 -313744 104959 866667 1183179 789962 236043 9965 66322
$$ packed form
32316E51258K25519o9343l59477l91871j90604n6857j22465j50210L1682J84359
32306c48009L1200k67840l30031o5846K77076M27232K71617o8336k37309j3256
32296c23502K80285J56034k19462k07087K10094L07902j44488m28688j04895K32557
32286b41250N2362j83039K5438K15756j17320m21229j7701N49922L28356m04322
32276b13027n69838j294M96563N25054L59375Q6615l65151n63532r3498M81828
32266A43095L42221j81947j78151J69677p7631p67286p57243O4445M86448p359
32256g63731m72308j98485K80028M18651N37539Q19446O97704k9137n91278m70504
32246B27925j92681k23144j25844M18703P61708L16512l93217n53919k26078N6357
$$ plain form
32236 66322 243254 474805 553436 298822 -33590 -76348 13337 -154115 -430729 -359913
32226 -359913 -36633 48372 -56845 163343 670337 792145 307764 -198668 -278256 -177607
32216 -177607 -221186 -305017 -265276 -169171 -25891 250246 449619 222569 -249195 -353522
32206 -353522 40821 410410 456032 461690 577753 487426 118820 7875 522316 1256165
32196 1256165 1583611 1365233 821239 202435 -139911 103058 675415 897834 613146
32187 613146 411919 602976 629971 -4280 -838140 -1074590 -649712 -96772 274332 486528
32177 486528 504716 308393 130603 136588 83868 -263637 -651361 -730202 -668064 -844760 -1145327
32166 -1145327 -1107580 -668526 -256116 -157452 -199767 -61452 378365 930691 1141684 674455
$$ packed form
32236F6322J76932K31551P8631k54614l32412m2758Q9685j67452k76614P0816
32226c59913L23280Q5005j05217K20188N06994J21808m84381n06432p9588J00649
32216a77607m3579q3831L9741R6105J43280K76137J99373k27050m71764j04327
32206c53522L94343L69589M5622N658J16063r0327l68606j10945N14441P33849
32196A256165L27446k18378n43994o18804l42346K42969N72357K22419k84688
32187F13146k01227J91057K6995o34251q33860k36450M24878N52940L71104K12196
32177D86528J8188j96323j77790N985n2720l47505l87724p8841O2138j76696l00567
32166a145327L7747M39054M12410R8664m2315J38315M39817N52326K10993m67229
$$ plain form
32156 674455 -104122 -262449 562685 1503128 1469063 574431 -67019 170890 811206 1132879
32146 1132879 971523 527918 -7839 -378206 -297190 110576 264808 -174421 -834489 -1111749
32136 -1111749 -879347 -461270 -139381 2056 -90988 -396403 -619333 -369272 341503 976736
32126 976736 1030796 622798 347567 517470 757544 514848 -170075 -672116 -547251 5555
32116 5555 528645 843637 1009009 1002686 743716 303296 -155058 -555458 -843304 -894010
32106 -894010 -722991 -630634 -853844 -1187321 -1229040 -894407 -428072 -66297 21907 -300070
32096 -300070 -808518 -808306 64347 1097982 1275928 721950 529540 1056320 1379869 839896
32086 839896 116491 53654 275626 -38299 -638575 -639525 -122721 -51345 -611273 -846054
$$ packed form
32156F74455p78577j58327Q25134R40443l4065q94632o41450K37909O40316L21673
32146A132879j61356m43605n35757l70367Q1016M07766J54232m39229o60068k77260
32136a111749K32402M18077L21889J41437r3044l05415k22930K50061P10775O35233
32126I76736N4060m07998k75231J69903K40074k42696o84923n02041J24865N52806
32116E555N23090L14992J65372o323k58970m40420m58354m00400k87846n0706
32106h94010J71019R2357k23210l33477m1719L34633M66335L61775Q8204l21977
32096c00070n08448K12Q72653J033635J77946n53978j92410N26780L23549n39973
32086H39896p23405o2837K21972l13925o00276r50N16804P1376n59928k34781
$$ plain form
32076 -846054 -182226 748668 1182279 1162940 974512 545267 -18510 -147578 279883 504772
32066 504772 80606 -263825 176150 750658 432067 -423660 -574481 124831 580054 287612
32056 287612 -25036 165156 353195 92813 -187713 -79668 9761 -356786 -818065 -859358
32046 -859358 -638046 -502944 -310062 93994 304548 22576 -265595 -69494 169860 -182331
32036 -182331 -747781 -683148 -102670 147791 -35460 71421 607641 806019 345927 -52002
32026 -52002 173578 572363 591357 514584 798468 1106231 802645 45543 -367277 -101358
32016 -101358 363793 461769 166715 -141680 -144679 129497 354113 268785 15393 -45700
32006 -45700 167567 430773 663282 978076 1223655 1032532 545129 480031 1077151 1549299
$$ packed form
32076h46054O63828R30894M33611j9339j88428m29245n63777j29068M27461K24889
32066E04772m24166l44431M39975N74508l18591q55727j50821O99312M55223k92442
32056B87612l12648J90192J88039k60382k80526J08045Q9429l66547m61279m1293
32046h59358K21312J35102J92882M04056K10554k81972k88171J96101K39354l52191
32036a82331n65450O4633N80478K50461j83251J06881N36220J98378m60092l97929
32026e2002K25580L98785J8994p6773K83884L07763l03586p57102m12820K65919
32016a01358M65151R7976k95054l08395k999K74176K24616q5328k53392o1093
32006d5700K13267K63206K32509L14794K45579j91123m87403o5098N97120M72148
$$ plain form
31996 1549299 1179016 481360 510674 1308526 1909881 1816214 1552374 1579893 1532951 1013579
31986 1013579 469075 587239 1186978 1442475 1112911 848062 1113447 1414927 1014716
31977 1014716 71493 -475994 -119659 606963 888660 617964 311414 282228 332335 244769
31967 244769 154848 244578 349666 145558 -376477 -840464 -884820 -506147 -26846 177502
31957 177502 -51017 -528614 -850869 -730939 -282060 69922 10955 -342144 -620684 -684972
31947 -684972 -749145 -926036 -900408 -401133 156802 66693 -547021 -663064 187605 1025889
31937 1025889 671601 -533524 -1138610 -567408 272116 470053 234477 131462 71392
31928 71392 -270757 -608613 -385035 321123 872241 897014 518125 -73443 -728361 -1109545
$$ packed form
31996A549299l70283o97656K9314P97852O01355r3667k63840K7519m6942n19372
31986A013579n44504J18164N99739K55497l29564k64849K65385L01480m00211
31977A014716r43223n47487L56335P26622K81697k70696l06550k9186N0107q7566
31967B44769q9921Q9730J05088k04108n22035m63987m4356L78673M79301K04348
31957A77502k28519m77597l22255J19930M48879L51982n8967l53099k78540o4288
31947f84972o4173j76891K5628M99275N57935r0109o13714j16043Q50669Q38284
31937A025889l54288j205125o05086N71202Q39524J97937k35576j03015o0070
31928G1392l42149l37856K23578P06158N51118K4773l78889n91568o54918l81184
$$ plain form
31918 -1109545 -882568 -187039 450735 702680 667724 587494 630446 874648 1192652 1221708
31908 1221708 741483 15785 -481931 -554805 -282157 195584 563611 337777 -518889 -1257811
31898 -1257811 -1207465 -729661 -617302 -758544 -327089 700027 1281744 911440 483500
31889 483500 931489 1791471 1936050 1210621 473949 298351 452408 569103 585869 489781
31879 489781 243653 51008 182076 461395 412261 1790 -239960 -80 360028 351697
31869 351697 3884 -297848 -357165 -302994 -345516 -578524 -897958 -1013674 -704530 -154993
31859 -154993 141642 -80065 -579712 -946399 -1025076 -924336 -806723 -795294 -914745 -1005933
31849 -1005933 -845293 -427895 25070 364654 584950 577745 174636 -430905 -689176 -378464
$$ packed form
31918a109545K26977O95529O37774K51945l4956q0230M2952K44202L18004K9056
31908A221708m80225p25698m97716p2874K72648M77741L68027k25834q56666p38922
31898a257811N0346M77804J12359j41242M31455J027116N81717l70304m27940
31889D83500M47989Q59982J44579p25429p36672j75598J54057J16695J6766r6088
31879D89781k46128j92645J31068K79319m9134m10471k41750K39880L60108q331
31869C51697l47813l01732n9317N4171m2522k33008l19434j15716L09144N49537
31859a54993K96635k21707m99647l66687p8677J00740J17613J1429j19451r1188
31849a005933J60640M17398M52965L39584K20296p205m03109o05541k58271L10712
$$ plain form
31839 -378464 51034 117678 -41691 -40992 65668 -21665 -200471 -123963 90748 -28975 -451929
31828 -451929 -574001 -216180 -20923 -440424 -904022 -609033 218319 571077 73732 -556360
31818 -556360 -601211 -278101 -216358 -437289 -396732 106550 619564 743474 701864 905054
31808 905054 1251147 1283261 929068 631107 683075 840034 739440 353014 -163954 -693520
31798 -693520 -969896 -595641 346879 1065225 953190 423702 273403 507960 525568 244220
31788 244220 126181 120295 -360864 -1184787 -1319131 -420547 424041 299387 -114052 287428
31778 287428 1176035 1336347 633903 125509 300811 480268 143217 -286015 -357076 -328503
31768 -328503 -488322 -533300 -169532 306571 552668 741998 1052814 1120874 604387 -101203
$$ packed form
31839c78464M29498O6644j59369O99J06660q7333j78806P6508K14711j19723m22954
31828d51929j22072L57821J95257m19501m63598K94989Q27352L52758m97345o30092
31818e56360m4851L23110O1743k20931M0557N03282N13014J23910m1610K03190
31808I05054L46093L2114l54193k97961N1968J56959j00594l86426n16968n29566
31798f93520k76376L74255R42520P18346j12035n29488j50299K34557J7608k81348
31788B44220j18039n886m81159q23923j34344Q98584Q44588j24654m13439M01480
31778B87428Q88607J60312p02444n08394J75302J79457l37051m29232p1061K8573
31768c28503j59819m4978L63768M76103K46097J89330L10816O8060n16487p05590
$$ plain form
31758 -101203 -320820 -1209 385183 599220 755356 848291 698331 339412 52043 4545
31748 4545 117544 199347 24008 -510128 -1074931 -1084446 -491773 -32561 -214391 -467320
31738 -467320 24507 934442 1102339 209288 -745034 -874931 -516489 -458011 -717851 -725452
31728 -725452 -342817 -37895 -138484 -450709 -674787 -813605 -1024738 -1272636 -1276997 -804618
31718 -804618 -21795 499039 316219 -295469 -557688 -142461 353407 153288 -695191 -1407779
31708 -1407779 -1422912 -883331 -213888 330245 593936 430868 -44622 -380856 -257964 113267
31698 113267 302863 233350 173835 265145 360069 321009 178450 -48608 -397658 -728586
31688 -728586 -734650 -373302 -41260 -65057 -199748 52538 723490 1323935 1505758 1424641
$$ packed form
31758a01203k19617L19611L86392K14037J56136R2935j49960l58919k87369m7498
31748D545J12999Q1803j75339n34136n64803r515N92673M59212j81830k52929
31738d67320M91827R09935J67897q93051r54322j29897L58442N8478k59840p601
31728g25452L82635L04922j00589l12225k24078j38818k11133k47898m361M72379
31718h04618P82823N20834j82820o11688k62219M15227M95868k00119q48479p12588
31708a407779j5133N39581O69443N44133K63691j63068m75490l36234J22892L71231
31698A13267J89596o9513n9515R1310R4924l9060j42559k27058l49050l30928
31688g28586o064L61348L32042k3797j34691K52286O70952O00445J81823q1117
$$ plain form
31678 1424641 1336305 1165603 722297 132724 -242493 -253273 -82208 48288 62944 -78270
31668 -78270 -426090 -857254 -1030008 -721522 -155502 173044 19524 -372013 -584993 -489797
31658 -489797 -308646 -268383 -308816 -205275 72388 255154 101798 -252472 -421215 -243723
31648 -243723 25907 82866 -38575 -94325 -7290 124406 305164 604750 837393 650112
31638 650112 62729 -434899 -529123 -464551 -502151 -413823 15503 359899 106717 -378216
31628 -378216 -262514 385077 556738 -101791 -578273 47692 1177255 1512877 815563
31619 815563 -14883 -333890 -336578 -310989 -174453 52454 915 -487215 -1010009 -1117815
31609 -1117815 -869936 -642534 -599184 -544516 -208562 380439 781445 567064 -20332 -184744
$$ packed form
31678A424641q8336j70702m43306n89573l75217j0780J71065J30496J4656j41214
31668g8270l47820m31164j72754L08486N66020L28546j53520l91537k12980R5196
31658d89797J81151M0263m0433J03541K77663J82766j53356l54270j68743J77492
31648b43723K69630N6959j21441n5750Q7035J31696J80758K99586K32643j87281
31638F50112n87383m97628r4224O4572l7600Q8328M29326L44396k53182m84933
31628c78216J15702O47591J71661o58529m76482O25965J129563L35622o97314
31619H15563q30446l19007k688K5589J36536K26907n1539m88130n22794j07806
31609a117815K47879K27402M3350N4668L35954N89001M01006k14381n87396j64412
$$ plain form
31599 -184744 342350 771269 372057 -283302 -58952 954179 1426160 696923 -327081
31590 -327081 -571394 -166005 152798 225731 335627 476858 517766 683729 1169083 1591789
31580 1591789 1508650 1183962 1158817 1307006 1062968 439524 48308 116429 207603 19881
31570 19881 -194444 -183695 -104521 -147288 -220554 -240014 -333709 -531792 -597986 -395338 -123866
31559 -123866 14698 115100 315179 488051 433083 211312 67194 115072 279117 468849
31549 468849 646907 735986 595960 186251 -245446 -246828 392050 1277301 1738962 1609884
31539 1609884 1382268 1398681 1261407 469249 -637033 -1174903 -919131 -576052 -711577
31530 -711577 -988346 -817333 -324249 -168167 -591162 -1128560 -1270823 -1034100 -743305 -516259
$$ packed form
31599a84744N27094M28919l99212o55359K24350J013131M71981p29237j024004
31590c27081k44313M05389L18803P2933J09896J41231M0908J65963M85354M22706
31580A591789q3139l24688k5145J48189k44038o23444l91216O8121R1174j87722
31570A9881k14325J0749P9174m2767p3266j9460r3695j98083o6194K02648K71472
31559a23866J38564J00402K00079J72872n4968k21771j44118M7878J64045J89732
31549D68849J78058Q9079j40026m09709m31697j382O38878Q85251M61661j29078
31539A609884k27616J6413j37274p92158j106282n37870K55772L43079j35525
31530g11577k76769J71013M93084J56082m22995n37398j42263K36723K90795K27046
$$ plain form
31520 -516259 -197021 290652 759020 982345 947224 765332 468890 73718 -249418 -318549
31510 -318549 -228129 -216607 -247276 -60747 295692 394870 55646 -347795 -426234 -231943
31500 -231943 72999 530035 994014 942572 231220 -400033 -253172 247867 180564 -442828
31490 -442828 -768113 -511381 -296584 -493751 -697519 -641429 -720403 -1171923 -1531175 -1404107
31480 -1404107 -1081040 -851987 -402011 470286 1150143 981456 287755 -138024 -184121 -275734
31470 -275734 -407469 -214068 145823 102711 -281383 -260409 387569 889229 595021 -70330
31460 -70330 -274388 54764 275663 7239 -473993 -771979 -874572 -992137 -1151694 -1156944
31450 -1156944 -898721 -545819 -347024 -309979 -206728 100085 486093 761601 868535 805494
$$ packed form
31520e16259L19238M87673M68368K23325l5121j81892k96442l95172l23136o9131
31510c18549R0420J1522l0669J86529L56439R9178l39224m03441p8439J94291
31500b31943L04942M57036M63979n1442p11352o31253J46861N01039o7303o23392
31490d42828l25285K56732K14797j97167k03768N6090p8974m51520l59252J27068
31480a404107L23067K29053M49976Q72297O79857j68687o93701m25779m6097r1613
31470b75734j31735J93401L59891m3112l84094K0974O47978N01660k94208o65351
31460g0330k04058L29152K20899k68424m81232k97986j02593j17565j59557n250
31450a156944K58223L52902J98795L7045J03251L06813L86008K75508J06934o3041
$$ plain form
31440 805494 558254 238216 82215 129065 95166 -207792 -537629 -579164 -431714 -376092
31430 -376092 -305931 153984 963796 1530601 1379389 671930 -41697 -349724 -200675 147433
31420 147433 322004 189828 51226 260143 659179 700391 184415 -450305 -707571 -599457
31410 -599457 -446777 -383185 -322033 -259618 -332720 -580771 -818239 -799728 -489754 -150474
31400 -150474 -91179 -289617 -402159 -264719 -170591 -394070 -648836 -434909 178025 594668
31390 594668 523217 269744 143678 92674 58597 132249 132362 -363569 -1205708 -1488375 -715810
31379 -715810 342753 609461 138787 -117282 253094 705507 729938 519285 489401 693815
31369 693815 920621 979969 770172 379583 139769 235024 327497 1884 -512597 -609533
$$ packed form
31440H05494k47240l20038j56001M6850l3899l02958l29837m1535J47450N5622
31430c76092P0161M59915Q09812N66805j51212p07459p13627l08027J49049L48108
31420A47433J74571j32176j38602K08917L99036M1212n15976o34720k57266J08114
31410e99457J52680O3592O1152O2415p3102k48051k37468J8511L09974L39280
31400a50474N9295j98438j12542J37440R4128k23479k54766K13927O12934M16643
31390E94668p1451k53473j26066n1004l4077P3652J13m95931q42139k82667P72565
31379g15810J058563K66708m70674k56069L70376M52413K4431k10653k9884K04414
31369F93815K26806N9348k09797l90589k39814R5255R2473l25613n14481r6936
$$ plain form
31359 -609533 -231121 125771 335000 793857 1479922 1696566 1165196 612289 704104 1036019
31349 1036019 845604 209195 -217397 -270487 -306575 -394107 -268292 -22787 -113266 -593365
31339 -593365 -940125 -772307 -298148 41748 18910 -310475 -644840 -599538 -160565 149621
31329 149621 -68285 -460015 -415290 18588 300591 279346 215973 64341 -430653 -903865
31319 -903865 -562588 556940 1376764 1175827 443889 -32380 -156647 -135324 101234 470860
31309 470860 450078 -67169 -267653 409275 1191035 1032065 285988 182259 865682 1191420
31299 1191420 565829 -187125 -185574 282526 478768 383059 416239 508644 237428 -303152
31289 -303152 -473524 3865 605881 671393 225789 -77444 250221 985544 1500752 1495111
$$ packed form
31359f09533L78412L56892K09229M58857O86065K16644n31370n52907R1815L31915
31349A036019j90415o36409m26592n3090l6088q7532J25815K45505r0479m80099
31339e93365l46760J67818M74159L39896k2838l29385l34365M5302M38973L10186
31329A49621k17906l91730M4725M33878K82003k1245o3373j51632m94994m73212
31319i03865L41277J119528Q19824k00937p31938m76269j24267K1323K36558L69626
31309D70860k0782n17247k00484O76928P81760j58970p46077j03729O83423L25738
31299A191420o25591p52954J551M68100J96242r5709L3180R2405k71216n40580
31289c03152j70372M77389O02016O5512m45604l03233L27665P35323N15208n641
$$ plain form
31279 1495111 1222880 991805 727287 239346 -310114 -537462 -334649 74781 504246
31270 504246 898634 1111784 983840 702162 721918 1177367 1635874 1584064 969828 177828
31260 177828 -337813 -339800 45392 381582 323181 24113 -58413 196568 404615 250706
31250 250706 -46029 -49031 288998 556287 367799 -208699 -705035 -707574 -291739 48395
31240 48395 -20632 -284356 -340519 -199109 -219558 -509831 -747626 -653066 -316021 45805
31230 45805 359479 598655 682531 636823 646114 795645 929841 874138 626096 260252 -135857
31219 -135857 -354592 -166841 330575 714656 748503 652855 678592 674035 375100 -54443
31209 -54443 -137493 276694 779731 889364 587142 279255 320721 667978 978746 990981
$$ packed form
31279A495111k72231k31075k64518m87941n49460k27348K02813M09430M29465
31270E04246L94388K13150j27944k81678J9756M55449M58507n1810o14236p92000
31260A77828n15641j987L85192L36190n8401k99068q2526K54981K08047j53909
31250B50706k96735l002L38029K67289j88488n76498m96336k539M15835L40134
31240D8395o9027k63724n6163J41410k0449k90273k37795R4560L37045L61826
31230D5805L13674K39176Q3876m5708R291J49531J34196n5703k48042l65844l96109
31219a35857k18735J87751M97416L84081L3847r5648K5737m557k98935m29543
31209e4443q3050M14187N03037J09633l02222l07887M1466L47257L10768J2235
$$ plain form
31199 990981 761092 533986 448013 432946 362769 220096 85283 -7928 -175489 -567852
31189 -567852 -1080497 -1299768 -967405 -438230 -326827 -658210 -797330 -376528 202693 489282
31179 489282 655416 945359 972148 319671 -488864 -529324 95447 276281 -508950 -1447533
31169 -1447533 -1544521 -840501 -90831 239849 256402 272688 498368 851462 962020 637836
31159 637836 270488 318660 488256 96613 -772584 -1309903 -1275723 -1292319 -1558088 -1336419
31149 -1336419 -302546 605973 507784 -82611 -169064 168600 178000 -142054 -163996 129561
31139 129561 144824 -216843 -477200 -542898 -749581 -941208 -537532 309386 605588 -96531
31129 -96531 -1015586 -1241537 -832672 -400092 -190918 -53197 110157 275247 408946 379305
$$ packed form
31199I90981k29889k27106q5973j5067p0177j42673j34813r3211j67561l92363
31189e67852n12645k19271L32363N29175J11403l31383j39120M20802N79221K86589
31179D89282J66134K89943K6789o52477q08535m0460O24771J80834p85231r38583
31169a447533r6988P04020P49670L30680J6553J6286K25680L53094J10558l24184
31159F37836l67348M8172J69596l91643q69197n37319L4180j6596k65769K21669
31149a336419J033873R08519r8189n90395q6453L37664R400l20054k1942K93557
31139A29561J5263l61667k60357o5698k06683j91627M03676Q46918K96202p02119
31129i6531r19055k25951M08865M32580K09174J37721J63354J65090J33699k9641
$$ plain form
31119 379305 31187 -471803 -707101 -558316 -381225 -458469 -654109 -763446 -811815 -815680
31109 -815680 -643836 -346691 -237928 -375403 -333967 151824 623581 412811 -424492 -1109656
31099 -1109656 -1102828 -731798 -687010 -1056603 -1163970 -502507 406278 520242 -333125 -1116272
31089 -1116272 -930740 -167118 245879 264737 555335 1122452 1146513 353039 -398054 -326176
31079 -326176 210624 416114 227538 146718 296268 322518 84137 -127671 -43046 297563
31069 297563 683980 880196 706094 252848 -65856 48905 363051 394621 57075 -270389
31059 -270389 -315623 -265352 -426399 -732166 -793606 -429841 22402 73912 -291794 -582068
31049 -582068 -468394 -235439 -312852 -586836 -590592 -294180 -204910 -563284 -892853 -643769
$$ packed form
31119C79305l48118n02990k35298J48785J77091p7244j95640j09337m8369l865
31109h15680J71844K97145J08763j37475M1436M85791M71757k10770q37303o85164
31099a109656O828L71030M4788l69593j07367O61463R08785J13964q53367p83147
31089a116272J85532P63622M12997J8858K90598N67117K4061p93474p51093P1878
31079c26176N36800K05490j88576q0820J49550K6250k38381k11808Q4625L40609
31069B97563L86417J96216j74102m53246l18704J14761L14146L1570l37546l27464
31059b70389m5234N0271j61047l05767o1440L63765M52243N1510l65706k90274
31049e82068J13674K32955p7413k73984l756K96412Q9270l58374l29569K49084
$$ plain form
31039 -643769 8847 367484 108405 -347143 -428410 -174946 -173641 -706040 -1230429 -1056232
31029 -1056232 -411820 -255456 -856187 -1247938 -612282 403846 571331 -107725 -465285
31020 -465285 66123 786583 953892 677994 283261 -277357 -878389 -916536 -179652 604380
31010 604380 700023 322883 106624 140478 138638 68645 -32396 -394285 -965242 -980263 90213
30999 90213 1467633 1823408 985048 70486 -45491 376629 638115 468171 23535 -399153
30989 -399153 -465542 -54971 487617 719984 693812 758419 894236 807917 607136 689599
30979 689599 925165 696437 -64171 -610666 -456315 -20631 184729 337245 726212 993007
30969 993007 669296 85011 -41320 260579 254898 -307424 -751293 -447884 331576 854307
$$ packed form
31039f43769O52616L58637k59079m55548q1267K53464J305n32399n24389J74197
31029a056232O44412J56364o00731l91751O35656J016128J67485o79056l57560
31020d65285N31408P20460J67309k75898l94733n60618o01032l8147P36884P84032
31010F04380R5643l77140k16259L3854j840o9993j01041l61889n70957j5021J070476
30999I0213J377420L55775q38360r14562j15977M22120K61486j69944m44636m22688
30989c99153o6389M10571N42588K32367k6172O4607J35817q6319k00781Q2463
30979F89599K35566k28728p60608n46495J54351M35684K05360J52516L88967K66795
30969I93007l23711n84285j26331L01899n681n62322m43869L03409P79460N22731
$$ plain form
30959 854307 842722 611091 518237 612286 724811 672528 401846 87860 27222 294624
30949 294624 584882 545149 185340 -194940 -381306 -342396 -77049 321651 506513 184135
30939 184135 -348830 -404334 174946 708746 582909 57675 -223732 -156864 -76617 -39537
30929 -39537 132290 243863 -117147 -810625 -1216207 -1158073 -1078441 -1159377 -1013680 -509669
30919 -509669 -146337 -189283 -136030 407679 929605 744700 61072 -359852 -253315 81141
30909 81141 439477 768386 812310 390318 -126448 -230169 -24225 22929 -118913 -118869 11047
30898 11047 -14857 -102276 78578 360208 254704 -129652 -140415 349821 711168 573024
30888 573024 298504 189425 1758 -365605 -446751 -3840 375012 92889 -506005 -649440
$$ packed form
30959H54307j1585k31631r2854R4049J12525n2283k70682l13986o0638K67402
30949B94624K90258l9733l59809l80280j86366L8910K65347L98700J84862l22378
30939A84135n32965n5504N79280N33800j25837n25234k81407O6868Q0247L7080
30929c9537J71827J11573l61010o93478m05582N8134P9632q0936J45697N04011
30919e09669L63332m2946N3253N43709N21926j84905o83628m20924J06537L34456
30909H1141L58336L28909M3924m21992n16766j03721K05944M7154j41842M4J29916
30898A1047k5904q7419J80854K81630j05504l84356j0763M90236L61347j38144
30888E73024k74520j09079j87667l67363q1146M42911L78852k82123n98894j43435
$$ plain form
30878 -649440 -278994 -34502 -265457 -649482 -768587 -588283 -319623 -165507 -265918 -616189
30868 -616189 -958611 -948772 -515291 44564 369219 372542 257507 234945 300068 342715 391850
30857 391850 541738 648089 437688 44291 15209 493827 841776 538831 30702 43915
30847 43915 432823 537329 432232 797471 1557345 1756427 1073036 427835 596483 1109237
30837 1109237 1137974 709056 338835 95221 -233065 -509322 -502592 -397364 -420348 -321802
30827 -321802 162638 700597 839490 741422 796260 849124 528203 63490 20582 380639
30817 380639 596119 456696 246050 137515 65644 104778 359718 575621 457272 245668
30807 245668 342105 517486 228353 -383342 -611003 -305525 -66220 -218308 -395700 -319294
$$ packed form
30878f49440L70446K44492k30955l84025j19105J80304K68660J54116j00411l50271
30868f16189l42422R839M33481N59855L24655L323j15035k2562O5123M2647M9135
30857C91850J49888J06351k10401l93397k9082M78618L47949l02945n08129J3213
30847D3915L88908J04506j05097L65239P59874J99082o83391o45201J68648N12754
30837A109237K8737m28918l70221k43614l28286k76257O730J05228k2984R8546
30827c21802M84440N37959J38893r8068N4838N2864l20921m64713m2908L60057
30817C80639K15480j39423k10646j08535p1871L9134K54940K15903j18349k11604
30807B45668R6437J75381k89133o11695k27661L05478K39305j52088j77392P6406
$$ plain form
30797 -319294 -226359 -267009 -172193 167343 401599 303766 108344 12835 -116595 -308851
30787 -308851 -312671 -87338 86288 168102 395117 569123 86822 -982660 -1660630 -1381864
30777 -1381864 -777300 -559568 -430799 121877 669532 480800 -163961 -353566 22431
30768 22431 252424 96858 72885 375905 502677 227233 101361 545860 1098164 1083848
30758 1083848 602560 329382 562180 905065 841801 330327 -206058 -346636 -86400 215051
30748 215051 265662 101851 -106639 -294102 -421362 -415622 -374241 -538277 -814572 -679242
30738 -679242 61190 765563 733063 200884 -31645 240832 521607 518098 415703 281108
30728 281108 -42112 -383106 -357279 -148550 -380095 -1015930 -1247091 -784634 -375310 -553282
$$ packed form
30797c19294R2935m0650R4816L39536K34256r7833j95422r5509j29430j92256
30787c08851l820K25333J73626Q1814K27015J74006m82301j069482o77970K78766
30777a381864O04564K17732J28769N52676N47655j88732o44761j89605L75997
30768B2431K29993j55566k3973L03020J26772k75444j25872M44499N52304j4316
30758A083848m81288k73178K32798L42885o3264n11474n36385j40578K60236L01451
30748B15051N0611j63811k08490j87463j27260N740M1381j64036k76295J35330
30738f79242P40432P04373l2500n32179k32529K72477K80775l509j02395j34595
30728B81108l23220l40994K5827K08729k31545o35835k31161M62457M09324j77972
$$ plain form
30718 -553282 -755433 -342487 285702 409305 176002 170336 314129 164401 -80287 99400
30708 99400 456587 271784 -347751 -517903 83 446982 346065 168111 369908 656427
30698 656427 680392 719855 1091925 1478186 1401164 937979 481209 173322 -22035 -87443
30688 -87443 -155607 -505186 -994790 -1014045 -420669 43210 -185178 -579572 -370564 199195
30678 199195 294696 -190620 -615552 -670465 -580864 -360997 196465 774314 713734 95290
30668 95290 -249472 -37800 41060 -437927 -849362 -528505 149682 375150 65553 -245709
30658 -245709 -301494 -256833 -193563 -89204 -75557 -213569 -201792 198423 647523 663044 405122
30647 405122 457535 894488 1131524 757620 48070 -442939 -439824 -45941 388353 469931
$$ packed form
30718e53282k02151M12946O28189J23603k33303n666J43793j49728k44688J79687
30708I9400L57187j84803o19535j70152N17986M46899j00917j77954K01797K86519
30698F56427K3965L9463L72070L86261p7022m63185m56770l07887j95357o5408
30688h7443o8164l49579m89604j9255N93376M63879k28388l94394K09008N69759
30678A99195R5501m85316m24932n4913Q9601K19867N57462N77849o0580o18444
30668I5290l44762K11672P8860m78987m11435L20857O78187K25468l09597l11262
30658b45709n5785M4661O3270J04359J3647j38012J1777M00215M49100J5521k57922
30647D05122N2413M36953K37036l73904p09550m91009L115L93883M34294Q1578
$$ plain form
30637 469931 119265 -299125 -459609 -548004 -885261 -1254791 -1144010 -602812 -251293 -338443
30627 -338443 -401070 -88896 239368 119337 -257814 -339069 -2476 356745 385749 86697
30617 86697 -325600 -600869 -563688 -272904 -18859 -11517 -156352 -249065 -248625 -230094 -231502
30606 -231502 -291643 -466638 -657382 -617332 -317113 -97321 -227633 -500695 -535426 -326031
30596 -326031 -174386 -175013 -105533 182482 565854 876217 1060674 1061742 792671 352413 68343
30585 68343 158308 447568 566929 392236 154208 88758 100010 -96940 -526002 -842683
30575 -842683 -792785 -591039 -590509 -692134 -451358 202261 750783 766177 458733 284240
30565 284240 284751 167057 -130736 -327121 -231526 -2967 78936 -55904 -197791 -63686
$$ packed form
30637D69931l50666m18390j60484q8395l37257l69530J10781N41198L51519q7150
30627c38443o2627L12174L28264j20031l77151q1255L36593L59221K9004k99052
30617H6697m12297k75269L7181K90784K54045P342j44835r2713M40J8531j408
30606b31502o0141j74995j90744M0050L00219K19792j30312k73062l4731K09395
30596c26031J51645o27O9480K88015L83372L10363J84457J068k69071m40258k84070
30585F8343Q9965K89260J19361j74693k38028o5450J1252j96950m29062l16681
30575h42683M9898K01746N30j01625K40776O53619N48522J5394l07444j74493
30565B84240N11j17694k97793j96385R5595K28559Q1903j34840j41887J34105
$$ plain form
30555 -63686 368173 718873 574535 37623 -328059 -202119 123187 221116 53212 -194593
30545 -194593 -451146 -653743 -641009 -471982 -503451 -801837 -891640 -528483 -247150 -532196
30535 -532196 -906242 -637989 16385 226342 -15797 -1351 288452 118038 -506821 -580077
30525 -580077 213790 801690 441874 7424 562406 1575676 1744447 992149 411684
30516 411684 539611 858326 904464 799053 622476 197161 -351168 -571633 -368901 -86701
30506 -86701 113125 320778 370855 -7920 -538453 -659914 -469089 -555648 -828075 -492021
30496 -492021 514800 1073876 418004 -733131 -1233314 -1007848 -754619 -711758 -548992
30487 -548992 -160005 195529 380807 426643 265904 -56432 -138680 250553 612099 291217
$$ packed form
30555f3686M31859L50700j44338n36912l65682J25940L25306R7929j67904k47805
30545a94593k56553k02597J2734J69027l1469k98386q9803L63157K81333k85046
30535e32196l74046K68253O54374K09957k42139J4446K89803j70414o24859p3256
30525e80077P93867N87900l59816m34450N54982J013270J68771p52298n80465
30516D11684J27927L18715M6138j05411j76577m25315n48329k20465K02732K82200
30506h6701J99826K07653N0077l78775n30533j21461J90825q6559k72427L36054
30496d92021J006821N59076o55872j151135n00183K25466K53229M2861J62766
30487e48992L88987L55534J85278M5836j60739l22336q2248L89233L61546l20882
$$ plain form
30477 291217 -530427 -1039073 -910930 -603348 -516919 -489829 -260195 99261 402532 589223
30467 589223 568862 193969 -436932 -953655 -1128712 -1046880 -801359 -378869 36833 44438
30457 44438 -445447 -950002 -946355 -464984 62660 349352 402670 288624 32350 -264354
30447 -264354 -409796 -286485 19822 256583 199103 -103094 -312562 -193392 15942 -138312
30437 -138312 -652649 -947752 -590390 115158 511057 394866 146169 117747 227953 230030
30427 230030 116659 62231 92943 45222 -124258 -172547 134821 624397 803121 424370
30417 424370 -167688 -399448 -107956 325234 438130 110667 -479125 -1106872 -1587408 -1746815
30407 -1746815 -1496886 -952702 -388656 -44172 20814 -83645 -173696 -85943 241858 693834
$$ packed form
30477B91217q21644n08646J28143L07582Q6429K7090K29634L59456L03271J86691
30467E89223k0361l74893o30901n16723j75057Q1832K45521M22490M15702P605
30457D4438m89885n04555L647M81371N27644K86692N3318j14046k56274k96704
30447b64354j45442J23311L06307K36761n7480l02197k09468J19170K09334j54254
30437a38312n14337k95103L57362P05548L95899j16191k48697k8422J10206K077
30427B30030j13371n4428L0712m7721j69480m8289L07368M89576J78724l78751
30417D24370n92058k31760K91492M33190J12896l27463n89792o27747m80536j59407
30407a746815K49929N44184N64046L44484O4986j04459r0051Q7753L27801M51976
$$ plain form
30397 693834 971711 779554 136887 -524790 -727749 -436084 -39846 168285 288149 478256
30387 478256 571938 291079 -272536 -674150 -615579 -229475 126639 186115 -81417 -440571
30377 -440571 -530085 -242398 54863 -92380 -619047 -983122 -841480 -402872 -35405 169308
30367 169308 276316 227615 -57996 -446407 -668512 -566384 -139426 504429 1082652 1206045
30357 1206045 788563 310670 375479 967168 1405269 1149419 454289 41397 224542 596330
30347 596330 612086 248902 -105586 -266797 -421455 -652050 -666510 -249659 283464 439738
30337 439738 205700 -24244 -81223 -135235 -175928 102379 713723 1131709 927912 324725
30327 324725 -188562 -475143 -637437 -587208 -195659 296748 503446 462685 530830 724791
$$ packed form
30397F93834K77877j92157o42667o61677k02959K91665L96238K08131J19864J90107
30387D78256R3682k80859n63615m01614N8571L86104L56114N9476k67532l59154
30377d40571q9514K87687K97261j47243n26667l64075J41642M38608L67467K04713
30367A69308J07008m8701k85611l88411k22105J02128M26958O43855N78223J23393
30357A206045m17482m77893O4809N91689M38101k55850o95130m12892J83145L71788
30347E96330J5756l63184l54488j61211j54658k30595j4460M16851N33123J56274
30337D39738k34038k29944n6979n4012m0693K78307O11344M17986k03797o03187
30327C24725n13287k86581j62294N0229L91549M92407K06698m0761O8145J93961
$$ plain form
30317 724791 665755 272548 11692 205929 506740 419368 60037 -52712 184920 339707
30307 339707 167302 -10303 121626 297739 79582 -353915 -337731 280884 751694 349605
30297 349605 -599841 -1046079 -470748 578053 1225443 1168860 718639 273459 3318 -104432
30287 -104432 -104262 10050 293345 654814 753629 339485 -310771 -618377 -431704 -179803
30277 -179803 -184340 -243824 -143760 -126998 -427546 -691987 -423888 186672 465282 226619
30267 226619 -48501 -84912 -263729 -913763 -1610907 -1630628 -910955 -160218 -1889 -304856
30257 -304856 -488252 -321802 -181776 -454249 -909423 -961324 -507234 -136028 -353921 -932411
30247 -932411 -1270462 -1121078 -664750 -139451 226846 155915 -356223 -812393 -764576 -452521
$$ packed form
30317G24791n9036l93207k60856J94237L00811q7372l59331j12749K37632J54787
30307C39707j72405j77605J31929J76113k18157m33497J6184O18615M70810m02089
30297C49605r49446m46238N75331J048801O47390n6583m50221m45180k70141j07750
30287a04432J70J14312K83295L61469R8815m14144o50256l07606J86673K51901
30277a79803m537n9484J00064J6762l00548k64441K68099O10560K78610k38663
30267B26619k75120l6411j78817o50034o97144j9721P19673P50737J58329l02967
30257c04856j83396J66450J40026k72473m55174n1901M54090L71206k17893n78490
30247i32411l38051J49384M56328N25299L66297p0931n12138m56170M7817L12055
$$ plain form
30237 -452521 -414744 -611455 -520982 -42241 356219 441523 507029 704555 736158 460543
30227 460543 202696 156210 46273 -275043 -461737 -291786 -99093 -143655 -104037 273797
30217 273797 564034 340129 -17766 53027 255924 -126450 -990745 -1514777 -1433092 -1322712
30207 -1322712 -1532545 -1659485 -1304848 -638208 29844 575146 724555 106162 -990583
30198 -990583 -1557846 -1064164 -183298 170986 39709 45095 242783 117731 -418152 -771630
30188 -771630 -530828 -28339 178058 4651 -238824 -398982 -656465 -1159946 -1657796 -1645165
30178 -1645165 -931224 51253 673389 788424 740737 735648 583819 188742 -133337 -118336
30168 -118336 -16882 -226996 -699710 -1093811 -1325357 -1522918 -1560701 -1143122 -394328 89291
$$ packed form
30237d52521L7777j96711R0473M78741L98460Q5304O5506J97526L1603k75615
30227D60543k57847m6486j09937l21316j86694J69951J92693m4562L9618L77834
30217B73797K90237k23905l57895P0793K02897l82374q64295n24032Q1685J10380
30207a322712k09833j26940L54637O66640O68052N45302J49409o18393j096745
30198i90583n67263M93682Q80866L54284j31277N386J97688j25052n35883l53478
30188g71630K40802N02489K06397j73407k43475j60158k57483n03481m97850J2631
30178a645165P13941R82477O22136J15035m7687n089j51829l95077l22079J5001
30168a18336J01454k10114m72714l94101k31546j97561l7783M17579P48794M83619
$$ plain form
30158 89291 -51790 -478999 -582857 -185600 323397 452958 137025 -173125 -958 526807
30148 526807 738226 261494 -440727 -681897 -454944 -293328 -411255 -542695 -589283 -797571
30138 -797571 -1162019 -1252454 -897496 -513526 -428536 -373205 -61101 173362 -134947 -748274
30128 -748274 -969646 -597091 -115251 22791 -157449 -424976 -635541 -688750 -548136 -381025
30118 -381025 -399129 -539335 -590258 -613816 -866787 -1263068 -1341719 -943185 -536708 -594633
30108 -594633 -911951 -875916 -271606 487758 894457 856266 639865 495583 444231 365602
30098 365602 196396 8304 -75663 7041 211601 377783 302860 -24879 -271133 -78583
30088 -78583 381126 499814 79087 -277973 -2128 534022 506132 -135560 -594285 -388173
$$ packed form
30158H9291j41081m27209j03858L97257N08997J29561l15933l10150J72167N27765
30148E26807K11419m76732p02221k41170K26953J61616j17927j31440m6588k08288
30138g97571l64448r0435L54958L83970Q4990N5331L12104K34463l08309o13327
30128g48274k21372L72555M81840J38042j80240k67527k10565n3209J40614J67111
30118c81025j8104j40206n0923k3558k52971l96281p8651L98534M06477n7925
30108e94633l17318L6035O04310P59364M06699l8191k16401j44282n1352p8629
30098C65602j69206j88092q3967Q2704K04560J66182p4923l27739k46254J92550
30088g8583M59709J18688m20727l57060K75845N36150k7890o41692m58725K06112
$$ plain form
30078 -388173 101982 408562 614633 872672 894266 419663 -240349 -643561 -847642 -1085966
30068 -1085966 -1135377 -623130 212535 687674 562062 237453 86076 96211 209733 483800
30058 483800 781898 749726 286151 -283579 -623640 -675998 -481336 -87019 264719 246675
30048 246675 -88855 -300620 -184395 -67504 -278946 -653757 -807418 -632907 -300086 -14672
30038 -14672 24665 -281667 -666111 -635688 -145693 211044 30514 -241079 44063 694257
30028 694257 898731 418050 -64425 86028 635343 880992 524818 -130092 -637517 -795562
30018 -795562 -662521 -390210 -79407 231291 454738 447745 224008 48041 115504 241420
30008 241420 131393 -108905 -76291 302522 604491 468658 -14612 -594696 -1153088 -1469525
$$ packed form
30078c88173M90155L06580K06071K58039K1594m74603o60012m03212k04081k38324
30068a085966m9411N12247Q35665M75139j25612l24609j51377J0135J13522K74067
30058D83800K98098l2172m63575n69730l40061n2358J94662L94317L51738j8044
30048B46675l35530k11765J16225J16891k11442l74811j53661J74511L32821K85414
30038a4672L9337l06332l84444L0423M89995L56737j80530k71593K85142O50194
30028F94257K04474m80681m82475J50453N49315K45649l56174o54910n07425j58045
30018g95562J33041K72311L10803L10698K23447o993k23737j75967O7463J25916
30008B41420j10027k40298L2614L78813L01969j35833m83270n80084n58392l16437
$$ plain form
29998 -1469525 -1103538 33836 1206150 1477640 824482 181536 275670 814508 1059255
29989 1059255 855540 691215 865415 1057904 847496 317993 -120690 -319959 -456197
29980 -456197 -556017 -349337 255164 863944 1036191 823418 576164 380174 64912 -306051
29970 -306051 -405561 -177579 18335 -30260 -56352 207822 541220 540045 184568 -213951
29960 -213951 -449765 -501717 -355076 -81122 53050 -92535 -231772 -60466 168784 -44546
29950 -44546 -616831 -897364 -603517 -217961 -253577 -580488 -756139 -643129 -394164 -129689
29940 -129689 70511 108144 56190 154632 405294 500452 390391 484594 917536 1098509
29930 1098509 568953 -103505 -45905 562149 741020 274451 48880 592406 1202151 1054955
$$ packed form
29998a469525L65987J137374J172314K71490o53158o42946R4134N38838K44747
29989A059255k03715j64325J74200J92489k10408n29503m38683j99269j36238
29980d56197r9820K06680O04501O08780J72247k12773k47254j95990l15262l70963
29970c06051r9510K27982J95914m8595k6092K64174L33398j175l55477l98519
29960b13951k35814n1952J46641K73954J34172j45585j39237J71306K29250k13330
29950d4546n72285k80533K93847L85556l5616l26911j75651J13010K48965K64475
29940a29689K00200L7633n1954R8442K50662R5158j10061R4203M32942J80973
29930A098509n29556o72458N7600O08054J78871m66569k25571N43526O09745j47196
$$ plain form
29920 1054955 453510 263453 595325 807529 577257 250536 179634 315699 503643 688610
29910 688610 760250 626732 527275 847431 1482545 1784225 1368115 655614 332362 502778
29900 502778 708196 657373 570631 736799 1016598 1012344 651636 367826 586526 1148398
29890 1148398 1438235 1113721 529578 318918 670234 1181468 1376943 1186141 880579
29881 880579 694952 635170 614189 632936 732102 825081 753964 573757 591584 942762 1284161
29870 1284161 1184791 724165 364638 283170 249956 178728 261322 395370 77457 -761105
29860 -761105 -1356531 -1084423 -384480 -75543 -123681 112118 638434 777011 386622 179570
29850 179570 529882 830133 520251 18745 -18355 208300 69614 -322628 -233707 464299
$$ packed form
29920A054955o01445j90057L31872K12204k30272l26721p0902J36065J87944J84967
29910F88610P1640j33518r9457L20156O35114L01680m16110p12501l23252J70416
29900E02778K05418n0823q6742J66168K79799m254l60708k83810K18700N61872
29890A148398K89837l24514n84143k10660L51316N11234J95475j90802l05562
29881H80579j85627n9782k0981J8747R9166R2979p1117j80207J7827L51178L41399
29870A284161r9370m60626l59527q1468l3214p1228Q2594J34048l17913q38562
29860g61105n95426K72108O99943L08937m8138K35799N26316J38577l90389k07052
29850A79570L50312L00251l09882n01506l7100K26655j38686l92242Q8921O98006
$$ plain form
29840 464299 972692 685397 37747 -118161 363186 808717 619962 -42920 -542115 -553295
29830 -553295 -393185 -533489 -970846 -1291050 -1289005 -1218731 -1345207 -1538829 -1509273 -1235637
29820 -1235637 -949214 -828504 -885982 -1013081 -980329 -576611 58213 433262 279086 -51907
29810 -51907 -21953 412140 843960 993183 902340 677208 419123 371860 726520 1228255
29800 1228255 1347050 946983 464687 295788 308636 142343 -271448 -694523 -896248 -775423
$$ packed form
29840D64299N08393k87295o47650j55908M81347M45531j88755o62882m99195j1180
29830e53295J60110j40304m37357l20204K045P0274j26476j93622K9556K73636
29820a235637K86423J20710n7478j27099L2752M03718O34824L75049j54176l30993
29810e1907K9954M34093M31820J49223r0843k25132k58085m7263L54660N01735
29800A228255J18795m00067m82296j68899J2848j66293m13791m23075k01725J20825
$$ [...]
##END NTUPLES=NMR SPECTRUM
##END=
