##TITLE=31Pdec_LY-12Dix.4.B
 CD3CN, 24 sc
 4.06.2021
##JCAMPDX= 6.0         $$ Bruker NMR JCAMP-DX V2.0
##DATA TYPE= NMR SPECTRUM
##DATA CLASS= NTUPLES
##ORIGIN= UXNMR, Bruker Analytische Messtechnik GmbH
##OWNER= root
$$ XWIN-NMR		Version 3.5
$$ Fri Jun  4 10:26:58 2021 Russian Standard Time (UT+4h)  she@DPX200
##.OBSERVE FREQUENCY= 81.013821
##.OBSERVE NUCLEUS= ^31P
##.ACQUISITION MODE= SIMULTANEOUS
##.ACQUISITION SCHEME= undefined
##.AVERAGES= 24
##.DIGITISER RES= 16
##SPECTROMETER/DATA SYSTEM= spect
##.PULSE SEQUENCE= zgpg30
##.SOLVENT NAME= CD3CN
##.SHIFT REFERENCE= (INTERNAL, CD3CN, 0, 248.564)
##AUDIT TRAIL= $$ (NUMBER, WHEN, WHO, WHERE, WHAT)
$$ ##TITLE= Audit trail, XWIN-NMR		Version 3.5
$$ ##JCAMPDX= 5.01
$$ ##ORIGIN= Bruker BioSpin GmbH
$$ ##OWNER= she
$$ F:/spectra/data/she/nmr/P31/1/pdata/1/auditp.txt
$$ ##AUDIT TRAIL=  $$ (NUMBER, WHEN, WHO, WHERE, WHAT)
(   1,<2021-06-04 10:25:07.07 +0400>,<she>,<DPX200>,
      <created by zg, POWCHK disabled, PULCHK disabled
       configuration hash MD5:
       00 E9 B6 7A A2 85 ED C7 34 08 36 98 17 FE 4E 26
       data hash MD5: 32K
       6E 87 33 EC 91 9D 74 34 0D 40 F7 E4 67 97 B2 32>)
(   2,<2021-06-04 10:25:45.32 +0400>,<she>,<DPX200>,
      <Start of raw data processing
       efp BC_mod = 2 LB = 1 FT_mod = 6 PKNL = 1 PHC0 = -5924.864 PHC1 = 174.6705 SI = 64K 
       data hash MD5: 64K
       42 47 BD D6 7D 1F 68 0D 6F 31 33 26 76 38 1A 6F>)
(   3,<2021-06-04 10:26:08.10 +0400>,<she>,<DPX200>,
      <pk PHC0 = 15.5112 PHC1 = -29.4 
       data hash MD5: 64K
       E8 8D 8C 5E 0B B2 B1 87 7A 08 8E 18 5D 7A E3 ED>)
(   4,<2021-06-04 10:26:11.32 +0400>,<she>,<DPX200>,
      <abs ABSG = 5 
       data hash MD5: 64K
       84 DC 3B B3 39 C1 E3 A1 8E EB 2D 57 EB 40 0C F4>)
$$ ##END=
$$ 
$$ hash MD5
$$ F9 06 67 67 EE C1 81 25 23 52 AD 4D 2D F1 B2 5B
##$RELAX= 
##$RELAX= 
##$RELAX= 
##$RELAX= 
##$RELAX= 
##$RELAX= 
##$RELAX= 
##$RELAX= 
$$ Bruker specific parameters
$$ --------------------------
##$DU= <F:/spectra>
##$EXPNO= 1
##$NAME= <P31>
##$PROCNO= 1
##$TYPE= <nmr>
##$USER= <she>
##$AMP= (0..31)
100 100 100 100 100 100 100 100 100 100 100 100 100 100 100 100 100 100 
100 100 100 100 100 100 100 100 100 100 100 100 100 100 
##$AQSEQ= 0
##$AQ_mod= 1
##$AUNM= <au_zg>
##$AUTOPOS= <>
##$BF1= 81.014009
##$BF2= 200.13
##$BF3= 200.13
##$BF4= 200.13
##$BF5= 200.13
##$BF6= 200.13
##$BF7= 200.13
##$BF8= 200.13
##$BYTORDA= 1
##$CFDGTYP= 0
##$CFRGTYP= 5
##$CHEMSTR= <none>
##$CNST= (0..31)
1 1 145 1 1 1 1 1 1 1 1 1 1 1 1 1 1 1 1 1 1 1 1 1 1 1 1 1 1 1 1 1 
##$CPDPRG= <waltz16>
##$CPDPRG1= <>
##$CPDPRG2= <waltz16>
##$CPDPRG3= <>
##$CPDPRG4= <mlev>
##$CPDPRG5= <mlev>
##$CPDPRG6= <mlev>
##$CPDPRG7= <mlev>
##$CPDPRG8= <mlev>
##$CPDPRGB= <>
##$CPDPRGT= <>
##$D= (0..31)
0 1 0 0 0 0 0 0 0 0 0 0.03 2e-05 3e-06 0 0 0 0 0 0 0 0 0 0 0 0 0 0 0 0 
0 0 
##$DATE= 1622787906
##$DBL= (0..7)
120 120 120 11 120 120 24 19 
##$DBP= (0..7)
150 150 150 150 150 150 150 150 
##$DBP07= 0
##$DBPNAM0= <>
##$DBPNAM1= <>
##$DBPNAM2= <>
$$ [...]
##$SUBNAM3= <"">
##$SUBNAM4= <"">
##$SUBNAM5= <"">
##$SUBNAM6= <"">
##$SUBNAM7= <"">
##$SUBNAM8= <"">
##$SUBNAM9= <"">
##$SW= 501.771253377433
##$SWIBOX= (0..15)
0 1 3 0 0 0 0 0 0 0 0 0 0 0 0 0 
##$SW_h= 40650.406504065
##$TD= 32768
##$TD0= 1
##$TE= 0
##$TE2= 300
##$TE3= 300
##$TEG= 300
##$TL= (0..7)
0 120 53 12 22 120 120 120 
##$TP= (0..7)
150 150 150 150 150 150 150 150 
##$TP07= 0
##$TPNAME0= <>
##$TPNAME1= <>
##$TPNAME2= <>
##$TPNAME3= <>
##$TPNAME4= <>
##$TPNAME5= <>
##$TPNAME6= <>
##$TPNAME7= <>
##$TPOAL= (0..7)
0.5 0.5 0.5 0.5 0.5 0.5 0.5 0.5 
##$TPOFFS= (0..7)
0 0 0 0 0 0 0 0 
##$TUNHIN= 0
##$TUNHOUT= 0
##$TUNXOUT= 0
##$USERA1= <user>
##$USERA2= <user>
##$USERA3= <user>
##$USERA4= <user>
##$USERA5= <user>
##$V9= 5
##$VALIST= <valist>
##$VCLIST= <CCCCCCCCCCCCCCC>
##$VD= 0
##$VDLIST= <DDDDDDDDDDDDDDD>
##$VPLIST= <PPPPPPPPPPPPPPP>
##$VTLIST= <TTTTTTTTTTTTTTT>
##$WBST= 1024
##$WBSW= 4
##$XGAIN= (0..3)
0 0 0 0 
##$XL= 0
##$YL= 0
##$YMAX_a= 3504
##$YMIN_a= -3202
##$ZGOPTNS= <>
##$ZL1= 120
##$ZL2= 120
##$ZL3= 120
##$ZL4= 120
##$ABSF1= 248.5645
##$ABSF2= -253.2056
##$ABSG= 5
##$ABSL= 3
##$ALPHA= 0
##$AQORDER= 0
##$ASSFAC= 0
##$ASSFACI= 0
##$ASSFACX= 0
##$ASSWID= 0
##$AUNMP= <proc_1d>
##$AZFE= 0.1
##$AZFW= 0.5
##$BCFW= 0
##$BC_mod= 2
##$BYTORDP= 0
##$COROFFS= 0
##$CY= -3
##$DATMOD= 1
##$DC= 0
##$DFILT= <>
##$DTYPP= 0
##$F1P= 0
##$F2P= 0
##$FCOR= 1
##$FTSIZE= 65536
##$FT_mod= 6
##$GAMMA= 0
##$GB= 0
##$INTBC= 1
##$INTSCL= 5.30512e-09
##$ISEN= 30
##$LB= 1
##$LEV0= 0
##$LPBIN= 0
##$MAXI= 10000
##$MC2= 0
##$MEAN= 0
##$ME_mod= 0
##$MI= 50
##$NCOEF= 0
##$NC_proc= -6
##$NLEV= 6
##$NOISF1= 182.463
##$NOISF2= 159.3651
##$NSP= 0
##$NTH_PI= 0
##$NZP= 0
##$OFFSET= 248.5645
##$PC= 4
##$PHC0= -5909.353
##$PHC1= 145.2705
##$PH_mod= 1
##$PKNL= yes
##$PPARMOD= 0
##$PSCAL= 0
##$PSIGN= 0
##$REVERSE= no
##$SF= 81.014009
##$SI= 65536
##$SIGF1= 159.3651
##$SIGF2= -187.1042
##$SINO= 113.3802
##$SIOLD= 16384
##$SREGLST= <1H.CDCl3>
##$SSB= 0
##$STSI= 65536
##$STSR= 0
##$SW_p= 40650.406504065
##$SYMM= 0
##$S_DEV= 0
##$TDeff= 32768
##$TDoff= 0
##$TI= <>
##$TILT= no
##$TM1= 0
##$TM2= 0
##$TOPLEV= 0
##$USERP1= <user>
##$USERP2= <user>
##$USERP3= <user>
##$USERP4= <user>
##$USERP5= <user>
##$WDW= 1
##$XDIM= 65536
##$YMAX_p= 467570515
##$YMIN_p= -14788012
$$ End of Bruker specific parameters
$$ ---------------------------------
##NTUPLES= NMR SPECTRUM
##VAR_NAME=  FREQUENCY,     SPECTRUM/REAL,   SPECTRUM/IMAG
##SYMBOL=    X,             R,               I
##VAR_TYPE=  INDEPENDENT,   DEPENDENT,       DEPENDENT
##VAR_FORM=  AFFN,          ASDF,            ASDF
##VAR_DIM=   65536,         65536,           65536
##UNITS=     HZ,            ARBITRARY UNITS, ARBITRARY UNITS
##FACTOR=    0.620285442955139, 1,           1
##FIRST=     20137.2065510759, 0,            0
##LAST=      -20513.1999529892, 0,           0
##MIN=       -20513.1999529892, -14788012,   0
##MAX=       20137.2065510759, 467570515,    0
$$ Real data points
##PAGE= N=1
##DATA TABLE= (X++(R..R)), XYDATA
$$ [...]
35200A680444M005057O86694l881092n224225k855137N15325K600690K631933
35192A59689R42613q66824j122072m88473j036521k261832j237690K084965L611467
35183b14678J313006j212338m25464J605671J173707p92782r53308M03562M39377
35174A336753o75265j82686J953149K657832O68285j851725k684487j546647R36708
35165F11917L419654L665696R88463k003367k707222k088206k090196j706646
35157a909907N03994K214502N33460k215391j379581K286481L515129Q89226j561313
35148B876600j511659j193586k000699j932204k02949P14623l05374r60927M9079
35139d467096Q68164N05903O12746J484247Q52995j386163j889333M90574K373353
$$ y = [1680444, 5685501, 6372195, 2491103, -2733122, -5588259, -5072934, -2472244, 159689, 1102302, 235478, -886594, -1375067, -2411588, -4673420, -5911110, -3826145, -214678, 1098328, -114010, -539474, 1066197, 2239904, 1447122, 493814, 897376, 1336753, 661488, 478802, 2431951, 5089783, 5758068, 3906343, 1221856, -324791, 611917, 4031571, 7697267, 8685730, 6682363, 3975141, 1886935, -203261, -1909907, -1405913, 808589, 1342049, -873342, -2252923, 33558, 3548687, 4437913, 2876600, 1364941, 171355, -1829344, -3761548, -3964497, -3249874, -3555248, -4516175, -4467096, -3598932, -3093029, -2480283, -996036, -143041, -1529204, -3418537, -2927963, -554610]
35130e54610J532037K46996M16336J49699j699667k373247j45242J997348J373953
35121I43603J01133O69458J220934m81173k333545j718641l67501o79880p81831
35112c427443J654569M040225K856670Q4683j52296J155392J36947k427933k258284
35103A662530P77949K409175J087898l56195k91225k01084o48483k03118R85225
35094E222672Q42205q48022k042300j952876j502364p15416P34430J251539m41008
35085E48860j933741m14389K042029J552110n86134r986K495357J837609k130087
35076C401628l516331p6123L018465J644059j384125k072021j267346j332087
35068a583881j578965o60541M08724P04361J254220K055146J186695r81277j226592
$$ y = [-554610, 977427, 1224423, 1640759, 1790458, 90791, -2282456, -2427698, -430350, 943603, 1044736, 1714194, 2935128, 2453955, 120410, -1598231, -1965732, -2645612, -3427443, -1772874, 2267351, 5124021, 5208704, 5056408, 6211800, 6348747, 3920814, 1662530, 2440479, 4849654, 5937552, 5581357, 5290132, 5089048, 4440565, 4237447, 5222672, 6064877, 5216855, 3174555, 1221679, -280685, -996101, -261671, 989868, 548860, -1384881, -1799270, 242759, 1794869, 1208735, 1198749, 3694106, 5531715, 3401628, -114703, -190826, 2827639, 4471698, 3087573, 1015552, -251794, -1583881, -3162846, -3823387, -3414663, -2710302, -1456082, 599064, 1785759, 804482, -422110]
35059d22110O68315O81219k101099k692980J394877M792218K394447k308845k979970
35050e73928k27895Q54382l25646j81437J742562K322209P87176n55159r04269
35041B937995j337831j391378M9391J350950K33971j730308j359587N31719O65005
35032e0073o51200l28576J359760J070579j298620k197778p12385J66212p11116
35023c353197r15142N02704J302599O70267O16307J410108O15830j661858j673598
35014b485980J605207L867999J953526j495650k760486k279269j991318j334536
35006d920507N23789J713611N82893r83854m86216J215971J779778R94679j23108
34997B97036j430718k322554j047413J922041K849570J43381k385731j258451
$$ y = [-422110, 246205, 927424, -1173675, -3866655, -2471778, 2320440, 4714887, 2406042, -573928, -801823, 52559, -273087, -454524, 1288038, 3610247, 4397423, 3842264, 2937995, 1600164, 208786, 258177, 1609127, 1843098, 112790, -1246797, -715078, -50073, -701273, -1029849, 329911, 1400490, 101870, -2095908, -2808293, -2642081, -3353197, -4268339, -3765635, -2463036, -1792769, -1176462, 233646, 849476, -812382, -2485980, -880773, 2987226, 4940752, 3445102, 684616, -1594653, -3585971, -4920507, -4396718, -2683107, -2100214, -3084068, -3570284, -2354313, -574535, 420144, 297036, -1133682, -3456236, -4503649, -2581608, 267962, 411343, -1974388, -3232839]
34989c232839J019647M83127j247815k735L049077K867734q13260k637691j22181
34980f36936K724390K021637n85293j570774p44082p9198j06112j55921l51408
34971E16303j003734j211923J1567J894497K596547J423254m82505j465243r98345
34962A280418o0464K33571K05208Q45096J490606K71295k297774k760881K32362
34953e60563K857994J160706k820618l720001m13721L039292L428394J450989
34945D422472j012426k784640k520822J86890K622489J659439j235654j810436
34937d72688J25370N50270j462795j879117J052529L280084J650505r21302p40359
34928A182497O24176p1904j753300j344149O08997J272777N47877M69291J075983
$$ y = [-3232839, -2213192, -1730065, -2977880, -2980615, 68462, 2936196, 2122936, -514755, -636936, 2087454, 4109091, 3523798, 1953024, 1208942, 1129744, 1023632, 867711, 516303, -487431, -1699354, -1687787, 206710, 2803257, 4226511, 3744006, 2278763, 1280418, 1219954, 1453525, 1658733, 2503829, 3994435, 4265730, 1967956, -792925, -560563, 2297431, 3458137, 637519, -3082482, -3496203, -456911, 2971483, 4422472, 3410046, 625406, -1895416, -1708526, 913963, 2573402, 1337748, -472688, -347318, 202952, -1259843, -3138960, -2086431, 1193653, 2844158, 1922856, 1182497, 1806673, 1734769, -18531, -1362680, -753683, 519094, 1066971, 1536262, 2612245]
34919B612245P54642n20397j606866k425232k835066j335260J931497L385938
34911c8499R96224j613207m87882J927040Q11257k552200k766347M24885J826195
34902a472534k30148j555265P6912J429869K65747p79359L71662J365258K75486
34893b52372n32936R31642K096329L60138j853644r54994J746813K248310J37494
34884C926780j458901r35690L91922J125915J090040M80027j26517P4790M05072
34875D973438r36353l198175k716130J211982L469314Q6842m855302m415755R62011
34866e418128M181338J973704j318993j414312R0546L7719p34821K73146K261659
34857f8142K265968q2591k090042j913145n16917M18018O92270J014523J309064
$$ y = [2612245, 3366887, 2846490, 1239624, -1185608, -4020674, -5355934, -3424437, -38499, 957725, -655482, -1143364, 783676, 1594933, -957267, -3723614, -3298729, -1472534, -1702682, -3257947, -3181035, -1751166, -1485419, -2264778, -1893116, -527858, -252372, -785308, 146334, 2242663, 2602801, 749157, -205837, 1540976, 3789286, 3926780, 2467879, 1532189, 1924111, 3050026, 4140066, 4620093, 4493576, 4568366, 4973438, 4037085, 838910, -1877220, -665238, 2804076, 2890918, -1964384, -6380139, -5418128, -1236790, 736914, -582079, -1996391, -1905845, -1868126, -2602947, -2329801, -68142, 2197826, 2115235, 25193, -1887952, -2404869, -1986851, -1294581, -280058, 1029006]
34848A029006O64119r84250j972424p54622J498160J723272q51176l051124j901202
34839d600241J088634K183319R06443J34082R43918R96101r31101k295113r60803
34830b534761P42278o03049l631523l514349Q48714M581858L302934q64527k296326
34821c968751N62655L681495L424115R80462m98042o35141j176755k107142j624650
34812a361754K02052R27938l28569j287897k96157Q51134j8922j632301j195466
34803d139942J113941K387263J228497p74690j777202j629235q43508M35724J839093
34794b160059K496602J876147J92214j851673l004939j952155Q78351K871713
34786f53799K263217P32970Q67642J876746P03517k706549m459518k043905K035750
$$ y = [1029006, 1693125, 708875, -1263549, -2018171, -520011, 1203261, 352085, -2699039, -4600241, -3511607, -1328288, -421845, -287763, 656155, 1652256, 721155, -1573958, -2534761, -1792483, -2395532, -6027055, -9541404, -8692690, -4110832, -807898, -1672425, -3968751, -3406096, 275399, 3699514, 4679976, 4181934, 3546793, 2370038, 262896, -1361754, -1159702, -231764, -560333, -1848230, -2144387, -1293253, -1312175, -2944476, -4139942, -3026001, -638738, 589759, -184931, -1962133, -3591368, -4434876, -3999152, -2160059, 336543, 2212690, 2404904, 553231, -2451708, -4403863, -3525512, -653799, 1609418, 2342388, 3210030, 5086776, 5790293, 3083744, -1375774, -3419679, -1383929]
34777a383929L539045J566378j218754k163690r99754N90730P87535n26887j483792
34768a293118n45575J138764J169912m83041j398975n28955L34955j53008n96036
34759b355077N31885K063128K001516O99819J6777L57939O40050M30874R7233
34750D484144o05425k023166k979063j777818R87421K552519J494311m27236p82742
34741I22945L41589P85676o03437k449239k597506p39238J312152J876917J201814
34732E1673N50537K68389j54735n30551l0215J095518J475007P76913K73427M95243
34722D271206J26253j491773k510226j134762J261391J808723J49102j483884
34714I96030j718284j204030m65439Q37969K067210J518734p99129k444960j879173
$$ y = [-1383929, 2155116, 3721494, 2502740, 339050, -660704, -69974, 717561, 190674, -1293118, -1838693, -699929, 469983, -13058, -1412033, -1940988, -1606033, -1759041, -2355077, -1823192, 239936, 2241452, 2941271, 2958048, 3315987, 3956037, 4386911, 4484144, 3878719, 1855553, -1123510, -2901328, -1913907, 638612, 2132923, 1705687, 922945, 1264534, 2050210, 1446773, -1002466, -3599972, -4339210, -3027058, -1150141, 51673, 602210, 870599, 715864, 185313, 155098, 1250616, 2725623, 3502536, 3775963, 4271206, 4397459, 2905686, 395460, -739302, 522089, 2330812, 2479914, 996030, -722254, -1926284, -2391723, -1553754, 513456, 2032190, 1233061, -1211899, -3091072]
34705c091072n77634k72224k0905J708511L493525K490678q15371k445836l30132
34696A39540K636834K516102m70729k663022j926676K27076J337414Q98964P8841
34687B774344o4538O58129J657355J795018L46268j701028k236631o84322R03553
34678C448148N17412r43189j075905K90915Q56458m27683j579463o85158J021263
34669A422798J058914m14150r45111J96346Q38292m13067j521404L5818K959627
34660C218063L286366j49194l744332l634226m64606J899541J430128j39686k76209
34651A425845J116603J961338O37615k130677l756976k344217Q92665K495993
34643B98189R13074j272239q88869J075416R68603j599088k813426o31403J855371
$$ y = [-3091072, -3668706, -3940930, -3961835, -2253324, 1240201, 3730879, 2915508, 469672, 139540, 2776374, 5292476, 4821747, 2158725, 232049, 459125, 1796539, 2695503, 2774344, 2709806, 3367935, 5025290, 6820308, 7166576, 5465548, 3228917, 2544595, 3448148, 3965560, 3022371, 1946466, 2237381, 3093839, 2666156, 1086693, 401535, 1422798, 2481712, 2067562, 1122451, 1318797, 2157089, 1744022, 222618, 258436, 3218063, 6504429, 6355235, 2610903, -1023323, -1487929, 411612, 1841740, 1702054, 1425845, 2542448, 4503786, 5141401, 3010724, -746252, -3090469, -2197804, 298189, 1211263, -60976, -949845, 125571, 1094174, -504914, -3318340, -3949743, -2094372]
34634b094372J302555p14246o99225Q81953Q12189r69882j182073R57700K089439
34625C84038K58115j712709o90411J853681K283874K71305j232216o56887L88637
34616A147427N6692j259610k015022j564328l74186Q71364J667744J686599R38771
34607A155451j61809j073562j377737q32985M70863J882726K414723J576834M3091
34598D097595q18116l46794O48847Q82291J47918o96384j211099j926630l081598
34589b303970l698276k644013j36434K397081L597095K966347R99751r77939j634082
34580a434440p70929O71209J724673J841879O35397j404279k225843l72344K123680
34571G89003J745018j051231j822727R32847K803629L03260l138420k361398J336470
$$ y = [-2094372, -791817, -1506063, -2205288, -1323335, -511146, -1481028, -2663101, -1705401, 384038, 642153, -1070556, -1760967, 92714, 2376588, 2647893, 1415677, 758790, 1147427, 1204119, -55491, -2070513, -3634841, -4009027, -3137663, -1469919, 216680, 1155451, 993642, -79920, -1457657, -2290642, -1819779, 62947, 2477670, 4054504, 4097595, 3279479, 2932685, 3581532, 4463823, 4611741, 3915357, 2704258, 777628, -2303970, -6002246, -8646259, -8782693, -6385612, -2788517, 177830, 1177581, 199642, -1434440, -2205369, -1534160, 190513, 2032392, 2667789, 1263510, -962333, -1334677, 789003, 2534021, 1482790, -339937, 592910, 3396539, 3699799, 561379, -1800019, -463549]
34562d63549K534546L42226j174570n17639n54769k203661k260838O42900L055263
34553f00091K107478l29230j337821j056451p22816j53511M63664l44974k131559
34544d105311j831929J306045L626319K528813L94069P6295K41027j193673k525980
34535a484325j389214O26381Q57097L36504J137218J654822l22675k247995l99530
34526a231717K844987J813972k936183m651991p36583L376793K769100k44336
34518A004042j008219M51627J014966p8931j011310p66112J90364J396950K380097
34509C573474K173958N54441j145700j683313j417042j282969j363265j259640
34501a850056q14606R7788J378237K038334J127392m91185r18258L1637O67001
$$ y = [-463549, 2070997, 2413223, 1238653, 721014, 166245, -2037416, -4298254, -3655354, -600091, 1507387, 1178157, -159664, -1216115, -1938931, -2092442, -1628778, -1973752, -4105311, -5937240, -4631195, -1004876, 1523937, 1918006, 1994301, 2235328, 1041655, -1484325, -2873539, -2247158, -1390061, -1053557, 83661, 1738483, 1415808, -832187, -1231717, 1613270, 3427242, 491059, -4160932, -4897515, -1520722, 1248378, 1004042, -4177, 447450, 1462416, 1383485, 372175, -393937, -203573, 1193377, 3573474, 5747432, 6301873, 5156173, 3472860, 2055818, 772849, -590416, -1850056, -2664662, -2566874, -1188637, 849697, 1977089, 1485904, 567646, 599283, 1266284]
34492A266284J94503m19176o77135j296003k097167j626510J25588J043673J94696
34483c291247n34873L62939J490837J132360K60208O44008J644927J464438L70527
34474C544124j8396J01023q63239k435095j964356J145825L549222K041659j869527
34465C231240l544251j058201K451638K967138O12693j089542l32412Q08305n5830
34456C990778j931009k087554k30107J174189N11365j020654j431434l94471Q81588
34447e37309J181550K09195j273670j961356j178192M75537J975863K801142K524708
34438D217468O48372j996428k903536p40415K292787K869900O54994j878780k925379
34429B38983k433277o08911J903996K921657Q98460j984561k162719r8219L45315
$$ y = [1266284, 1460787, 1041611, 364476, -931527, -3028694, -4655204, -4529616, -3485943, -3291247, -3826120, -3463181, -1972344, -839984, -579776, 64232, 1709159, 3173597, 3544124, 3525728, 3626751, 2763512, 328417, -1635939, -490114, 3059108, 5100767, 3231240, -313011, -1371212, 1080426, 4047564, 4660257, 3570715, 3238303, 4046608, 3990778, 2059769, -27785, -257892, 916297, 1427662, 407008, -1024426, -1418897, -537309, 644241, 853436, -420234, -2381590, -3559782, -3084245, -1108382, 1692760, 4217468, 4865840, 2869412, -34124, -774539, 1518248, 4388148, 5043142, 3164362, 238983, -2194294, -2803205, -899209, 2022448, 2920908, 936347, -1226372, -1324591, -979276]
34420i79276j646453k273582N02182L230281K269248o76520j657156n30151k13246
34411a974673j425150j853772k03370J899387K370727J135491j88621l3748J576610
34402A302881K705517J457092j350996k798231j719137j77302j36404p17410l20467
34393a754457M85661L05559l29122J12931J318803J387322l30054k245572k376436
34384c425365l64450K032583K270400k12146k618222j867544J013486K052869
34376a118389J70367j350472k40667J475983J421288N19613K73697j08061r35247
34367A08112m993L014233L810365l10524m610214k991049K470718M313742O83395
34358F483785l002016l045523j492628m55077J061516K850288K016614j533659
$$ y = [-979276, -2625729, -4899311, -4397129, -1166848, 1102400, 425880, -1231276, -1761427, -1974673, -3399823, -5253595, -5456965, -3557578, -1186851, -51360, -239981, -273729, 1302881, 4008398, 5465490, 4114494, 1316263, -402874, -580176, -716580, -1433990, -1754457, -1268796, -963237, -1292359, -1179428, 139375, 1526697, 1196643, -1048929, -3425365, -3789815, -1757232, 513168, 301022, -2317200, -4184744, -3171258, -1118389, -948022, -2298494, -2539161, -1063178, 358110, 877723, 1151420, 1043359, 108112, 103119, 3117352, 6927717, 6617193, 2006979, -984070, 1486648, 5800390, 6483785, 3481769, 436246, -1056382, -1511459, -449943, 2400345, 4416959, 2883300]
34350B883300l276479p76179K256902J797432o04117j170594K88078J403918J307954
34341D110215M46244j179876k718371j962373J068506K750762R67630j305592
34333B177145p79481Q56359L61658j216453q51921N88344L9255j689437j103095
34324a617626J388276J809810k57743p19928J671301K721634l9521k775146j471850
34315G09207J502657J337227j560737k580295k44743K008518J435216m42178r46890
34306A217982j86966k12055j663843k864575k018738N18644K494678K299346R18184
34297E02657O29665J788863K162768J33783k670655l253204j049000J557009K257992
34288B059878J109767k12515l91700M60986J031682J42163j608750k024246n3007
$$ y = [2883300, -393179, -1169358, 1087544, 2884976, 2280859, 1110265, 1398343, 2802261, 4110215, 4556459, 3376583, 658212, -1304161, -235655, 2515107, 3482737, 2177145, 1397664, 2254023, 2615681, 1399228, 547307, 1135651, 1174906, -514531, -1617626, -229350, 1580460, 1322717, 602789, 2274090, 4995724, 4956203, 2181057, 709207, 2211864, 3549091, 1988354, -591941, -836684, 1171834, 2607050, 2164872, 1217982, 1031016, 818961, -844882, -3709457, -5728195, -5209551, -2714873, -415527, 502657, 1132322, 2921185, 5083953, 5217736, 2547081, -706123, -1755123, -198114, 2059878, 3169645, 2957130, 2565430, 3026416, 4058098, 4200261, 2591511, 567265, 514258]
34279E14258K215533J808308j026620k818274j486406R12335J289885k30400j187643
34270i024r54475j352244k820155k743016O24597M497530M583420J120161j207956
34261A738838M851J418591o73715m099573l599584J136990M485630K723182j073449
34252B061761k072880l12746R16150Q21664J109052J477495k36697l190865l336737
34243b763803L57216L379532J824505k033972l280905j087783J402309K187971
34235a4930J810600O41361j454368k868736j308714K223918L678548J298987j984962
34226B021704k796380j426612r3491O28259J479049K194664J789578L94409r60138
34217C231042j827393k222389j724633j43564J490067J964018J462049R25616
$$ y = [514258, 2729791, 4538099, 3511479, 693205, -793201, 119134, 1409019, 1178619, -9024, -963499, -2315743, -5135898, -7878914, -7254317, -2756787, 1826633, 2946794, 1738838, 1743689, 3162280, 2488565, -1611008, -5210592, -4073602, 412028, 3135210, 2061761, -11119, -323865, 592285, 1413949, 2523001, 4000496, 3763799, 572934, -2763803, -2406587, 972945, 2797450, 763478, -2517427, -3605210, -2202901, -14930, 1795670, 2437031, 982663, -1886073, -3194787, -970869, 2707679, 4006666, 2021704, -774676, -2201288, -2294779, -1666520, -187471, 2007193, 3796771, 4191180, 3231042, 1403649, -818740, -2543373, -2686937, -1196870, 767148, 2229197, 3154813]
34209C154813M34687m80851j456080j634452j080618n41763o1833Q68110J943756
34200A145769K133356J192020L4049m97435m16403j77991j48694l45943k66720
34191B652008M92354J052256j59354k758997l829404j617187J520098K055807
34183e92419J52128j089461n78117k08201p71391m11953J629189K894746J392851
34174B417372j014783j323900K20648R83945J24089o34273q1523Q17837O10189
34165B119601p42051j906770j358007J217893L948340L923260M76205l327985
34157D350486l893762j342216R69683R24070j31108M8910J424973K048673Q11359
34148E211068j180960j967080j008483K14815N9053j164582j692226q58732Q8083
$$ y = [3154813, 3589500, 3108649, 1652569, 18117, -1062501, -1604264, -1666097, -797987, 1145769, 3279125, 4471145, 4505194, 4007759, 3591356, 3413365, 3264671, 2918728, 2652008, 3144362, 4196618, 4037264, 1278267, -2551137, -4168324, -2648226, -592419, -440291, -1529752, -2107869, -2316070, -3087461, -3499414, -1870225, 1024521, 2417372, 1402589, 78689, 299337, 1283282, 1407371, 773098, 691575, 1509412, 2119601, 1377550, -529220, -1887227, -669334, 3279006, 7202266, 7678471, 4350486, 456724, -885492, 84191, 1008261, 877153, 926063, 2351036, 4399709, 5211068, 4030108, 2063028, 1054545, 1269360, 1328413, 163831, -1528395, -2387127, -2299044]
34139b299044J43353N2889O63282J176945N79431l32291j97826M85016K65248
34130E37003n15085k06291J086378J363714k6192j302416j045291j3396N65441
34121D43865N59728L4075j188273k196914j422357M78627N61912j922261l408007
34112h059605p94191L616575M935668K243602p77176j238431k0697P94424P15682
34103A415851L13411p4674k83184k73186m68548j030272j086501j28927M51362
34094a164668p32349k207418j352708J242425K261856Q63155o1023J095490J974697
34085A919457N93793j035853n22828N07471p67365l169568l159913o02299J148129
34076e088976O37671j12982K08717K51350o38356n43041J634638L613221K858426
$$ y = [-2299044, -2155691, -2102802, -1439520, -262575, 316856, -15435, -213261, 271755, 537003, 21918, -184373, 902005, 2265719, 2239527, 937111, -108180, -121576, 443865, 1003593, 1037668, -150605, -2347519, -3769876, -3291249, -2729337, -4651598, -8059605, -8853796, -5237221, -301553, 1942049, 1164873, -73558, -94255, 700169, 1415851, 1729262, 1654588, 1371404, 1098218, 629670, -400602, -1487103, -1616030, -1164668, -1897017, -4104435, -5457143, -4214718, -1952862, -1089707, -1150730, -55240, 1919457, 2513250, 1477397, 954569, 1462040, 694675, -2474893, -5634806, -6237105, -5088976, -4451305, -4564287, -4355570, -4104220, -4742576, -5285617, -3650979, -37758, 2820668]
34067B820668L86602q58781j67961O24329K72442n09706o75592k04795L62997
34058B050203O54963N14783K6150m08499m26563o6372M43704Q92074Q61617q1795
34048D460265j560165k383923j922176q69643r9347N20517J405843K082735J792337
34039C426443P98056m4484p09228j717905k537425j786644M69792K050261J343072
34030A291938l40049n44961P19605R92179p70418k285719j195898J270115J972762
34021A109554M90068m96091L43555R30073m86632k062523j229344R17246J130954
34012F46860q62603j973420o06714J168740J201997K74984P4054M02279K59071
34003E85248K070M26313Q52675J39098j071324r71399P30210K199605J640740
$$ y = [2820668, 3207270, 2348489, 2180528, 2804857, 3077299, 2567593, 1892001, 1687206, 2050203, 2705166, 3219949, 3246099, 2837600, 2411037, 2344665, 2788369, 3680443, 4542060, 4460265, 2900100, 516177, -1405999, -2275642, -2374989, -1854472, -448629, 1634106, 3426443, 4224499, 4180015, 3470787, 1752882, -784543, -2571187, -2101395, -51134, 1291938, 951889, 406928, 1126533, 2118712, 1348294, -937425, -2133323, -863208, 1109554, 1599622, 1103531, 1447086, 2377159, 1890527, -171996, -1401340, -484094, 646860, -215743, -2189163, -2795877, -1627137, -425140, -150156, -76102, 326177, 585248, 587318, 1013631, 1866306, 2005404, 934080, -37319, 692891, 2892496, 4533236]
33994D533236p55845k952107k805302k25716K209574J870065m44174j293255N04149
33985F40625K004171O49284j708793j776155R0213R33892J43013k22625L90919
33976A144544K28570j064450j472057k59569O72832L27056L23193J470303J795432
33967C165854J94853r59086K77195J578393p135k641783k199480Q96484K014887
33958B320182l40488k178953n02040J979211J306660j550382k423017k95215J549208
33949a34834N87156j601389j953661j14348J349640M55414j543854j663633P57934
33940c861575K681246J232342j938878k469910N29458L013117J906273n15194
33932E76879n60075J124287J217047m97136j146743p7322J34167j443400k203270
$$ y = [4533236, 3777391, 825284, -1980018, -2205734, 3840, 1873905, 1429731, 136476, 640625, 2644796, 3294080, 1585287, -190868, -100655, 833237, 976250, 753625, 1144544, 1373114, 308664, -1163393, -1422962, -750130, -423074, -99881, 1370422, 3165854, 3360707, 2401621, 2678816, 4257209, 4250074, 1608291, -591189, 305295, 2320182, 1979694, -199259, -701299, 1277912, 2584572, 1034190, -1388827, -1684042, -134834, 452322, -1149067, -3102728, -3217076, -1867436, -1412022, -2955876, -4619509, -3861575, -1180329, 52013, -1886865, -4356775, -3827317, -814200, 1092073, 576879, 16804, 1141091, 2358138, 1861002, 714259, 636937, 771104, -672296, -2875566]
33923b875566m02046K016507K797096K450623J926931K98054k614730m082413
33915d85544k157137O28677O85032j218080j620990j49478M71941l79947l13284
33906d538810J370923K111465N31792r95299j29845J744718J802685l0895j299963
33897E66771n16056J220926J795475L85534j651677k083433l54984J614523J920698
33888B897777J013268K08394q69894l047117m713592l223263Q60239L832951L550890
33879E09653J483787j53836o23837J34468J553333J533863j185612l663055j842549
33870b253785K514142K995417j780535n128014k045453L161436L563616k41502
33862G85322k187091k15219K093422K096904R37566O595r08081j585621j069066
$$ y = [-2875566, -3277612, -1261105, 1535991, 3986614, 5913545, 6211599, 3596869, -485544, -2642681, -2014004, -1328972, -2547052, -4168042, -4317520, -3845579, -4225526, -4538810, -3167887, -1056422, -524630, -1519929, -1649774, 94944, 1897629, 1866734, 566771, 50715, 1271641, 3067116, 3452650, 1800973, -282460, -637444, 977079, 2897777, 3911045, 4119439, 3249545, 202428, -4511164, -7734427, -6874188, -3041237, 509653, 1993440, 1839604, 1215767, 1350235, 2903568, 4437431, 3251819, -411236, -2253785, 260357, 3255774, 1475239, -3652775, -5698228, -2536792, 1026824, 785322, -1401769, -1616988, 476434, 2573338, 3510904, 3517499, 2609418, 1023797, -45269]
33853d5269K24395Q72525Q70682J228753J640473J015512l25283j292155j852936
33844B336697k025439p27609J773388K444228j86494k631101j385528J150809
33836G48951O36468j542681o58787K635352K906920o87492k708265m60075J993515
33827B863906J177360n87134m16723J58959q80735j768003m82980J178461Q04965
33818B048076m95390n54765O3731j90060r22018j287968j781569k236639j051000
33809f407602J415182K168891O42349L57251K699153L603265L12880l080778j788919
33800g8328J867240K374243l63311k193727k016108j837190j428723Q13466K906709
33791D4271J472364j733028j696716J575565K888280L95079j872180j137279L55909
$$ y = [-45269, 179126, 1051651, 1922333, 3151086, 4791559, 5807071, 5481788, 4189633, 2336697, 311258, -416351, 1357037, 3801265, 3614771, 983670, -401858, 748951, 1385419, -157262, -816049, 1819303, 4726223, 4038731, 1330466, 870391, 2863906, 4041266, 3454132, 3037409, 3196368, 2315633, 547630, 64650, 1243111, 2048076, 1552686, 997921, 1061652, 871592, -50426, -1338394, -3119963, -5356602, -6407602, -4992420, -2823529, -2181180, -1823929, 875224, 4478489, 4791369, 1710591, -78328, 1788912, 4163155, 3799844, 1606117, -409991, -2247181, -3675904, -2862438, 44271, 1516635, -216393, -1913109, -337544, 2550736, 2945815, 1073635, -63644, 292265]
33782B92265M22197L13498R13738N57327j033877j239289O79895J715544M24683
33773C045981l94042R59006J663675l65991k220881j018551P89542j98900k016359
33764B43480p16189K327511K291461j018921k647824k62929K599811K276714j42843
33755D950271j472118r18795O2419M17362K28627r8500k41051j82626m25219j272434
33745A047936j959765j468151o7836R75866J007696K86722q28235j792683j598416
33736d396866o4757J197599Q00967q8985N07120J872313J435879q85843k092883
33727a715456o17081J306277J199650o7086j51627J047069J684085R27825l43289
33718C270367j243312j657809j638160j239225o78595Q0639J190545J771654L54212
$$ y = [292265, 714462, 1027960, 1941698, 2499025, 1465148, 225859, 905754, 2621298, 3045981, 2651939, 3610945, 5274620, 4908629, 2687748, 1669197, 2458739, 2259839, 243480, -472709, 1854802, 4146263, 3127342, 479518, 216589, 2816400, 5093114, 4950271, 3478153, 2559358, 2621777, 3039139, 3267766, 3169266, 2928215, 2745589, 2320370, 1047936, -911829, -2379980, -2447816, -1471950, -464254, -177532, -1005767, -2798450, -4396866, -4461623, -3264024, -2463057, -2552042, -2044922, -172609, 1263270, 377427, -1715456, -2332537, -1026260, 173390, 106304, -45323, 1001746, 2685831, 3613656, 3270367, 2027055, 369246, -1268914, -2508139, -3186734, -3106095, -1915550, -143896, 210316]
33709B10316k364856k999308J81732L870140L529631k48617k497348r00997J482577
33700B63270J373975l43589j205324j131225j277169j170737J40652J580248J493095
33691b76804N47278M86442R17734K28478j011759p78386N59286N53517r29887
33682B95899j256610K27964Q13651n85687r40517J633964L603809J011183l592280
33673A211376l976879P63096M758395L534272n30648k541416j481455J10124M56019
33664B302884j68301j091458j673513q35428J509428K970908J053500k852250
33656A215770m334138j719100J351320R00231j679749j697844J776622M294651
33648A07763K371328j541996k669588n05585J182417J73898j506973j171789Q30282
$$ y = [210316, -2154540, -5153848, -4972116, -1101976, 2427655, 2179038, -318310, -1219307, 263270, 1637245, 1293656, 88332, -1042893, -2320062, -3490799, -3350147, -1769899, -276804, 270474, 756916, 1674650, 1903128, 891369, 112983, 672269, 1225786, 295899, -960711, -732747, 80904, -504783, -1445300, 188664, 3792473, 4803656, 1211376, -2765503, -2002407, 2755988, 6290260, 5759612, 3218196, 1736741, 1846865, 2302884, 2134583, 1043125, -630388, -1465816, 43612, 3014520, 4068020, 1215770, -3118368, -4837468, -3486148, -2585917, -4265666, -5963510, -4186888, 107763, 2479091, 937095, -1732493, -2238078, -1055661, -881763, -2388736, -3560525, -2730243]
33639b730243K183390J698974J53687r33379o07285O13171R50357m00957j533980
33630f06265k23803K123694J733283j727989l866117j730186J876986K739283
33622C18886J072157j49319l57603j028851j699735n53262J598229J910975Q3859
33613A195336j336428j385747j698904k575070j841850J100905L432876K711796
33605c97086o9690k418244k858341q27567K909282N002362K354052k572964l491472
33596b369668P13878L431513l166m819430l925249J286595L516257Q01458j620453
33587b988265l57165J799394J781209P22802L41704l19294j832876k153897m47784
33578c454172L82207j645013l423111j132399L401258M896072K016026j423923
$$ y = [-2730243, -546853, 1152121, 1305808, 372429, -234856, 378315, 1328672, 927715, -606265, -830068, 1293626, 3026909, 1298920, -2567197, -4297383, -2420397, 318886, 1391043, 1241724, 884121, -144730, -1844465, -2397727, -799498, 1111477, 1195336, -141092, -1526839, -3225743, -5800813, -7642663, -6541758, -3108882, -397086, -466776, -2885020, -5743361, -6570928, -3661646, 1340716, 3694768, 1121804, -2369668, -1655790, 1775723, 1772557, -3046873, -6972122, -5685527, -2169270, -1367812, -2988265, -3345430, -1546036, 235173, 957975, 1299679, 980385, -852491, -3006388, -3454172, -3071965, -4716978, -8140089, -9272488, -5871230, -975158, 1040868, -383055]
33570c83055k262881j197512J11520J512405K737199K271157k68060k524966k057814
33561b062007N02952K451017K343157R81128l40854j135042j342780q56983J46138
33552F86726R60447Q86786j5654q63692p73214J84940J032962J021917L74548
33543C495766l75277j179897j926247j745338j36931J529325J270870n55521j325214
33534i48464J27213J639915Q79207j208394j951825q77520R0906j57526p26607
33525c133095p07102k82037M34412J693271K785687K353263O61930l56145q2800
33516C367384j18440j156143j354082M03189J932015R58504r77507q96256O98138
33507B856802Q15443p89841j329351j12974J25315j765485k918441j183083J075875
$$ y = [-383055, -2645936, -3843448, -3731928, -2219523, 517676, 2788833, 2520773, -4193, -2062007, -1559055, 891962, 3235119, 4216247, 3875393, 2740351, 1397571, 540588, 686726, 1647173, 2533959, 2518305, 1654613, 881399, 1066339, 2099301, 3121218, 3495766, 3120489, 1940592, 14345, -1730993, -1867924, -338599, 932271, 376750, -948464, -821251, 818664, 1697871, 489477, -1462348, -2339868, -2248962, -2406488, -3133095, -3840197, -4122234, -3687822, -1994551, 791136, 3144399, 3806329, 3450184, 3367384, 3248944, 2092801, 738719, 1141908, 3073923, 4032427, 3054920, 2158664, 2856802, 3672245, 2882404, 1553053, 1440079, 1565394, -200091, -3118532, -4301615, -3225740]
33498c225740Q08381p96662o56791Q96403J041126l18743l14622J850661L371950
33489B655963K242008K0956j112526j372664j784531j903319j119932m81220j029254
33480c884519j563369l12755J884184K354751M65676j294310n87344J870889L380977
33471B314180K369935j73865j940308j594354K1750R16091J43270j387619k300009
33462a630929k119822r49653J040473K873291K683897m5825k872079k847006l59081
33453d226734J370675P20766m45305K6227J464019J795586P21580j82548M6451
33444A290717O15623L33949p61229j366190l63889J551614K031054k59919l294469
33435b22739l499786l17603K722324K463393M0216j205987m01866L52429m74880
$$ y = [-3225740, -2417359, -3214021, -3870812, -2974409, -1933283, -2252026, -2566648, -715987, 2655963, 4897971, 4918927, 3806401, 2433737, 649206, -1254113, -2374045, -2855265, -3884519, -5447888, -5760643, -3876459, -1521708, -1056032, -2350342, -2937686, -1066797, 2314180, 4684115, 4510250, 2569942, 975588, 997338, 1913429, 2056699, 669080, -1630929, -3750751, -4700404, -3659931, -786640, 1897257, 1851432, -1020647, -3867653, -4226734, -2856059, -2135293, -2580598, -2554371, -1090352, 705234, 1426814, 1244266, 1290717, 1906340, 2240289, 1479060, 112870, -251019, 1300595, 3331649, 3071730, -222739, -3722525, -4040128, -1317804, 1145589, 1185805, -20182, -422048, -69619, -544499]
33426e44499j963102k495630j674787j41246J188800J416353L88974n69397J89815
33417d204719K338003L429745J649673j930510m295115l378590J8361K838947
33409c534205K516200l72081k531329j622025J082491K589902K003088J022508
33401A154549J068315J625563J584106P00609o53937j983259k577499k024885
33393a106438j039473p37509r95881o64481N23053J475512J307514K51112r50904
33384a937495j407937k15403K210700L391907J467433j620826k109306L21717
33376A00790K071888R57645j018934j388758o50169k17515K37874J136385J149973
33367B379179m00414j403267j3569J894257J316781j174684k390574j269957L33558
$$ y = [-544499, -2507601, -5003231, -6678018, -6819264, -5630464, -4214111, -3825137, -4394534, -4204719, -1866716, 1563029, 3212702, 1282192, -3012923, -6391513, -6373152, -3534205, -1018005, -1390086, -3921415, -5543440, -4460949, -1871047, 132041, 1154549, 2222864, 3848427, 5432533, 6133142, 5479205, 3495946, 918447, -1106438, -2145911, -2883420, -3879301, -4543782, -4020729, -2545217, -1237703, -986591, -1937495, -3345432, -3560835, -1350135, 2041772, 3509205, 1888379, -220927, 100790, 2172678, 3130323, 2111389, 722631, 72462, -145053, 92821, 1229206, 2379179, 1978765, 575498, 561929, 2456186, 3772967, 2598283, 207709, -1062248, -728690]
33358g28690J027297J129251Q26220j61335j077194p35923L19633M39700m55853
33349E83106r50320o54796m39556l90024J17917M95819m09668j799610j621670
33340e068802J13958J297693J157841J023569J355598R23289l99455r08175q3953
33331e88437M40662Q553J81374J467940J693760m35362k707194k640830j246076
33322c825610j045925j927287j547983R81270L982264N327475M223602J486928
33314G654734r22229j489604r39071j128728j831154r57604J253753J603093n43980
33305B699210p63933L784294Q286866N903694k035145p021308m706972K6284Q11532
33296F984522k056260l904417k664161k42400J203823J349074P55564l3648o29594
$$ y = [-728690, 298607, 1427858, 2254078, 2092743, 1015549, 279626, 599259, 1038959, 583106, -367214, -1022010, -1461566, -1851590, -1733673, -1237854, -1647522, -3447132, -5068802, -4954844, -3657151, -2499310, -1475741, -120143, 803146, 403691, -504484, -588437, -147775, -139222, 42152, 1510092, 3203852, 2768490, 61296, -2579534, -3825610, -4871535, -6798822, -8346805, -7365535, -3383271, 1944204, 6167806, 7654734, 6732505, 5242901, 4303830, 3175102, 1343948, 386344, 1640097, 3243190, 2699210, 1935277, 5719571, 14006437, 19910131, 17874986, 10853678, 6146706, 6172990, 6984522, 4928262, 1023845, -1640316, -1882716, -678893, 670181, 1425745, 1392097, 762503]
33287G62503j037575j331164q94077P15298K048058J086432j174170j283926J196867
33278H8246K064704j139812m294401k272426K873453M399446P96400k277431q39603
33269f01424K010357J963007J13057j02799Q19520j07212k460484k721069j61749
33260a248796J803866P97397j464533k335057j551396j07002J638673L130426
33252F63578K964498Q36619j329985j754958j044039o92592o75027j14897P45849
33243d00954R69041N69255J68553l67960j399696k119955j316345O58653K097880
33234a141528K092767J285581N18787j05566o95962j059492r77183m78421J53117
33225d07900L55906l09568j331224j449495k66903J042888J278554O66665P1450
$$ y = [762503, -275072, -1606236, -2500313, -1785015, 263043, 1349475, 175305, -1108621, 88246, 2152950, 1013138, -3281263, -5553689, -2680236, 1719210, 2515610, 238179, -601424, 1408933, 3371940, 3484997, 3382198, 4201718, 4094506, 1634022, -1087047, -1248796, 555070, 1352467, -112066, -2447123, -3998519, -4105521, -2466848, 663578, 3628076, 4464695, 3134710, 1379752, 335713, -356879, -1031906, -1146803, -400954, 568087, 1137342, 1305895, 937935, -461761, -2581716, -3898061, -3239408, -1141528, 951239, 2236820, 2755607, 2650041, 1954079, 894587, -82596, -561017, -407900, -51994, -361562, -1692786, -3142281, -3409184, -2366296, -1087742, -421077, -349627]
33216c49627k78730l94406N8403Q42491P77303m37638j246229n93296J36007m75131
33206a960853r73852O90554L003129K437116r19383k915036j372907Q67090O57885
33197d86257p59946l85823J441810J841480L11270m93130P71130J788014K01510
33188D230058k360042k184867J132310L608209K008204j828010l582683k176611
33180a153432l66649L3733M15555J893643K600651O93205k115083k748548j136505
33171a883430K87675M53219L00757K62052j39691n04625L7281Q75906Q25214N46593
33161A060951J395466K361015J316985r27253j412464p9332j25552k410849l504280
33152b325313j110680K115353K544172M70120j408218j914397j324722L63187
$$ y = [-349627, -628357, -1022763, -964360, -121869, 655434, 217796, -1028433, -1621729, -1485722, -1960853, -2934705, -2244151, 758978, 3196094, 2276711, -638325, -2011232, -1144142, -486257, -1246203, -1632026, -190216, 1651264, 1962534, 1469404, 2240534, 4028548, 4230058, 1870016, -314851, 817459, 4425668, 6433872, 4605862, 1023179, -1153432, -1520081, -1486348, -1070793, 822850, 3423501, 4116706, 2001623, -746925, -1883430, -1595755, -1142536, -841779, -579727, -719418, -1224043, -1186762, -310856, 514358, 1060951, 2456417, 4817432, 6134417, 5207164, 3794700, 3715368, 3589816, 1178967, -2325313, -3435993, -1320640, 1223532, 1693652, 285434, -1628963, -2953685, -2590498]
33144b590498K428769K577084j54633l031550k737191K27051K536606K371042
33136A626680N81449j328070k081899n59213K608647M099401J277805l649151
33128B575649n420376k037399K851563M545397K482036j84125r48391m62535p81004
33119B620815k191285k744468j024019J645389K740625J692259J87965l35897
33111B591384j1556M75360N84296l24882k199236l333113k116619L56282J560786
33102b417298J199348R98756J100661o387j733710j452442P74804J581417j18493
33093g3344j191746J3858N63329j483106k843719m06292L024389L067928O66176
33084A337473l99652j33856r04383j554701Q55510M434721L901427j115984m941614
$$ y = [-2590498, -161729, 2415355, 2260722, -770828, -3508019, -3280968, -744362, 1626680, 2208129, 880059, -1201840, -1761053, 847594, 4946995, 6224800, 2575649, -2844727, -4882126, -2030563, 2514834, 4996870, 4812745, 3864354, 3401819, 2620815, 429530, -2314938, -3338957, -1693568, 1047057, 2739316, 2927281, 2591384, 2579828, 3055188, 3639484, 3314602, 1115366, -2217747, -4334366, -3978084, -2417298, -1217950, -219194, 881467, 875080, -858630, -2311072, -1536268, 45149, -73344, -1265090, -1251232, -687903, -2171009, -5014728, -5421020, -2396631, 671297, 1337473, 937821, 803965, -100418, -1655119, -799609, 3635112, 7536539, 6420555, 1478941]
33075A478941l943677p16690R79253P63574l16580j947561l043263j866887P34169
33066g878721J714485P41075R08278L071868L665554M89087l196929l309536n13572
33057d308411J863187K686954K618256J358856j142584k551240q47408J923297
33049A600907J966707q53312l050508k569579p45887P49504J842891K361466J297217
33040B599406r28633j790071k2234K035651J552366n08203q02729J017982J458704
33031D612239j177541l323549j157999K949975L165702j039472l618511r23291
33023e12447K714638J710354k224264l055049K32550K703869J422370q96626j059994
33014A035401K81296J147471J382083J304735K03948j761341k553279j050635
$$ y = [1478941, -2464736, -3181426, -2202173, -1438599, -1755179, -3702740, -6746003, -8612890, -7878721, -6164236, -5423161, -4514883, -1443015, 2222539, 2711626, -485303, -3794839, -4308411, -2445224, 241730, 2859986, 4218842, 3076258, 525018, -322390, 1600907, 3567614, 2714302, -336206, -2905785, -3651672, -2902168, -1059277, 1302189, 2599406, 1670773, -119298, -141532, 1894119, 3446485, 2938282, 2135553, 3153535, 4612239, 3434698, 111149, -1046850, 1903125, 5068827, 4029355, 410844, -512447, 2202191, 3912545, 1688281, -1366768, -1134218, 1569651, 2992021, 2095395, 1035401, 1316697, 2464168, 3846251, 5150986, 5354934, 3593593, 1040314, -10321]
33006a0321J130567K106222J969882J286988k60792k164852k500534r45320k959
32997F08881j092624j834538J56770K989536L163279Q73842p57612o95891o93960
32988B717683j415859j408101k81605K78280m25495p40546M13729J525098Q81280
32979A544464p44433j388758o50503L81051J042079J372839J020211m81435k256298
32970a60783k357883j64865K370574K768983R85413n82900j50664J280374J441892
32961E430141p7266j313049o39541J037788J538659K86597j109797j200909n77882
32952C374741o65853j299482q72183R04489J915407N02361j702589j740749K65055
32943F81197J037750r98721l209014k552992R6375J570681J006567L70319R53988
$$ y = [-10321, 1120246, 3226468, 5196350, 6483338, 6222546, 4057694, 1557160, 611840, 608881, -483743, -2318281, -2161511, 828025, 3991304, 4865146, 4107534, 3411643, 2717683, 1301824, -106277, -387882, -109602, -535097, -1275643, -861914, 663184, 1544464, 800031, -588727, -1239230, -858179, 183900, 1556739, 2576950, 2095515, -160783, -2518666, -2683531, -312957, 2456026, 3441439, 2858539, 2707875, 3988249, 5430141, 5352875, 4039826, 3400285, 4438073, 5976732, 6263329, 5153532, 3952623, 3374741, 2708888, 1409406, 537223, 1441712, 3357119, 3859480, 2156891, 416142, 681197, 1718947, 720226, -2488788, -5041780, -4945405, -3374724, -2368157, -1997838, -1043850]
32934a043850J742058J387244q5948j848869l064077k938555j303535P34508J822053
32925d598971J879440J522217N80541j203385k560107j840138L40648J648691
32917d231064J284133O38729N97508M41912j52182l29346L8695j01150o79420
32908b492185n3046J982029L046641J649603l14652n02801L25002O7381r26557
32899B781415p26483L03680k57178k458092k918304K07602L571637K606076j810654
32890A299699l789525k57349M471134M245647o30388m108813k946061l99351p6519
32881b191526k99839K044051N111830M291448m04661l893636l191767q27071j30112
32872E08717q56155j073135l50670P09239J710788J751262k09073k909275l188498
$$ y = [-1043850, 698208, 2085452, 1999504, 150635, -2913442, -5851997, -7155532, -6421024, -4598971, -2719531, -1197314, -616773, -1820158, -4380265, -6220403, -5879755, -4231064, -2946931, -2308202, -1710694, -1268782, -1420964, -1750310, -1711615, -1812765, -2492185, -2545231, -563202, 2483439, 4133042, 3818390, 3315589, 3640591, 3707972, 2781415, 2054932, 2358612, 2101434, -356658, -3274962, -3067360, 504277, 3110353, 1299699, -2489826, -2747175, 1723959, 5969606, 5339218, 1230405, -1715656, -2115007, -2191526, -2491365, -447314, 4664516, 8955964, 8551303, 4657667, 1465900, 638829, 508717, -347438, -1420573, -1771243, -1062004, 648784, 2400046, 2190973, -718302, -3906800]
32863c906800l93231K047620J239574j315112k443459j645111m60233M98357J418496
32854d959899J812501J534618J806578K993231L003946M22470k432765k534396
32846A646284q29163n45325j821944j802170J94048J539979R39860M39552J408599
32837A169720J878245O2916k110893j715961O24439J728978N76568o87470l84048
32828A142494N44422O34082J16280j08313k22979p81531j220619p03036Q1603
32819e17597k86140j464980j561786k11228N83954k85856r31270N74921K713909
32810a386073K460406j07007j815937r68809O56696Q91332m6052p96208r39626
32801b051278o21332L51854J718711K226724J162195m11954j015084o02812q8690
$$ y = [-3906800, -4300031, -2252411, -1012837, -2327949, -4771408, -6416519, -6876752, -6378395, -4959899, -3147398, -1612780, 193798, 3187029, 6190975, 6613445, 4180680, 1646284, 817121, 271796, -1550148, -3352318, -3158270, -1618291, -678431, -238879, 1169720, 3047965, 3110881, 999988, -715973, -91534, 1637444, 2214012, 1526542, 1142494, 1686916, 2320998, 2437278, 2328965, 2105986, 1324455, 103836, -599200, -517597, -803737, -2268717, -3830503, -4041731, -3457777, -3743633, -4674903, -4099982, -1386073, 1074333, 967326, -848611, -1817420, -1160724, -269392, -315444, -1111652, -2051278, -2672610, -2320756, -602045, 1624679, 2786874, 2374920, 1359836, 757024, 668334]
32792F68334K38159O73096R32228K59228j175777j849090m58759K171773L386657
32783D845849J591168j368177j989182L34781K207114Q79743j726366j858698
32775B916232M72272J735144M01243j017802k16184J471461J406794o07324k580055
32766C981781l005494j883964q9761J058000L80622j864133l652043k959570J71711
32757g862851L497798M412359K290988o70894j619196m20193L32425o78106j465907
32748b183577k48359J305928R32096j68201M64491J893444J409394k93171j92675
32739B919370J285367P11472j769129j801305J717503L879149J096932l432877
32731D606482m805404l004830r37182O85768K557864L487328J967377n30391j317259
$$ y = [668334, 906493, 1579589, 2511817, 2771045, 1595268, -253822, -712581, 1459192, 4845849, 6437017, 5068840, 3079658, 3414439, 5621553, 6501296, 4774930, 2916232, 3388504, 5123648, 5524891, 4507089, 4290905, 5762366, 7169160, 6561836, 3981781, 976287, -907677, -997438, 60562, 441184, -1422949, -5074992, -8034562, -7862851, -4365053, 47306, 2338294, 1667400, 48204, -371989, -39564, -717670, -2183577, -2431936, -1126008, -193912, -362113, 102378, 1995822, 3405216, 3112045, 2919370, 4204737, 4916209, 3147080, 1345775, 3063278, 6942427, 8039359, 4606482, -198922, -3203752, -4140934, -3455166, -897302, 2590026, 4557403, 4027012, 2709753]
32722B709753m13624J58409j58574l88023l61026n90506o42884J28746R45456
32713A387727N94829o19270j426453j306293n20750N40612J178407Q46552L93704
32704A069065J123117K212970J429747j037570k339722j417461m31917o03007
32696E222l49189P43957K45250k298123l036623K26314L553242K520807q69712
32687G41145j635913L44505J064047n51906j448209Q4034K199593K970709K432472
32678F200477R35489j346524k971772k145637M27969J863693O92632j528055k344293
32669b16021q81705J631272K917391J776101l35947r92257k80378n02512j932382
32660A183562j890504N83869K405091J036717j532929k114455j025261n16639
$$ y = [2709753, 2296129, 2454538, 2295964, 1907941, 1546915, 956409, 313525, 442271, 1387727, 1982556, 1363286, -63167, -1369460, -1890210, -1349598, -171191, 675361, 1069065, 2192182, 4405152, 5834899, 4797329, 2457607, 1040146, 608229, 5222, -343967, 399990, 645240, -1652883, -4689506, -4463192, -909950, 1610857, 741145, -894768, -550263, 513784, -38122, -1486331, -1402297, 797296, 3768005, 6200477, 7135966, 5789442, 2817670, 672033, 1100002, 2963695, 3656327, 2128272, -216021, -1097726, 533546, 3450937, 5227038, 4891091, 3898834, 3618456, 3115944, 1183562, -706942, -123073, 2282018, 3318735, 1785806, -328649, -1353910, -1870549]
32652a870549p14197k51542O90213Q52857K20040l38711n16302j48035R31566
32643a144660J528333O4032k086486j551397J458292K595970K80069j499720K594
32634c52973J603364R5770j878823o09444K030434J939710l27554j255414n05426
32625G39644m21429j289516j469647o44734N59796K177747L262481J590664k093537
32616B411469l257997k78747K316147J041833r00547K65806K071668N89898k363388
32607A896142k692294q91311J84741P33776J802625J560751r14567k245353k88024
32598h53514J551845N87210n5459J964757K836319J1461j876876N47675K399350
32589G112768l29894k562013J99533K456535r82942m049718k91242M065133J012834
$$ y = [-1870549, -2584746, -2836288, -2146075, -1293218, -1073178, -1411889, -1928191, -2076226, -1144660, 383673, 447705, -1638781, -3190178, -1731886, 864084, 1144153, -355567, -352973, 1250391, 1346161, -532662, -1142106, 888328, 2828038, 2500484, 1245070, 739644, 318215, -971301, -2440948, -3085682, -2525886, -348139, 2914342, 4505006, 2411469, -846528, -1125275, 1190872, 2232705, 1332158, 1597964, 3669632, 4259530, 1896142, -796152, -1687463, -1502722, -768946, 1033679, 2594430, 1679863, -565490, -853514, 698331, 1285541, 1230082, 3194839, 6031158, 6042619, 4165743, 4713418, 7112768, 6782874, 4220861, 4420394, 6876929, 5893987, 1844269, 1553027, 5618160, 6630994]
32580F630994l750569q73470M952386L296225k963802l703567l57464j164784
32572B065949l634621j66247M591794J388636m345708j343904N395130L464919
32564G415948k421568Q00359P946037N052128j533800L409447J0887422K779160
32556C4335133p160653P492858L0411444K3564309P216692M6464761J32067775
32549B74392319J52351821M0826375j09824689j56302708q7013716j4363225q499572
32542I1566605k8670732k2005150k712898k925979j1964866o432158M025933L89753
32534B1270508q072340m141046M089220Q40858o726192l525763M562751K827080
32526A1125076m842117m681647J680916K641143j487610j815374J129740M89470
$$ y = [6630994, 2880425, 2006955, 6959341, 10255566, 7291764, 3588197, 3230733, 2065949, -1568672, -1734919, 2856875, 4245511, -100197, -1444101, 3951029, 7415948, 4994380, 5794739, 13740776, 18792904, 17259104, 20668551, 31555973, 34335133, 27174480, 34667338, 65078782, 88643091, 95859783, 142324544, 274392319, 426744140, 467570515, 357745826, 201443118, 114429402, 100066177, 91566605, 62895873, 40890723, 38177825, 35251846, 23286980, 16854822, 20880755, 21270508, 13198168, 9057122, 13146342, 13987200, 7261008, 3735245, 8297996, 11125076, 6282959, 1601312, 3282228, 5923371, 4435761, 2620387, 3750127, 4239597]
32518D239597k133515q12098J718564l81424l423060o80053M224567L376988j398804
32509D730762k856748j397767j974013l051230l30847L169724K041981q17829
32501d85967P05362M285572L284466j147598k560366o82785m56064k234332k260861
32492a552573o37012l74993q35676L02090J397957L15695q4793K849688N049964
32483F430347K110688k151474j728612J234984P89971k089973k200825j12931
32475B282175k84600k019347j337231O27610j04289k134129j424619L06974j097851
32466e185307l106259k56758N013645N345534R99232p48035J714494K436243q04837
32457E407952l167060k112243j014220j537127q02615J737211K399874M23244
$$ y = [4239597, 2106082, 1293984, 3012548, 2631124, -791936, -1471989, 2752578, 6129566, 4730762, 1874014, 476247, -1497766, -4548996, -4879843, -1710119, 331862, -485967, 219395, 4504967, 7789433, 6641835, 4081469, 3398684, 2942620, 708288, -1552573, -2189585, -2564578, -3400254, -3098164, -1700207, -1384512, -1469305, 1380383, 6430347, 8541035, 6389561, 4660949, 5895933, 6685904, 4595931, 2395106, 2282175, 1997575, -21772, -1359003, -731393, -835682, -2969811, -4394430, -4087456, -5185307, -8291566, -8548324, -3534679, 1810855, 2810087, 2062052, 3776546, 6212789, 5407952, 2240892, 128649, -885571, -2422698, -3225313, -1488102, 911772, 1335016]
32449A335016k81268J373843J506750j146713k449501l04775J578864K71319j802174
32440H1361j722360l48106Q24802K234128L398469K174814r92219k546847j419915
32431A684127o64404j767303k065703K1436J711009M09768k145718k751290q66660
32422f434738J822661L439317K653816o855j513330P7042K089114R78916j605803
32413A500140j384541J034267J216285r10923q00001K069096K474313j601359
32405C597277n088323l800537k62180J587552J926442J966844O78087j784751
32397a179589k275664N3535J315143o34888k075354J49166K811103J726131j146485
32388a256902j351821O05521R60824n44333j005582L9944L86210k25444K75484
$$ y = [1335016, 1053748, 2427591, 3934341, 2787628, 338127, 33352, 1612216, 1883535, 81361, -1640999, -1989105, -1164303, 1069825, 4468294, 6643108, 5650889, 3104042, 1684127, 1019723, -747580, -2813283, -2791847, -1080838, -671070, -2816788, -5568078, -6434738, -4612077, -1172760, 1481056, 1474201, -39129, 37913, 2127027, 3105943, 1500140, 115599, 1149866, 2366151, 1455228, 655227, 2724323, 5198636, 3597277, -1491046, -5291583, -5553763, -3966211, -2039769, -72925, 605162, -1179589, -3455253, -3401718, -2086575, -2721463, -4796817, -4647651, -1836548, -110417, -1256902, -2608723, -2003202, -1042378, -1586711, -2592293, -2552349, -2166139, -2391583, -2116099]
32379b116099K197832L254725K016360l99873k074979j954564l40910R61081J42543
32370A686116j914700k276396l15178J164091N56983J5872J244562K125720N02874
32361B789944j729598j739399l55768l7092n84802m34143Q238j13727M24886K168154
32351C96693K241072j210955m304974k400387K095442K858770m29270j801566
32343b555175J087468L399574J306480k173855k609236p15667J92652j41136K97907
32334a910988J535606J775764P76373J28698N52785J018162M15449j239396k988306
32325F4147l451445j750931J274221L365201L054093J093355p08448j430921j475045
32316C4227j648420k074105j743603L72115L188148L625895M33813l113885k678431
$$ y = [-2116099, 81733, 3336458, 5352818, 4952945, 2877966, 923402, 582492, 1543573, 1686116, -228584, -2504980, -2820158, -1656067, -1099084, -1083212, 161350, 2287070, 2789944, 1060346, -679053, -1034821, -1071913, -1656715, -2090858, -2082620, -2196347, -1771461, 396693, 2637765, 1426810, -2878164, -5278551, -3183109, -324339, -753609, -2555175, -1467707, 1931867, 3238347, 1064492, -1544744, -2260411, -2067759, -2208895, -1910988, -375382, 1400382, 2176755, 2305453, 2858238, 3876400, 4291849, 3052453, 64147, -3387298, -5138229, -3864008, -498807, 2555286, 3648641, 2940193, 1509272, 34227, -1614193, -3688298, -5431901, -5059786, -1871638, 1754257, 2188070, -925815, -3604246]
32307c604246J403996M448572L510722L79036j925190k640163k231751q27685
32299a486709O57888L76173j615649k649398j434946k56101r08003j173008J369729
32290g120024M325587L520968j94636j824362K34280K168591J135978q14514j084251
32281C47617p09660j344802j438160Q51264L239235K044632j745079l357668j176207
32272c288828J186380O71444r76214o09657J497233K697654K021982O80655l85507
32263C495142j125319j192081l03188N50673K30307m90401j9100J103979P27137
32254B977149j208732k083065n97128J155077J077727J84380K71246N59153o08204
32245A727603k169148j642951O03212J640018N75753l01748M37721J279208Q32277
$$ y = [-3604246, -2200250, 2248322, 5759044, 6138080, 4212890, 1572727, -659024, -1486709, -828821, -452648, -2068297, -4717695, -6152641, -6408742, -7316745, -8489753, -7120024, -2794437, 726531, 531895, -1292467, -1058187, 1110404, 2246382, 1431868, 347617, -362043, -1706845, -3145005, -2293741, 945494, 2990126, 1245047, -2112621, -3288828, -2102448, -1431004, -2407218, -3016875, -1519642, 1178012, 3199994, 3880649, 3495142, 2369823, 1177742, 874554, 1425227, 1655534, 1165133, 1146033, 2250012, 2977149, 1768417, -314648, -911776, 243301, 1321028, 1505408, 1776654, 2335807, 1727603, -441545, -2084496, -1481284, 158734, 734487, 432739, 870460, 2149668, 2981945]
32236B981945Q0020k4094n08966j917001k333600l42604K105128K454644J354389
32227C849861P92517K35309j767233l475524j793515K127270L567666J104777
32219D641128j441023j096728L59645M20505j76046p6770m30627k184981l105314
32210c090211j052386J891895K202962K48004p44907J06875P50967J22990p48089
32201c11900j192381j354021n73524J614189L253262J963335j057339k302826
32193C8795j071402J71861M36961J195010K274349J160854k173448l857897j683065
32184c507982J461618K077302P40995l03070j092791k265714k095848R10433M088419
32175A3362L285834r94614l614014j400454K838956L828862k8359m800876n141835
$$ y = [2981945, 3061965, 3037871, 2528905, 611904, -1721696, -2064300, 40828, 2495472, 3849861, 4642378, 4877687, 3110454, -365070, -2158585, -31315, 3536351, 4641128, 3200105, 2103377, 2463022, 2883527, 2707481, 2630711, 2200084, 15103, -3090211, -4142597, -2250702, -47740, 200264, -544643, -437768, 313199, 436189, -311900, -1504281, -2858302, -3431826, -1817637, 1435625, 3398960, 2341621, 38795, -1032607, -860746, -423785, 771225, 3045574, 4206428, 2032980, -1824917, -3507982, -2046364, 30938, 771933, 468863, -623928, -2889642, -4985490, -4075057, 13362, 3299196, 2304582, -1309432, -2709886, 129070, 3957932, 3929573, -871303, -6013138]
32166f013138l45707M225362L169720j951341m335885j012575L407146L725232
32158H68814J111237r3321O54388O05881p43736j226296l60974Q8421k00058K87439
32148I91795J416058J177928n43401j438488p41948l92254j218116j316622K17692
32139a847356J091642m48634k234620j265897J445440K035927o98662l499904
32131e422064k867281N98476L159533K603984O43427J31835J004613Q18301q33984
32122a63160j186696J058759K733541P03756k697445k672751O10046K173442R4112
32113F53604j605371K89345K933977K100272j187787k660614j471858o22954j407724
32104b979110j603045J17824J508120K66637k166437k565452l86004J904388K432171
$$ y = [-6013138, -6358845, -2133483, 1036237, -915104, -5250989, -6263564, -2856418, 868814, 1980051, 1886730, 2541118, 3146999, 2403263, 1176967, 815993, 904414, 704356, 991795, 2407853, 3585781, 3042380, 1603892, 861944, 469690, -748426, -2065048, -1847356, -755714, -1204348, -3438968, -4704865, -3259425, -1223498, -1922160, -5422064, -8289345, -7690869, -4531336, -1927352, -1283925, -1152090, -147477, 670824, -163160, -1349856, -291097, 2442444, 3146200, 448755, -2223996, -1613950, 559492, 653604, -951767, -662422, 2271555, 4371827, 3184040, 523426, -948432, -1571386, -2979110, -4582155, -4464331, -2956211, -2689574, -4856011, -7421463, -7807467, -5903079, -3470908]
32095c470908J762889J049207L77937k19770J00201J396353J850050J66669j943520
32086A069108j963595m99702j61918q58401J49808K872885L407223R6031l056967
32077A054472k202820N57878J060147k14470m1622J154550L06113j989491j930257
32068b245500O57382J540523q98939l068137k164700j791J089104J678941K328280
32059a084837J563158o12983j189852R88909K591457J079644j044925o62819Q40685
32050B468437P08399j92530K44861Q45267m13706j853853p93275J160005M85992
32041B659597k076059k797593j270845k77816j95420R90732K449018J103888k116530
32032a531028k523583O64940K694433J151098l27336J039105K190267O6618k506862
$$ y = [-3470908, -1708019, -658812, -280875, -500645, -400444, 995909, 2845959, 3012628, 1069108, -894487, -1394189, -1556107, -2414508, -2264700, 608185, 4015408, 4111439, 1054472, -1148348, -590470, 469677, 255207, 213585, 1368135, 1674248, -315243, -2245500, -1588118, -47595, -946534, -4014671, -6179371, -6181162, -5092058, -3413117, -1084837, 478321, -134662, -1324514, -335605, 2255852, 3335496, 2290571, 1627752, 2468437, 3176836, 2984306, 3229167, 4074434, 3660728, 1806875, 1013600, 2173605, 2659597, 583538, -2214055, -3484900, -3762716, -3958136, -2967404, -518386, 585502, -1531028, -4054611, -3389671, -695238, 455860, 128524, 1167629, 3357896, 3424514, 917652]
32023I17652j690580M73484l86196l100326k589556J644997M347058K292318j499843
32014D09008k708521j201151K44353J75595m72214k26446J269612K813568K572212
32005B876016K30615k076203k155375n81658M51468N51330J208318K552436K564002
31996E620949K83296k346661l032098j909320o10532M2330J48941k73561r95579
31987c072235j091251j00942Q93108O51166j71822K21057J950347K803643J071280
31978C154351j872105k925636j080060J225515J194959o91101j455082J45626
31970b303533J935851J618725P2778j99825J262684K690913K827312J819486j11218
31961I613173k592732l913560k484727K74907J155776j97283o92128J162084K653827
$$ y = [917652, -772928, -299444, -685640, -3785966, -6375522, -4730525, -383467, 1908851, 409008, -2299513, -3500664, -3256311, -3080716, -3552930, -3779376, -2509764, 303804, 2876016, 3106631, 1030428, -1124947, -1706605, -1255137, -703807, 504511, 3056947, 5620949, 5904245, 3557584, 525486, -1383834, -1994366, -1952036, -1803095, -2076656, -3072235, -4163486, -4264428, -3371320, -2720154, -2891976, -2670919, -720572, 2083071, 3154351, 1282246, -1643390, -2723450, -1497935, -302976, -994077, -2449159, -2303533, -367682, 1251043, 1323821, 1123996, 2386680, 5077593, 7904905, 9724391, 9613173, 7020441, 3106881, 622154, 897061, 2052837, 1855554, 1163426, 2325510, 4979337]
31952D979337J122222j900685l145718k042115k81917J118389J814321J029613
31944B693447q54573j352181O37385K237399P66818j445468n63267K023779J595568
31935E738907j831152l038733n9313K545120J060372j735956j580877O55314J305327
31926C059009L3703n13324L85131P62914m01557j734069j681237l12416J030948
31917F29102R06654p80433j999203o50502K126539K832034O22371j192668j34851
31908B359043J755629J368633q62115k329487k139844j131191N4920N81750p63157
31899a105819k983177k635795J050916L672783J762359j444956p47746K927632
31891D96197M294034J928256p63714j943703l002904l831659k116413J641732
$$ y = [4979337, 6101559, 4200874, 1055156, -986959, -1268876, -150487, 1663834, 2693447, 1838874, 486693, 1124078, 3361477, 4128295, 2682827, 2119560, 4143339, 5738907, 3907755, 869022, 809709, 3354829, 4415201, 2679245, 1098368, 1753682, 3059009, 3092712, 2579388, 2964519, 3727433, 3325876, 1591807, -89430, -401846, 629102, 1535756, 755323, -1243880, -1894382, 232157, 3064191, 3686562, 2493894, 2359043, 4114672, 5483305, 4621190, 2291703, 151859, -979332, -924412, -342662, -1105819, -4088996, -6724791, -5673875, -2001092, -238733, -1683689, -2431435, 496197, 4790231, 6718487, 5954773, 4011070, 1008166, -2823493, -4939906, -3298174]
31883c298174L484198J845923l17695o09594j85109k79581K0409Q35060L64325
31874A859762j391002j607103O43486K328450J255706n91397p47898J14841N27699
31865B392544P79132Q21721q16618l469983l430749L13911L182303J538207j431043
31856a20575q34479K016674K134141p36646j963893L06638K700813K351852N28720
31847F383245n79216r36874j122354p66611m0823k76308j635812k133466m35823
31838a544042J885302K361726Q63955n90918p92275p22861j619066k580118j442370
31829d180667J703548L480254J310346k608923l904811k030986m41624o25347
31821g298210J3148K811440M511885K259682j356982k032545j34389O97666l06021
$$ y = [-3298174, 186024, 2031947, 1714252, 1104658, 919549, 639968, 660377, 1495437, 1859762, 468760, -1138343, -494857, 1833593, 3089299, 2497902, 1750004, 1864845, 2392544, 3171676, 3993397, 3176779, -293204, -3723953, -3410042, -227739, 1310468, -120575, -955054, 1061620, 3195761, 2459115, 495222, 801860, 3502673, 5854525, 6383245, 5804029, 4867155, 3744801, 2978190, 2937367, 2661059, 1025247, -1108219, -1544042, 341260, 2702986, 3566941, 2976023, 2183748, 1460887, -158179, -2738297, -4180667, -2477119, 1003135, 2313481, -295442, -4200253, -6231239, -6672863, -7298210, -7285062, -4473622, 38263, 2297945, 940963, -1091582, -1225971, -528305, -834326]
31812h34326o24978N63065J175791J57320r64013r66278m40910M2568O59914Q90055
31802c41792j47051j617802j654658l48074L38681j66366l73097L93194J018232
31793b898733R51509R86756J160107M66951o66625l55048J376003J980683M46775
31784C448378q36594m0256R59534j67506k025568j606534P50801J751288J23921
31775B357464j797430j856954p84056r9956M22432J479358J979074L73861k237362
31766a63569k716765j43165K559414K476425N16777m81025j69726n60769j847803
31757e30206j508239J407978L790158K319734j775913m012785k078928J735638
31749f52563L395556J332054k147737l256388q69486J923743J500418j459331
$$ y = [-834326, -1459304, -896239, 279552, 436872, -527141, -1493419, -1934329, -1891761, -1231847, -341792, -488843, -2106645, -3761303, -4109377, -3770696, -3937062, -4310159, -3916965, -2898733, -1947224, -960468, 199639, 666590, -35, -355083, 1020920, 3001603, 3448378, 2611784, 2571528, 3531062, 3363556, 1337988, -268546, 482255, 2233543, 2357464, 560034, -1296920, -2080976, -2180932, -1758500, -279142, 1699932, 2073793, -163569, -2880334, -3023499, -464085, 2012340, 2529117, 2048092, 1878366, 1317597, -530206, -2038445, -630467, 3159691, 5479425, 3703512, -309273, -2388201, -652563, 2742993, 4075047, 1927310, -1329078, -2198564, -274821, 1225597, -233734]
31741b33734k895702j162938R76193J085688N79371J448912K364310J037041j532982
31732A666159k411810j150273J12884K03191o0919J41600P91881J587756J662040
31723B542509j04652k838552l510764j075771J351205R93096l33712K88306J648409
31714a039926Q79977r27631n52625J283075J022832j164111j503682N83857J420024
31705A790l49169j573784m64582O04515J33963L03446K189519K877597M99277
31696D222572j938577j252348Q36644R41140n51793j000185k31606r5263q31310
31687I9274j155246q99544q33374p48581k5530P57064P17097K82439L17588O64695
31677h24118Q78559J162405J383774O53012r29763j743240j041370j44564j08849
$$ y = [-233734, -3129436, -4292374, -3316181, -2230493, -1651122, -202210, 2162100, 3199141, 1666159, -745651, -1895924, -1783040, -1579849, -1640768, -1499168, -707287, 880469, 2542509, 2437857, -400695, -3911459, -4987230, -3636025, -2642929, -2976641, -2688335, -1039926, -159949, -1087580, -1640205, -357130, 665702, -498409, -2002091, -1418234, 1790, -347379, -1921163, -2385745, -1781230, -1647267, -1343821, 845698, 3723295, 4222572, 2283995, 1031647, 1868291, 2809431, 2257638, 1257453, 1025847, 930584, 99274, -1055972, -1955516, -2788890, -3537471, -3563001, -2805937, -2088840, -1806401, -1488813, -824118, 54441, 1216846, 2600620, 3253632, 2323869, 580629, -460741, -605305, -714154]
31668g14154j40066M48172P34706J8427p59032o63492k4474P70079J596645J312602
31658B579413r23363k651250l73571M154447M630525o50604n309804l849699O27357
31649a766549K013036K45066n99809L2041n51935k265076k346187o35297L93659
31640e481051L04457P04220J172309r8887j956150j321181J399622K536631J121750
31631a618280J61120J233386K081835Q21171j127710j733517j058853j07146O20911
31622g27083P10710R2350j68486N97143R73504k03667j046323N00090K314253
31613C042491R71081k014792j985389J043896K101592m27151k163101l29349J756790
31604A996068P92505j024163m54248J046606L85345j531586j626424M0703Q81269
$$ y = [-714154, -854220, -406048, 328658, 347085, -411947, -1075439, -1099913, -329834, 1266811, 2579413, 1656050, -995200, -1368771, 2785676, 7416201, 6765597, 1455793, -2393906, -1766549, 246487, 491553, -108256, -76215, -628150, -2893226, -5239413, -5874710, -5481051, -5176594, -4472374, -3300065, -3398952, -5355102, -6676283, -5276661, -2740030, -1618280, -1457160, -223774, 1858061, 2679232, 1551522, -181995, -1240848, -1347994, -727083, -16373, 75977, -92509, 504634, 1478138, 1274471, 228148, 728238, 3042491, 4013572, 1998780, 13391, 1057287, 3158879, 2731728, 568627, 239278, 1996068, 2788573, 1764410, 1310162, 2356768, 2742113, 1210527, -415897, -375194, 506075]
31595E06075K53402k91290k14160k65260l08775L40561R63664K09195j592330
31586c98918k765885k420701q03744J530309L457595L373184J168021r71423j286053
31577H82385p86907j272845k261257j813647L95458K601856L107206J709636m73658
31568B088227j784857j353841j11153N15873Q10606J804564K333198J43934l486557
31559I59994m049427m44626K545941J155381j694901j353282J151776J420475
31551c08669p64584j520245L07499J584317N06696p98601l64540P45169J025733
31542D12775Q31435O65158j32280j542040k005206p91555O74078J021766P02428
31533a63441N16954J70359n64909q71713k96856K32381m3901l82194Q9258P24062
$$ y = [506075, 759477, 468187, 254027, -11233, -320008, 20553, 984217, 1193412, -398918, -3164803, -5585504, -6389248, -4858939, -1401344, 1971840, 3139861, 2168438, 882385, 95478, -1177367, -3438624, -5252271, -4856813, -2254957, 852249, 2561885, 2088227, 303370, -1050471, -1161624, -645751, 164855, 1969419, 4302617, 4446551, 959994, -3089433, -3534059, -988118, 167263, -1527638, -2880920, -1729144, -308669, -1073253, -2593498, -2285999, -701682, -194986, -993587, -1358127, -612958, 412775, 1244210, 1909368, 1777088, 235048, -1770158, -2561713, -1887635, -865869, -163441, 353513, 523872, -41037, -912750, -1209606, -977225, -1021126, -1403320, -1314062, -590000]
31523e90000L43894q11836j283853l15957J158279J464489k0369j896014j885444
31514c836811N00428K920958K804738O16945p92573m7199J065624K83784j963538
31505A552356l070359j542480J049363J797580M4016j559246n05256J760346J570304
31496A096624j352833k920291o99954K087446J327231j657499k246488M30986
31488c934778K704158K201147M63446n76689r74530q76468K62797J525779Q61046
31479A655908j248780j662735M83502J980019M92586j823357j937358m02245L99253
31470b063207J87845K69440Q16681J110588J059700N24825j145263l065911k526606
31461d831908R73945L740778K679813j83507j124886l87542n92778j425555n16057
$$ y = [-590000, -246106, -1057942, -2341795, -2657752, -1499473, -34984, -55353, -1951367, -3836811, -3336383, -415425, 2389313, 3006258, 2213685, 2166486, 3232110, 3515894, 1552356, -1518003, -3060483, -2011120, -213540, -169524, -1728770, -2234026, -473680, 1096624, -256209, -3176500, -3876454, -1789008, -461777, -2119276, -4365764, -3934778, -1230620, 970527, 1433973, 857284, -117246, -993714, -730917, 794862, 1655908, 407128, -1255607, -772105, 1207914, 1700500, -122857, -2060215, -2462460, -2063207, -1875362, -1605922, -789241, 321347, 1381047, 1905872, 760609, -2305302, -4831908, -3857963, -117185, 2562628, 2379121, 1254235, 866693, 273915, -1151640, -1667697]
31452a667697J423551J246022r46285j531573N83906K159997J088802n24519m68395
31443A363809J95845l1814k84614K37502M5767j763226l000385j589886Q62711
31434c964291J580614Q37081O78847J024619L15808r96463j023007p1739l73930
31425a992461j962218j968373R74326M135642L996698O36981k569129k873189
31417a621723p69752J040721P70165n64385o61403Q42153J881353J102956k32187
31408A787898o63333r06599j765752j547188J334883M393728L553387o12722l147324
31399B426978j831919O0212m03056j370216k42270J426096P03692j504370j958543
31390b693396l11753R83139J078979J247000J378312j27141k573401k749930K91355
$$ y = [-1667697, -244146, 1001876, 55591, -1475982, -892076, 1267921, 2356723, 1832204, 1363809, 1559654, 1527840, 1243226, 1480728, 1526495, -236731, -3237116, -4827002, -3964291, -2383677, -1546596, -867749, 156870, 472678, -523785, -1546792, -1618531, -1992461, -3954679, -5923052, -4948726, -813084, 3183614, 3820595, 1251466, -1621723, -2391475, -1350754, -580589, -1144974, -1806377, -964224, 917129, 2020085, 1787898, 1124565, 217966, -1547786, -3094974, -1760091, 2633637, 6187024, 5574302, 2426978, 595059, 655271, 252215, -1118001, -1360271, 65825, 769517, -734853, -2693396, -3005149, -2022010, -943031, 303969, 1682281, 1555140, -1018261, -3768191, -3476836]
31381c476836L248871K943445L66829j263608p13579O00146R40750m7041j243605
31372A355372j072044O08044J703706L71941j958114k130882J38878J764024Q90951
31363A671876p41076j038260l58853L43461J414982K667390K260383l09910k398069
31354C511924j778062J07163Q76614Q77710J318264J124428q51094k516058j398806
31345A272083P31737L52042j864617k170569j85350O83454o51396j406417l18967
31336c558000K63905p78095r62697J171981L076711K337849M05983l38250j72397
31327A446990k10443N2645P90378K76931j938389k918640m19094L174178M023201
31318D277757K026589n8711q33045p10804Q0939J065679O97622j265347k293850
$$ y = [-3476836, -227965, 2715480, 3082309, 1818701, 1105122, 1705268, 2646018, 2598977, 1355372, 283328, 891372, 2595078, 2967019, 1008905, -1121977, -983099, 780925, 1671876, 930800, -107460, -466313, -122852, 1292130, 3959520, 6219903, 5909993, 3511924, 1733862, 1841025, 2717639, 3595349, 4913613, 6038041, 5186947, 2670889, 1272083, 2003820, 2355862, 491245, -1679324, -1864674, -1181220, -1832616, -3239033, -3558000, -3294095, -4072190, -5034887, -3862906, -786195, 1551654, 1957637, 1619387, 1446990, 1236547, 1289192, 2079570, 2356501, 418112, -2500528, -2919622, 254556, 4277757, 6304346, 6245635, 5412590, 4701786, 4782725, 5848404, 6546026, 5280679, 2986829]
31309B986829p38719J053758L58013j338458r93536O98022Q36741l70300l32048
31300B160302Q54792O83177q50409j189486k5718L46231l19074J90223J752560
31291C602598J458883r46751j902543l7113J212287o06023k713892j734483Q64715
31282h02322J441868k10543j394452r89670k63813j64943l49242l25586K05005
31273b853698J424438K545664K029057j44669j794817j378159k229O65125P79567
31264A270279J082813J018906k7311j025996p84030p591n8854o85550q14151o75869
31254g07354j195220j869818j229290O63954J805260P52049j365755j883461L59317
31245d670318L202418L123748m16025l659216k981607M22315K405651J531887
$$ y = [2986829, 2248110, 3301868, 3659881, 2321423, 1327887, 2025909, 2862650, 2492350, 2160302, 3015094, 3698271, 2847862, 1658376, 1632658, 1978889, 1659815, 1850038, 3602598, 5061481, 4114730, 2212187, 2175074, 3387361, 2781338, 67446, -1667037, -802322, 639546, 429003, -965449, -1955119, -2218932, -2383875, -2733117, -3058703, -2853698, -1429260, 1116404, 3145461, 3000792, 1205975, -172184, -174413, 490712, 1270279, 2353092, 3371998, 3344687, 2318691, 1534661, 1527070, 1468216, 782666, -31485, -707354, -1902574, -3772392, -5001682, -4337728, -2532468, -1780419, -3146174, -5029635, -4670318, -1467900, 1655848, 1239823, -2419393, -5401000, -4978685, -2573034, -1041147]
31237a041147M6072l48414k98500j86744P52038J970705J725505N21515P94494
31228C935524K172456J275368k186777l772070j260701J406087N12321j555729
31220E26479j015971P86179N49295o97477l2267J307104K35219j769788q20195
31211i31422J953482J631385j946670l324093j54912L164784K564740r9103j034586
31202A823605K5143J044158J202936P38514l22348j381598j321186o14771j119910
31193G4543k741689k891470m80737K146468K675260J785726J192102J002261O13742
31184C376206K56502J20462l61304j122775j047742n252M94375k32944p47659
31175G29869J26966J313498J187565j21054j335533j783762j560538r48849m35599
$$ y = [-1041147, -995075, -1343489, -1641989, -1828733, -1076695, 894010, 2619515, 3141030, 3935524, 6107980, 7383348, 5196571, 1424501, 163800, 1569887, 2082208, 526479, -489492, 296687, 845982, 148505, 116238, 1423342, 1658561, -111227, -931422, 1022060, 2653445, 706775, -2617318, -2772230, 392554, 2957294, 2858191, 1823605, 1848748, 2892906, 4095842, 4834356, 4512008, 3130410, 1809224, 1194453, 74543, -2667146, -5558616, -6039353, -3892885, -1217625, 568101, 1760203, 2762464, 3376206, 3632708, 3753170, 3391866, 2269091, 1221349, 1216097, 1710472, 1477528, 729869, 856835, 2170333, 3357898, 3236844, 1901311, 117549, -1442989, -2391838, -2827437]
31166b827437m43211o24511k50742O46150J413404J742165J468341J74137j623815
31157c25519j973885o3432J880026J519812p0608n06571k01605r79132j985544
31148b706458j124993M31934j61890j889613j020755K232400L636200K016258
31140A413083P41047J143461N18393j601168j537756J430095K333311j389329
31132C051137m869870l350734N08079J812302J115230J434528J872511K62596
31124A835779j290301J91879K350560J027328k134087k111796R20802K003104
31116B793268k53384k078925j459244o27804q22922p5562K259119L446928J711922
31107D893396j007323k251345k071279j687875j587234j679305j319642O89808
$$ y = [-2827437, -3270648, -3895159, -4145901, -3499751, -2086347, -344182, 1124159, 1298296, -325519, -2299404, -2362836, -482810, 1037002, 966394, 459823, 258218, -720914, -2706458, -3831451, -3399517, -3561407, -5451020, -6471775, -4239375, -603175, 1413083, 2154130, 3297591, 3815984, 2214816, 677060, 2107155, 4440466, 3051137, -1818733, -5169467, -4661388, -2849086, -1733856, -299328, 1573183, 1835779, 545478, 737357, 3087917, 4115245, 1981158, -130638, 790164, 2793268, 2539884, 460959, -998285, -1626089, -2449011, -2524573, -265454, 3181474, 4893396, 3886073, 1634728, -436551, -2124426, -3711660, -5390965, -6710607, -6020799]
31099f020799L925789N112928K078105k099729k612348J83288J641761K25249
31091B434244p76397N61042J739704N47550j371228j791565j430535j941325k851140
31082d879650k520615n16000K201374M058043L492957N73300k045632j878240
31074a514463k8708N87373j70372L3J385863J885872J131428R87690J457782K64676
31064E987174k445525l177727n63459K033410J465360r32773k193173j920109
31056a746822j412548j038242o11440m24087k38438Q86063K533697K748077R78387
31047A674647r21112j540690j502493j429247p91312L77323R91696Q14904O04713
31038a721571L03366l46906K8761K208900L210227J247m268718l618921J078204
$$ y = [-6020799, -2095010, 3017918, 5096023, 2996294, 383946, 567234, 2208995, 2434244, 1657847, 2218889, 3958593, 4506143, 3134915, 1343350, -87185, -2028510, -4879650, -7400265, -7916265, -5714891, -1656848, 1836109, 2409409, 363777, -1514463, -1543171, -955798, -1126170, -1126137, 259726, 2145598, 3277026, 4264716, 5722498, 5987174, 3541649, 363922, -199537, 1833873, 3299233, 2366460, 173287, -1746822, -3159370, -4197612, -4809052, -5233139, -5471577, -4585514, -2051817, 696260, 1674647, 753535, -787155, -2289648, -3718895, -4510207, -4132884, -3141188, -2326284, -1721571, -1418205, -1765111, -1736350, 472550, 3682777, 3684024, -584694, -4203615, -3125411]
31029c125411K630649j019199l470285p13039K533280J680031m1062J435783L081716
31020B992463Q22886k180694j059269J601119L56844k986504k510941J154971
31012a809125K141716k22312j061067N73482N73104j578383j505028J515498K711197
31003A339082L40470j463414n26735K1301j181641o53715K585794L697945K85443
30994D444530k597462o68277K322693J277841j536728j043893J434626P36915
30986D370245k779222l659236m65458K022382M20080k708906l378627j352007
30978g530749Q91576J724112J436934J219262J794356K343219J259551j128526
30970B009735j974234K35017K726252J789920j950435m323418l128513k11881
$$ y = [-3125411, -494762, -1513961, -4984246, -5697285, -3164005, -1483974, -1525036, -89253, 2992463, 3815349, 1634655, 575386, 2176505, 2533349, -453155, -2964096, -1809125, 332591, 110279, -950788, -377306, 195798, -1382585, -2887613, -1372115, 1339082, 1679552, 216138, -310597, -289296, -1470937, -2124652, 461142, 4159087, 4444530, 1847068, 1178791, 3501484, 4779325, 3242597, 2198704, 3633330, 4370245, 1591023, -2068213, -2533671, -511289, -91209, -2800115, -6178742, -7530749, -6639173, -4915061, -3478127, -2258865, -464509, 1878710, 3138261, 2009735, 35501, 270518, 2996770, 4786690, 2836255, -1487163, -4615676, -4827557]
30962d827557J772823K083110J195823k04729r91951k56846J224852J688182Q43123
30953B526830J23127K28281J27144q78748j659879q78968Q89571J786619J013385
30944C277362l66152r70567p26329m78370l68506L61566J562173J421594j080970
30935B631801l793187l517804l66716K264008K342424J329672R12829M08896r43613
30926A268310j702868o37744N66413k26464j832243j379534J050193K324700P46124
30917A76887j802218k512391o97567K013978L260092J904181n75229j396628j94057
30908A77048J16352k105224l818365j459005L013530M221172J151020j454468
30900a57940l28115J805813J021936j777733k633321n01379J625322J203533o43702
$$ y = [-4827557, -3054734, -971624, 224199, 19470, -972481, -1229327, -4475, 1683707, 2526830, 2649957, 2878238, 3005382, 2126634, 466755, -412213, 477358, 2263977, 3277362, 2911210, 1940643, 1214314, 735944, 367438, 729004, 2291177, 3712771, 2631801, -1161386, -4679190, -5045906, -2781898, -439474, 890198, 1803027, 2211923, 1268310, -434558, -1072302, -505889, -732353, -2564596, -3944130, -2893937, -569237, 176887, -1625331, -4137722, -4835289, -2821311, 438781, 2342962, 1767733, 371105, 177048, 293400, -1811824, -5630189, -7089194, -4075664, 145508, 1296528, -157940, -486055, 1319758, 2341694, 563961, -2069360, -2570739, -945417, 258116, -385586]
30891c85586j076028M81856J448813m68988l629923l857983j5532L828859L527461
30882a47051L19871j463252o83951J36204j17515K14793J499971J533268l58191
30873I34147j654079q64419j9369q14821j458440J9764K023580J876005l3978
30864H390j395334j536244j203665l78729J048841J761613O61494j069171j606530
30855c709335q82636L60457J983046L077482J779911j154545j698219J258125
30847A014286K551055j719409o523270m178284L555151P107892K886950k165399
30839B528972j673349J664681K272438L80949l65667L03086J17817p66527m38798
30830D023602O97451N77772q54023j973647k401999k582242j678590R16166L048502
$$ y = [-385586, -1461614, -979758, 469055, 67, -3629856, -7487839, -7503371, -3674512, -147051, 172820, -1290432, -1974383, -1838179, -1955694, -1740901, -240930, 1292338, 934147, -719932, -1584351, -1603720, -2418541, -3876981, -3857217, -1833637, 42368, 8390, -1386944, -2923188, -4126853, -4505582, -3456741, -1695128, -1033634, -2102805, -3709335, -4591971, -4231514, -2248468, 829014, 2608925, 1454380, -243839, 1014286, 3565341, 1845932, -4677338, -8855622, -5300471, 1807421, 4694371, 2528972, 855623, 2520304, 4792742, 5173691, 4808024, 5111110, 5228927, 4462400, 4023602, 4721053, 5298825, 4444802, 2471155, 69156, -2513086, -4191676, -3275510, -227008]
30821b27008K145267n67500j499981l0640R02323l30319j805914j442279Q7844
30812b768207J006342R65429P12927O26168O16608N88542L32353l55051j126457
30803E98654j293299p05533Q5827M43047O4148p28313q20115N60787K045446J080669
30793A331318k147375l643404n86423M136607N183842J734911j816112k001015
30785B192349o7255R22972M7857j521647k438310j898169r430J692292J509626
30776D30285m0842o55611M27735J309401M11996j233084j822540j335625r13823
30767c422108q92531p93925m51843l1316M38280P85578O88696N01681J090993
30758b086495K214564K234514L49991j928824k558292j375346J88388R79583P78874
$$ y = [-227008, 1918259, 1350759, -149222, -179862, 722461, 392142, -1413772, -2856051, -2768207, -1761865, -796436, -83509, 542659, 1159267, 1747809, 2080162, 1725111, 598654, -694645, -1400178, -1314351, -871304, -807156, -1535469, -2355584, -1794797, 250649, 1331318, -816057, -4459461, -5045884, -909277, 4274565, 6009476, 4193364, 2192349, 2125094, 3048066, 3095923, 1574276, -864034, -2762203, -2771633, -1079341, 430285, 389443, -266168, 161567, 1470968, 1882964, 649880, -1172660, -2508285, -3422108, -4314639, -5108564, -5560407, -5591723, -5153443, -4367865, -3679169, -3177488, -2086495, 128069, 2362583, 2712574, 783750, -1774542, -3149888, -2961500, -1981917, -1203043]
30749a203043j07020q80500n15948J022063K286341J898486K01517j243539j354972
30740A03385l08751P39943M09695j518589l155823k217706P74341K572046J462754
30731a138705k52304L37870K384983K632441L40445j733680j399755K43276R65258
30722B379829N20821L42767J085580J771696J250792k99847j594614j724233j117561
30713B615230q29832j105944j211619o90518m9808N7314l54984q71026j050720
30704c491907m27077R03626J632107N89299j048144q37004J063370J586532l48353
30695c77551j529888M72616K739634J305633k066890k294769P99191K232964K37514
30686A518454j053071P33321J727875j214393m159771k068081K521994L111632
$$ y = [-1203043, -1310063, -2190563, -2706511, -1684448, 601893, 2500379, 2701896, 1458357, 103385, -205366, 534577, 944272, -574317, -3730140, -5947846, -5173505, -2601459, -1138705, -1391009, -1053139, 1331844, 3964285, 4304730, 2571050, 1171295, 1414571, 2379829, 2900650, 3243417, 4328997, 6100693, 7351485, 7051638, 5457024, 3732791, 2615230, 1785398, 679454, -532165, -1222683, -1272491, -1215177, -1570161, -2441187, -3491907, -3918984, -3015358, -1383251, -793952, -1842096, -2679100, -1615730, -29198, -377551, -1907439, -1434823, 1304811, 2610444, 543554, -1751215, -952024, 1280940, 1518454, 465383, 1198704, 2926579, 1712186, -2447585, -4515666, -1993672, 1117960]
30678A117960m36766j978049P85080L054065J346706j068429l08811J589609N77457
30669D678822k413633l082599n12850K045828K374350J466590O48604j82387j038867
30660C983858j196645o62231l33960l68876r4947L78253K10614m79953p23552
30651G12561m69112m83486o13730j04543M89845n2169j066339o29617R54086J103496
30641a59008p74909j854585k08819K058631K033639K21864p79355l01876J43794
30632C79376k40813o56601m38872L4866J97150O0074J83331J107824K220241J518205
30622D364781j785557m609303k806485K569455N148950J429574m074117m892550
30614d655252j165822J743927J412017N61927J476029K589413J744125l64947
$$ y = [1117960, 681194, -1296855, -511775, 2542290, 3888996, 2820567, 2511756, 4101365, 4678822, 2265189, -817410, -1330260, 715568, 3089918, 4556508, 5205112, 5022725, 3983858, 2787213, 2124982, 1791022, 1422146, 1327199, 1705452, 1916066, 1436113, 712561, 243449, -240037, -853767, -958310, -468465, -520634, -1586973, -2216590, -1262504, -159008, -933917, -2788502, -2997321, -938690, 1094949, 1316813, 537458, 235582, 379376, 138563, -518038, -956910, -922044, -724894, -664820, -481489, 626335, 2846576, 4364781, 2579224, -2030079, -4836564, -2267109, 2881841, 4311415, 237298, -4655252, -5821074, -4077147, -2665130, -2103203, -627174, 1962239, 3706364, 3341417]
30606C341417j561926j095481L3212N46274P9020n11910j74683O49085M75171
30597A780179m92835j45065J673917J779230j389178m162616k631519J059736
30589b528151J877436k88118j093288P57473J956573P84557m46298j19575L90423
30580A291032L71574J008151J636517l11169l869291m158485Q2346L555907K133856
30571A740438j162293j655339j68110k17226j583493j561920j42024P02396J032459
30562c015112J987250K445006P64983j506221j627510j75091K24916m91909l42124
30553a735812N52388K41417j223357j904165j443893j007447m15031J171328K435707
30544c328865J534831j13211L15508J938901J392255r88771j252537J184643J968556
$$ y = [3341417, 1779491, 684010, 717222, 1263496, 1342516, 830606, 655923, 1305008, 1780179, 1287344, 1142279, 2816196, 4595426, 3206248, -956368, -3587887, -2528151, -650715, -938833, -2032121, -1274648, 681925, 1466482, 1020184, 900609, 1291032, 1662606, 2670757, 4307274, 3996105, 126814, -4031671, -3949325, -393418, 1740438, 578145, -1077194, -1245304, -1462530, -3046023, -4607943, -4749967, -4047571, -3015112, -1027862, 1417144, 2182127, 675906, -951604, -1126695, -901779, -1393688, -1735812, -1183424, -942007, -2165364, -4069529, -5513422, -6520869, -6935900, -5764572, -3328865, -1794034, -1907245, -1591737, 347164, 1739419, 750648, -501889, 682754, 2651310]
30535B651310q38415k919758m69556L410794L318932l41036k562271j528351l65424
30526C56225j122035j553820M60583K785739K102363q00805j939707J24141K370310
30517B782994J757535r04547k846331l028942k092932l73030J649386K251749
30509h04118N85886j092359k87549J571260J347395k55916J78176K285074J830536
30500E358385j895938m112483k061677Q36122J176580O86063J587242J952974
30492C527268K2393j584306p64062m10775k663482l441314Q40716N507397M148894
30483E182729o70211j589452J385904K019498n21277r35164J533312J583808j817877
30474F171270l207798q61086P4500k314043k696003J310812L869643J136975j568406
$$ y = [2651310, 1812895, -1106863, -1576419, 1834375, 5153307, 4812271, 2250000, 721649, 356225, -765810, -2319630, -1859047, 926692, 3029055, 2228250, 288543, 412684, 2782994, 4540529, 3635982, 789651, -2239291, -4332223, -4705253, -3055867, -804118, -218232, -1310591, -1598140, -26880, 1320515, 1064599, 1242775, 3527849, 5358385, 3462447, -650036, -2711713, -1875591, -699011, -12948, 1574294, 3527268, 3549661, 1965355, 1201293, 790518, -1872964, -5314278, -4473562, 1033835, 5182729, 4512518, 2923066, 4308970, 6328468, 5807191, 4872027, 6405339, 7989147, 6171270, 2963472, 2102386, 2176886, -137157, -2833160, -1522348, 2347295, 3484270, 1915864]
30465A915864P78026L734199J181785l847649m336438p05728J202782L38507M71497
30456G32845J955682J287831j669969k874591q05469J566840J885532Q68952m41998
30447B505655j781116k071918m66905J300606R57973o00912r42258l23781p06992
30438b129648j693458j323590R029L31127p9423M79238J340223N33082j082156
30429c615576q50264J036701J929313J198886L41948o18543k476031l356774q40988
30420g251328K758464K562093j145152k841588l59751K041436R89815r62847l21528
30411d530386J895186K812246K165133J128490j92367j403888r69823O94343L68067
30402A967001k909261n014133k337901K454844M012736J632836q50442j126214
$$ y = [1915864, 2693890, 6428089, 7609874, 3762225, -574213, -1279941, -77159, 261348, 732845, 2688527, 3976358, 2306389, -568202, -1373671, 193169, 2078701, 2947653, 2505655, 724539, -1347379, -1814284, -513678, 444295, -156617, -1098875, -1422656, -2129648, -3823106, -5146696, -5137667, -4806540, -4885963, -4406725, -3066502, -2533420, -3615576, -4465840, -3429139, -1499826, -300940, 41008, -577535, -3053566, -6410340, -7251328, -4492864, -1930771, -3075923, -5917511, -6277262, -4235826, -3246011, -4208858, -4530386, -2635200, 177046, 2342179, 3470669, 3278302, 1874414, 904591, 1598934, 1967001, -942260, -5956393, -8294294, -5839450, -1826714, -193878, -1044320, -2170534]
30394b170534m38924j34635J84575Q10549J048718O56321J78780k29815n94753
30385f89718p5687J821119L236954J574159k463209m650718k164500K732314N162813
30376D483527L055852r73712k929870j723794K42476M13781q73284j290866J44398
30367E48508J914349K248994J220626O4143m89166m88536k45089k18898p30530
30358C824401j342986j313179q67688q89089j148550m89936P43153N38652j435473
30349b380695k523662q99072J395544J611267O08717Q76076J661678J04469l088596
30340b634274l530454J15948L325374J974081j757284k807861l53427J969719
30332c698178J797921M70772j66857k27841l09790k3551Q58959J481478J213386
$$ y = [-2170534, -2609458, -2744093, -2559518, -1748969, -700251, -43930, 134850, -94965, -689718, -765405, 1055714, 4292668, 5866827, 3403618, -1247100, -3411600, -679286, 4483527, 7539379, 6565667, 3635797, 1912003, 2154479, 2568260, 1694976, 404110, 548508, 2462857, 4711851, 5932477, 5996620, 5507454, 5018918, 4773829, 4554931, 3824401, 2481415, 1168236, 300548, -588541, -1737091, -2227027, -1483874, -945222, -2380695, -4904357, -5803429, -4407885, -2796618, -2187901, -1311825, 349853, 454322, -2634274, -6164728, -6048780, -2723406, -749325, -2506609, -5314470, -5667897, -3698178, -1900257, -1429485, -1596342, -1824183, -2133973, -2157524, -1298565, 182913, 1396299]
30323A396299O78186O16110P22532L25372o31192j753499k484363k009550n2339
30314c192444J982898K106988M57080o57878n7996P56853L51120l11407J04562
30305A539776O62908l10395k161898k607320r72089J130237K017094J381172M5356
30296G24841n09942P10801K385391J718829j341806k891570n22034K353038J261833
30287C889381k175128k581379O87133K801094J416978k53473J96899L73861j838040
30278B517326l858040k623582K98113J447588O44985L5021J61394J34972q7708
30269a329931k39818p39766j054996M73682L044457K858461r90967l668626j422119
30260c069623K252511K023401q36411j194768J049062J411531q31164j603673
$$ y = [1396299, 2074485, 2690595, 3413127, 3738499, 3107307, 1353808, -1130555, -3140105, -3192444, -1209546, 897442, 1354522, 696644, 638648, 1395501, 1746621, 1435214, 1539776, 2202684, 1892289, -269609, -2876929, -3849018, -2718781, -701687, 679485, 724841, 214899, 925700, 3311091, 5029920, 3688114, 796544, 274510, 2627548, 3889381, 1714253, -867126, -179993, 2621101, 4038079, 3784606, 3981505, 4355366, 2517326, -1340714, -3964296, -3666183, -2218595, -1573610, -1538589, -1377195, -1242223, -1329931, -1569749, -2309515, -3364511, -2890829, 153628, 3012089, 2021122, -1647504, -3069623, -817112, 1206289, 369878, -824890, 224172, 1635703, 804539, -799134]
30252g99134K69152R23124j351712k717018k12019L310033L738844J384903q76848
30243C669325j978071k274080j424562M71909J586090P09964o38257m91224O50911
30234B82005R76811Q5077j034247j532713r70149O98869K395727K517292J078049
30225D496721j97305m58608n66529q41622l40214O98312K71186j992231l253085
30216b183375j289780K005270L111928J455251n74745j137273n33170J04247R5219
30207A053572n89944j457272j978005k133741j874177m37841K306427M226346
30199h84635K910625n80391k495940j420326K24965M57937L57733R60873P74676
30190C05517j244170k869561j572792J510939L178061K309813K03617j795666
$$ y = [-799134, -529982, 393142, -958570, -3675588, -3887607, -577574, 3161270, 4546173, 3669325, 1691254, -582826, -2007388, -1535479, 50611, 760575, 122318, -368906, 282005, 1258816, 1343893, 309646, -1223067, -2193216, -1494347, 901380, 3418672, 4496721, 4299416, 3840808, 3274279, 2432657, 2092443, 2790755, 3061941, 1069710, -2183375, -3473155, -1467885, 1644043, 3099294, 2524549, 1387276, 854106, 958353, 1053572, 463628, -993644, -2971649, -5105390, -6979567, -7417408, -5110981, -884635, 2025990, 1445599, -1050341, -2470667, -2245702, -1787765, -1430032, -469159, 305517, -938653, -3808214, -5381006, -3870067, -692006, 1617807, 1821424, 25758]
30182B5758k798260j912150M73230K112567J567609J88919k51021j55535l99488
30173a148371j26737J240253J838502K10275j522792p13950J178159Q34252j265657
30164E23934j696154j1553P33425m24676q46635O26839J521780M51345j45112
30155G33193J413410K362123j26132l581739l411690j2362J644742m76963k525633
30146c981051q08511K506451K554014j068982l648075j920654J716003L050555
30138a600250J833777J085928J754313J433803j069238l078468j862277J112050
30130c90362K223014O95075j030562j289388r33380r72406q17398L50603K027809
30121a36995K992362K533254P76180j324550k319611j650140o01027o55617j138905
$$ y = [25758, -2772502, -4684652, -4211422, -2098855, -531246, -342327, -593348, -748883, -1148371, -1275108, -34855, 1803647, 2013922, 491130, -222820, 955339, 1789591, 523934, -1172220, -1183773, -450348, -875024, -1721659, -1094820, 426960, 878305, 733193, 2146603, 4508726, 4382594, 800855, -2610835, -2623197, -978455, -1455418, -3981051, -4789562, -2283111, 270903, -798079, -4446154, -6366808, -4650805, -1600250, 233527, 1319455, 3073768, 4507571, 3438333, 359865, -1502412, -390362, 1832652, 2527727, 1497165, 207777, -725603, -1698009, -2515407, -2164804, -136995, 2855367, 5388621, 6164801, 4840251, 2520640, 870500, 269473, -386144, -1525049]
30112a525049j89131J895772K429738K72051k027125j583280P39625J576932k57024
30103A332509k358319k121606J67986K274263K756916J800509J49786j531543
30095B470501k481574k187988j116072k65128J27800N51173Q26905J10713j210440
30086c174110j239218O21661K095283J061105j070326j310645M00464J362015
30078a253771N33020j67308N86005J528861J343305O42053K21350l40550j064385
30069B028580q39246K86828L94394j125913k006066n99171J324927J475353O10704
30060A550390P13635J421711R87001n61813j751031k037475j694579o18365P76984
30051a213542J101196L46360M99352J643495N13911l816459o210076k230899M066608
$$ y = [-1525049, -1714180, 181592, 2611330, 2883381, 856256, -727024, 12601, 1589533, 1332509, -1025810, -3147416, -2979430, -705167, 2051749, 3852258, 4002044, 2470501, -11073, -2199061, -3315133, -3580261, -3452461, -2901288, -2074383, -1963670, -3174110, -4413328, -3791667, -1696384, -635279, -1705605, -3016250, -2615786, -1253771, -720751, -888059, -302054, 1226807, 2570112, 3212165, 3433515, 3092965, 2028580, 1189334, 1476162, 1870556, 744643, -1261423, -1860594, -535667, 939686, 1550390, 2264025, 3685736, 4672737, 4110924, 2359893, 322418, -1372161, -1990526, -1213542, -112346, 234014, 733366, 2376861, 2890772, -925687, -7135763, -9366662, -5300054]
30042e300054N015374M00505k811602j278991J031799P31522k37621J69293L08160
30033a971615p67611n94443J639618K317407m79170k673142m87659K983979K581723
30024B549087p17747j926537k75181L85089j405696k650568j224448J119420K054147
30015b092434J666999J109648P62085O15840O74382M98476k55945q77137m63082
30006A638832O03375J220831R73175L5297j124726j174060P72545K167229j171328
29997C941170p791760r382243j555179P762003P497782r99538n698841j313002
29989g539608L997452K386416j877165p20140M059166M068212j637105m806679
29981b069451q62924M254678L276377j975722m069065q64791K235500O69075l070770
$$ y = [-5300054, -284680, 115825, -2695777, -3974768, -2942969, -2211447, -2449068, -2279775, -1971615, -2739226, -3333669, -1694051, 623356, 144186, -2528956, -3016615, -32636, 2549087, 1831340, -95197, -370378, 14711, -1390985, -4041553, -5266001, -4146581, -2092434, -425435, 684213, 1446298, 2062138, 2736520, 3234996, 2979051, 2101914, 1638832, 2242207, 3463038, 4436213, 4471510, 3346784, 2172724, 2945269, 5112498, 3941170, -3850590, -13232833, -14788012, -7026009, 471773, -527765, -6226606, -7539608, -3542156, -1155740, -3032905, -3753045, 306121, 4374333, 2737228, -2069451, -2932375, 1322303, 4598680, 2622958, -1446107, -2310898, -75398, 593677, -2477093]
29972b477093l551678q5479K865002K386396Q27268J388453K802080J533345k067654
29963C620640l731324j641765R63996R72246l30166m91956l09354j637694k971825
29954e557202j253300K739514M693105K649360o60061j975689j193002q029O63028
29945I7724P20259J64669n59347p79718o78073q45363p19774O82028K375768K075424
29935B533597k21890j748777r56469M35802N43522k190j2186J3812n15186o36817
29925e66782J36934K88606r04243j250763Q54578K909963J750705j129746j698962
29916C90290J88368Q86109p14243j572051p8116J136510j66647k048048j665585
29907c643413M29997J754997J546654O61028m43559j452904j356482J57859J644007
$$ y = [-2477093, -6028771, -6114250, -3249248, -862852, -35584, 1352869, 4154949, 5688294, 3620640, -110684, -1752449, -788453, 183793, -146373, -638329, -947683, -2585377, -5557202, -6810502, -4070988, 622117, 3271477, 2611416, 635727, -557275, -565304, 97724, 817983, 982652, 423305, -356413, -1034486, -1879849, -2599623, -1917595, 458173, 2533597, 2311707, 562930, -393539, 42263, 585785, 583595, 571409, 585221, 70035, -566782, -429848, -141242, -1045485, -2296248, -1441670, 1468293, 3218998, 2089252, 390290, 578658, 1464767, 750524, -821527, -899643, 236867, 70220, -1977828, -3643413, -3213416, -1458419, 88235, 749263, 305704, -1147200, -2503682, -2345823, -701816]
29898g01816J830533J314945R47589K23508j079284j534855l76754O34589k4207
$$ y = [-701816, 1128717, 2443662, 3391251, 3614759, 2535475, 1000620, 623866, 1258455, 1234248]
$$ [...]
##END NTUPLES=NMR SPECTRUM
##END=
